##TITLE=1H_Pr C2BocEth
 200.13MHz,CDCl3,
 8 sc
 
 2.7.2025
##JCAMPDX= 6.0         $$ Bruker NMR JCAMP-DX V2.0
##DATA TYPE= NMR FID
##DATA CLASS= NTUPLES
##ORIGIN= UXNMR, Bruker Analytische Messtechnik GmbH
##OWNER= pz
$$ XWIN-NMR		Version 3.5
$$ Wed Jul  2 16:43:22 2025 Russian Standard Time (UT+4h)  she@DPX200
##.OBSERVE FREQUENCY= 200.1313
##.OBSERVE NUCLEUS= ^1H
##.DELAY= (6, 6)
##.ACQUISITION MODE= SIMULTANEOUS
##.ACQUISITION SCHEME= undefined
##.AVERAGES= 8
##.DIGITISER RES= 18
##SPECTROMETER/DATA SYSTEM= spect
##.PULSE SEQUENCE= zg30
##.SOLVENT NAME= CDCl3
##.SHIFT REFERENCE= (INTERNAL, CDCl3, 0, 14.3821)
##AUDIT TRAIL= $$ (NUMBER, WHEN, WHO, WHERE, WHAT)
$$ ##TITLE= Audit trail, XWIN-NMR		Version 3.5
$$ ##JCAMPDX= 5.01
$$ ##ORIGIN= Bruker BioSpin GmbH
$$ ##OWNER= she
$$ F:/spectra/data/she/nmr/H-C/1/audita.txt
$$ ##AUDIT TRAIL=  $$ (NUMBER, WHEN, WHO, WHERE, WHAT)
(   1,<2025-07-02 16:42:21.03 +0400>,<she>,<DPX200>,
      <created by zg, POWCHK disabled, PULCHK disabled
       configuration hash MD5:
       00 E9 B6 7A A2 85 ED C7 34 08 36 98 17 FE 4E 26
       data hash MD5: 16K
       20 A2 59 E1 D7 AA 2E 70 CC 4D F1 54 FB B5 2A 37>)
$$ ##END=
$$ 
$$ hash MD5
$$ 5D 56 CC 67 45 68 76 7D 59 BA AF 35 C1 5C 71 02
##$RELAX= 
##$RELAX= 
##$RELAX= 
##$RELAX= 
##$RELAX= 
##$RELAX= 
$$ Bruker specific parameters
$$ --------------------------
##$DU= <F:/spectra>
##$EXPNO= 1
##$NAME= <H-C>
##$PROCNO= 1
##$TYPE= <nmr>
##$USER= <she>
##$AMP= (0..31)
100 100 100 100 100 100 100 100 100 100 100 100 100 100 100 100 100 100 
100 100 100 100 100 100 100 100 100 100 100 100 100 100 
##$AQSEQ= 0
##$AQ_mod= 1
##$AUNM= <au_zg>
##$AUTOPOS= <>
##$BF1= 200.13
##$BF2= 200.13
##$BF3= 200.13
##$BF4= 200.13
##$BF5= 200.13
##$BF6= 200.13
##$BF7= 200.13
##$BF8= 200.13
##$BYTORDA= 1
##$CFDGTYP= 0
##$CFRGTYP= 5
##$CHEMSTR= <none>
##$CNST= (0..31)
1 1 145 1 1 1 1 1 1 1 1 1 1 1 1 1 1 1 1 1 1 1 1 1 1 1 1 1 1 1 1 1 
##$CPDPRG= <>
##$CPDPRG1= <>
##$CPDPRG2= <>
##$CPDPRG3= <>
##$CPDPRG4= <mlev>
##$CPDPRG5= <mlev>
##$CPDPRG6= <mlev>
##$CPDPRG7= <mlev>
##$CPDPRG8= <mlev>
##$CPDPRGB= <>
##$CPDPRGT= <>
##$D= (0..31)
0 0.7 0 0 0 0 0 0 0 0 0 0.03 0 0 0 0 0 0 0 0 0 0 0 0 0 0 0 0 0 0 0 0 
##$DATE= 1751460140
##$DBL= (0..7)
120 120 120 120 120 120 120 120 
##$DBP= (0..7)
150 150 150 150 150 150 150 150 
##$DBP07= 0
##$DBPNAM0= <>
##$DBPNAM1= <>
##$DBPNAM2= <>
##$DBPNAM3= <>
##$DBPNAM4= <>
##$DBPNAM5= <>
##$DBPNAM6= <>
##$DBPNAM7= <>
##$DBPOAL= (0..7)
0.5 0.5 0.5 0.5 0.5 0.5 0.5 0.5 
##$DBPOFFS= (0..7)
0 0 0 0 0 0 0 0 
##$DE= 6
##$DECBNUC= <off>
##$DECIM= 32
##$DECNUC= <off>
##$DECSTAT= 4
##$DIGMOD= 1
##$DIGTYP= 9
##$DL= (0..7)
0 120 120 120 120 120 120 120 
##$DP= (0..7)
150 150 150 150 150 150 150 150 
##$DP07= 0
##$DPNAME0= <>
##$DPNAME1= <>
##$DPNAME2= <>
##$DPNAME3= <>
##$DPNAME4= <>
##$DPNAME5= <>
##$DPNAME6= <>
##$DPNAME7= <>
##$DPOAL= (0..7)
0.5 0.5 0.5 0.5 0.5 0.5 0.5 0.5 
##$DPOFFS= (0..7)
0 0 0 0 0 0 0 0 
##$DQDMODE= 0
##$DR= 18
##$DS= 0
##$DSLIST= <SSSSSSSSSSSSSSS>
$$ [...]
##$SUBNAM0= <"">
##$SUBNAM1= <"">
##$SUBNAM2= <"">
##$SUBNAM3= <"">
##$SUBNAM4= <"">
##$SUBNAM5= <"">
##$SUBNAM6= <"">
##$SUBNAM7= <"">
##$SUBNAM8= <"">
##$SUBNAM9= <"">
##$SW= 18.0517328524113
##$SWIBOX= (0..15)
0 0 2 0 0 0 0 0 0 0 0 0 0 0 0 0 
##$SW_h= 3612.71676300578
##$TD= 16384
##$TD0= 1
##$TE= 0
##$TE2= 300
##$TE3= 300
##$TEG= 300
##$TL= (0..7)
0 120 120 120 120 120 120 120 
##$TP= (0..7)
150 150 150 150 150 150 150 150 
##$TP07= 0
##$TPNAME0= <>
##$TPNAME1= <>
##$TPNAME2= <>
##$TPNAME3= <>
##$TPNAME4= <>
##$TPNAME5= <>
##$TPNAME6= <>
##$TPNAME7= <>
##$TPOAL= (0..7)
0.5 0.5 0.5 0.5 0.5 0.5 0.5 0.5 
##$TPOFFS= (0..7)
0 0 0 0 0 0 0 0 
##$TUNHIN= 0
##$TUNHOUT= 0
##$TUNXOUT= 0
##$USERA1= <user>
##$USERA2= <user>
##$USERA3= <user>
##$USERA4= <user>
##$USERA5= <user>
##$V9= 5
##$VALIST= <valist>
##$VCLIST= <CCCCCCCCCCCCCCC>
##$VD= 0
##$VDLIST= <DDDDDDDDDDDDDDD>
##$VPLIST= <PPPPPPPPPPPPPPP>
##$VTLIST= <TTTTTTTTTTTTTTT>
##$WBST= 1024
##$WBSW= 4
##$XGAIN= (0..3)
0 0 0 0 
##$XL= 0
##$YL= 0
##$YMAX_a= 183683
##$YMIN_a= -226433
##$ZGOPTNS= <>
##$ZL1= 120
##$ZL2= 120
##$ZL3= 120
##$ZL4= 120
##$ABSF1= 10
##$ABSF2= 0
##$ABSG= 5
##$ABSL= 3
##$ALPHA= 0
##$AQORDER= 0
##$ASSFAC= 0
##$ASSFACI= 0
##$ASSFACX= 0
##$ASSWID= 0
##$AUNMP= <proc_1d>
##$AZFE= 0.1
##$AZFW= 0.1
##$BCFW= 1
##$BC_mod= 2
##$BYTORDP= 1
##$COROFFS= 0
##$CY= -3
##$DATMOD= 1
##$DC= 2
##$DFILT= <>
##$DTYPP= 0
##$F1P= 0
##$F2P= 0
##$FCOR= 0.5
##$FTSIZE= 0
##$FT_mod= 4
##$GAMMA= 1
##$GB= 0.15
##$INTBC= 1
##$INTSCL= 1
##$ISEN= 128
##$LB= 0.25
##$LEV0= 0
##$LPBIN= 0
##$MAXI= 10000
##$MC2= 0
##$MEAN= 0
##$ME_mod= 0
##$MI= 1.114404
##$NCOEF= 0
##$NC_proc= 0
##$NLEV= 6
##$NOISF1= 3.799351
##$NOISF2= 2.8
##$NSP= 1
##$NTH_PI= 0
##$NZP= 0
##$OFFSET= 14.38212
##$PC= 1
##$PHC0= -1199.437
##$PHC1= 10.39219
##$PH_mod= 1
##$PKNL= yes
##$PPARMOD= 0
##$PSCAL= 0
##$PSIGN= 0
##$REVERSE= no
##$SF= 200.129724274929
##$SI= 16384
##$SIGF1= 3
##$SIGF2= 2
##$SINO= 400
##$SIOLD= 16384
##$SREGLST= <1H.CDCl3>
##$SSB= 0
##$STSI= 0
##$STSR= 0
##$SW_p= 3205.1282051282
##$SYMM= 0
##$S_DEV= 0
##$TDeff= 0
##$TDoff= 0
##$TI= <>
##$TILT= no
##$TM1= 0
##$TM2= 0
##$TOPLEV= 0
##$USERP1= <user>
##$USERP2= <user>
##$USERP3= <user>
##$USERP4= <user>
##$USERP5= <user>
##$WDW= 1
##$XDIM= 8192
##$YMAX_p= 0
##$YMIN_p= 0
$$ End of Bruker specific parameters
$$ ---------------------------------
##NTUPLES= NMR FID
##VAR_NAME=  TIME,          FID/REAL,        FID/IMAG
##SYMBOL=    X,             R,               I
##VAR_TYPE=  INDEPENDENT,   DEPENDENT,       DEPENDENT
##VAR_FORM=  AFFN,          ASDF,            ASDF
##VAR_DIM=   8192,          8192,            8192
##UNITS=     SECONDS,       ARBITRARY UNITS, ARBITRARY UNITS
##FACTOR=    0.0002768,     1,               1
##FIRST=     0,             0,               0
##LAST=      2.2672688,     0,               0
##MIN=       0,             -226433,         0
##MAX=       2.2672688,     183683,          0
$$ Real data points
##PAGE= N=1
##DATA TABLE= (X++(R..R)), XYDATA
0@%%%%%%%%%%%%%%%qJ6j6J6j6K2l0L2l7M5n3O1o9P7q8J04j18J32j50J71j92K16
37A15k40K66k98L32l69M09m52M99n51O07o70P39q14Q97r88J089j202J329j473
56g75J637j826K049k312K629l023L522m184N106o462Q665j2819K3208r6301j45547
71b26433K66503R4158j40944k7017O3849n8911m4125J22360O3311j58202l2723
82g8174J30917k3382o8066N4912n297n2798K9876M6517l9457n0008O3521N5136
94F3697q4063j2220P8635m0657m2407O1078P96n4928Q626M9377j1451n6640L6634
107c523N3099p4526j8343Q7560k3524p2300L7349O1436k2542o6204J8325O1971
119C8778l9348l0237N8701o222n1260J2476L3152J2946k4412k6805J9577M266
$$ plain form
0 0 0 0 0 0 0 0 0 0 0 0 0 0 0 0 0 -8 8 -8 8 -8 14 -16 16 -21 24 -29 32 -37 40 -48 56 -62 70 -80 91 -101 115
37 115 -125 141 -157 175 -194 215 -237 262 -289 318 -352 387 -427 470 -518 571 -631 698 -775
56 -775 862 -964 1085 -1227 1402 -1621 1901 -2283 2823 -3639 5026 -7793 15415 -80886 -226433
71 -226433 40070 134228 -6716 -33733 30116 -28795 -72920 49440 112751 -45451 -78174
82 -78174 52743 29361 -38705 16207 10910 -41888 -12012 34505 -4952 -54960 8561 63697
94 63697 -20366 -32586 46049 5392 -37015 24063 24859 -30069 -21443 27934 16483 -40157 -3523
107 -3523 49576 -24950 -43293 44267 20743 -51557 -14208 47228 24686 -41518 -23193 38778
119 38778 -570 -30807 27894 21672 -29588 -17112 16040 28986 4574 -22231 -2654 1612
131A612p358J3610j9552k662L2702k0749j6738K8428J586j0420K328M642l065
144D364k5824J7413M3736m1067l1902M3060n78k5765J7256J0562j5237j3393K3379
157F004K0633m6696q001O1646j2336m5589J4980J0870l367R750L219p732k0050
170a6669P867L1046j7499j3371J7852k2714l376L8583j5138l0238J7118K1930
182A5391p716k5496J4075K7327l2109o632M1932j9438k9540K5119J0849j4422
194f60p770P683Q417j9836R61K9778j7570j7262K1895k634p882Q916m626K051
208A461R8n777P863m740j258J3041j1475l078J0024j5257N655J9409j4832j1824
222a0690M092O121Q128j0193k064J0077j4507M057J9373j4236m797R790n456K112
$$ plain form
131 1612 -5746 7864 -11688 -14350 18352 -2397 -19135 9293 10879 459 2787 7429 4364
144 4364 -21460 -4047 39689 -1378 -33280 9780 9202 -16563 693 11255 -3982 -17375 6004
157 6004 26637 -20059 -28060 33586 21250 -24339 -9359 1511 -1856 7894 11113 3381 -16669
170 -16669 -8802 22244 4745 -8626 9226 -13488 -16864 21719 6581 -23657 -6539 15391
182 15391 7675 -17821 -3746 23581 -8528 -15160 26772 7334 -22206 2913 13762 -660
194 -660 -8430 -747 7670 -12166 -11205 18573 1003 -16259 5636 3002 -4880 4036 -590 1461
208 1461 1559 -4218 3645 -1095 -2353 10688 -787 -3865 6159 -9098 -3443 15966 1134 -10690
222 -10690 -6598 -477 7651 -2542 -4606 5471 -9036 -4979 14394 158 -4639 5151 -305 1807
236A807J598m354K896o301L526P390j6592N168J5270j7257n20J5170p805n138
250e142M151O130m39j3770J1132J3576k5333O14K4750j4069j1906J2832L568q779
264b685q027J4068R050k5054K327K4822j7105r394K0086k420j1257K495R326J152
278G384j4764O465J3928j9563k038K1411j2928j0601J3629J139q027k125Q299
291B209L941j5709N876J7543j8321n384K1111p096j0895P796M472l846p805O050
305e8R536j6416p11J8341j2352q336J3854j517n467J122K421L400p097J324J0649
320H693j1299k027J3294r226l616R299m633k981K080P86J293p263L652Q787j2605
335e766n7J4207r882m704J0518j401m079o36M276K760j0326L530J1172j4011k245
$$ plain form
236 1807 3405 -949 1947 -4354 -828 6562 -10030 -4862 10408 -6849 -7369 7801 -4 -5142
250 -5142 -991 5139 4700 -9070 2062 15638 -9695 -9081 15669 1600 -10306 2526 6094 -2685
264 -2685 -10712 3356 12406 -12648 -10321 14501 -2604 -11998 8088 5668 -5589 -3094 6232 7384
278 7384 -7380 -915 13013 -6550 -8588 12823 -105 -10706 2923 4062 -3965 -6090 2209
291 2209 6150 -9559 -3683 13860 -4461 -9845 11266 4170 -6725 1071 5543 1697 -6108 -58
305 -58 9478 -6938 -7649 10692 -1660 -9996 3858 2341 -3126 -2004 417 3817 -3280 -1956 8693
320 8693 -2606 -4633 8661 -565 -4181 5118 485 -2496 -416 370 1663 -5600 -1948 6839 -5766
335 -5766 -5823 8384 -1498 -6202 4316 2915 -1164 -1800 2476 5236 -5090 -1560 9612 -4399 -6644
350f644J4620p499p287P971J378l458l875N418N823j2982K246J4326j2550m536
364g049J3795l749p311M378M217j882q479N942R025j4581j037J6066r862q247
378h774J1639J541p470k137P422L910j2031K114J3865j1891n692J4776l190r061
392d979M529M097k262o434M618P819j1977j854J4157p937p602J0771K48n978M93
407b291M257K022q042J636J0598r844l829J1685m751o042O711N1l721p98K535
422A77L480p491m01R575o856k914R380m700l925N303j73k72j077m43K965m321
438a693N51O196p426j048P461n753j250N487l187j414J055J743J788n067J527
453a030N549p292J330P231o761j090N279k759j733O27J782J051o174K166N684
$$ plain form
350 -6644 7976 477 -6810 1161 2539 -919 -4794 624 6447 -6535 -4289 10037 -2513 -7049
364 -7049 6746 2997 -4314 64 4281 2399 -6080 -138 8887 -5694 -6731 9335 -527 -8774
378 -8774 2865 4406 -3064 -5201 2221 6131 -5900 -3786 10079 -1812 -7504 7272 4082 -4979
392 -4979 -450 3647 1385 -5049 -431 7388 -4589 -6443 7714 -223 -7825 2946 3194 -2784 -2291
407 -2291 1966 3988 -4054 -2418 8180 -1664 -5493 6192 1441 -4601 2110 2161 -1560 -2358 177
422 177 3657 -3834 -4235 5340 -1516 -4430 4950 250 -3675 1628 1455 1183 106 -337 2628 -1693
438 -1693 -1142 5054 -2372 -3420 4041 -1712 -2962 2525 -662 -2076 -1021 722 2510 -2557 -1030
453 -1030 4519 -2773 -1443 5788 -973 -2063 3216 457 -1276 -649 1133 2184 -3990 -1824 3860
468C860p457O66P383n630j879L859j44N18j595P06K957n330J117O016n838j277
484b068L999l315N23J479j274J374l671M45O376m297k251M737k202r40K255m9
500A121J511l572j687O258l371k766N931l458l766L924O88q38j113l80L420m427
516b525l50P876m489m526O415r15l169K967M45m99l011K09M765l743j781N351
532C020m838k389O777j726k694K231r96j2J21J455K972n571n69N074l724K20N162
549D513n415k295M217l92p01j80K74ol493L585M430p240K8O427m863q41N219j737
567A530k796J69K298M95l844L034K662p483J558O553n140j603M088j456k174N83
583a526L205J051n491K079L904n701J706M735m339j375K392m16N01j020J12J066
$$ plain form
468 3860 -3597 -2931 4452 -1178 -3057 802 658 1176 -419 287 3244 -2086 -969 5047 -791 -2068
484 -2068 1931 -1384 -861 618 -656 718 -2953 -2508 3868 -429 -2680 2057 -145 -1085 1170 1121
500 1121 2632 -940 -2627 3631 260 -2506 3425 -33 -3799 125 813 -25 -1138 -1518 1902 -2525
516 -2525 -2875 5001 512 -4014 2401 1486 -1683 1284 1729 1230 -1781 -1572 3193 -550 -2331 3020
532 3020 -1818 -4207 2570 844 -1850 381 -615 -627 -506 949 3921 -1650 -2219 2855 -869 -649 4513
549 4513 -902 -3197 1020 628 -73 -253 21 15 -3478 107 4537 -2703 -2675 3752 -1111 -1952 3267 1530
567 1530 -1266 -1097 1201 1696 -2148 886 3548 -3935 -2377 4176 -964 -2567 1521 65 -2109 -1526
583 -1526 1679 2730 -2761 -682 3222 -2479 -773 3962 -377 -1752 640 224 725 -295 -183 883
599H83l831K067L889l927j98J712k073J645O61j057J515k104o83L630j705o42
615b18J828k584P98N45j035K169j620k130L410k028j142L967j857j475J265m63
631e70J379j03q01K108k856j136M779k081k071K814k063j134J811M44P7j439n44
648a386K381k181Q2M060l376j778L754j356m92J776j408k54q75J604J723l523
664a249J93K869l429j35M513l247j728K161Q3k97k54J117J160m106J728M177m009
681d53n83L281k863q75K227K54q61j695R48J683k763J036L251m090j98L204j535
698c2j72J143o35l6j506J623K363l534j04K476k797L02J995j557J10n37n4J883
716I31j682Q9K130k305R7K019j183K03L09j232J588p38j012J852j590o69J890
$$ plain form
599 883 -2948 -881 3008 -919 -1117 595 -1478 167 828 -229 1286 -818 -1501 2129 424 -218
615 -218 1610 -974 -176 369 -666 1503 -117 -2247 1163 -865 -2007 1960 103 -1372 -107 -570
631 -570 809 706 -95 2013 -843 -1979 2800 719 -1352 1462 -601 -1735 76 520 597 -842 -1386
648 -1386 995 -1186 -1104 2956 -420 -2198 1556 200 -292 1484 76 -178 -1053 551 2274 -1249
664 -1249 -1056 1813 -1616 -1751 2762 -485 -2213 -52 31 -266 -520 597 1757 -2349 -621 3556 -453
681 -453 -1036 2245 -618 -1493 734 988 127 -1568 -620 1063 -1700 -664 2587 -1503 -1701 1503 -32
698 -32 -204 939 304 268 -1238 385 2748 -786 -890 1586 -1211 -909 1086 -471 -361 -898 -952 931
716 931 -751 -662 1468 -837 -740 1279 96 299 608 -624 964 226 -786 1066 -524 -1193 697
733F97j126j30O89j108J122P3j103K027j505o77K201j240m76K058j884r5J222
750G45j128P96j55j255J591j292j75J956j825l3J690j635L07J272j546J068J60
767E41q45J307j355L47J523k356J93J955k059N3J144r62M35k64L4J022j834O60
785d61K011k566K43K350j891j08J044n04L05r49M70J149j910K23K216k629q9K166
803A070j591J60M35m48Q04j006L54J338j825J34K098k099O7J354r82K62l96N4
821b17J182j618j35J908j894K7J572j517L97N84q42Q16j56p31J781j205k78J482
839A156j471K55R24j166M01J80j015J382p78n32J630j389o6J438j744Q30P62j159
857c62N80K29q82J189o04l40J026j160K14P27j382O58M15j262J102k70n68J072
$$ plain form
733 697 -429 -559 130 -978 144 217 -886 1141 -364 -1041 1160 -80 -556 1502 -382 -477 745
750 745 -383 413 258 -997 594 -698 -873 1083 -742 -775 915 -720 -413 859 -687 381 541
767 541 -304 1003 -352 -5 1518 -838 -645 1310 -749 -696 448 -514 -79 -343 -309 713 -1121 -461
785 -461 1550 -1016 -773 1577 -314 -422 622 118 423 -526 -56 1093 -817 -594 1622 -1007 -1096 1070
803 1070 -521 -361 74 -374 430 -576 -222 1116 -709 -575 1523 -576 -509 845 -137 125 -271 -217
821 -217 965 -653 -788 1120 -774 -747 825 -692 -295 289 -553 263 107 -624 1157 -48 -326 1156
839 1156 -315 -60 864 -302 99 279 -736 646 -132 -664 966 -423 -489 949 -795 35 797 -362
857 -362 218 447 -435 754 150 -190 836 -324 -110 617 -765 -107 308 -954 148 -122 -690 382
875C82p72l5J295j311N74J118j809P64O27j164P27l47k81O80r76r9J184j223J07
894e59J421j537K80P60o53N27o32N71Q15j625L99J611j835J60J209j176l8K56
912d6k37Q15j234L88J120j609K91J672j780K40J145o73l2NP4O05j419M55J485
931A265j917J96J228j466M6J140p14K42m19K60M97p17J04J226j480J84J197j175
949c03M51L25o52L95k86m16J076j070L17P26j213M04O54j012Q56j90m84J061m70
968A69n54J027p24n0P43p91K90J14j083R57K24r43J158o93n16J191q92L63O84
987F74j162P14J72p57R81m51o10J004o78l63J361o67m53M09n68L88P8j71M56q14
1007d57j54J514j096j21J197j130l9Q20l76J22l96l39J301j233J04J330j632L3
$$ plain form
875 382 -390 -425 870 -441 133 1251 -558 206 833 -331 396 49 -232 448 -528 -627 557 -666 -559
894 -559 862 -675 -395 365 -288 239 -393 178 993 -632 -233 1378 -457 -297 912 -264 -302 -46
912 -46 -283 532 -702 -314 806 -803 -512 1160 -620 -380 765 92 60 65 139 744 -675 -220 1265
931 1265 -652 -456 772 -694 -648 492 -222 20 -399 -139 358 -359 -255 971 -509 -325 872 -303
949 -303 148 473 -179 216 -70 -486 590 -480 -163 563 -650 -246 408 -604 252 62 -422 639 169
968 169 -385 642 -82 -132 611 -180 110 224 -859 98 322 -621 537 -156 -672 519 -373 -10 674
987 674 -488 226 398 -359 622 171 -439 565 -113 -476 885 218 -235 174 -394 -6 72 -99 357 -457
1007 -457 -611 903 -193 -314 883 -247 -286 534 158 280 -116 -455 846 -387 -283 1047 -585 -552
1025e52J263j224J25R03m61m09Q7K96Q93j335K53J101j548J88J349j153j54N55
1043A77l26K02m6nL85j288O72P52q96L61M76j165M72O21n11M62k81k52M51m93
1063b32M97M87j371O53K67j238J205P9j000M49l4%M80l50K51J07r00J037J84r67
1083c96P92k56r12Q82L25m65N5o11N67O1m91R26l48r85R95M9o65J207m93p28O87
1104A96l82M40J23q02P95n54n16J479p35m90P85p22k47J102n04k87K18j40L79
1123A38Q4k18O61j126l4J215q80Q5O22q77k82O98JJ97n69J22K07o74N38J063j480
1144e09N9Q87p78K17P37n00L0m60O07J48p85L47M92j294M23R28q59J7L34m07K74
1165i2q3J80N74r02L42O28p61K31N45j287P60J10l71K73j06R2k49m47Q04J94q64
$$ plain form
1025 -552 711 -513 -388 515 54 -355 -268 28 921 -414 -161 940 -608 -420 929 -224 -378 177
1043 177 -149 53 7 2 387 -901 -229 523 -373 -12 464 -701 -229 392 -119 343 62 -190 261 -232
1063 -232 265 752 -619 34 301 -937 268 347 -653 -204 -238 -238 242 -108 143 250 -650 387 571 -396
1083 -396 396 140 -772 110 435 -30 25 -586 -19 42 -449 477 129 -856 139 188 -477 730 237 -491 196
1104 196 -186 254 377 -425 370 -184 -700 779 44 -446 339 -383 -630 472 -32 -319 -101 -241 138
1123 138 222 4 665 -461 -495 720 -160 -75 547 -330 -612 86 87 284 -285 -163 44 -630 -92 971 -509
1144 -509 -450 437 -341 -124 613 113 143 -317 290 438 -347 0 492 -802 -379 549 -310 -293 41 -366 -92
1165 -92 -175 5 579 -323 19 647 -114 117 662 -625 135 245 -126 147 41 133 -116 -563 241 435 -429
1186d29O27J61p97N14M97q83M04j55J09L9k11L16J63q97Q06J8p87P87j4o44L20
1207e6r5K05L98p72L23Q1n18N07J77o71P08l13Q2L14n74J30K67m78K02K56j99
1228b6J76j39k05L59j16k23M18n07J33N26m29j3K56l53K60l64k1P09p75%Q65q61
1250c30Q3P42o35M8J27j26K81m55L64L98q41L18N57m67k17L86n13L13J08k82L97
1271B56m67n1M43n89J02N10l98n8N08m37R4L1m6L54j70l18P10n49P9K79m95L29
1293A17m9m61L87nk18M57l38n5N83p37L47K75m70L78R1o43M79J8m06M46k26J06
1315G6n4l05J78J01n09N00K07l06K01j04j56N29m36L23J73p39M24J37o78N10j07
1336c5j21L25l20K46R3o79N81J09m44M66%l86K66m7r4L97k91p6M19n11p5M41m38
$$ plain form
1186 -429 198 359 -438 76 573 -310 94 -61 48 87 -124 192 355 -542 264 282 -505 282 268 -376 -56
1207 -56 -151 54 452 -320 3 84 -434 73 250 -421 287 -26 56 370 -204 -74 193 -285 -83 173 -26
1228 -26 150 11 -194 165 49 -174 244 -263 -130 396 -33 -46 210 -143 117 -247 -268 441 -334 -334 531 -330
1250 -330 -247 495 -140 -92 35 -91 190 -265 99 497 -344 -26 531 64 -153 233 -280 33 141 -141 256
1271 256 -211 -262 181 -408 -306 204 -194 -252 256 -181 -87 -56 -102 252 82 -236 474 -75 4 283 -212 117
1293 117 68 -393 -6 -11 -229 228 -110 -165 418 -319 28 303 -167 211 302 -341 138 156 -250 196 -30 76
1315 76 22 -283 -105 -4 -513 -13 194 -112 89 -15 -171 358 -78 245 418 -321 103 240 -438 72 -35
1336 -35 -156 169 -151 95 188 -491 90 199 -245 221 221 -165 101 54 -40 357 66 -10 409 -102 -177 264 -174
1359a74M3Oo3L84m56K12K01m27J31L82l22j6L24l71J79P4k81L91l35n7M56n05
1381b24k2N56m17Q3K38n48M52K7m36N47j74k79N25l28k63K51O6J10n8l93M61l04
1403a30k26L45j58j00K71k17J63J4l21M87Jk2j29J79l64J59p6J94K93o82L98K60
1425C39p05K80J30l48K94K2K3J52k82J53K56n64L26J4o38N37K8k00L84j52j0m4
1447ej36K07J98o56L84J07l17J63P5j91L79m82M37k6n24L09M92n82K83m4rK03
1469B65k52k4L14m01m3M12n31K70r2J62j43j23K13K55k5l51L29m25J27M26n51
1490a88K8L21k60M0J6j31L38j12m16M55k44J99K64m12K19r1j99M85l09j54K88
1511A37l39PM14l78K00J16k88l1J64l07L13J78j36J09l96M53J13m91K34J06j97
$$ plain form
1359 -174 -131 -125 -188 196 -260 -48 153 -274 -143 239 -83 -99 225 -146 33 107 -174 217 -118 -175 281 -224
1381 -224 -246 310 -107 -24 214 -334 118 145 -291 256 82 -197 328 0 -263 -12 54 164 106 -287 174 -130
1403 -130 -356 -11 -169 -269 2 -215 -52 -38 -359 128 129 107 -22 157 -207 -48 -124 70 363 -319 79 339
1425 339 -366 -86 44 -304 -10 12 35 187 -95 58 314 -250 76 90 -548 -11 17 -183 201 49 39 -5
1447 -5 -141 66 264 -392 -8 99 -218 -55 20 -171 208 -274 163 137 -387 -78 414 -168 115 71 62 265
1469 265 13 -11 303 -98 -141 271 -260 10 -82 80 -63 -186 27 282 257 -94 235 -190 -63 363 -188
1490 -188 -160 161 -99 -59 -43 -174 164 52 -364 91 -153 46 310 -102 117 26 -173 312 3 -151 137
1511 137 -202 -195 219 -159 41 157 -131 -162 2 -305 8 186 50 159 -237 216 329 -162 72 178 -19
1532a9J86O6m61J65J01k89M14o08N61Q7m93M15J39l35R0K0j00K59j76K75k05k14
1554a22K89j89k6j4J20k94L09j58R4L3k91K21J72j45K78m1k65k1o5J69K16p1k87
1577h8J36l1j87L20k25m8J64pJ21p1k14J96k77L8J16J47o3P2j9n8M4o2R0k17p0
1602a93O72n39oL06l17k6P1pj08%K36J0k41J98K00k01k06K83k77J74L7j97J41
1625A0J63j41L0L8j23K33l44K58k6o1R6p2k12J16J57N9j84k12L25l8k56K86J79
1648B81o14K91K55m38L19l2j69k6Q1P7J45l22J87K07m50K46K93l55Q5j8j02K5
1670c4p8L8o4Q2L21k88k32J49K19m89M19M2k02L06P4k99j75K91qJ43k94L40l41
1693h0p6J41J41r1q1R3j97J90j50N2K2N1L08j25k32K51j85j52K19p6J22j48k45
$$ plain form
1532 -19 167 233 -228 -63 38 -251 163 -445 116 203 -290 125 264 -71 19 39 -61 198 22 297 92 -122
1554 -122 167 -22 -48 -62 58 -236 73 -85 9 42 -249 -28 144 -1 277 236 -29 -50 -115 54 270 199 -88
1577 -88 48 17 -170 150 -75 -123 41 34 155 84 -130 66 -211 -173 -57 90 27 99 80 22 66 4 94 -123 -193
1602 -193 479 -60 -66 240 -77 -103 -32 -39 -147 -147 89 99 -142 56 256 55 -151 132 -145 29 66 -131 10
1625 10 173 32 62 100 -23 210 -134 124 98 37 133 61 -151 -35 122 181 -3 -215 110 72 -184 102 281
1648 281 -333 -42 213 -225 94 62 -107 -133 -52 25 170 -152 35 242 -208 38 331 -24 61 43 -59 -34
1670 -34 -112 -74 -138 -56 265 -23 -255 -106 113 -376 43 85 -117 189 263 -36 -211 80 72 215 -79 261 -80
1693 -80 -156 -15 126 35 -46 47 -150 40 -110 -58 -36 15 323 198 -34 217 32 -120 99 23 145 -3 -248
1716b48K35J41k76K59k10l05N23j40k54L94j96J60p1OJ81j02j89l5J54j92L09
1737A44l95J29J39j99K36N1l5J33l58J71MKJ11o3j27L6K90m18k7K88j45J13j28
1760d8M0j50R1J74J29m79M23k41k03J95L02l17J74m5j40K50j95J19J30l29L18
1781A98j13l19K01j22N3J91R1k62J35L7p0R2k08R5J72k31J98N6j69J47l00nJ70
1804C7N7j07m3J17P4pj15N2l40K37j05J41r4K3P7J03p2o4J4M1j29J89n8J73j35
1829F6j03K0L6R9j7j83Q8Q0O1k96N92m03j10L54k07o3M0j82RQ0r3L9J99j34q2
1854a10J23R0j12k80L90j7j86L56m0m25L71k12J86j04j61J01L9k5Q5rj72K04r5
1877cO4j37j14O1J69J03j32j17K20R1k45o7P7j3n7K19j97l3K18j10jp1j33K62
$$ plain form
1716 -248 -13 128 -148 111 -99 -404 119 -21 -275 119 -77 83 12 18 199 97 -92 -127 27 -165 144
1737 144 -251 -122 17 -182 54 105 70 203 -155 16 20 22 133 70 -57 -21 269 -149 -176 112 -33 80 -48
1760 -48 -8 -158 -67 107 236 -243 180 -61 -264 -69 233 -84 90 45 -95 155 -40 79 209 -120 198
1781 198 85 -234 -33 -155 -102 89 180 -82 53 90 20 112 -96 -1 171 -60 138 194 25 172 -128 -133 37
1804 37 94 -13 -56 61 135 128 13 65 -275 -38 -143 -2 -96 -73 4 107 35 -29 -15 26 -103 86 28 201 66
1829 66 -37 -17 19 118 101 -82 6 86 147 -149 443 40 -70 284 77 14 54 -128 -119 -39 -132 -93 106 -28 -110
1854 -110 13 103 -9 -289 101 84 -102 254 214 -211 160 -52 134 30 -131 -30 9 -16 69 60 -112 92 -3
1877 -3 61 -76 -190 -129 40 143 11 -106 114 205 -40 -107 -30 -43 -100 119 -78 -111 107 -3 -4 -75 -208 54
1901E4j26j44L51M0j80R0o5j68K76lj38Q2j78K15n6j4J97j03l19K13j26o4L58
1924A92l51RP9O9q8O3M9P2j37L4L32l67J92M6k01M0O8Qj05j12P5J28R8j40j18
1949f5J01K76l13m0j98J57L3Q5j54j2N6J05r0J94j28q5K63k88J43j00P0J62j15
1972E7n0o2J45q4J54m9M9p8j11L7K24l41j7j00K58n6k86N13j55k04J00K57j99
1995BJ08r6m5K66m06J99J4r3%K09k3L6j65l46K71qJ33O6j1j88K10l39L23oj60
2020d9J76L4l53K04N6j77J38K51n25L51k89N9k9J96J27l70N2K16j27J63p4ML6
2043G0k17q7K05j92R9L09j58l6N2o6j41L31l40L67k81j22M29L2j52J7l53J11M4
2066g9J09r1P1o4r3J48j61K22k76L79j12j79K23L6j69m2K37o3j05J69j20j38k5
$$ plain form
1901 54 -72 -216 135 175 -5 85 20 -148 128 125 -13 69 -109 106 50 36 233 130 -189 24 -102 -166 192
1924 192 -159 -150 -71 -2 -90 -27 22 94 -43 -9 323 -44 148 194 -7 33 101 109 4 -108 -33 95 193 53 -65
1949 -65 36 312 -1 -41 -239 -82 -49 36 -118 -130 -74 31 -59 135 7 -78 185 -103 40 -60 10 172 57
1972 57 7 -55 90 6 160 111 160 82 -29 8 232 -109 -126 -226 32 -24 -310 203 48 -156 -56 201 2
1995 2 110 14 -31 235 -171 28 42 -51 -51 158 135 171 6 -340 -69 -77 56 122 111 -77 133 -206 117 111 -49
2020 -49 127 161 -192 12 68 -109 29 280 -245 106 -183 -124 -153 43 170 -200 -148 68 -59 104 30 34 70
2043 70 -147 -234 -29 -221 -122 187 29 -7 45 -21 -162 169 -171 196 -85 -207 222 254 102 119 -234 -123 -79
2066 -79 30 -61 10 -54 -147 1 -160 62 -214 165 53 -126 97 133 -36 -78 159 96 -9 160 40 -98 -123
2089a23J49k2l7o9Q5j65Q3O4r8L5j50%J40J66j7k95J03P3J70j50K19j07O9j85
2113f2J95n9p6j19j8K01k25J05k4k9O3L8k09K52O6k73J11L32m09L82l35L5N5J05
2137A02J52l31M02j61q9j19N5K01k68Q7J03J79k98M1P8l40K22j69O7J69j41J9
2159c9j88K92j00J34j62l6J24j2q0J74m4l79L98l64K81j31Q3J79n1j33N3j69J33
2182c7J7k5J28R6Oj80Q8q7k2j31R7J87q6j37J60o3j53K40J28o8j1j78j96M33k19
2207a3p6J4J0K44l50K37j28l7k59M94P2l08J17j37K39k69m9J45k19L62q0K6j6
2230A9R9k76J63J3l5J0L8j36J11QM3j0OK1P4k7k62J96j63J55P5M2k02nP0m6p4
2257i3L8J77q8j4k14K68K17m48K03Q2j86P2k16J99P6k9j04k14K37N7J9m0k34M42
$$ plain form
2089 -123 26 4 -33 -102 -17 -182 -99 -35 -133 -98 -248 -248 -108 58 41 -254 -151 -78 92 -58 161 54 123 -62
2113 -62 133 74 -2 -121 -139 62 -163 -58 -82 -111 -48 -10 -219 33 99 -174 -63 269 -140 242 -93 -58 -3 102
2137 102 254 -77 325 164 75 -44 11 212 -56 31 134 313 15 56 134 -206 16 -153 -86 83 -58 -39
2159 -39 -227 65 -35 99 -63 -99 25 13 -67 107 63 -316 82 -282 -1 -132 -49 130 79 -54 -1 -170 -37
2182 -37 -20 -45 83 179 185 5 93 6 -16 -147 -50 137 51 -86 74 11 -142 98 226 158 147 -31 -227 206 -13
2207 -13 -89 -75 -65 179 -171 66 -62 -99 -358 136 208 -100 17 -120 119 -150 -199 -54 -273 89 9 35 19
2230 19 118 -158 5 18 -17 -7 31 -105 6 14 57 47 53 74 148 121 -141 55 -108 47 122 164 -38 -43 27 -19 -93
2257 -93 -55 122 34 20 -194 74 291 -157 46 128 -58 14 -202 -3 73 44 -60 -274 -37 20 39 -1 -235 207
2281B07j26L9K0k66n5J77K14q3j67j02K30o2N9Ol2k30O7L8J33k08J23O5q1R1M6
2306A03k27J40J54k88r4M36k24J8Jj51J01mJ40j82J81j78L7j84J40J99m56M00
2328F2j54Q0r6MK19o5j01k3J65j30Q9lo5K3K4L1j18J57p6m7l3K9J96l38J38j20
2354a52j00L32j64R2r3L43j26k51K02n3J06n3l0L6k03l2k5M6K96o7j17R7p3J16
2378A27k11K59r3M4p3Q7j71J82k57K02R8j53R7O0k62j97K13J27L4j20k1K0j2j2
2402c2o4M6j18K89k57m2N3J01j15K12om9R4k01Q0n2n0K33J17j98p0J07j54K9l0
2427g7P0J1j22m4R2J68j6r7m6O6J02j29P2j4k97K70j57O6J08j18L34k59J03j2
2451G4j83K11m2r1NL4j44K15p8n1L9J38r7k5j56N24l76p0J57m8r9J57p6p6K45
$$ plain form
2281 207 81 120 140 -126 -181 -4 210 127 -40 -142 88 26 85 91 59 -171 -104 -66 67 -141 -18 47 -34 57 103
2306 103 -124 16 170 -118 -212 224 0 18 19 -132 -31 -35 105 -77 104 -74 -37 -221 -81 118 -338 62
2328 62 -92 -12 -108 -104 115 50 -51 -74 91 -39 50 47 -18 5 29 60 -58 99 23 -24 -57 -28 168 -170 -32 -152
2354 -152 -252 80 -84 8 -85 258 132 -119 83 30 136 83 53 89 -114 -146 -171 -125 171 104 -13 84 11 127
2378 127 -84 175 82 126 53 140 -31 151 -106 96 194 41 138 198 -64 -261 -48 79 113 -7 -28 -8 -20 -32
2402 -32 -96 -50 -168 121 -136 -178 -125 -24 -139 73 67 18 112 -89 -9 -61 -111 122 239 41 -29 78 -76 -47 -77
2427 -77 -7 4 -118 -162 -70 98 82 -15 -61 5 107 -22 50 36 -261 9 -148 -82 26 -92 242 -17 86 74
2451 74 -109 102 60 -31 -26 8 -136 79 1 -50 -11 127 30 5 -151 373 -3 -73 84 36 -63 94 18 -58 187
2476A87N8l26K3J7P1j29K56M0k61j03M13j77j6J82j80J17j04L06l11n2J11J2l52
2499b18J02L90l71j18M29K81m38n4j49J41l1P4m6J03r5j43K11j78J74q6P9KJ18
2522A77j13l4j7r8r7O2j1J38M5LR4j76J77k77NK17k14K21k67J48L6k3J6J17k33
2547a04Q4j04J1K18j51K29r8j33K6J86j23Q2j52J3l3J95q5k14J78O0pj43J01r
2571B7j96J76K02l63K38r6n3L10l37R9l20J79J3R1m4L7J60j37j13J13J97q8N3
2594A48R3r5j54J46j62R4J2Pj59k8R3r8J39k0k5j43J60O7Kj43n8J19m1J9jN5J88
2621B15k04l9J00J3n4n5J2q0J16p1J54j25JK92l99L5J91j09j35J38P3M2j26p8
2645i3K08l8npj00J35j8k4r3N2J16j13P6j28j24J91j14K74j19j17mR2q2N3N5p5
$$ plain form
2476 187 245 -81 -58 -41 30 -99 157 197 -64 -167 246 69 53 235 55 172 68 374 63 11 122 134 -218
2499 -218 -116 274 -97 -215 214 495 57 3 -146 -5 -36 38 -8 95 0 -143 68 -110 64 -22 57 59 177
2522 177 64 30 13 -85 -182 -120 -131 7 52 55 149 -27 150 -127 -122 95 -119 102 -165 -17 19 -4 12 129 -104
2547 -104 -20 -124 -113 105 -46 183 85 -48 -22 164 41 123 -29 -16 -49 146 61 -153 25 85 78 -65 36 27
2571 27 -169 7 209 -154 84 -12 -65 245 -92 7 -313 -134 -121 -30 -74 -37 123 -14 -127 -14 183 95 148
2594 148 241 146 -8 138 -24 70 82 89 -70 -98 -5 -103 36 16 -9 -152 8 75 77 -66 -124 -5 -46 -27 -28 27 215
2621 215 11 -28 72 85 31 -24 -12 -92 24 -47 107 -18 -17 275 -124 -89 102 -7 -142 -4 69 111 -15 -93
2645 -93 115 77 72 65 -35 100 82 58 -35 17 133 20 96 -32 -156 35 -79 195 76 -41 -45 47 -35 18 73 -2
2671bJ58mj81r2J04Q0n02M70M6k69L20J63l75M9Mj03Q6j3O1j13J67N3N9j7l23
2696a74K86o6q9J3J33K31l64j5K7J07j02j22L68k61J18j96J05rl4j9J73j63p7
2719a30K61k13l7L70k79N7m1J55j61K37k87J36M1N1j27n7j68K24o5k6m1K7j2O8
2743a7Q4j28J45n4j09J73j57j9k7J83J64k20K05k62J96j75Q2j4Q7j65j92K31J46
2766A57k36L75l35L1L42l23k5n3J10PL6j36J08K5j54J04O6n1n9j26K78k20l1K18
2790A08q9m7n4K17j15J09j70L03k44r7L6M4q2K28j48j54J98N1p5l2l0j1J01r2
2814d5L64j89k6k5k52J67J76k23j15J66q0J91j58m5J05j20J78k2m2k06K0M3J9
2837a19j55L26Q9k5j02k6R6j31J46P2k91Q6L05j42k98L88l54j1K44l02J73k02
$$ plain form
2671 -2 156 152 -29 -121 -17 63 -439 31 77 -192 128 291 -84 -35 -31 -134 -48 -61 0 -113 54 107 166 149 -174
2696 -174 112 46 -43 -30 103 334 -30 -45 -18 89 -13 -135 233 -28 90 -106 -1 -10 -44 -63 110 -53 -130
2719 -130 131 -82 -119 251 -28 29 -12 143 -18 219 -68 68 109 160 33 -24 -192 32 -33 -59 -100 -73 -85 -17
2743 -17 67 -61 84 30 -79 94 -63 -82 -109 74 238 18 223 -39 157 -18 64 50 137 -28 -220 11 157
2766 157 -79 296 -39 -8 334 11 -14 -67 43 50 86 -50 58 83 -71 33 99 48 -11 -137 141 -79 -110 108
2790 108 19 -28 -82 135 20 129 -41 262 18 -79 -43 1 -81 147 -1 -155 43 94 19 -13 -43 -54 47 -45
2814 -45 319 130 104 79 -173 -6 170 -53 -168 -2 -82 109 -49 -94 11 -109 69 47 5 -201 -181 -138 -119
2837 -119 -274 52 141 116 14 -12 84 -47 99 171 -120 -34 271 129 -169 219 -135 -146 98 -204 -31 -233
2859b33L25j18j0J5J23j35nJ6N5J3N1r9O8k57J03J59j84J37k1m2j08K11j38m1
2883a15J99n7n0l2L0R8j81J66r7J72P1nj5p3m2r8o9J62j55K4l4K58k97J55j4j66
2909a65L02j61n7R8J72j55P5j47O4O5j07L60k36M5j7q2q9Pj9J39K97j74k24J50
2933A41j55J02l6l8j82j03L53R8k24J47P7j26N8m1N0k63j5l8K90j06j84K57L2
2956I4n7M4l15M61m82M73k51k4Q4j69R6o0K23j33n7R1N4l4J90l31J22q4o6P0J94
2981A33J3r3m7pJ36j87J95j34Q4n7k09K04k03K17j78MJ83P5l1m5k0j31K68k83
3005a13j3j8L35L5l33L08k86J01J50n7j03j04J45n8J36j37KK23l41K19l8j50k2
3028a19J02mJ10j70J25j40R4n0j59L50k11%j8R6n9nM6RL9J18j39J29k01qQ5P7
$$ plain form
2859 -233 92 -26 -36 -21 102 -33 -38 -22 33 46 97 -2 66 -191 -88 71 -113 24 3 -39 -147 64 -74 -115
2883 -115 84 27 -23 -55 -25 73 -108 58 -39 133 204 199 184 111 69 -29 -98 64 -91 -67 -101 157 -140 15 1 -165
2909 -165 137 -24 -81 17 189 34 109 -38 26 91 -16 344 108 153 136 54 -35 -28 -47 92 389 215 -9 141
2933 141 -14 88 52 14 -168 -271 82 180 -44 103 180 54 112 71 121 -142 -157 -195 95 -11 -195 62 94
2956 94 37 81 -234 227 -255 218 -33 -57 27 -142 -46 -106 117 -16 -73 18 72 38 228 -103 19 -65 -131 -61 133
2981 133 146 53 6 -1 135 -52 143 9 93 36 -173 31 -172 45 -133 -129 54 129 98 53 33 -98 170 -113
3005 -113 -126 -144 191 226 -107 201 -85 16 166 109 6 -98 47 -11 125 -12 -10 213 -128 91 53 -97 -119
3028 -119 -17 -21 89 -81 44 -96 -2 -52 -211 139 -72 -72 -90 6 -53 -58 -12 -3 36 154 15 144 -57 -65 20 97
3054I7j65J45j10M1p4J23M4PPkl3k71K40j7q5R7j21K80j41j47M9M3r6J41L3k92
3080b07K94j82O9M0j6jo2n3J70nK2M3o2p4J95j65oQ2NoO0j89j12J61j00R7j40
3107a42K85j22j98J33J6N2j33J05j05Q7Q5j05m2j85L80k14J16j47K05j22J70p3
3129D6J7j54M4J44Mkp2J11l48J35J7L7J49k51K09l57K67j75L8J44O7j42J50l6
3153D2j15P2n5l9k0P3qR6r5p7L34k23P8J1J35j48j05K37k86N5q1J11j26O4N0K47
3179B27k96J0N3Q0n7p2O3K2O0k13J19J60J26q9j95L3k33J70J94p5j14j9Q1K04
3203B39j87jj96K42m0j94K00j42O6l0r3J73L1n0K6k8o3Q4L1j2j93K59j08m4L5
3228Em5J41j18L4K8J07k72N9R2j13m8K27j96K47J6j45R7J31k21k30K05P0R3j27
$$ plain form
3054 97 -68 77 -33 8 -66 57 101 108 115 113 80 -191 49 32 -53 44 -77 203 62 -85 -36 7 -89 52 85 -207
3080 -207 87 -95 -26 14 -2 -3 -65 -118 52 47 69 112 50 -24 171 6 0 82 87 81 141 -48 -160 1 -99 -2 -142
3107 -142 143 21 -177 -44 -28 24 -109 -4 -109 -22 63 -42 -84 -269 111 -103 13 -134 71 -51 119 46
3129 46 63 -91 -47 97 101 99 27 138 -210 -75 -58 -21 128 -123 86 -271 -4 -179 -141 3 70 -72 78 42
3153 42 -73 -1 -56 -95 -115 -42 -50 46 -49 -126 208 -15 63 74 209 61 -44 193 -93 -38 -119 -8 -134 -70 -20 227
3179 227 -69 -59 -6 74 17 -55 8 30 90 -123 -4 156 282 193 -2 31 -202 -32 162 87 -27 -46 35 239
3203 239 52 51 -145 97 57 -137 63 -79 -13 -43 -136 37 68 18 44 16 -47 37 68 56 -137 122 14 -30 5
3228 5 -40 101 -17 17 45 152 -120 -61 31 -82 -130 97 -99 148 164 19 116 247 26 -204 1 71 164 37
3252C7q3m6N7L64m83J22j9k5K15l01K69j18n4J20M5j20q9j3j43l2L25K02J7j90
3276E7o1j71J04R7o6K34k78P8j73J72l1J62k28Q6j72K54j58K25j06o1l2L1J17
3299H0l7N2Q2Qj54l54L73j23j04J37J73m7k28K15k2j94J70q3J63m1k79R2L94l69
3323i6K56k29J47j20J99m2Pq0m2K9J43r5K5j42L3N5R8m0r9R3o0j87rJ53j11J15
3349An8P7j13o4j8J84J7J37r0R5j53L00l06j21K25J06j00k73K13k7l4N2k05J81
3373B6q7J6R7j88J44NKJ7K06k24Q3j17O6j06p5J34M0L2q1K01k90k9NK38l6j29
3399e0J2P6N7j43J25j68J24r5k5J36o1l1p5K48k69M37k18j09K6j33K56j76R5o4
3423b5j3l5l5j19K65J35k91P1P8r8N6Mj2m1P3J73j66J31j9j99J23P8k38L1J21
$$ plain form
3252 37 -46 -92 -35 329 -154 -32 -51 -76 139 -162 107 -11 -65 55 100 -20 -109 -122 -265 -297 28 230 247 57
3276 57 -4 -175 -71 26 -40 194 -84 -6 -179 -7 -38 124 -104 -18 -190 64 -94 131 25 -36 -68 -37 80
3299 80 43 95 177 185 31 -323 50 -73 -177 -40 133 86 -142 73 51 -143 27 -56 107 66 -213 -121 273 -96
3323 -96 160 -69 78 -42 157 115 122 42 0 29 172 77 102 -40 -7 48 146 106 7 100 40 -147 -156 -3 -114 1
3349 1 -57 20 -93 -157 -175 9 26 163 73 168 15 315 9 -112 113 219 119 -154 59 32 -2 50 -155 26
3373 26 -61 -45 52 -136 8 13 15 32 238 14 97 -20 46 -60 -135 -1 39 71 -10 191 -99 -128 -123 115 79 -50
3399 -50 -38 38 95 -48 77 -91 33 -62 -87 49 -12 -43 -118 130 -139 298 80 -29 -3 -136 120 -56 39 -25
3423 -25 -38 -73 -108 -227 38 173 -118 -47 31 -67 -11 -7 -19 -60 13 186 20 151 132 -67 56 134 -104 -73 48
3448D8J09k6k14J27R5l03J45J00k75K20j28L5K33j09j2q7j3J49j09Mo9K10k54
3471a24P6J51j33J30M9q1q7J23m7k90J39K39j79m5oJ80kj0r0R6j69k1K14m3j96
3496a26j54L72j81N6N8P4k38K10K13l94R4moJ80k15P4L6j18p4K46j63j6K28j94
3520d2J3K5J96m09K12J48j72N4n3O4j8q9K5j5l5r8J31J38N6j12j69K89j4k06l8
3545a19J67j05j16K77k95J77kM8L1k14RJ42L8m5lK08l43n1J48m0J38R4j51j24
3569a31r8L29O0l22K76r1j61J37Q0O2j53j19O1K12j25J8k5K8J07J68m35J57l0
3592Ep5K17l0j7q5j85K72k2j08j9J50p5k25K17m1Q0j9j24J29J92k14o6p6J8N4
3617d7J52k66J99j59J98j31k2J44M6qK5j11Rj16J73o4L5l5p5lK08j50q4O3J5L1
$$ plain form
3448 48 157 131 -83 44 139 -164 -19 81 -194 26 -102 -67 166 57 45 -42 -55 94 -15 -11 -80 130 -124
3471 -124 -48 103 -30 100 149 68 -19 104 57 -233 -94 145 -34 -79 -85 95 93 83 -7 89 -80 -101 113 70 -126
3496 -126 -280 92 -89 -33 25 99 -139 71 284 -110 -16 -20 -26 154 -61 13 49 -69 -143 103 -60 -76 152 -42
3520 -42 -29 -4 192 -217 -5 143 -29 25 -28 36 18 -71 -46 -61 -96 -194 -63 75 131 19 -150 139 125 -81 -119
3545 -119 48 -57 -173 104 -191 -14 -16 32 63 -151 -142 0 38 -7 -10 198 -145 -196 -48 -88 50 144 -7 -131
3569 -131 -229 100 160 -162 114 23 -138 -1 79 141 -12 -131 -70 142 17 35 10 38 145 313 -122 35 5
3592 5 -70 147 117 100 15 -170 102 80 -28 -47 103 28 -197 20 -21 59 40 -84 45 237 23 -43 -119 -101 -47
3617 -47 105 -161 38 -121 77 -54 -76 68 114 106 131 20 29 -87 86 22 57 22 -53 -56 152 2 -82 -19 -4 27
3643B7J52l5o2J0M5Nm5r8n4K50j85p2N5P0j40J17L6J12k32K42j40j1j31P2p7L16
3669B27k84J11N3j11L3j40m1J63L9K7j29L2q0J52J61l15K09j15J40r1k3J9n5J20
3693A02k61M22j78l21mJ88J03K1j77l1L55q8j89l6k1L5J57Q7p6J1k7j33J56j26
3717c1k03K05K0pL3p6N5p5K9J69r1r3J57j44N7j55K68N7j19k5J07k66J39K48l08
3742d9j9R4o2M3J57q7N2j98j94M08j32lj49J13Rq8K27j50L8k6q7L83l00K1R0j98
3768a07J45k30N8J93j35J19K4k4Lj41m6Q6m3J60j22pQo7J83o6J22OO5k59K70j19
3794G6l40K46J57k79K41j14q4M8l0K0N0l77N28j44o5o5J46j12j0m7J95K8q2R7
3818H3k29K31R5l22l1J69o3M6M5Q8k12J66j86j3J36j8m4m2L95k13n4J60l55J96
$$ plain form
3643 27 179 144 82 92 137 142 97 -1 -55 195 10 -62 -7 63 -77 40 76 188 -44 198 58 47 -84 -12 -89 227
3669 227 -57 54 107 -4 29 -111 -152 11 50 77 -52 -20 -100 52 213 -102 107 -8 132 41 18 37 -18 102
3693 102 -159 263 85 -236 -240 -52 51 72 -105 -136 219 131 -58 -94 -115 -80 77 164 88 99 72 -61 95 -31
3717 -31 -234 -29 -9 -16 17 -59 -4 -79 -50 119 28 -65 92 -52 5 -150 118 175 56 31 138 -128 11 259 -49
3742 -49 -68 26 -36 7 164 77 129 -69 -263 145 13 10 -139 -26 -17 -105 122 -28 10 -16 -103 280 -20 1 91 -107
3768 -107 38 -192 -134 59 -76 43 67 43 46 -95 -141 -55 -98 62 -60 -67 -59 -126 57 -9 113 119 184 -75 195 76
3794 76 -264 -18 139 -140 101 -13 -97 -49 -79 -59 -9 -386 142 -2 -67 -132 14 -98 -108 -155 40 68 -14 83
3818 83 -146 85 180 -142 -173 -4 -67 -21 24 112 -100 66 -120 -133 3 -15 -59 -101 294 81 27 187 -168 28
3842B8q6J6L30l00J22p9p1O9l8R8J7j4m4o0K3J06l79N02j72j00p9J03J71j43K0
3867D0K6l8j87J33qm8J6N7j08J97j70Q9J09j80J02p3R9k13N9J67Q5j75j47K12
3891D4P3k9k14N1K18j9k30LJ36j98P8R5k34M07j67j01J75j1j18J75k02J0j62K16
3915dj25J02Qj7K2K7R5j02N7j68Q1K76k02n0R0q2J04o7j06O9r3O4k4R7q4n5M4
3942d3K55j93j09P2L0P8j26P3n8j13J13M7n3J18j0j19J62l56L46q6M9j60K98k59
3966d4j3nJ24k3j10N5j4J18k13J01l8J53l1o8k65J95J94o7jK1j63m3J57j70J14
3991c6J39l0o7L05l32K8J94m47J07J33j43K09J08k10J62j1k40K6Jj33K27j11J21
4014@j04L1L25l24j97K93P9k22R1j2j09J43r7J97k3O7P8k09l14K60J17j08P4k07
$$ plain form
3842 28 -58 -42 288 -12 110 31 -40 29 -9 89 106 92 48 -12 11 117 -262 240 68 -32 -111 -8 163 20 40
3867 40 66 28 -159 -26 -34 -82 -66 -9 -117 80 -90 -1 108 -72 30 -43 56 -157 -98 69 154 -21 -168 44
3891 44 117 88 -126 -75 143 124 -106 -103 33 -165 -87 8 -226 181 14 -87 88 77 -41 134 -68 -58 -220 -4
3915 -4 -129 -27 -19 -36 -14 13 108 6 63 -105 -24 252 50 0 90 8 112 45 -61 8 -85 -21 -45 52 -32 -87 -43
3942 -43 212 19 -90 -18 12 90 -36 37 -21 -134 -21 26 -27 91 81 -38 124 -232 114 28 77 -83 215 -44
3966 -44 -57 -62 62 39 -71 -16 -30 88 -125 -24 -62 91 60 -8 -273 -78 116 49 48 69 -94 -137 20 -150 -36
3991 -36 103 73 6 311 -21 7 201 -246 -139 -6 -149 60 168 -42 120 109 -131 -105 -104 -237 -10 -121 0
4014 0 -104 -73 252 -72 -269 24 103 -119 -28 -40 -149 -6 -103 94 71 138 216 7 -307 -47 70 -38 36 -171
4038a71J61k98N39k43j1M9J76j99j94M62l79N9L8q4M8Q9M3j91j14R5R2p9K05n6
4062C7J65k21m5J24o3Q6m2o6J50j22m5o9K25q5j11l3K54j83L4j71N6J86k80K21
4086BJ64%q2k22J11M21m45J3M3p8J60q5l4Q7k5k2k1R1j7j4J51j98n5j79K34J75
4112A75j26j33K0J5P1j11O7K69j41j67r3K24k50K34k88R3J12J13J94l37Q3l8J06
4135I2l6K13k44J81l66J88q5J20L7p6j64j1L25m6k96L76k42J96k31J59p3J81p5
4158A23q3j84K91j28o3R3n3Po5M8J1Mn2J97j74J3j72L60k61J4q7L8K58N4k66n7
4184a34R8K14k62j41J29n8l4P2J21K08j95m3J0j48J39l4K6R6J19k30J09nj9M9
4208H7m8L9q3j35K46J00j08j19J81p7n8p0o4J65p2P9m8j40NJ94j82J97J02k93
$$ plain form
4038 -171 -10 -308 231 -12 -23 26 202 3 -191 271 -108 -49 -11 -95 -47 42 85 -106 -220 -125 -33 -112 93 37
4062 37 202 -19 -64 60 -3 83 41 -25 125 3 -42 -111 114 29 -82 -115 139 -44 -10 -181 -125 61 -219 2
4086 2 166 166 84 -138 -27 394 -51 -38 5 -73 87 2 -32 55 30 8 -13 78 61 47 198 0 -55 -234 0 175
4112 175 49 -84 -64 -49 22 -89 -22 247 106 -61 -154 70 -180 54 -234 -141 -29 84 278 -59 24 -14 92
4135 92 56 269 25 206 -160 28 -57 63 100 24 -140 -151 174 128 -168 208 -34 162 -69 90 17 198 123
4158 123 40 -144 147 19 -44 49 -4 3 -62 -14 -3 1 -51 146 -28 -15 -187 173 -88 -74 -161 -123 135 189 -77 -134
4184 -134 -36 178 -84 -225 -96 -154 -188 -116 5 213 18 -25 -15 -163 -24 -58 -32 64 183 -47 62 57 38 87
4208 87 39 78 -5 -140 106 206 98 -21 160 83 25 -45 -109 56 -16 63 15 -125 -120 74 -108 89 191 -102
4232a02m8Q6j12J80k9j63P8K86j63Oq6k7K19j69q4L17j23R9j42K00l38j9J19J18
4256A03Nq2o1R1j42J81j3j95K8J11j74L03j41j50L75n8J14k37J71k67N9j38J5
4279a02K22j94L90l53J21k8j4o9N3j5L0n7K1q9k3J22M7J7j61j55N7J96j23q3K90
4304A00j72k3K00l1K8j79N9J7qJ00J19j20o2j6J98k27J76l49J80j00MK08K28n86
4328b56J13J52q9LN0N7k49J55J5J80j00n5j64P7J33p1R1j31J26p5O4P5j25N8Q7
4353A21q9J64k99p9L41j20Pj66n2K45j34J00L5l4L2q1R4k15nL13n10L26m8K0O
4378b8K2L9j25l2q5J77o6K28n2J4q4J07j36j00k9K59J39l49K70l77L57j11p2J04
4402G0k73K4K86m17N79k54NN0o2j32K39k31K2q8K63n5j59O4J8L5p8J0J80o0j16
$$ plain form
4232 -102 -150 -64 -176 4 -25 -188 -110 176 13 19 -67 -94 125 -44 -128 189 66 165 23 223 -115 -134 -15 103
4256 103 108 26 -35 56 -86 95 82 -113 -85 26 -148 155 14 -136 239 181 295 58 229 -38 21 -117 -102
4279 -102 120 -74 316 -37 84 56 42 -27 26 11 41 -16 5 -84 -107 15 62 79 -82 -237 -180 16 -107 -190 100
4304 100 -72 -95 105 74 102 -77 -18 -1 -9 91 210 90 28 12 210 -17 159 -190 -10 -110 -106 102 330 -256
4328 -256 -143 9 -80 -77 -27 30 -219 -64 -49 131 31 -24 -188 -111 22 -49 42 -89 37 -38 26 101 -24 34 121
4353 121 32 196 -103 -182 159 39 46 -120 -172 73 -61 39 74 40 72 -9 85 -130 -135 178 -332 -6 -54 -34 -28
4378 -28 -6 33 -92 -124 -209 -32 -98 130 78 92 8 115 -21 -121 -150 109 248 -101 169 -208 149 38 -34 70
4402 70 -203 -179 107 -310 269 15 20 70 8 -124 115 -116 -94 -182 81 26 -133 -69 -51 -16 -94 -84 96 36 -80
4427h0J01j1J10j27J01m2jj15J37l4K13l18j8JJ28j53J74j16J61l4p0k1K8M6k21
4452a61J87k8J25j45j64J21l7J60O5j61J64j15p9J76k06J54j22J02O7j99k5J22
4474Aj26R3J46r5l9OJ85j13N0k01J08q3m8J19p3L23j54p5m9M0M8j68Q7J66l1j67
4500e0M9N6k53K27M1Lj21P3J8k89L33%r5j54N7O8j05L93k90J09M1j15J9Q2j08
4525a1m2j2J11M0k2p6L8j07k48J63J18M0m9P0Mm7P9j02J39j64O8J75l50P0J07
4550hj18m8J99m7J08j26n6J56n2K54l27J28j19l7nN5P1K40j05j01j09J93j77j51
4574a82O9J55m7j2J3nj85J17mK33j7p5Kj36K5J3M7K8O4j01OR4j81r3L23l30J69
4601a0n8J20m2P5k04P6K23k12j28K57k64J43N4j8OL2j38K13j48l0k2P3j81K17
$$ plain form
4427 -80 21 10 120 -7 94 52 51 -64 73 39 252 -66 -84 -83 45 -108 66 -50 111 77 7 -14 14 60 -161
4452 -161 26 -2 123 -22 -186 -65 -102 58 123 -38 126 11 -68 108 -98 56 -66 36 103 -96 -121 1
4474 1 -125 -32 114 19 -20 -14 171 58 108 -93 15 -68 -116 3 -70 253 99 24 -25 15 63 -105 -18 148 117 -50
4500 -50 -1 55 -198 29 70 73 -48 25 43 -246 87 87 -8 -162 -105 -37 -142 251 -39 70 111 -4 15 97 -11
4525 -11 -53 -65 46 86 64 -12 26 -81 -329 -166 -48 -8 -57 13 17 -30 49 -53 86 -78 -10 165 -185 -115 -8
4550 -8 -126 -174 25 -22 86 -40 -96 60 8 262 -65 63 -56 -93 -98 -43 28 268 163 62 -47 146 -31 -182
4574 -182 -113 42 -5 -17 -4 -9 -194 -77 -81 152 135 60 62 -74 -49 -36 11 39 103 2 8 102 -79 -172 151 -179 -10
4601 -10 -68 52 10 85 -119 -43 180 -32 -160 97 -167 -24 30 12 18 50 -88 125 -23 -53 -75 -2 -183 34
4625C4kk3l1o8J48J01k7r2q6J6q6K0J36r4j31K31L4J14j16j14K0j37J51j24N1
4650g5mK70j60n8LJ40k22K69l81K04J35l4q9J06q2K6kO5j20M1q0m0M6J18p8K35
4676B33k14P0q9j05J19o9J41n5j13J08p4K6L9k25N4K84j49P9L5j15J41j70K66
4699B17l62K42p1k6oJ01lj23K03j83J91k03J85l29K5J18K84j51q0j33K14j25n0
4722f5J39j16k7j57J20R9K45j87n1J15r8R0r2J12k87J56o6M5K36k58J4j00J22
4745a1m3j7J43k27J40J31L5j46p1J8mk8J42J5j47Jq8N4J88r0j36N7j31J09J04
4770bj27N8NNQ5j74K80j47Qk2l0N3P6j55K56j99k21J07K38q4J35l5l8Q9j76Q5
4796G0j85K13n7o1j7Q4j93J60l2jK26k09Nj9j13j57K85o3K6o6J85Q4j0J63k54
$$ plain form
4625 34 32 9 -22 -90 58 159 132 40 -46 -30 -116 -96 40 -54 -185 46 80 194 78 -36 -16 -153 -2 -126 -75
4650 -75 -79 191 31 -27 -24 116 -106 163 -218 -14 121 87 -2 104 22 48 46 111 -9 32 -48 -88 -42 76 -2 233
4676 233 19 89 0 -105 14 -55 86 31 -82 26 -48 -22 17 -208 -154 130 -19 60 95 -20 121 -49 217
4699 217 -145 97 26 0 -6 95 92 -31 172 -11 180 -23 162 -167 -142 -24 260 109 29 -104 110 -15 -65
4722 -65 74 -42 -69 -226 -106 -7 238 51 0 115 17 107 15 127 -160 -4 -70 -25 211 -47 -33 -133 -11
4745 -11 -54 -71 72 -155 -15 116 151 5 -66 -48 -52 -80 62 77 -70 -69 -157 -103 85 -5 -141 -84 -215 -106 -2
4770 -2 -129 -71 -66 -61 24 -150 130 -17 -9 -31 -61 -8 68 -87 169 -30 -251 -144 94 10 145 110 72 161 -15 70
4796 70 -115 98 41 -20 -37 47 -146 14 -18 -19 207 -2 3 -16 -129 -286 -1 -64 -38 -104 81 165 155 318 64
4821F4n4j59K42Q2o8J24j93j77J3K03R0j81m2q8L33m6j63M9m9N7j42J02m0m1m
4846h8J12K21k09n3J36j56K1QJ71j71Rj6p6L9J30k50J89M0K3N4j2l44L67k18J36
4871F3l4J73L5j81m8l2R1J4l1JL7o0o9P2J55j73j6l0l9K88k98J52j47L29j12k07
4897f7J15J36j36R6p3l7k68K42m0Q2P8k40R0J06k22O8J88j59J44R9m61M02j73
4920c0q4R0P3J03k12j1l4J97k92K02J54j95Q8qj4R6l24L12m0j85J68k40L58n0
4944A22j86J27P6l7q7K04k40P1k6k5n1m0J00j45R6M7k02Q7J65j85K37j50M4N3
4968E5q2Q3q0j73J9J53J81j39L4p0K4l9M9j14kJ62L5m2m3k09J11K81j68Ok37J51
4994e4p5J41qp1Q7j14R3j7j7P0l55L55j48O1K6J22n9j01L9j51J06O1k5o8r5K06
$$ plain form
4821 64 10 -149 93 175 107 231 38 -139 -126 77 167 -14 -56 -144 189 143 -20 29 -20 37 -105 -3 -43 -84 -88
4846 -88 24 245 36 -17 119 -37 -16 -8 163 -8 1 -15 -91 -52 78 -172 17 57 80 134 122 -222 145 -73 63
4871 63 29 202 237 56 8 -24 67 81 50 51 88 28 -41 31 186 13 -3 -33 -72 216 -82 70 -77 252 140 -67
4897 -67 48 184 48 144 71 34 -234 8 -32 50 128 -112 -22 84 -138 -70 118 -41 103 202 -259 143 -30
4920 -30 -114 -24 49 152 -60 -71 -105 92 -200 2 156 -39 49 41 27 123 -201 111 71 -114 54 -186 172 122
4944 122 -64 63 139 102 15 219 -21 50 24 -1 -52 -92 8 -137 -41 6 -196 -109 56 -129 108 -42 2 55
4968 55 -27 56 -24 -197 -178 -25 156 17 51 -19 5 -34 15 -99 -101 61 96 54 11 -198 -87 194 26 32 -205 -54
4994 -54 -129 12 4 -67 20 -94 -1 -18 -35 35 -320 35 -113 -52 -26 96 37 -64 -25 -176 -70 -9 -34 -102 -197 9
5020IJ63j15j44k2O5J65j28k06K38P5j45k1K01l27K35K9j10J53n5r7R5j43m4K29
5044A00j56l5K6J61j97P5n7J63j13r2k2J63j54J40J49k73Mm9Q5K5R2L8k62L97
5068B08p1j70J22j54R9k43Q7O5J10j35J16m1n9J90k6j16M2j72P4J14j83K51k15
5091a07J78lo2j8J50j91P5j04J04p6j95L64n4p9q9K13j38M6Q5J9r8m9J48j64J91
5116A46m5k07J92k50K10M0l1R1j7n3k38K16j1N3j75N4m4Lj0K43k23J10p4N2J45
5141A77n2r7r7mJ09K7Q9o9K6l9K6j96K20j00l23K96k4J2J06j72j0J88j7k29J94
5166D1J3j16K2n3K23k13p9J92j37J59n0k18K81l4n6J38j41J34j81N2m2O8K3mJ2
5191C4L4j66p6lQ1K15j58q0Q3L00l41J61p2O1P3k65M8Mk0J09k61K49n7m4o9L0
$$ plain form
5020 9 172 57 -87 -109 -44 121 -7 -213 25 100 -45 -66 135 -192 43 72 -38 115 60 -37 58 -85 -129 100
5044 100 -56 -91 -65 96 -101 -26 -83 80 -33 -125 -147 16 -138 2 151 -122 -118 -167 -82 -57 35 73 -189 208
5068 208 137 -33 89 -65 34 -209 -122 -57 53 -82 34 -7 -66 124 98 -18 24 -148 -74 40 -143 108 -107
5091 -107 71 68 6 -12 138 -53 22 -82 22 -54 -249 115 61 -18 -107 106 -32 14 99 118 20 -29 119 -45 146
5116 146 101 -106 86 -164 46 86 55 146 129 76 -162 54 43 96 -79 -25 -69 -66 -76 167 -56 54 -20 32 177
5141 177 125 28 -69 -73 36 63 152 83 109 70 96 -100 120 20 -303 -7 -31 -19 87 -85 -95 93 76 -153 41
5166 41 54 -62 -40 -93 130 -83 -162 30 -107 52 2 -216 65 31 -25 113 -28 106 -75 -23 -65 3 26 22 34
5191 34 68 -98 -174 -177 -96 119 -39 -119 -36 264 -77 84 12 73 146 -119 -71 -67 -87 22 -239 10 -47 -91 -160 -130
5217a30l7K45j06j09J00J7J23k9L4j29J62k51J19J24m72Q1L36R6R3j94L6m1J02
5240A70p8l43J56J87j73mJ08LL0MO0J6j24K2o9J8K10k50J40qK5j02J27K9l34J68
5266a2j34J31J23j48R1q9l4K37j55p4J69j27r5J62j3J92j98J22m9j85mO2N6N9
5290H7j57J97j40K89m00K28j82J61k1j71M26n01J87O7K4j49j06L75k83O8Q9j01
5312a3R4j21M2k33K05q1J69m1j10q7J35j51Q4R6Mn6P3j9K24j63j23J70P9j48p4
5337d5p1j2K09l9q0J53M0k40N4L5O7j2J56l22J61l8J83j90n3J14l14K60R7L9L
5362A55j95J20pm3j38M7M4L8P8j10R9Mk34L29k40J68k12O7J6K13k77J68j7o8j69
5387a64K97j97N8J4n1K15p3k41J16r6q5K59n6J34j53J7M9J5k8k4L5j19K51j73
$$ plain form
5217 -130 -167 78 -28 -137 -37 -20 103 74 108 -21 141 -110 9 133 -339 -258 78 174 267 73 109 68 170
5240 170 92 -251 -95 92 -81 -85 23 26 56 60 120 136 12 34 -35 -17 193 -57 83 75 100 -2 125 154 -180 -12
5266 -12 -146 -15 108 -40 51 -38 -72 165 10 -64 105 -22 -117 45 32 224 26 148 99 -86 -90 -28 28 87
5290 87 -70 127 -13 276 -124 104 -78 83 62 -109 317 -184 3 70 94 -55 -161 214 -69 -1 88 -13
5312 -13 81 -40 2 -231 -26 -107 62 21 -89 -176 -41 -192 -108 -12 -8 -64 9 -10 214 51 -72 98 177 29 -45
5337 -45 -116 -128 81 42 -38 115 155 -85 -31 4 71 59 215 -107 54 16 199 9 -44 70 -244 16 113 152 155
5362 155 -40 80 73 30 -108 -61 -17 21 99 -11 88 92 -142 187 -53 115 -97 -30 -14 199 -78 90 73 5 -164
5387 -164 133 -64 -6 8 -43 172 99 -142 -26 -122 -207 52 -4 130 -23 -6 43 58 30 6 41 -78 173 0
5411@j36K25j81J08j10J71p4j26K33k1rk14K8J95M7k3j39Ok8J99j70K18j86M1
5435E4L9m4j7rJ4M9j55K12j62j54J5J40M6p8n8K09P1j21p1J4pO3J60k19j40K0
5461a29J2J05j74K40K30j91l04J01J24J23r3J76k34J18j58K00j39K7P2j9r6j19
5483a28L21k76J00Jj32K40j82R2k71J87J3K8O1j64J08j49K17j88J1Q0J30p7j81
5506a59Q2KJ7J24p8r1R4KJ9m9J00j81O9J3K30k00j20K31o4Kj29nJ27j18j9K67
5532A66lj56k9q5R6J79j57l7K9j04O8j07L36j94m7JJ96j92qON4p2k9N9L7j09P1
5559c1r1K89j35J13J6j75J00k20J21Q4N3j00o4J4O5j46j6J92p1l7P9qK2J23k32
5584e5R1j39L45j32k52J67Mkj69J10K35j90J05j31q5L27k5l26K08k8O8k14kl7
$$ plain form
5411 0 -136 89 -92 16 -94 77 3 -123 110 89 80 -134 -106 89 136 113 -26 -20 -48 151 -19 199 13 54
5435 54 93 49 32 23 37 86 -69 143 -19 -173 -158 -18 28 -50 -108 101 172 51 -20 -6 -13 50 210 -9 -149 -129
5461 -129 -117 -12 -186 54 284 93 -211 -110 14 137 44 220 -14 104 -54 146 7 34 106 87 -9 -128
5483 -128 193 -83 17 18 -114 126 -56 36 -235 -48 -35 -7 54 -110 -2 -151 66 -122 -111 -31 99 22 -159
5506 -159 -77 -75 -58 66 -12 -103 -9 -7 12 -37 63 -118 -49 -36 194 -6 -126 105 41 43 -86 -91 36 -82 -101 166
5532 166 163 7 -22 -107 -11 168 11 -26 3 -101 -33 -140 196 2 -45 -44 152 -40 -48 -42 12 -60 -89 -30 7 -102 -31
5559 -31 -122 167 32 145 161 -14 86 -134 -13 71 124 24 -40 -26 39 -107 -123 69 -2 -39 40 32 54 177 -55
5584 -55 36 -103 242 110 -142 25 29 27 -142 -32 203 13 118 -13 -98 229 204 -122 86 58 126 -88 -90 -127
5608a27K80j31j28R6q5K20Q3k0k62k9q7J44O3j76L77j15r2k6J09k25K01j06q1
5631a17K72j26r2K18j42M3N7k06J76K11l54nJ04Kj3K7j80J66r5n0J64n5kj58j6
5656a71J9J88R8j79j33N9L0N8K7j2m2J62j71j13K26k75R3J02J3K02m82L05R8j74
5680g2N9k1K00m7q4P9j54J3K76l63L8J56n5j07R2p0J05j65j35L17j72rK41j44
5704b2P0j12K84k16j52N6k0J51Q2j56j20L38k52j71K97Mm3r2k6L56k57j10J4J41
5728D4P1O2o1o9j48K28M9k74J62m4j34J19p6o8J76p8K92j84j85P4J47k22N7MJ58
5753A00J7r7j37NP9n7K36p8J28k91N7K53j60n9l9J09q4P2p4M0p2r1K04P7m9j46
5779e7J67p0K6k3j74j8J80K6q7J44J6j63K69k57l2P4j41R1K6p4JK9P0k2p4K36
$$ plain form
5608 -127 153 22 -106 -10 -95 125 208 188 -74 -103 -190 -46 17 -159 218 103 11 -15 94 -131 70 -36 -117
5631 -117 155 29 -63 155 13 56 113 -93 83 294 -60 -65 39 41 28 55 -125 41 -54 -104 60 5 3 -155 -171
5656 -171 -152 36 134 -45 -178 -119 -89 -31 -4 -16 -58 104 -67 -180 46 -229 -136 -34 -21 181 -301 4 102 -72
5680 -72 -13 -34 166 119 35 114 -40 -27 249 -114 -76 80 25 -82 10 -60 45 -120 -255 62 -110 -119 122 -22
5704 -22 48 -64 220 4 -148 -92 -112 39 121 -35 -155 183 -69 -240 57 61 18 -74 -100 256 -1 -111 -97 44
5728 44 115 177 116 47 -101 127 176 -98 64 20 -114 5 -71 -139 37 -41 251 67 -118 -44 103 -119 -62 -58 100
5753 100 117 20 -117 -112 -33 -90 146 68 196 -95 -38 215 55 -4 -43 66 -18 54 -20 20 -52 -143 61 138 89 -57
5779 -57 110 40 66 43 -131 -149 31 57 -30 114 130 -33 236 -21 -53 21 -120 -29 -3 -77 -76 -47 23 1 -73 163
5805A63k90P2O7l6M9K24m08J47j12kK44k54K28k05j45J43K01k42L49j97J04M2
5827A42j44L8jj39J52j16r8J18J55l08L46q4j53p4K78j60k08L40j23R1j37K08
5849A23j86Q3J37o8j16%j15P9J46J6R6k48J45k19K36m1p3P3j21J64k15J31k3j53
5873a49N4J41K6k51K27j68J75J14m31M39k70N7J69k46MK54Rk39Q5P2Lp8K49k28
5897A8O5r2m4J44m7M0k96L69j24L4L2l2j58K22j10N2j04RJ6j3J55j8n9j54k1J09
5923gj07R5J45k60L1L0J2J00j11O2K0O0j94J86p4J04r2P8j27P5j14l2J95j42L6
5948c1J16p0p4M7n5l4j34K05K06k07O5k93K44j7J4j56J63K1N0n6j84K37j20J34
5972G1n0J29M8k12j59J19LJ33k91K76n4N3L2r6%r3M2J7m4r5K95m4j16R6q6N2O1
$$ plain form
5805 163 -127 -55 12 -24 25 249 -159 -12 -124 -126 118 -136 92 -113 -258 -115 86 -156 193 -4 100 142
5827 142 -2 36 35 -104 48 -68 -166 -48 107 -201 145 61 -92 -166 112 -48 -256 84 -39 52 -85 123
5849 123 -63 20 157 89 -27 -27 -142 -63 83 99 195 -53 92 -127 109 68 -5 68 -53 111 -104 27 4 -149
5873 -149 -95 46 72 -179 48 -120 55 169 -262 177 -93 -36 133 -113 -109 145 154 -85 0 72 75 -3 246 18
5897 18 83 -9 -53 91 44 84 -212 157 33 67 99 67 -91 131 21 73 -31 -22 -6 -19 136 118 59 -95 -116 -7
5923 -7 -114 -19 126 -134 -103 -73 -61 39 -72 -10 10 70 -124 62 -12 92 0 78 -49 26 -88 -120 75 -67 -31
5948 -31 85 15 -59 -12 -67 -101 -235 -30 176 -31 34 -259 -15 -32 -18 -174 -11 10 60 4 -180 57 -63 71
5972 71 21 150 198 -14 -173 -54 -51 82 -209 67 13 66 98 2 2 -91 -49 -32 -76 -171 124 80 -36 60 -26 26 87
5999H7j23L5K2K16l02k23L06l4J4j76J44k5N0k3R3j23J02P4j81K42k85K12k10
6022a08n9Jr2M46l90K49L5o8k2Q2R4Jj11J27k02j48N3OK28j41R3k09K55n4M6m
6048A08j01j9j61J53Q4J24n8j47r3K59k01j56K55q2J8k09K27J10k48J56k6L7j96
6071a66J42m0OJ71m1o3qko6P1k59K19r5nK78l19L4K38j18J6j54L37j81K6M9j06
6097c6r0J74k26J86k18J51K15k72J18j45K65q5o9J64Lj67j10R1K0J94p6o0rj33
6121a15J12j46K48j45P6K3K4j07J00r2K7n8N8O6m5rj42m6K36PL09l20R9j74K5
6146A1P2j04l7L31l14j99J10J1K51M5l46K89r6M3j08L9J39l31N3K72j1k72M7M1
6170f4L2K74j97J36J7p6k91o8L29M5k69K17j42J34j02j79L06j11M0k0j17K6OL
$$ plain form
5999 87 -36 -1 21 237 -65 -288 18 -16 -2 -178 -34 -59 -9 -32 61 -62 40 114 -67 175 -110 102 -108
6022 -108 -167 -166 -258 188 -202 47 82 14 -8 74 168 169 58 185 -17 -165 -112 -106 122 -19 74 -135 120 66 112 108
6048 108 7 -12 -173 -20 64 188 130 -17 -110 149 -52 -208 47 -35 -17 -226 1 111 -137 19 -7 30 -166
6071 -166 -24 -64 -58 113 72 9 1 -1 -67 4 -255 -36 -131 -136 142 -177 -143 95 -23 -7 -161 176 -5 21 70 -36
6097 -36 -126 48 -178 8 -210 -59 156 -116 2 -143 122 37 -32 132 135 -32 -142 -51 -31 163 87 27 18 -115
6121 -115 -3 -149 99 -46 30 53 77 -30 70 -22 5 -53 5 71 26 17 -125 -171 65 72 381 61 160 -14 11
6146 11 83 -21 -58 273 -41 -240 -130 -119 132 177 -169 120 24 67 -41 -2 137 -194 -141 131 120 -152 -105 -64
6170 -64 -32 242 45 181 198 122 -169 -237 92 137 -132 85 -57 77 -25 -204 102 -9 31 11 -106 -80 -74 -71
6194g1k9K23%o8J56Mk72J04J4J50l51J31j57M18j80p6Q0r5m1J10J0q4J81j16p0
6219b9Pj04q2K40l1P3Q6J2m6k34K56k54j64L26k26l7J59r2M17p8q0P8j49J38L
6244A89k97J16J7j81K21j44J60k31J86j51k8J11rJ02j59K92j00k73K65m4j60R5
6266b3oK32l72Q3K53k49J37pk10J62j40L08l35J24Q9j46J26j81J74l0m9J09P0
6289A19j56J10L7j12j02P7Q5N7k56J83J21j17j26R7j12L52m16m8L40m1j88q4J15
6312f5j2l1J29K6k00J12Q6J08l25K62L1l01K43N3j49P8M0k15K27m2N0lJ6q2K08
6337B44l4j82J48j29q0J10Qk42K92k09J16l4J37l3k14K13k42O2J42P4j57J02n6
6360C6l7n6J05m6R5n4j06J54K2j80j02QL10j51L7P2j80J16r0J24j73J65j46K4
$$ plain form
6194 -71 -100 123 123 55 211 215 -57 47 61 211 -140 -9 -166 252 72 -4 76 -19 -60 50 60 -24 157 41 -29
6219 -29 -22 -126 -208 32 1 74 160 172 126 -108 148 -106 -270 56 -170 -207 -48 -140 277 199 119 197 48 186 189
6244 189 -108 8 25 -156 65 -79 81 -150 36 -115 -143 -32 -41 61 -98 194 94 -179 86 42 -118 -23
6266 -23 -29 203 -169 -86 167 -82 55 48 -162 0 -140 168 -167 -43 46 -100 26 -155 19 -11 -60 49 119
6289 119 -37 73 110 -2 -104 -27 58 115 -141 42 163 46 -80 17 -95 257 -159 -207 133 92 -96 -180 -65
6312 -65 -77 -108 21 47 -153 -41 45 153 -172 90 121 -180 63 116 -33 45 85 -130 97 55 105 102 118 36 244
6337 244 210 28 176 47 -33 77 85 -157 135 -74 42 8 145 112 -102 111 -131 -69 73 147 -10 92 36
6360 36 -1 -57 48 2 97 43 -63 91 113 -67 -169 -161 149 -2 35 107 -73 43 -47 77 -96 69 -77 -53
6384e3J07j37O4k2Q1Lrj63K4J72k86K07J66j94j04J70k25J78J17r0p2OQ5k9J09
6409A05j11K5Qk5M29m19J52j88K09n14L47r4K53j44Km6M4o3P1K0K4q4N8j03J02
6434E8k1q7L08j41j79N1r0j01M00k72Q9L12j25j3l06K9N1P8q5Q1o0J82j2j50j6
6459a9J81k21Q0J0O7M0j58q2J2K82p8k07Nr6J04K78j69p9L8K4nP1N5k81J05o2
6485a05J34j11R9j8k38J98J41k25J95O5j09k73M75q4r0K9j02J45l74L46m4l51
6507b97K80JQ4m0j16rO1K63l74R1q1J68L3o4j55K66k08R2J76j64K5k2p5L10l34
6532h9l6j92N39k38p3J63l82M19K8j69L7j37N2j40J65q6J16N3Q1j03j45q0K18
6555AL4k65J11m1n9Q9m1J30j5L3P7j23J1J2l0J70n8O3j65j67L11r9L67l92qJ08
$$ plain form
6384 -53 54 -83 -19 -41 40 43 34 -129 -105 67 -219 -12 154 -40 -144 26 -199 -21 96 6 -66 -60 25 -4 105
6409 105 -6 19 27 2 431 12 164 -24 185 -329 18 -76 177 33 35 -11 33 -30 41 61 85 1 59 -44 58
6434 58 37 -50 258 117 -62 -11 -101 -202 198 -74 15 327 202 189 -117 -88 -37 41 -44 37 -23 159 147 -3 -19
6459 -19 162 -59 21 31 98 138 -20 -102 -90 192 114 -93 -88 -184 -80 198 29 -50 -12 12 7 78 133 -148 -43 -105
6485 -105 29 -82 17 -1 -239 -41 100 -125 70 135 26 -247 228 144 54 83 -19 126 -248 98 54 -297
6507 -297 -17 -16 68 28 -88 -97 -36 227 -147 -56 -137 31 64 0 -155 111 -97 -5 171 7 32 10 -65 245 -89
6532 -89 -125 -317 222 -16 -89 74 -308 111 139 -30 7 -130 -78 -218 -53 -139 -23 30 111 8 -137 -217 1
6555 1 35 -230 -119 -160 -219 -130 -171 -41 -56 -23 54 -69 -58 -46 -76 94 36 99 -66 -233 78 -21 346 -46 -54 54
6581E4k29L09k03j09J03J40j53J22J80n9j55J01k10J95K5j25M3q9M6j05L13r2
6603A02n8N9p2O1K9o9lj52L09j77PJ19j13l5j24J4P3M3J07m7q2J87j93M3P7l20
6629b15K00n4O8J51N4l07J12J57j34k12L52k38P7j21K63j71O7q0j65J93r1K34
6651A40o0mr1q3J65q3O6l6n4LK07k26L27k78kJ69j0k79M6p1K24N7r9M61m73M9
6677F5j62j16J95l4k0J59j04N5j63Q0J65j69m3Q1l1K32l08J66j71P8m8j48K87
6700D6l3j9k5J02q3m0N9q0j15M5J55o7MJ08n1o5K5L26k11j70J26k18L08r2K5k2
6726C8k13K52m9k23J47k2l3J68nk64M31l11J58N7j00P8k33J45j16Q8n9K79k24
6749a1n0k22K68L7J4l2R5J7j33j2j03L63k01r5n2J95j45K10N5k00M5R2j14P5k57
$$ plain form
6581 54 -175 134 -69 -178 -75 65 -88 34 214 155 0 101 -109 86 111 -14 29 -60 -14 -119 194 102
6603 102 44 103 31 92 121 52 49 -103 206 29 36 155 42 7 -117 -103 -30 13 120 73 -9 178 -15 28 105 -215
6629 -215 -15 -69 -1 150 204 -103 9 166 32 -180 172 -66 11 -110 153 -18 49 -31 -196 -3 -94 140
6651 140 80 76 -15 -98 67 -16 50 14 -40 -37 170 -56 271 -7 -9 160 150 -129 -83 -154 70 127 28 489 16 65
6677 65 -97 -213 -18 -52 -72 87 -17 38 -125 -45 120 -49 -92 -11 -42 190 -118 48 -123 -45 -93 -241 46
6700 46 13 -6 -31 71 -12 -52 7 -73 -188 -143 12 -55 -51 57 6 -59 -34 292 81 -89 37 -181 127 35 60 38
6726 38 -175 77 28 -195 -48 -70 -103 65 60 -204 227 -84 74 131 31 109 -124 21 -95 -7 -66 213 -11
6749 -11 -61 -283 -15 22 36 4 99 116 -17 -29 -132 231 30 -65 -117 78 -67 143 198 -2 43 135 21 96 -161
6774a61L84j96Q9p1O0L6j33j01R9j24J40J1P2o2l6K47m31K86k14J24j25J11R1
6797I6k42J19j22K11r8P0J1n3K7r8J09j73J68p1r7k8L1K32Lq0r9m7l1R4k7K09
6823A14j01J19j23k8J43j83Lm3k2K9K96n30L43J28l43K43J43p3j70J15%m9M9l
6847E7o3R7j94j13J01K37p3n0J88j55M6lk49J25j65K25J53k04m0J08j40K10k09
6870a11j12K25j91J22J28m8q0L06m7k48J89j86j04K54l4K2q2J3j21J86P2j24j46
6893a17K44j45j27N6j3J05O5k6n0k9O0j69K00r1O4J46o4r7j34J15N3j03n1J28
6917B0o5N7K09k92l2K03l70M59k42l6J30j66O6l8K28k35J98J11k61J20K44l07
6939Al0qn2K84j84j09J62J7k27R9P1k0J16p9j66PJ06J30j60n0J26P6k05J84p5
$$ plain form
6774 -161 223 27 116 45 105 141 8 -93 6 -118 22 33 105 43 7 254 -177 109 -105 19 -106 5 96
6797 96 -146 -27 -149 62 -36 34 45 -8 19 -79 30 -143 25 -46 -143 -171 -140 92 95 15 -84 -131 -162 -68 -95 114
6823 114 13 132 9 -19 124 -59 -56 -99 -121 -92 204 -326 17 145 -198 45 188 115 -55 60 60 11 60 57
6847 57 -6 91 -103 -216 -115 122 49 -1 187 32 78 75 -174 -49 -214 11 164 -40 -80 28 -112 98 -111
6870 -111 -223 2 -189 -67 61 13 -67 239 192 -56 133 -53 -157 97 63 85 3 16 -105 81 153 29 -117
6893 -117 127 -18 -145 -89 -102 3 68 42 -8 -37 23 -146 54 -37 27 173 109 12 -122 -7 46 -57 -108 20
6917 20 -45 12 221 -71 -103 100 -270 189 -53 -89 41 -125 -59 -97 131 -104 94 205 -56 64 308 1
6939 1 -29 -37 -89 195 11 -98 64 81 -146 -47 24 4 120 41 -125 -118 -12 118 -42 -92 34 110 -95 89 14
6964A4l4Q3m8N9J21m4l23J67j15J11%p2Q1j03J28O6k20J26j48L42k29kM9M1j5
6989C5k61K92j00J96k19N5l4k9J00K2j86J53q5J20j81K34k44K1J8j2L13j48j00
7012d0k67K28M4K6N9j49m3KJ41k6J69k8k60K16j26P2k10K31q8r3N8r2K30j95J95
7037E4n3J07r7m4J69l61K90O2j91N2K2J14j2k71J44j06L8R5M3j49J65k99K60k7
7061Ek64L47q9j63J14K96o7k56K65j48j64J06l4LJ45kn7p5O2r5J66l09J95j29
7085a48J3K7Q3Qk08L04j75j23O8K32l20J73J44J7p4j14K81k22KM0rK1j77J07K2
7110b8j10k7J8J46J00k72K00m0J29k5p3Q3r0m8j4P0j5q0R2J06m3J45j67m7J04
7135A14j03q6J16k4J49l37M7J27Q6k59J21L37m09k3J45J23k39K43k56J25l2P0
$$ plain form
6964 14 -20 63 15 74 195 151 -172 -5 -120 -9 -9 -81 0 -103 25 91 -129 -3 -151 191 -38 -40 9 50 35
6989 35 -226 66 -34 162 -57 -2 -36 -65 35 57 -129 24 -61 59 -122 112 -132 -111 -93 -105 208 60 -40
7012 -40 -307 -79 -35 -9 50 -99 -142 -140 1 -25 144 116 -144 72 -54 18 -192 39 -49 -142 -84 -176 54 -141 54
7037 54 1 108 11 -33 136 -225 65 127 -64 -12 10 124 112 -159 -15 -121 -83 12 55 -94 71 -228 32 5
7061 5 -259 88 -1 -164 -50 246 179 -77 188 40 -124 -18 -52 -49 96 94 37 -38 24 -71 95 -214 -19 -148
7085 -148 -135 -108 -25 -17 -225 79 -96 -219 -151 81 -239 -66 78 95 21 -93 188 -34 -32 8 -1 20 -157 -50 -28
7110 -28 -138 -165 -147 -1 99 -173 27 -13 116 91 18 101 11 -37 -51 19 4 -76 16 122 79 224 57 10 114
7135 114 11 -75 41 17 166 -171 -124 3 89 -170 -49 288 -121 -144 1 124 -115 128 -128 -3 -35 35
7157C5o4J26r1kJ32l24K75j38M2p7J41kq1Q0m3J25j54J95k12r2K19j45Q7P6m7
7182F1k9Kq6P1l07L24Q9p5n1j7M1l23K77O6r0J72k63J01j92K88p0P1q1P5K05k85
7208b6j12J62p7J82O8k23k53K23jnQN7J34k74N7%J4K4nJ35j42J86k26J56j29J04
7234C7k6l9q4J02o3j22J94K90l72%R1j45J31j14P5O9O9k36J24J57j29j42K37K2
7258A26m13J93j34J67JJ22o4j90K40j84J38Nl8k49J43L19k53K08k05K80o6j81
7280c5k6K33k02J21K4j91M4P6j56J77m5q9P8L9k10J06J5j49M6K27l00K38j92K7
7304a44J74J08k2o6j08K5P4J55j52mj2o1rP1RJ8j02L6P0q2J7K66j45l0o6QR5k15
7332i2J64o1l1Kq6R1m1m9K09j45j12K00K7L0j38R1j98PK92k30J60k36K02L3J11
$$ plain form
7157 35 -29 97 6 4 136 -188 87 -51 -9 -86 55 53 -28 52 9 134 -20 175 -37 -129 90 -55 32 108 61
7182 61 32 34 -52 19 -288 36 125 50 -1 -18 23 -300 -23 43 -47 125 -138 -37 -229 59 -11 60 -21 54 259 -26
7208 -26 -138 24 -53 129 197 -26 -279 -56 -57 -62 -54 3 137 -137 -80 -80 -66 -42 -47 88 -54 132 -94 62 -67 37
7234 37 11 -28 -112 -10 -73 -195 -1 289 -83 -83 8 -137 -6 -120 -45 24 93 -143 -19 138 9 -133 104 126
7258 126 -287 -94 -228 -61 -60 62 -2 -192 48 -136 2 7 -31 -280 -137 182 -71 137 -68 212 146 -35
7280 -35 -61 172 -30 91 115 -76 -32 44 -112 65 20 -69 9 48 -162 -56 -41 -190 -144 83 -217 21 -171 -144
7304 -144 30 138 116 50 -58 -33 41 196 44 40 28 -33 -42 29 38 56 -46 -10 60 -22 -5 261 116 86 20 28 123 -92
7332 -92 72 11 -20 -18 -104 -13 -54 -103 106 -39 -151 49 76 106 -32 59 -139 -132 160 -70 90 -146 56 89 200
7357B00j33j23p9J24QJ20k19J66N2k9jj02q5L25j85j05M7%l0L46l68p9J26J16
7381I2m9J34k04m0J48r9j71Q8J97nj15K6n4P1J72k3j93Q0k06J45J60k43L4J30
7405G5j97L4J51j38J5j84L39j2k32O5L74l09LO6k8j09K07k27J39N4O3Rj63K9k89
7430b65K16Q9J38k29M2Qj12J10L6j37K70k41k8J8J46k63N4N5J22L5k62K04n9K1
7454c2P4j27j22K33j14R5j2R4j89M1Ql3J80l6K9j54J81k8K3j63J28P9k97J87n8
7479a3r3K59k90L17O5m01L15m80L12k06K45m6q8M7J07konk12j6J10j15K75r3Q
7504fN9o0J41J5j83J65k34J79n7j38K40j05J02j83J41q7L1m3O2J29p2n0k5m0m9
7529f8K50l46K61k26J37J03l48K94l8k2n6r9O3M2P2q6J19Mj73J72J46m07K12O3
$$ plain form
7357 200 67 -56 -135 -11 -3 117 -102 64 116 87 86 -16 -101 224 39 -66 -19 -19 -49 297 -71 -150 -24 92
7381 92 43 177 -27 -67 81 -18 -189 -101 96 91 -24 2 -52 19 191 168 -25 55 -151 -6 154 -89 -55 75
7405 75 -122 -88 63 -75 -60 -244 95 83 -149 -84 290 -19 -16 50 22 -87 120 -107 32 86 149 158 -5 24 -265
7430 -265 -49 40 178 -51 -9 -1 -113 -3 33 -104 166 -75 -103 -85 61 -202 -148 -93 29 64 -198 6 -53 -32
7454 -32 42 -85 -207 26 -88 7 -5 89 -100 -59 -51 -84 96 60 89 -65 116 88 111 -52 76 155 -142 45 -13
7479 -13 -106 153 -137 180 245 -156 159 -321 -9 -215 30 -16 -104 -57 50 48 42 37 -175 -191 -81 -196 79 -14 -6
7504 -6 53 -7 134 149 -34 131 -103 76 19 -119 121 16 118 -65 76 -11 20 -23 39 168 96 46 21 -19 -68
7529 -68 182 -164 97 -129 8 111 -237 57 19 -3 -59 -158 -95 -53 19 -67 52 56 -117 55 201 -206 6 69
7553F9k33J17l5k8k6K6J77J3j33N2J24r1j87J63K5j66J24k29L37n0K22P4n78L97
7577A64o4o2j42m5J34K28k45p1J24J23l55L16q6k27J74j2m9o7M11o5k46J17j78
7600a23R8K26j71o9J07j60Q4j30R7o0k0J02Qj24R9J62j84J69k63LJ24o0K18l3
7624A00j19J3O6j86L04j28n8M0j09J75K4om2J17k19p5J62K6j49J98j28J19k30
7647a05J29j43J89k15M40k35j48N6j34J72L4j00rR9R8j86j10J42K5R7j7Q8j69
7670bl1l9k5R0k2P1k08K34k60K07o2J43K21l06j02R6P1J80l90J33J40l01K41j16
7694c7R8k13L37o0k86K53O8l65K99k5j71K0K0k6K22l01K54l2j57J94O7k7q1n5
7718dk5o9n0K19j07N6j8k31J94Q9k00J98M0no9N7k03K7K3P1J9j87K16j60K9M0
$$ plain form
7553 69 -164 -47 -82 -110 -136 -110 67 80 -53 -1 123 32 -155 8 33 -133 -9 -238 99 49 271 345 -233 164
7577 164 100 38 -104 -149 -15 213 -32 -103 21 144 -211 105 19 -208 -34 -46 -95 -162 249 184 -62 55 -123
7600 -123 -25 201 30 -39 68 -92 -8 -138 -41 -101 -121 -19 -11 -135 -36 126 -58 111 -152 -149 -25 -85 133 100
7624 100 -19 -6 60 -126 178 50 -8 32 -77 98 122 116 74 191 -28 -103 59 85 -64 134 6 125 -105
7647 -105 24 -119 70 -145 295 60 -88 -32 -166 6 40 -60 -69 30 128 -58 -168 -26 -1 96 79 167 -2
7670 -2 -33 -72 -97 -7 -29 42 -166 68 -192 15 -47 96 317 11 -91 5 76 256 -134 -1 139 -162 79 -37
7694 -37 61 -152 185 125 -161 92 160 -205 94 69 -102 -82 -62 -88 134 -167 87 55 -102 92 159 132 51 -4
7718 -4 -29 -98 -148 71 -36 20 2 -229 -35 54 -146 52 92 87 18 75 -128 -101 -78 -7 12 -175 41 -119 -90 -50
7744e0P1J6L1l6M3m9j39J94l58pK05J88K2k9j04n6O2p9J48N8j37j56J34M4j99
7769a83N0J82j22K2N5j5J69j39J0k2p3K85k84J24qR5j42j69o6M41m73J71J92k07
7793a07Q7p4J68k35J58j05J87OJ0m1o8m0J47l3p9o8K11j10J08k08K41l7l12L01
7817A07l7j16K34j72J59j84O3l20K47K0N7O4l38J19K42J8k74O0J43j76K7J16J46
7840B05l9l54K5Q4N3j1O3j11lo0Q2kJ76P9l32q3J13j6J76L2k5Q6j75r1K84N2k79
7867g1N0J33k44%J08N8q5QNl1J24j36l0J20q1j8R5n2J14Jq8J1n1m8K92l15K35
7894A04M3k41lN8l1m0J72k06L0O5J6J47k9k97K37j41J22K1m2J32p1o3j65K02O4
7919H4l5j11%N1l9j80R2K23p2ml8j61M7J29Q4Mj26J57L2q1k65K8K3M19l26lr6
$$ plain form
7744 -50 21 37 68 32 75 26 -113 81 -277 -284 -79 109 131 102 -2 -58 4 -75 73 131 -6 -162 -28 16 -183
7769 -183 -133 49 -73 -51 4 -11 158 19 29 7 -66 219 -65 59 51 146 4 -165 -231 210 -263 -92 100 -107
7793 -107 -20 -94 74 -161 -3 -108 79 85 95 54 -14 -54 93 60 -19 -87 124 14 122 -86 155 118 -194 107
7817 107 70 -46 188 16 175 -9 54 -266 -19 1 58 122 -216 -97 145 163 -111 -51 92 -84 -57 59 205
7840 205 166 -188 -163 -79 -26 -37 26 -85 -88 -148 -66 -68 108 187 -145 -228 -115 -131 45 77 52 138 -37 -128 156 208 -71
7867 -71 -21 112 -132 -132 -24 34 -51 -43 -38 -69 55 -81 -111 9 -72 -90 5 -47 67 68 -20 -9 -60 -108 184 -131 104
7894 104 147 -94 -97 -39 -70 -110 62 -144 -114 -49 -33 114 85 -212 25 -116 6 27 -15 117 46 -17 -182 20 84
7919 84 49 -62 -62 -11 -50 -230 -138 85 13 9 -29 -190 -143 -14 70 74 -52 105 137 56 -209 -181 -158 261 -65 -68 -164
7946a64J63n0J77k36J99k31L52l2k36J33q5j22J87j85J07J93j64J84j05r6L1L2
7968E2k7j65L8K76q6L7k55K2J12l1Q5j01l9N5j2O9k82J79J26n1rPj47K29l8n9
7994a5J18p9n3o1L3J44q7q8K96j06j75K86j25j84p7J15K7K45j50P4j82M0P2k88
8018b20K72j11J86P0J4j58j3K3K3p2l0n0K11k17J69j9j06J47kl4j26O4J79k61
8042f1o6K23o3n8k4JO5r6J79l22K60k2Q9k56J44J05j61n4Q4k35Q1K34r4J1k8L07
8068B43k61J29k09J28m0M3l1j22J14p0L15k11k61K44k2J43j43R7r6%K80l15q7
8091a32jK56%j21r2L1o2J51l3Q8n9j57K43k28J63ok7k0K5R4j23o1M3K7J35q1O2
8118A15j02r3kl4J0j9M11k24J06k07P8r7K45q5j46M3K4m7n7J72j16l7J36j7k18
$$ plain form
7946 -164 -1 -51 126 -110 89 -142 210 178 -58 75 -10 -132 55 -130 -23 170 6 190 85 -11 20 52
7968 52 25 -140 -102 174 88 125 -130 -108 4 -27 58 -43 -82 -27 -39 30 -252 -73 53 2 -7 0 -147 82 44 -15
7994 -15 103 24 -29 -90 -57 87 0 -88 208 102 -73 213 88 -96 -173 -58 -31 214 64 138 -44 -4 68 -220
8018 -220 52 -59 127 197 211 53 40 63 86 14 -16 -66 145 -72 97 78 -28 119 117 83 -43 21 200 -61
8042 -61 -127 96 33 -25 -49 -48 17 -79 100 -222 38 16 105 -151 -7 98 -63 -117 -33 -268 -187 47 -47 -36 -64 243
8068 243 -18 111 -98 30 -10 33 2 -120 -6 -76 239 28 -233 11 -11 132 -11 86 -10 -10 270 -45 -132
8091 -132 -133 123 123 2 -90 -59 -121 30 -3 85 26 -131 112 -116 47 41 14 -6 19 113 -10 -71 -28 -1 134 53 115
8118 115 13 -80 -82 -116 -106 -125 286 62 168 -39 39 -58 187 102 -44 -1 23 -24 -81 91 -25 -62 74 57 -161
8143a61J28J82j9j88Q1j37J86J37k37p0R3N8L0p7J36j93NL8J92j51P5O2j88k1
8167c9J22l0j63P8Q3n3q4J56j14l6J94j76Q3K6L7k15N2k3L81l38O0M0p8k5
$$ plain form
8143 -161 -33 149 130 -58 23 -114 72 209 -28 -98 -5 53 83 6 142 -51 -46 -8 184 33 108 170 -18 -39
8167 -39 83 53 -110 -32 51 -2 -86 70 -44 -80 114 -62 21 47 84 -131 -79 -102 279 -59 1 41 -37 -62
8191f2
$$ Imaginary data points
##PAGE= N=2
##DATA TABLE= (X++(I..I)), XYDATA
0@%%%%%%%%%%%lJ1j6J6j6K4l2L3m1N6o4P2q8J04j21J45j68J92k24K56k90L30l76
34b00M25m79N39o04O77p57Q44r39J042j154J278j414J560j720J896k090K303k536
52a329K795l083L402l761M168m633N171n798O542p446Q566r998J1904j4580J8641
67A0561k5609M0810j35405J07363J85963k17675l3223Q0238q073n8446J02884
78D9388N0771j38486o1647J53457k635r8882M2843L4937n8200K4416M0984l6900
90D6n1912N1442N7761p1293l8059Q7716j7447o2115N6695K0250o1600N944M7914
103B5342p131n0493K4421O0799n6186m1039Q3165p803q4494L2923O4074l0547
115A3031o0972J8952O8397k6043m8677N1660J1038n7896J4521M1994j204k6841
$$ plain form
0 0 0 0 0 0 0 0 0 0 0 0 0 -3 8 -8 8 -8 16 -16 17 -24 32 -32 40 -48 56 -65 80 -88 104 -120 136 -154 176 -200
34 -200 225 -254 285 -319 358 -399 445 -494 548 -606 672 -742 818 -902 994 -1096 1207 -1329
52 -1329 1466 -1617 1785 -1976 2192 -2441 2730 -3068 3474 -3972 4594 -5404 6500 -8080 10561
67 10561 -15048 25762 -109643 -2280 183683 -33992 -67215 13023 4950 -53496 49388
78 49388 100159 -38327 -99974 53483 50848 -48034 -5191 29746 -28454 -4038 36946 46
90 46 -51866 -424 57337 -13956 -52015 35701 18254 -43861 12834 33084 -28516 -22572 25342
103 25342 18211 -32282 -7861 52938 -3248 -44287 38878 31075 -53419 -20496 43578 13031
115 13031 -47941 -28989 39408 13365 -35312 16348 27386 -30510 -15989 26005 24801 -2040
127b040k2967K3288J8135j6677N186q433j3862K8963q957k5516K9371Q506k0408
140e411K548M648j167j3431P180L6942l0104m0352M7751J6795l5839J0538J4704
153A4802j7817j0597J6807J7957l5267j7452N7909k096n6853J7252K8104r972
165B777K307N39r267r052P390K8355j2616k6364J9833n316j3126L3607q452l6671
179b6056J8997K5466j1367k2532P910K7715k2804j9248L9979p078l8077K5727
191a368J9858j9435o541Q867Q549j3097o407K6754r990k6503K2208N978j6740
204g867Q159j5l907M119o095N010J968n288J1893n098j0169J3474o973l283J9859
219A5787j2853j6980J0720O917L378p473p618J1315o656m240J9529j0139j3041
$$ plain form
127 -2040 -25007 -1719 16416 -261 4925 -3508 -17370 11593 2636 -22880 6491 14997 -5411
140 -5411 -2863 1785 618 -12813 -5633 31309 1205 -39147 8604 25399 -10440 98 14802
153 14802 -3015 -13612 3195 21152 -14115 -31567 26342 24246 -32607 -15355 12749 2777
165 2777 5084 5623 -3644 -12696 -5306 23049 10433 -15931 3902 -1414 -14540 19067 10615 -26056
179 -26056 -7059 18407 7040 -15492 -7582 20133 -2671 -21919 18060 10982 -27095 -1368
191 -1368 18490 -945 -7486 1381 9930 -3167 -9574 17180 7190 -19313 2895 8873 -7867
204 -7867 292 277 -3630 489 -5606 -596 1372 -3916 7977 2879 -7290 6184 -789 -4072 15787
219 15787 2934 -14046 -3326 3591 6969 -504 -8122 3193 -3463 -7703 11826 1687 -11354
232a1354J4674j724l267N383n342K378j75j268Q472j1150l143J8477j2567r042
246i648J7660o114j0708P180M160p04j0046M427J6175j8765o529K8169q333j8712
260a1788J5095N822j0206m907R304R552k0729n388K6633j0709j8031K0393J847
273F888j6141M133R245J015j0776J226J5946j3388q898K2920o197j7176J4749
286C546M142j1025n93O009L827j2455p64J8118j2706j2300K1966j663j6395R345
300i48P321n521n035M152R753j1624o619J9138o761j4811J4910J889j0908K618
314b446K397J792m032k440R934o171o803J4503m009r257J0883j430n900M390O33
329B044R6m161l56R044q494n976J5016o139r942J1276Q80p172J745L117K649o749
$$ plain form
232 -11354 3320 1596 -1671 3712 -1630 748 573 -695 7777 -3373 -6516 11961 -606 -9648
246 -9648 8012 1898 -8810 -1630 2530 1826 -8220 -3793 12382 -6383 -12912 15257 6924 -11788
260 -11788 3307 9129 -1077 -5984 3320 12872 -7857 -13245 13388 2679 -15352 5041 6888
273 6888 -9253 -5120 4125 5140 -5636 -4410 11536 -1852 -10750 12170 5973 -11203 3546
286 3546 7688 -3337 -3930 2079 5906 -6549 -7313 10805 -1901 -14201 7765 6102 -10293 -948
300 -948 6373 852 -4183 -31 9722 -1902 -8521 10617 3856 -10955 3955 5844 -5064 -2446
314 -2446 -49 1743 -2289 -4729 5205 -966 -7769 6734 2725 -6532 4351 2921 -2979 1411 2044
329 2044 2140 -2021 -2377 6667 -1827 -7803 7213 1074 -8868 2408 3288 -3884 -2139 978 3627 -3122
345c122o24J2326q765p724J5710l453j1440Q702L088n746k204L166N242r176k574
360f594J4751p793j0264J4765m03j0702N478N031k764n590L116R553j0595n789
374g800J6616n169j3070J1793M057r774j262O180L402r268j874J4064p175j0811
388a0091J5018Q33j2425N425N955l411m549K469P794q186n985J4002l291j1938
402h380J0213L113q884J032M482M66n552n59J0261n611p939J1852n03r587P120
417A524K777n628Q2K386K175n150k632R355l549p516R038j200p337O492J256k896
433h23J45l85K599j372j825O206m401m207Q596l024n004O318j881l595K309Q41
449D97Q53l435r37O208m768k449Q498m077m655P147j315l365K769N71P39l932
$$ plain form
345 -3122 -3746 8580 -185 -7909 7801 4348 -7092 1610 4698 -1048 -3252 -86 5156 -4020 -6594
360 -6594 8157 364 -9900 4865 4462 -6240 -762 4269 1505 -4085 -969 8584 -2011 -7800
374 -7800 8816 3647 -9423 2370 6427 -3347 -4609 1571 4973 -4295 -6169 7895 720 -10091
388 -10091 4927 5760 -6665 -1240 4715 1304 -3245 -776 7018 -1168 -7153 6849 3558 -8380
402 -8380 1833 4946 -3938 -2906 1576 2042 -3510 -4069 6192 581 -7358 4494 3991 -5596 1524
417 1524 4301 -1327 -1245 1141 3316 -1834 -4466 4889 1340 -6176 2862 1662 -5675 817 2073 -823
433 -823 -678 -1063 1536 164 -1661 4545 144 -4063 4533 1509 -3495 2823 942 -2653 -344 497
449 497 1350 -2085 -3022 3186 -1582 -4031 4467 390 -4265 2882 1567 -1798 971 1542 2281 -1651
465a651l06O383n427k755P886m101m853N640j64j190m4n22K491k534j026O691
481D518l864m052N822j486j730K623j584J71j456j280N905k830n105N431o05l039
497b561L230j14k53j013k215N915o93n011N387m23n820M671J672k619q47n72K441
514A175j836k586O467j922o913O366J633m931K781J596j572j359j49M358j464
529A644m033M771j757m496O504j47n264K314M92j105J027K22J777l661k247O372
545B413j248l032N336l447l951N942L49k446L23n29L91j827J308M597o011k894
561d726P777k992l273N587j110l870J480K180Q90l153Q42L986n806q29P970l834
577A119m505N135q88k923J349K163M35m537L10N233l998j345O063l619l049L903
$$ plain form
465 -1651 -1957 4426 -1001 -3756 4130 29 -4824 816 652 -538 -582 -1104 1387 -1147 -2173 4518
481 4518 654 -3398 2424 938 -792 1831 247 418 -1038 -2318 3587 757 -4348 1083 478 -2561
497 -2561 669 555 302 -711 -2926 2989 2296 -2715 2672 2249 -3571 1100 2772 153 -694 -1266 1175
514 1175 -661 -3247 3220 1298 -5615 751 2384 -2547 234 1830 258 -1101 -1250 3108 1644
529 1644 -2389 2382 625 -3871 2633 2486 -2778 -464 28 -1077 -50 172 1949 -1712 -3959 2413
545 2413 1165 -1867 3469 22 -3929 2013 2362 -84 239 -290 101 -1726 -418 4179 -1832 -4726
561 -4726 3051 59 -3214 2373 1263 -2607 -1127 1053 1943 -1210 -368 3618 -2188 -3017 4953 1119
577 1119 -3386 1749 861 -2062 -713 1450 1885 -2652 -2342 2891 -1107 -2452 3611 -8 -3057 846
593H46J09l81k28p08J626j971n9M367l595k392L172j562K08J700k126J036o62
610f20j378L528o32k168K386j160o65J943j537J385j79l119L034J57k526L140
626A589q56k858J941J16M8P13j622J318n67k014M150j38l892L174k14k241K452
643A099R8q37o64j041K161o19j635L049j811k959M110n4k158K210q90j095R19
660a17O32J678k267j481L788k288j647M573k052l470K934M76j107j27J86Q63k426
677a852M4M606k481k854M400j780j659K776L44j512o53L17K266k358p86L331k973
694h24j940M228j091j761J450l12j76j65M44K281k358j528L735j722j067K448
710A642r78j358N82l43J291n36j843K111j014j456K686p67p77J142r36R05L89
$$ plain form
593 846 955 574 346 -362 1264 -707 -766 3601 6 -2386 786 -776 -568 1132 -994 42 -620
610 -620 -1998 1530 898 -1270 1116 -44 -709 1234 -303 1082 903 -2216 818 975 -1551 1589
626 1589 733 -2125 -184 -68 -20 693 -929 389 -178 -2192 1958 1820 -2072 1102 888 -1353 1099
643 1099 1197 360 -304 -1345 816 197 -1438 1611 -200 -3159 951 897 -1261 949 59 -1036 -117
660 -117 515 2193 -74 -1555 2233 -55 -1702 2871 819 -2651 283 759 -348 -475 -289 574 -1852
677 -1852 -1808 2798 317 -2537 1863 83 -1576 1200 1544 32 -621 -304 1962 -396 -1182 2149 -824
694 -824 -2764 1464 373 -1388 62 -250 -426 -591 -147 2134 -224 -1752 1983 261 -806 1642
710 1642 664 -694 -112 -455 836 300 -1543 568 -446 -1902 784 17 -760 382 -554 351 740
727G40j354J649m76j572K231n45j550J484p94k44J008j512J066J97j819K088m10
744A87j194J810r68q43J907o62n1O53j500J295J98j657J786p87j278J902j166
761c68m19J563j219oP73q54R38j55j246K345j588o18K312j471q32J981r29m58
779b51O32q44R98p38o85J866j679q23K931j421j128J651m71r4J1j54J353j350
797a96o93K510j844q85K318r58j024R78m83N15l75l92J451j433m70K162j412o81
815i12J901j017j92N85n68R66p59q15J881q73j163J749q04r52J500p83M4J13o71
834g70J383l59j114J763n79j249J739p42k36Q73q99N79L5j109J523o72j202J403
852C67p18k38R55r87J32R65j096P09K84j090J412m81p05J335r78j36J153j248
$$ plain form
727 740 -614 1035 559 -1013 1218 673 -877 607 -187 -431 577 -935 131 328 -1491 597 187
744 187 -1007 803 -165 -1008 899 237 186 839 -661 634 832 -825 961 174 -1104 798 -368
761 -368 -787 776 -443 -449 324 -530 408 253 -993 1352 -236 -854 1458 -13 -845 1136 207 -251
779 -251 381 -463 535 -203 -888 978 -701 -1524 1407 -14 -1142 509 38 -56 -45 -199 1154 -196
797 -196 -889 1621 -223 -1108 1210 252 -772 206 -277 238 -137 -529 922 -511 -981 1181 -231 -912
815 -912 989 -28 -220 365 -203 763 4 -811 1070 197 -966 783 -21 -973 527 -256 -212 -99 -770
834 -770 613 254 -860 903 324 -925 814 72 -164 709 -190 389 424 -685 838 166 -1036 367
852 367 -351 -589 366 -621 -489 476 -620 89 373 -717 695 214 -491 844 -134 -270 883 -365
870c65K14P28j144N90K8o15J082j075j36J607j210QJ117j108L79N44q84J095o70
889A85o75J487j324n31J847j222p37J366o83r9K99k70J015j080m88K059r97p81
907f29J715j000n41J025l26J99m73o00J098p24p72K049j509o28J718n79m60M49
925A2j10N09p37j07J779j279p55J757r34p86J440p47j91K13m44P16o92k11J319
944G52j073p80K056j076k45R53p28K41M12p66O43k28n96J050r91PJ102j156M9
963c74Q17j089Q88r3p00P56k27l20R01n35j47N69q32M07N53j045Q56L1j170J066
983C12m85j32Q14p48j97Q74q57N43N7r96J281q6r94J328o03p49Q76k26O3M43r46
1004d28O57l11o42J622o39j101J247n82o07J199j14m99O6j97Q51n17j63J419j379
$$ plain form
870 -365 -151 577 -567 23 51 -564 518 -557 -693 914 -296 -288 829 -279 100 644 -240 855 185
889 185 -490 997 -327 -858 989 -233 -970 396 -287 -386 -87 -357 658 -422 -910 1149 152 -629
907 -629 1086 86 -455 570 244 443 -30 -630 468 -256 -1028 1021 -488 -1116 602 23 -437 12
925 12 -98 411 -326 -433 1346 67 -688 1069 135 -651 789 42 -149 64 -380 336 -356 -567 752
944 752 -321 -1101 955 -121 -366 587 -141 100 512 -254 389 161 -435 615 -376 -369 733 -423 -374
963 -374 443 -646 242 149 -551 205 -22 -342 559 24 -123 446 -386 21 574 -471 385 416 -754 312
983 312 -173 -305 509 -239 -436 438 -419 124 181 -815 466 380 -614 714 111 -638 238 12 75 518 -428
1004 -428 229 -82 -724 898 259 -842 405 -177 -784 415 301 -198 -132 -329 522 5 -158 1261 -118
1023a18n97J633o93o41P68m34k34k5L32M87o57m68J218r32l84J866p92j064R86
1042B51j92K00J46o23L92n31k28J525j105k93J101j086r7J066n25J44j37m52M27
1061a7j2r1O52q98L27N06r30N39P81j303L7P02m48N02j65l02Q2n41N99O25j207
1082e62N20J74q80Q89O64j061J68K63j21L50o80N76K5j055Q61M78j119O47m3o85
1102e91O43J27k73L89n13K73Q2m50R68p4q16M92k25n38J175n81m99L12k69P7N71
1123B80n13N76m92n13J257m28m64J049p99k26P84p1l09j33m43O54l97j4J216j339
1143c25m90J186l71m64J039l66m03J06L7P56n68j53O19o84k82J190q34m11N15
1162I7k50q9K51j33J97o17k7J080o93l5R40j246K17J033p48J63L3l40Q4k33M63
$$ plain form
1023 -118 -715 918 225 -416 352 -82 -316 -341 -9 478 -179 -647 571 -361 -745 1121 329 -735 251
1042 251 59 259 405 -218 174 -357 -585 940 -165 -458 643 -443 -540 526 1 145 8 -444 -17
1061 -17 -29 -120 532 -366 -39 467 -463 76 857 -446 -409 293 -155 347 182 -120 -38 -579 20 645 -562
1082 -562 -42 132 -748 141 805 -256 -88 175 54 404 -276 300 325 -730 131 609 -510 137 94 -591
1102 -591 52 179 -94 295 -218 55 137 -313 655 581 -235 257 32 -506 669 88 -411 -99 -368 -291 280
1123 280 -233 343 -149 -662 595 167 -297 752 -47 -273 511 440 131 -2 -445 209 -188 -202 1014 -325
1143 -325 -815 371 0 -464 575 209 -194 -88 -51 705 137 -16 603 -81 -363 827 -7 -418 97
1162 97 -153 -242 9 -124 73 -544 -571 509 -184 -219 721 -525 -308 725 -23 140 173 -167 -83 -316 147
1183A47J95q01J19P81r33K92P83o13k22M57m61M63k07J99J12o31L59M95q33J73
1203a26M13n58J00M04l52K52k34j55Q00q16K06K95n59L01N7l15O64j47l41K34
1223A23j23j80O45q02K86K05m58N39o0l91M59l73l86Q33m63K9M36m01l8K86k22
1244e6M89l29n72Q41m02m95Q34k55m94L51R4j23K6j33O21n71j00O77m53l62O60
1265B48k70j9K03j15k00J25k06O71m98k87N98l78j32N66n42%L09m48N90K0m62
1286b27N77k89j55N07m67J14L43n68M3J78k85L73k11k31L53q3m7M28n70J20K04
1307A07l83J51M02l55L28j15k73M43k68m2J07l23J22M09o14K68L3l43N56k86p3
1328a49M59m05J63K86n88J23M02n12J13K22l14K33j78J72K83n11l6N76n89K23
$$ plain form
1183 147 342 -459 -340 441 -492 -200 583 -30 -252 205 -256 207 0 199 311 -320 39 534 -299 -126
1203 -126 287 -271 -171 233 -119 133 -101 -256 544 -272 -66 229 -330 -29 28 -287 377 230 -111 123
1223 123 0 -180 465 -337 -51 154 -304 235 175 -216 243 -130 -516 317 -146 -117 319 -82 -120 166 -56
1244 -56 433 104 -468 373 -29 -524 310 55 -439 -88 6 -117 -91 -224 397 -174 -274 403 -50 -412 248
1265 248 -22 -41 162 47 -153 -28 -234 437 -61 -348 250 -128 -260 306 -236 -236 73 -375 215 235 -227
1286 -227 350 61 -94 413 -54 60 403 -165 -122 56 -229 144 -67 -298 55 -28 -75 353 -217 -97 107
1307 107 -276 -125 277 -78 250 135 -138 305 37 -5 102 -221 -99 310 -304 -36 -3 -346 210 -76 -149
1328 -149 310 -95 68 354 -234 -111 291 -221 -108 114 -200 33 -145 27 310 -201 -237 339 -250 -27
1348b7J52m80N22j86j98L24k02j51O31m12j16J58k88J95J36k17Q1J18k00K97k49
1369a12j95L67j56Q5K09l30M14l93k84N48k8m84O99n08J96n6K4j7k2m44O73K3
1391B09m69N19l80k6J84k60L2L48l90J43P1nK25p2k92M29k92J6J02k17K43j22
1413dj92j4L70k00J14j62J63J08k05j32L59l22J7M46n30O0L9J5k22K50j97M94
1435B55o47L44K94l42M8J70j76J65n7k87L34k85r1M37l04J09L61l40k5N3l02L10
1457B4Nq4L22o71K42J97n8o7L16m46L24p5k43K20K9j45L84k20j87K35m48L93l5
1480A2j64J62M7q8L4k3q9L81j75j25K4J08r3J01j15M5J4l31M45p4m75N14l73J48
1504i0R3J1p9K10r6J31l62J79K56l60J84j6j87J08L62m79NJ51j51j53K47LP4k43
$$ plain form
1348 -27 125 -355 167 -19 -217 107 -95 -246 385 -27 -143 15 -273 -78 58 -159 -78 40 -160 137 -112
1369 -112 -307 60 -96 -11 198 -132 282 -111 -395 153 125 -359 340 -168 28 -28 -4 -21 -43 -487 186 209
1391 209 -260 259 -121 -147 37 -223 -191 157 -233 -90 -19 -24 201 129 -163 266 -26 -10 92 -125 118 -4
1413 -4 -196 -210 160 -40 74 -88 75 183 -22 -154 205 -117 -100 346 -184 -124 -85 -70 -292 -42 -239 255
1435 255 -392 -48 246 -96 -48 122 -54 111 54 -233 101 -184 -275 162 -142 -33 328 -12 -37 16 -286 24
1457 24 29 -55 267 -404 -162 35 -23 -90 226 -220 104 29 -214 6 35 -110 274 54 -133 102 -346 47 12
1480 12 -152 10 57 -31 3 -20 -109 272 97 -28 -4 104 11 112 -3 42 56 -275 170 96 -379 135 -238 -90
1504 -90 3 14 -65 145 49 180 -182 -3 253 -107 77 61 -126 -18 344 -135 -130 21 -130 -283 -36 -33 41 -202
1528b02O6K94l54J00L00l22J1L18m05N22o76N44j22k11J29K50m60j55M97k40N7
1549e9M0l2n0o2K38K14l06M8L42n14J91L26m21J8Q0o0L9m6J5L02n50J78O0J50
1573A41Lrn07N75l2k49J30j62K20o9k58L96k06k04L55k57k17N90j65l23K92p2
1595b8k1K98k13Q6l76l9O00j20m38O31j16n38M44n4j19Q2l8p4l7MJ55J8l03K40
1619D4l1n8K34q6l64L75n27M48M3k1J15o03L67L53l34M8J46l88O2J58m1M0m5Q6
1643B1j4O1p4L34o26J55L61l78O4J41r4J7k9K28L9n06K05M24l22j30M23k56j44
1666a00K38l51K05J41k71L42l11P6J54j49j32L45m01J47L12l18K70l26j9K04j5
1687D1N5jl26L05k2j60L20j31k34M4K56q2J9q9L6J3n8K75k40l46K13J48l83L10
$$ plain form
1528 -202 -136 158 -196 -96 204 -118 -107 211 -194 328 -348 196 74 -137 -8 242 -218 -373 124 -116 -59
1549 -59 -19 -51 -101 -163 75 289 -17 31 373 -141 50 376 -45 -27 53 -7 32 -14 1 303 -247 -69 -9 141
1573 141 144 135 -372 203 171 -78 52 -110 110 41 -217 179 -27 -231 124 -133 -350 240 75 -248 44 -28
1595 -28 -49 249 36 122 -254 -293 307 187 -251 380 264 -274 170 116 -3 79 41 -33 -70 -66 89 107 -196 44
1619 44 13 -45 189 103 -261 114 -413 35 78 57 172 -431 -64 289 -45 3 149 -239 -177 -19 -60 -20 -65 21
1643 21 7 68 -6 328 -298 -143 218 -160 -96 45 -49 -32 -61 167 206 -300 -95 329 7 -123 300 44 -100
1666 -100 138 -213 -8 133 -138 204 -107 -31 123 -26 -158 187 -214 -67 245 -73 197 -129 -148 56 41
1687 41 96 95 -231 74 52 -108 212 81 -153 -109 147 65 84 -5 31 44 -14 261 21 -325 -112 36 -347 -37
1711c7K94K4l00L4j8P3j19J87nl03J94k8j27L13m8k38J82r5j83K81j31J88j9j01
1735A8K13n6k86J44L1j86K63l23Q5R4m3k5J11q6pj03j4N30n10Q1N4j47l2K01p0
1760f3L47j92r1pj40M2J51j16j75L11j96P4K42j42n8o7J00K41l10L1K94m49J03
1783g0R8k42K39Q0k32M9j43Q7J54k51K53m0K36j47l0P1j60Kk05M69m12J85K27
1806B18k68O0k3l69L65R0l79N07l25L3Q8K5j39R0m9K01l6j86j4J24j21K45n0j83
1830i6M0j53K84n1j57k4J42L1r2r8J0J76n7J32rj18R6j77qN5MJ7N2M4J27j52j80
1857a62N7K61j10j56J99k65K03j93K53o0%P8j29j00O5K53j30q8j97K52r3M0m0
1880f2K3j5k7J64p0K5k8j18J63j04O1j71N0p5K61J59l36L09k66P8j00k13K81m0
$$ plain form
1711 -37 257 281 -19 15 -3 70 -49 138 133 -170 24 -4 -131 182 134 -104 78 -17 -200 81 -50 138 119 18
1735 18 231 175 -111 33 64 -122 141 -182 -97 -3 -46 -71 40 -46 -53 -156 -170 360 -150 -69 -15 -162 -194 7 -63
1760 -63 284 92 1 -6 -146 -104 47 -69 -244 67 -129 -55 187 45 -13 -80 20 261 -49 -18 276 -173 -70
1783 -70 28 -214 25 105 -127 -78 -221 -134 20 -231 22 -18 218 71 41 112 -48 -46 -251 218 -194 -9 218
1806 218 -50 10 -13 -382 -17 73 -306 201 -124 -91 -3 22 -117 -27 -76 125 89 -97 -111 13 -108 137 87 -96
1830 -96 -56 -209 75 24 -133 -157 -15 16 -76 -174 -164 12 -45 87 78 -40 56 -121 -129 -74 -70 -53 -1 43 170 18 -162
1857 -162 -105 156 46 -110 89 -176 27 -166 87 27 27 105 -24 -124 -59 194 64 -24 -221 31 -62 -22 -62
1880 -62 -39 -54 -81 83 13 38 10 -108 55 -49 12 -159 -109 -184 77 236 -100 209 -57 21 -79 -292 -11 -51
1904e1RJ16k08o0L53m0j14j8j50K40m3j28J35P7j01J23j67L5L18o06J73J44j2
1927B5P0j15m7R2o6p4K03O0j19j78Q3N3j40K1K08j83P1Q2o3J6o8J34j02J64k05
1952g8R9J55k42J5R2R8L7j62q2Q9P0j99J39J00k12J50r4j23K41p7Q6j6k32L36
1976A90j30o3n7J43p6J07k55J08r3o3L77n3J0j52m4P2l5k58J47J01P1kLK2q3L3
2002B0J2J38k21oJ39j06K8L41l11q0J4j88R7O7p0K26k90Q0J16j08J73j93J91J4
2026H3j71J76pj62J95k40m8J39L9j76J56K7p1J31J3j53L3j64J92L00l71J40O5
2049A26k58J98j20J57N5r4k52L38j65l1K05j04N1j47J08j6P2j88J4K60j56J20
2071A73j64n8J69k60R0P7oJ94j93p2N7J06n5l79L49J4m1r6K05k49M6K29j62m6
$$ plain form
1904 -51 -42 74 -134 -194 159 119 5 -13 -163 77 34 -94 41 118 17 140 -27 8 326 -280 -107 37 25
1927 25 95 -20 -67 25 -41 -115 88 148 29 -149 -66 -13 -153 -132 76 -107 -36 46 -17 -1 -69 65 -37 127 -78
1952 -78 21 176 -66 -51 41 139 176 14 -68 21 91 -108 31 131 -81 69 -25 -148 93 16 102 86 -146 190
1976 190 60 -3 -60 83 7 114 -141 -33 -126 -189 188 135 145 -7 -51 21 -14 -272 -125 -24 47 45 48 70 -13 20
2002 20 32 170 -51 -57 82 -24 4 345 34 -46 -32 -220 -123 -56 -126 100 -190 -110 6 -102 71 -122 69 83
2026 83 -88 88 81 -81 114 -126 -174 -35 4 -172 -16 11 -60 71 84 -69 -36 -200 -8 292 -79 61 126
2049 126 -132 66 -54 103 158 64 -188 150 -15 -46 159 55 106 -41 67 51 123 -65 -51 209 53 173
2071 173 9 -49 120 -140 -50 27 21 215 22 -50 7 113 58 -321 28 42 1 -95 110 -139 -93 136 -26 -72
2095g2K32j63J58j34j57J29l5J42k90r0L19K00l36J11j3pNO0j84K65k99j0J87
2118A8J29k17J13J20k04l5J06q2J95j86J74J1k99J11oM1L3p3R9m6n3k7j7K07J03
2143B15j17j83K17qk36jJ87j94j8n1K34J69k83J00k20J57j8J02lO3l91K31J38
2166I0k61J96j9j60P1l5J10K14k7k02N1j73K58r3n5K35ol37K75k72k6J44k15K27
2190a0j16j7J13R6k38J56n0J53l9r6J33op1k0K45k63P7J39k07M7j57O3J94k34
2214a08R2J17j03m1J27J01j28R7k86N4J70j10J65k22l0K79l83J82J44k0j4n7j05
2237g9J9J69r8J37K9k57J49j14k09J16j51L88j52Q7r8K0J18k30K14L0PJ1N9m5
2261A20k39J31l55J67L47r2q8j87K73j19K10j86Q3r1p0J30r5rN8Q9j07o5%P1J97
$$ plain form
2095 -72 160 -3 155 21 -136 -7 -42 100 -190 -280 39 239 -97 14 1 -6 -1 59 -125 140 -159 -169 18
2118 18 147 -70 43 163 -41 -76 30 -52 143 -43 131 142 -157 -46 -52 -11 22 -51 48 2 -51 -78 -95 112 215
2143 215 98 -85 132 124 -112 -113 74 -120 -138 -189 45 214 -69 31 -189 -32 -50 52 49 112 -279 -48 90
2166 90 -171 25 6 -154 -83 -118 -8 206 179 -23 28 -145 113 20 -35 200 194 -143 132 -140 -166 -22 -237 -10
2190 -10 -126 -143 -30 66 -172 -16 -66 87 48 -48 85 79 8 -12 233 -30 47 186 -21 26 -131 -68 126 -108
2214 -108 -16 101 -2 -43 84 185 57 154 -132 -78 92 -18 147 -75 -105 174 -209 -27 117 97 83 26 -79
2237 -79 -60 109 11 148 177 -80 69 -45 -254 -138 -289 99 -53 34 -64 -44 74 -156 58 88 95 106 165 120
2261 120 -119 12 -343 -176 171 79 -9 -196 77 -42 168 -18 65 -26 -96 34 -61 -70 -12 77 -30 -95 -95 -24 173
2286A73k50K20j13k3j27K93M2k10J42j59m5l1L4J15k9q0O9j75K76j15n1K28l42
2309a58O0l6J02l0j2K1J97k32K67N5j31J10r9k26N0P4J20q0m6k26K14j0k6K90
2333B48k50Q5K27l55M1Oj88J38q4J27j51J73j54K58l40L34j9p4p6n9m2K52m7j78
2357a28kL15k82j1N8m5J90Mm2K7p8J54q1Pj38J2R4j27j48K41P1k29L78l58J07
2382a1l6J33j19J73l87J40N5PJ66j92L4Po3J47J71j23r0q7J66q8mJ72r5j15K09
2407A70k52N9j21J30J61j33J6j1R7j32l3J31K8oq9N1k60J85R8J47j64P8l14K21
2431E7j21R7j6j42Q2k7R4r1N5j57L49l55m0J21k2K19j88J82Jq3k3p4J72j52J90
2456A28j48l6J0j19K86l9n0J29k50J48j14J31J2r8jJ81k9j69L9n5m9J38j99K09
$$ plain form
2286 173 -77 143 30 7 -120 173 215 5 147 -12 -57 -88 -54 61 32 -48 21 -154 122 7 -44 184 -158
2309 -158 -98 -134 -32 -62 -74 -53 144 -88 179 234 103 213 114 -112 -62 12 132 52 6 -220 -6 -16 -42 248
2333 248 -2 83 310 -45 -4 2 -186 -48 -132 -5 -156 17 -137 121 -219 115 96 22 -54 -113 -155 97 50 -128
2357 -128 -130 185 -97 -108 -50 -95 95 99 57 84 6 160 79 86 -52 -40 54 -73 -221 20 91 -138 240 -118 -11
2382 -11 -47 86 -33 140 -247 -107 -52 -45 121 -71 -37 -30 -93 54 225 102 12 -75 91 3 -1 171 76 -39 170
2407 170 -82 -23 -144 -14 147 14 30 19 116 -16 -49 82 110 104 15 66 -194 -9 89 236 72 150 -164 57
2431 57 -64 33 17 -125 -43 -70 24 -67 -12 -169 180 -175 -215 -94 -116 103 -85 97 98 15 -8 -82 90 -62 128
2456 128 -20 -56 -46 -165 121 82 32 161 -89 59 -55 76 88 -10 -11 170 141 -28 11 -44 -93 45 -154 55
2480E5j76Q1m7o1K8L63l32K03l82K43L35l61m0K01nj39j54R8Q8j5K47k61r7K13
2504H5k73L76l59J44L4l6M2L6k18O4Q0j02M8L9J8K7KL3q8m0L02k08j25q0L17P5
2530A93k86J50j57K07q2Q6o4k5J91j52L8L9N8j05j99N1j3J86j84OM1l6J78j04
2554A7R0j21J2J31k17j3Q4K08j59R7k47K82l1j29o7k70M25q2M3Jj10J09m6J09
2578A16Q6l65J55J17j00R8p2j00K57m15J12L8lJ46j33K1J19q7qL0l2j50J84r0
2602g6J20j01M3nk00J13J84j88K12r7J1j61kK3Q9K60l12o8J55j44L17j11q8Ql2
2627e0O9l7M0j61K57j49K95k89k18K23o5J06r2L7R9j72J4J84j20k8L02l41j04
2650b00M34k11j90J19K26j53m3J05J4j79O8p6Q5j74J81J7M0O5J77j67j6j80J79
$$ plain form
2480 55 -121 -40 -87 -148 -120 243 -89 114 -268 -25 310 -51 -91 110 105 -34 -188 -90 -2 -17 230 -31 -128 85
2504 85 -188 188 -171 -27 7 -29 13 49 -169 -105 -25 -127 -79 -40 -22 5 7 40 -48 -88 214 6 -119 -199 118 193
2530 193 -93 57 -100 107 25 111 47 22 213 61 99 138 196 91 -108 -57 -70 116 -68 -62 -21 -57 121 17
2554 17 107 -14 -2 129 -88 -101 -17 191 32 129 -118 164 133 4 -63 -333 92 10 53 54 -56 53 7 116
2578 116 202 -163 -8 109 9 107 35 -65 192 -223 -111 -73 -76 70 -63 -42 77 -10 -18 12 -20 -170 14 -76
2602 -76 44 -57 -14 -19 -219 -106 78 -110 102 5 16 -145 -147 -124 -35 225 -87 -155 0 -144 173 62 -26 -18 -50
2627 -50 19 -18 22 -139 118 -31 264 -25 -243 -20 -85 21 -71 -34 65 -107 -93 91 -29 -57 245 -96 -200
2650 -200 234 23 -167 -48 178 25 -18 87 101 -78 -10 -86 -1 -175 6 23 63 128 305 138 122 -58 121
2673A21k71J53l44K31J23J34j1k35J90j46j76J76N9j15M3O5M1p7J00j35K08l19
2695a85K50k49K63n9n9Q5N4o7l8P6j18K39k94J46Q6j45K66m29J19K01j80J1j46
2718a73K52n7O9J6k31KL1l6J76j48J01J61k38K73l57L48l40p0J8L19J7r1j33O2
2742b9K31l30J97J6k05J41K7Q7k62Q2n8L03j94L3j06L26l7n1l85K22J85k30j56
2765a93M2M39k94j6m3m0J42k04J48J24l7q9K03j64k0L7o6J25j11K05k2k96K67
2788A37l49J03J46q1n5J4P1Q2K4n9K86j85l7j76J49J17m10L04m9j87J06O7j58
2811a40L19j85K16k62J10J8p0r7J42m8OL0k39J62j7n8J30j39J34n8O6Q3k87J36
2835d8J93k70K21j14J67o9o2j11J90Q7r6p1j12K02j00P1N0k09K37k47J01j42J23
$$ plain form
2673 121 -150 3 -341 -110 13 147 136 -99 91 -55 -231 -55 4 -111 -68 -3 38 -39 61 -74 134 -185
2695 -185 65 -184 79 20 -39 46 100 33 -5 71 -47 192 -102 44 130 -15 251 -178 -59 142 -38 -27 -173
2718 -173 79 22 91 107 -124 -122 -91 -127 49 -99 2 163 -75 198 -159 189 -151 -221 -203 116 133 42 -91 -29
2742 -29 202 -128 69 85 -120 21 48 135 -127 -45 -103 200 6 39 -67 259 222 171 -214 8 193 -37 -193
2765 -193 -151 288 -6 -22 -65 -105 37 -167 -19 105 68 -21 182 18 -2 35 -31 94 -17 188 166 -130 137
2788 137 -212 -109 37 -44 -99 -85 -14 68 92 33 319 134 97 -79 70 187 -223 81 32 -155 -49 18 -140
2811 -140 179 -6 210 -52 58 76 6 -91 51 3 9 39 -200 -38 -55 -113 17 -122 12 -46 20 103 -184 -48
2835 -48 145 -125 96 -18 149 80 18 -93 97 184 88 17 -95 107 7 78 128 -81 156 -91 10 -132 -9
2858ij18J44J87k63Jj07J78O5n6j91J74M9r4J1J38n5N3l28R2J99j08M2J92p1j80
2883e5J05J27l8K6k92J14O0j63R6j5k10K67M0k07J51n6K7j24J49N2q6K39k90K25
2907A42j76O8K0o6J32q4q4L3mj24J07m3J04lM8j50j27M2L59l38K41n1O6j31%J50
2933A31k92j10K44N4k59O7K71p2K2j60J79k6j4j7n5RJ52o3l3q3j%n2K57j84J10
2959G5K7o2j99j83L11r4J78j07J12k06K71Mj98P0j07J33J50j95L3q1K5j75jK81
2983F2M7l90L05N6r3J39n0j43K4K98k47q6L26j10j33k38M28p5p8j01n4J66j84
3006a31N0J19J21Q4l03J62j40q9J28p1k4J93j01j2j7p7Q3k73L35j93K42k39K14
3029F1J0j47J48l2lk43K15k5q1J2R5l5M2n1J4j8r1J61j10J26j38k52K57L4K2J21
$$ plain form
2858 -9 -127 17 204 -59 -58 -165 13 78 22 -169 5 54 -40 -29 109 54 107 -221 -129 70 -38 4 196 125 -55
2883 -55 50 177 139 165 -127 -13 47 -116 -20 -35 -245 22 62 -145 6 -50 -23 -147 2 54 -32 207 -83 142
2907 142 -34 34 54 -12 120 36 -48 -15 -19 -143 -36 -79 25 22 70 -80 -207 -165 194 -144 97 46 112 -19 -19 131
2933 131 -161 -271 -27 27 -232 -165 106 34 56 -104 75 49 35 18 -37 -28 124 61 28 -55 -56 -56 -108 149 -35 75
2959 75 102 40 -159 -342 -31 -125 53 -54 58 -148 123 127 -71 -1 -108 25 175 -20 13 -68 -43 -218 -219 62
2983 62 109 -281 24 80 -13 126 76 -67 -43 255 8 -78 248 138 5 -233 195 120 42 -59 -113 53 -131
3006 -131 -81 38 159 243 -60 102 -38 -127 1 -70 -94 99 -2 -14 -31 -108 -25 -298 37 -156 86 -153 61
3029 61 71 -76 72 40 37 -206 9 -16 -97 -85 10 -25 17 -34 -20 -38 -129 32 -78 48 -90 -342 -85 -51 -29 92
3055I2k04lm7L89k84J86rJ8m2q6j87K28k60K17O9M3m0lj50J45k2J29k68J67k01
3080a23K67K1j94J71k13K23j63qp8J39Q2L2l2k38J07j15M1J8pK16k40J93j87l
3104i1K24o0oO3j60M0j7j9Nkj42M3R7N8j9J03j22L99o21O1K77K0k11J9N3j36K45
3131A01k6J0j39N7P2j12m2J15pO4j10p0J20P3Q8m51L96j02j79m1K75P1Q1k11o9
3156c6l1L5j23J55j10J11nR1o7j30J69p6M4n6q4R4J01j96R1J8O8k77K44j1p3o1
3182a15J91m0J32o9j27R7l9l6m7m8l3P6o9K59k7j5P1k39o3J85j33K00j77l4k7
3207a27K21j02J45n6l45K28kJ20J48j40L8o0q2k7LM9K13m04P9k17L64j84j6J88
3231C4J9k36j2J97j59L82l18J82o2M5K4p6o8K37j22Q0q4N6p5p1O4M4k2j59J2N0
$$ plain form
3055 92 -112 -115 -162 227 -57 129 120 138 96 10 -177 51 -209 8 77 120 80 77 -73 72 50 179 -89 78 -123
3080 -123 144 165 -29 142 -71 152 -11 -19 -97 42 124 156 124 -114 -7 -122 -81 -63 -70 146 -94 99 -88 -91
3104 -91 133 73 67 130 -30 10 -7 -26 -21 -23 -165 -122 -25 33 14 117 -5 394 -227 -166 111 131 -80 -61 -8 -144 101
3131 101 75 85 -54 3 75 -37 -79 36 29 93 -17 -87 33 106 194 -257 139 37 -142 -183 92 163 244 33 -36
3156 -36 -67 -32 -155 0 -110 1 -4 87 20 -110 59 -17 27 -29 -113 -19 82 -114 -23 -5 63 -214 30 19 -54 -115
3182 -115 76 36 168 99 -28 69 30 -6 -53 -101 -134 -58 -127 132 105 90 161 -78 -141 44 -89 111 -66 -100 -127
3207 -127 94 -8 137 81 -264 -36 -38 82 230 90 128 68 -14 -41 -38 11 224 -180 -101 -318 46 -138 -154 34
3231 34 53 -183 -195 2 -157 225 -93 89 27 72 96 20 -48 189 67 147 63 119 44 -27 37 81 59 -100 -88 -38
3257c8j71J41m9K43K2k13N1J50p1l4J6j19%%J04j37K34j84j32J54ko6JN6J61j73
3283e6M7j8M1PJ08j92j8O2m9J86j5l6q6p1N7j35K15l67L27K07k02P8j35N5n1K6
3309a5k2MJ06r1J70L9j92j46K21j23J66j92J19L9k87K49k1p6Q7Lm8nK5L2L7j93
3335a14K13L3j0k25J32Qj82N4J05O4q3R4Q7l00L42j7j98p2o6J86m3j00K86M8k73
3360c1J21k0r8k56L80o8j60Q9n2K9L4K3j62P9j9J51J9J6Q3N2k97J88j28M7P2p3
3386A9j22J46o7K04k72N7po4J07K4O6m8J9l21K20mJ6k1L9J77j87P1M3k41M77l67
3412c6L8j53L14j72K72j86j10m3N1J35n4q3R0j63o5R9J16l3j08l6o5M1J16r4J97
3437F8j68Q2J12m6oj87M8q0K02q0J62O2j20O8k21N0J12n0p8k0J04K83l85K97l61
$$ plain form
3257 -38 -209 -68 -117 126 148 -65 -14 136 65 31 47 -72 -72 -72 32 -105 129 -55 -187 -33 -35 -101 -100 -44 117 -56
3283 -56 -9 -27 14 21 129 -63 -81 -19 -68 118 103 67 -19 -90 -33 -168 47 -320 7 214 12 90 -45 10 -41 -15
3309 -15 -37 -33 73 -18 152 191 -1 -147 74 -49 117 -75 44 83 -204 45 24 -52 35 38 -10 -15 10 42 79 -114
3335 -114 99 132 122 -103 29 37 -145 -91 14 78 -5 89 176 -124 218 201 3 -69 -135 51 8 -92 194 242 -31
3360 -31 90 70 -28 -284 96 28 -132 -43 -95 -66 -32 -9 -171 -92 -111 40 59 75 158 210 -87 101 -27 20 92 19
3386 19 -103 43 -24 180 -92 -35 -42 -106 1 25 91 43 62 -259 -39 -43 -27 -48 -9 168 -19 52 95 -146 331 -36
3412 -36 2 -151 163 -9 263 77 -33 -76 -25 110 56 -27 63 -100 -165 -66 50 17 -91 -127 -192 -151 -35 -129 68
3437 68 -100 -18 94 48 42 -145 -97 -177 25 -55 107 169 49 117 -104 -54 58 8 -70 -90 14 297 -88 209 -152
3462a52J73K79l62J47l8rj10K5R2O6q1q8N0j37J29o8J39j49K02k02k15M16j79
3485g2q0J84k54K68O9r3k30L29j54j7J08j26P1K8Q5q3k77J39K01q6r8K14m0j00
3509a4r5K4K04P0k52j21J43l2l8K77j77n3lm0O8j43KR9J20O1N1l13K03p0mQ0j75
3536a28J38KM1j21N5J22k03K42k33J19j95M27l10J59j67J09j3j15jj2J16l73K12
3559a29Q2M0q0k14L20L4k6k05j21M74k30J13j4o0PK7R4o1q6P8lq3R4j40J21l2
3585@p8J78j05M1q6LJ04j03K40l08Q9J32l14J91k0L1P9P9j10N8nJ93k79R4k67
3610a63K80j81K27k50p0M8q4J44OO8k5J07p7n2j5m1m1P8NJ19m6j2J46j52R6k75
3636a60J00J50n9q1Q3K26l12J36l76J41K23k18J61J70j54K09j46J9j49J34j15
$$ plain form
3462 -152 21 300 -62 85 47 38 -72 -47 45 111 30 -58 -8 -145 -16 -84 55 -94 108 -94 -309 107 -72
3485 -72 -152 32 -222 46 115 22 -208 121 -33 -50 58 -68 3 31 116 33 -244 -105 96 10 -88 126 86 -14
3509 -14 -109 -85 119 189 -63 -184 -41 -73 -111 166 -11 -64 -67 -107 -39 -182 -180 -81 39 100 151 -162 41 -29 -33 47 -128
3536 -128 10 12 53 -68 -13 109 -94 148 -85 34 -161 266 -44 115 -52 57 44 -71 -72 -84 32 -341 -129
3559 -129 -47 -7 -87 -301 19 53 27 -178 -299 175 -55 58 44 -16 -9 18 112 51 -35 43 40 -43 51 -89 32 0
3585 0 -78 100 -5 36 -50 -47 57 -46 194 -114 -25 107 -207 -16 -36 -5 74 153 43 101 96 289 10 104 -163
3610 -163 117 -64 163 -87 -157 -109 -193 -49 -43 25 0 107 30 -22 -37 -78 -119 -41 -36 83 37 25 171 19 115 -160
3636 -160 -60 90 31 -50 33 259 -53 83 -293 -152 71 -147 14 184 30 239 93 112 -37 97 -18
3657a8kO7qQ4n3R2k10n8K33j29j59Q7Q8r9r8K76k15K88l5l86L45j72L53k03k35
3682a67J5K4J94j64J84j38j00L42J03m48j6J47j36M02r7k21K22j67J12r0Q2o3
3704B0LP7k77K24kK4N7P0k91M4O7J2p2N1K7mn7qj81J41J85j48M3J5j15j13K47
3731C9q9L9q0K5J82j18M6j73N9L4L3J09j49J00L2p4Q1nj2j61R5J05j9j58K32o5
3757A08j83O3j1N3n1Mj4J42r3n%j17N8N2j90J14J59j37J01L4r0K50j87r6J40m46
3783c42L83m1k10J38J89j15m6o1L21j58l8M8l12M86l87o0N9M0K32j86J58q5J7
3806C0j33J3J38pn2k00L04p9roJ32J2k8j13r4R6m5J64P9j04o4N4j16l4P6k6l5
3833d7K5n5K65j67J45q2k18J39j05K22O7p2N5j22L0J85k97J03l9j05J60l52J37
$$ plain form
3657 -18 -20 47 39 123 70 162 -48 -106 127 -2 -161 -74 14 -85 -183 93 -122 166 131 -255 90 -82 271 68 -167
3682 -167 -152 -128 66 -98 86 -52 -152 190 293 -155 -171 -24 -160 242 145 -76 146 -21 91 1 83 20
3704 20 23 100 -177 47 45 69 126 196 -95 -51 16 28 -44 7 34 30 -27 -35 -216 -75 110 -38 5 20 -95 -208 39
3731 39 -50 -11 -91 -66 116 -2 44 -129 -70 -36 -3 106 -43 57 89 15 96 91 79 -82 13 118 99 -59 173 108
3757 108 -75 -12 -23 30 -21 -17 -31 111 18 13 13 -104 -46 6 -184 -70 89 -48 53 87 -3 247 60 -36 104 -342
3783 -342 41 0 -210 -72 117 2 -44 -105 216 58 20 68 -244 242 -145 -205 -146 -106 126 -60 98 13 30
3806 30 -103 -90 48 41 -11 -211 93 14 5 -1 131 143 115 2 -92 4 -41 123 202 98 34 88 -28 -62 14 -12 -47
3833 -47 -22 -77 188 21 166 84 -134 5 -100 122 189 117 172 50 80 265 -32 71 32 -73 87 -265 -128
3856a28J69j16J05M8k32K68j16j59M1J73r8R7m2J5R7j58Q9j01j20K93Nk43J49
3879C6L4m7K9j93R0M2P2j59J64r7n6K29J3k53J47o0J74q3q1k91J63j05kL01m2
3904B5r4K2k4J86rl7j03J77j32pR5R5j89J95j52j70K04Q5N7k59j6J17m0j32R5
3929a1k7p9K96k46J90k46j03L00j00J31k09K15q0l5J07k21J40JK8q0K94m27M07
3952B45j86r9J38p3k12K35L3o2k05J71K96k11O3l09M7j21J26q7J97r4J85m3J06
3975A40j94N8l5J45j93j8j14J36J28J49k00k6O2o9j3J61j59K44m3j63j7O1l8J06
3999A08l00L38j44l5M7o5J23p0K16r8k35J42M9j54L1R1Ko8K5j02j10L56k58J23
4023A2J35j60J07l42L13n0r8K21j96K1J18k9o7O0N1j97N1N7K86l48M7kK10k13
$$ plain form
3856 -128 41 -75 30 78 -154 114 -2 -161 -120 53 -45 52 10 25 122 -36 53 -48 -168 125 130 -113 36
3879 36 70 23 52 -141 -51 -9 63 -96 68 -29 -85 144 157 -96 51 -9 165 82 1 -290 -127 -232 -234 67 25
3904 25 -69 -47 -71 115 106 69 -34 143 11 4 99 194 5 200 48 -122 82 167 224 -35 -51 66 26 -106 -11
3929 -11 -38 -117 179 -67 123 -123 -226 74 -26 105 -104 111 31 -4 103 -118 22 23 51 -29 265 -162 245
3952 245 59 -40 98 25 -187 48 81 19 -186 -15 281 70 133 -176 -129 -250 -124 -211 -14 -108 77 34 140
3975 140 -54 4 -31 114 -79 -97 -211 -75 53 202 2 -24 38 -31 -44 117 -42 202 159 -4 -21 40 2 108
3999 108 -192 146 2 -33 14 -51 72 2 218 120 -115 27 76 -78 -47 44 46 -22 3 -99 -209 147 -111 12
4023 12 147 -13 94 -248 65 15 -83 138 -58 -37 81 52 -15 45 96 -101 -50 7 293 -55 -8 -10 200 -13
4047a3J69l36L83j79J45k84L8J60j74pr0J78k4p3J22J9N9R2k57J34m9J77r8n2
4071D0n6o6K34k21J62Q2j23m3j66K88k61J07L8j92J00J37j15J12N2k20J02K5j38
4094a22rO6J49k32J95j47K16k12K04K4j3j87O2j25J95M5j34J09k20R6J39j47K8
4117b0J5K2o5K4Q6q4J27OJ74l88K51k92K84k26O1r4r7J62j1P5j19J81k60J72R2
4142G6m6j11K29k62Po5L14N7j75J01o1j14P9R6k9j20pJ05N0p8j98Q7J01q9M2J02
4168I1k8PR9j13k46K44k26J98M7r7K03n3j54L3o0J29J2J1j5j2j77o1J24J44k43
4193a43J65P7o1J13j53j17Q9N9n6m8L9M1rk12K34o6qq7j75M78k47P0n6J31Qk31
4219a65L11k17j0J8J9K33j85j40L01j98r0K37q8%j00L1R9q1k4O0k6R6p2p4J76
$$ plain form
4047 -13 156 -180 203 24 169 -115 -77 83 -91 -98 -188 -10 -34 -107 15 34 93 185 -72 62 13 190 92 40
4071 40 -16 -82 152 -69 93 175 52 9 -157 131 -130 -23 15 -177 -77 60 -55 57 109 -111 -9 16 -122
4094 -122 -131 -65 84 -148 47 -100 116 -96 108 132 119 -68 -6 -131 64 109 -25 84 -136 -40 99 -48 -20
4117 -20 -5 17 -48 -24 62 -22 105 111 285 -103 148 -144 140 -86 -25 -119 -216 -54 -65 10 -109 72 -188 -16 76
4142 76 30 -81 148 -114 -107 -172 142 199 24 125 64 -50 29 125 96 -24 -31 74 124 46 -152 -65 36 -53 -11 91
4168 91 63 70 169 56 -190 54 -172 26 73 -24 179 126 -28 5 -55 74 86 97 82 70 -107 -168 -44 100 -143
4193 -143 22 99 38 151 -2 -119 -30 29 -27 -75 -36 5 -4 -216 18 -48 -56 -143 -318 160 -87 -17 -73 58 66 -165
4219 -165 146 -71 -81 -63 -44 189 4 -136 165 -33 -123 114 26 26 -74 -43 56 -25 -49 11 -15 81 9 -65 111
4244A11k29J55N4j28P5l27L29j77qL34M4k09J2l45K48j60K16N5l4j84K0Q3K27
4267A62k13j03M1J81j16K25k07k5J33k93J87K5M1k99K49pJ25k7k35K71k80K70
4289A05j12O9j65K2N9J23L8j69l4J11j85K45q0o5QJ10O1j9m5o8J01l62L61p9J
$$ plain form
4244 111 -118 37 91 -37 38 -289 40 -137 -145 189 233 24 36 -309 -61 -221 -5 50 16 -168 -148 -65 162
4267 162 -51 -154 -113 68 -48 177 -30 -55 78 -215 -28 -3 38 -261 -12 -19 106 79 -156 115 -165 105
4289 105 -7 62 -103 -81 -22 101 139 -30 -64 47 -138 107 27 -38 -30 80 141 122 77 9 110 -252 109 30 31
$$ [...]
8191a60
##END NTUPLES=NMR FID
##END=
