##TITLE=1H_Pr C2-nAc
 200.13Hz, D2O.
 8 sc
 13.8.2026
##JCAMPDX= 6.0         $$ Bruker NMR JCAMP-DX V2.0
##DATA TYPE= NMR FID
##DATA CLASS= NTUPLES
##ORIGIN= UXNMR, Bruker Analytische Messtechnik GmbH
##OWNER= pz
$$ XWIN-NMR		Version 3.5
$$ Wed Aug 12 12:18:13 2026 Russian Standard Time (UT+4h)  she@DPX200
##.OBSERVE FREQUENCY= 200.1313
##.OBSERVE NUCLEUS= ^1H
##.DELAY= (6, 6)
##.ACQUISITION MODE= SIMULTANEOUS
##.ACQUISITION SCHEME= undefined
##.AVERAGES= 8
##.DIGITISER RES= 18
##SPECTROMETER/DATA SYSTEM= spect
##.PULSE SEQUENCE= zg30
##.SOLVENT NAME= D2O
##.SHIFT REFERENCE= (INTERNAL, D2O, 0, 14.3821)
##AUDIT TRAIL= $$ (NUMBER, WHEN, WHO, WHERE, WHAT)
$$ ##TITLE= Audit trail, XWIN-NMR		Version 3.5
$$ ##JCAMPDX= 5.01
$$ ##ORIGIN= Bruker BioSpin GmbH
$$ ##OWNER= she
$$ F:/spectra/data/she/nmr/H-C/1/audita.txt
$$ ##AUDIT TRAIL=  $$ (NUMBER, WHEN, WHO, WHERE, WHAT)
(   1,<2026-08-12 12:17:08.03 +0400>,<she>,<DPX200>,
      <created by zg, POWCHK disabled, PULCHK disabled
       configuration hash MD5:
       00 E9 B6 7A A2 85 ED C7 34 08 36 98 17 FE 4E 26
       data hash MD5: 16K
       AF F4 B6 2B EC E9 EA 9E 5A A0 FB 78 CD 9A FB D8>)
$$ ##END=
$$ 
$$ hash MD5
$$ 49 26 09 18 80 3F FD 55 7D D3 FD 6C 15 A8 C7 7B
##$RELAX= 
##$RELAX= 
##$RELAX= 
##$RELAX= 
##$RELAX= 
##$RELAX= 
$$ Bruker specific parameters
$$ --------------------------
##$DU= <F:/spectra>
##$EXPNO= 1
##$NAME= <H-C>
##$PROCNO= 1
##$TYPE= <nmr>
##$USER= <she>
##$AMP= (0..31)
100 100 100 100 100 100 100 100 100 100 100 100 100 100 100 100 100 100 
100 100 100 100 100 100 100 100 100 100 100 100 100 100 
##$AQSEQ= 0
##$AQ_mod= 1
##$AUNM= <au_zg>
##$AUTOPOS= <>
##$BF1= 200.13
##$BF2= 200.13
##$BF3= 200.13
##$BF4= 200.13
##$BF5= 200.13
##$BF6= 200.13
##$BF7= 200.13
##$BF8= 200.13
##$BYTORDA= 1
##$CFDGTYP= 0
##$CFRGTYP= 5
##$CHEMSTR= <none>
##$CNST= (0..31)
1 1 145 1 1 1 1 1 1 1 1 1 1 1 1 1 1 1 1 1 1 1 1 1 1 1 1 1 1 1 1 1 
##$CPDPRG= <>
##$CPDPRG1= <>
##$CPDPRG2= <>
##$CPDPRG3= <>
##$CPDPRG4= <mlev>
##$CPDPRG5= <mlev>
##$CPDPRG6= <mlev>
##$CPDPRG7= <mlev>
##$CPDPRG8= <mlev>
##$CPDPRGB= <>
##$CPDPRGT= <>
##$D= (0..31)
0 0.7 0 0 0 0 0 0 0 0 0 0.03 0 0 0 0 0 0 0 0 0 0 0 0 0 0 0 0 0 0 0 0 
##$DATE= 1786522627
##$DBL= (0..7)
120 120 120 120 120 120 120 120 
##$DBP= (0..7)
150 150 150 150 150 150 150 150 
##$DBP07= 0
##$DBPNAM0= <>
##$DBPNAM1= <>
##$DBPNAM2= <>
##$DBPNAM3= <>
##$DBPNAM4= <>
##$DBPNAM5= <>
##$DBPNAM6= <>
##$DBPNAM7= <>
##$DBPOAL= (0..7)
0.5 0.5 0.5 0.5 0.5 0.5 0.5 0.5 
##$DBPOFFS= (0..7)
0 0 0 0 0 0 0 0 
##$DE= 6
##$DECBNUC= <off>
##$DECIM= 32
##$DECNUC= <off>
##$DECSTAT= 4
##$DIGMOD= 1
##$DIGTYP= 9
##$DL= (0..7)
0 120 120 120 120 120 120 120 
##$DP= (0..7)
150 150 150 150 150 150 150 150 
##$DP07= 0
##$DPNAME0= <>
##$DPNAME1= <>
##$DPNAME2= <>
##$DPNAME3= <>
##$DPNAME4= <>
##$DPNAME5= <>
##$DPNAME6= <>
##$DPNAME7= <>
##$DPOAL= (0..7)
0.5 0.5 0.5 0.5 0.5 0.5 0.5 0.5 
##$DPOFFS= (0..7)
0 0 0 0 0 0 0 0 
##$DQDMODE= 0
##$DR= 18
##$DS= 0
##$DSLIST= <SSSSSSSSSSSSSSS>
##$DSPFIRM= 0
$$ [...]
##$SUBNAM0= <"">
##$SUBNAM1= <"">
##$SUBNAM2= <"">
##$SUBNAM3= <"">
##$SUBNAM4= <"">
##$SUBNAM5= <"">
##$SUBNAM6= <"">
##$SUBNAM7= <"">
##$SUBNAM8= <"">
##$SUBNAM9= <"">
##$SW= 18.0517328524113
##$SWIBOX= (0..15)
0 0 2 0 0 0 0 0 0 0 0 0 0 0 0 0 
##$SW_h= 3612.71676300578
##$TD= 16384
##$TD0= 1
##$TE= 0
##$TE2= 300
##$TE3= 300
##$TEG= 300
##$TL= (0..7)
0 120 120 120 120 120 120 120 
##$TP= (0..7)
150 150 150 150 150 150 150 150 
##$TP07= 0
##$TPNAME0= <>
##$TPNAME1= <>
##$TPNAME2= <>
##$TPNAME3= <>
##$TPNAME4= <>
##$TPNAME5= <>
##$TPNAME6= <>
##$TPNAME7= <>
##$TPOAL= (0..7)
0.5 0.5 0.5 0.5 0.5 0.5 0.5 0.5 
##$TPOFFS= (0..7)
0 0 0 0 0 0 0 0 
##$TUNHIN= 0
##$TUNHOUT= 0
##$TUNXOUT= 0
##$USERA1= <user>
##$USERA2= <user>
##$USERA3= <user>
##$USERA4= <user>
##$USERA5= <user>
##$V9= 5
##$VALIST= <valist>
##$VCLIST= <CCCCCCCCCCCCCCC>
##$VD= 0
##$VDLIST= <DDDDDDDDDDDDDDD>
##$VPLIST= <PPPPPPPPPPPPPPP>
##$VTLIST= <TTTTTTTTTTTTTTT>
##$WBST= 1024
##$WBSW= 4
##$XGAIN= (0..3)
0 0 0 0 
##$XL= 0
##$YL= 0
##$YMAX_a= 467821
##$YMIN_a= -438745
##$ZGOPTNS= <>
##$ZL1= 120
##$ZL2= 120
##$ZL3= 120
##$ZL4= 120
##$ABSF1= 10
##$ABSF2= 0
##$ABSG= 5
##$ABSL= 3
##$ALPHA= 0
##$AQORDER= 0
##$ASSFAC= 0
##$ASSFACI= 0
##$ASSFACX= 0
##$ASSWID= 0
##$AUNMP= <proc_1d>
##$AZFE= 0.1
##$AZFW= 0.1
##$BCFW= 1
##$BC_mod= 2
##$BYTORDP= 1
##$COROFFS= 0
##$CY= -3
##$DATMOD= 1
##$DC= 2
##$DFILT= <>
##$DTYPP= 0
##$F1P= 0
##$F2P= 0
##$FCOR= 0.5
##$FTSIZE= 0
##$FT_mod= 4
##$GAMMA= 1
##$GB= 0.15
##$INTBC= 1
##$INTSCL= 1
##$ISEN= 128
##$LB= 0.25
##$LEV0= 0
##$LPBIN= 0
##$MAXI= 10000
##$MC2= 0
##$MEAN= 0
##$ME_mod= 0
##$MI= 1.114404
##$NCOEF= 0
##$NC_proc= 0
##$NLEV= 6
##$NOISF1= 3.799351
##$NOISF2= 2.8
##$NSP= 1
##$NTH_PI= 0
##$NZP= 0
##$OFFSET= 14.38212
##$PC= 1
##$PHC0= -4218.349
##$PHC1= 4.792301
##$PH_mod= 1
##$PKNL= yes
##$PPARMOD= 0
##$PSCAL= 0
##$PSIGN= 0
##$REVERSE= no
##$SF= 200.129724274929
##$SI= 16384
##$SIGF1= 3
##$SIGF2= 2
##$SINO= 400
##$SIOLD= 16384
##$SREGLST= <1H.CDCl3>
##$SSB= 0
##$STSI= 0
##$STSR= 0
##$SW_p= 3205.1282051282
##$SYMM= 0
##$S_DEV= 0
##$TDeff= 0
##$TDoff= 0
##$TI= <>
##$TILT= no
##$TM1= 0
##$TM2= 0
##$TOPLEV= 0
##$USERP1= <user>
##$USERP2= <user>
##$USERP3= <user>
##$USERP4= <user>
##$USERP5= <user>
##$WDW= 1
##$XDIM= 8192
##$YMAX_p= 0
##$YMIN_p= 0
$$ End of Bruker specific parameters
$$ ---------------------------------
##NTUPLES= NMR FID
##VAR_NAME=  TIME,          FID/REAL,        FID/IMAG
##SYMBOL=    X,             R,               I
##VAR_TYPE=  INDEPENDENT,   DEPENDENT,       DEPENDENT
##VAR_FORM=  AFFN,          ASDF,            ASDF
##VAR_DIM=   8192,          8192,            8192
##UNITS=     SECONDS,       ARBITRARY UNITS, ARBITRARY UNITS
##FACTOR=    0.0002768,     1,               1
##FIRST=     0,             0,               0
##LAST=      2.2672688,     0,               0
##MIN=       0,             -438745,         0
##MAX=       2.2672688,     467821,          0
$$ Real data points
##PAGE= N=1
##DATA TABLE= (X++(R..R)), XYDATA
$$ [...]
$$ plain form
2709 -4675 94 4971 7859 7962 4990 273 -4657 -7916 -7983 -5281 -514 4419 7646 8020 5461 1055
2725 1055 -4073 -7564 -7905 -5670 -1442 3519 7185 8149 5756 1690 -3302 -7309 -8106 -6347 -2214 2923
2741 2923 6687 8018 6387 2398 -2694 -6375 -8086 -6910 -2850 2078 6245 7875 6745 3074 -1720
2756 -1720 -5904 -7861 -6936 -3535 1543 5476 7854 7131 3920 -989 -5584 -7782 -7189 -3824 838 5003
2772 5003 7716 7418 4342 -237 -4754 -7538 -7382 -4668 -125 4478 7420 7609 4947 295 -4106 -7333
2788 -7333 -7646 -5227 -814 3726 7103 7577 5548 1287 -3458 -6919 -7594 -5380 -1541 3058 6721 7471
2804 7471 5737 2014 -2880 -6185 -7539 -5963 -2307 2427 6126 7577 6340 2523 -2179 -5917 -7560
2819 -7560 -6416 -2971 1841 5512 7716 6699 3066 -1538 -5146 -7485 -6538 -3427 851 5377 7251
$$ packed form
2709d675M769M877K888J03k972m717m930l259o7K702M767M933L227L74k559m406
2725A055n128l491l41K235M228M961L666R64k393m066m992m007p97J759M133N137
2741B923L764J331j631l989n092l681j711J176M060M928M167J630j130l671m794
2756a720m184j957R25L401N078L933K378p23l211m909m595k198N93L365M662M165
2772E003K713k98l076m579m517k784J56K714M543M603K942J89k662m652m401l227
2788g333l13K419M413M540L377M74k029m261m745l461o75K214L839M599L663P50
2804G471j734l723m894l305j354J576L656M734L699J451j237l817m702l738j643
2819g560J144L445M812L671K204j017l633m604l608k339R47L111M278M526J874
$$ plain form
2834 7251 6955 3658 -545 -4755 -7097 -7134 -3817 528 4726 6968 6945 4481 -132 -4110 -6905 -6986 -4640
2851 -4640 -420 3739 6723 7051 4941 657 -3602 -6665 -7191 -4990 -878 3337 6340 7200 5239 1534
2867 1534 -2961 -6198 -7130 -5455 -1851 2773 6040 7138 5450 1927 -2370 -5792 -7187 -5736 -2269
2882 -2269 2198 5636 7083 5850 2537 -1707 -5424 -7043 -6136 -2643 1502 5127 6977 6005 3271
2897 3271 -1203 -4873 -6885 -6356 -3231 691 4570 6742 6370 3812 -479 -4436 -6455 -6438 -3865 87
2913 87 4009 6465 6387 4258 463 -3781 -6358 -6573 -4452 -625 3486 6105 6540 4609 970 -3338
2929 -3338 -5971 -6527 -4909 -1085 3040 5582 6671 4832 1532 -2645 -5619 -6779 -5131 -2034 2007
2944 2007 5525 6432 5394 1905 -2068 -5202 -6628 -5531 -2188 1827 5110 6498 5576 2659 -1586
$$ packed form
2834G251k96l297m203m210k342l7L317M345M198K242k3k464m613l978k795q1K346
2851d640M220M159K984L28k110m284m259l063n26K201M112M215L003Q60j961l705
2867A534m495l237r32J675L604M624L267J098j688l523m297l422j395J451L467
2882b269M467L438J447j233l313m244l717j619R07L493M145L625J850r72k734
2897C271m474l670k012N29L125L922L879K172l72k558m291l957k019J7K573L952
2913H7L922K456p8k129l795m244k577k15K121L827M111K619M35j931l639m308
2929c338k633n56J618L824M125K542J089j839l300m177k974j160J648L097M041
2944B007L518R07j038l489l973l134j426J097L343M015L283J388r22k917m245
$$ plain form
2959 -1586 -4796 -6299 -5749 -2749 1077 4495 6258 5984 3178 -725 -4473 -6355 -5870 -3429 501 4089
2975 4089 6173 5912 3449 -212 -3961 -5920 -5980 -3512 -112 3492 5945 6339 3745 451 -3335 -5662
2991 -5662 -6073 -4206 -404 3038 5508 6241 4204 910 -2703 -5564 -5957 -4358 -1227 2521 5205 6146
3007 6146 4304 1607 -2219 -4837 -6034 -4748 -1713 1923 4718 5987 4717 1935 -1753 -4946 -5975
3022 -5975 -4929 -2098 1492 4255 5921 5187 2526 -954 -4239 -5800 -5328 -2689 693 3940 5904
3037 5904 5322 3068 -533 -3673 -5587 -5451 -3137 156 3525 5312 5275 3121 78 -3327 -5313 -5393
3053 -5393 -3323 -111 3261 5311 5504 3480 457 -2792 -5284 -5622 -3781 -792 2538 4810 5566 3993
3069 3993 974 -2305 -4836 -5588 -4211 -1364 2270 4699 5481 4224 1579 -2014 -4393 -5508 -4382
$$ packed form
2959a586l210j503N50L000L826L418J763k74k806l903l748j882M85K441L930L588
2975D089K084k61k463l661l749j959o0K468L400L604K453L94k594l294l786k327
2991e662m11J867L802L442K470P33k037l294l613k861l93J599L131L748K684R41
3007F146j842k697l826k618j197J286L035L636K795J269j270k782l688l193j029
3022e975J046K831L590K763J666p34k661l480l285j561M72K639L382L247J964
3037E904n82k254l601l140j914J36K314L293L369J787l7k154l043l405j986q0
3053e393K070L212L372K050J93k024l023l249k492l38J841K989L330K272P56j573
3069C993l019l279k531p52J377K847L634K429P82j257k645l593k379j115J126
$$ plain form
3084 -4382 -1620 1660 4500 5510 4428 1893 -1414 -4155 -5327 -4528 -2152 1168 3900 5203 4806
3099 4806 2342 -854 -3899 -5260 -4890 -2261 585 3700 5141 4818 2484 -385 -3545 -4922 -4843 -2849
3115 -2849 389 3001 4881 4840 3180 113 -2971 -4809 -4737 -3220 -136 2879 4647 4841 3187 281
3131 281 -2594 -4380 -4810 -3307 -732 2464 4515 4852 3320 1100 -1913 -4352 -4919 -3875 -1206 1876
3147 1876 4264 4894 3715 1558 -1522 -4129 -4713 -3938 -1485 1422 3776 4666 3883 1744 -1323 -3425
3163 -3425 -4750 -4019 -1869 905 3482 4469 3940 2240 -823 -3253 -4557 -4204 -2420 545 3111 4464
3179 4464 4399 2458 -281 -2804 -4446 -4452 -2530 78 2848 4562 4369 2770 182 -2469 -4135 -4247 -2744
3196 -2744 -335 2304 4135 4310 2954 568 -2291 -4112 -4367 -3012 -595 1915 3781 4499 3278 690
$$ packed form
3084d382K762L280K840J010j082k535l307k741j172P99K376L320K732J303l97
3099D806k464l196l045j361L70K629K846L115J441l23k334k869l160j377P9J994
3115b849L238K612J880m1j660l067l084j838P2J517L084L015J768J94j654k906
3131B81k875j786m30J503K575L196K051L37j532k220l013k439n67J044K669L082
3147A876K388O30j179k157l080k607n84P75K453K907K354Q90p83k139l067k102
3163c425j325P31K150K774K577R87n29j700l063k430j304L53J784K965K566J353
3179D464o5j941k739k523j642oJ922K608K770J714j93j599k588k651j666j12J503
3196b744K409K639J831J75j356k386k859j821k55J355K417K510J866P18j221k588
$$ plain form
3212 690 -1689 -3875 -4334 -3352 -1207 1570 3649 4232 3470 1081 -1449 -3561 -4196 -3505 -1222 1148 3201
3229 3201 4209 3678 1478 -993 -3214 -4263 -3591 -1598 755 3102 4077 3801 2025 -689 -2913 -4038
3245 -4038 -3852 -2065 322 2816 3962 3877 2298 -207 -2337 -4087 -3787 -2217 -13 2293 3766 3842
3261 3842 2369 12 -2154 -3723 -3769 -2650 -382 1937 3544 4001 2699 731 -1974 -3413 -3670 -2845
3277 -2845 -716 1646 3392 3787 3003 729 -1435 -3180 -3691 -2947 -874 1193 3171 3655 2854 1219
3293 1219 -1137 -3076 -3775 -3148 -1117 950 2910 3689 3239 1546 -835 -2590 -3807 -3043 -1474 664
3309 664 2775 3527 3399 1760 -348 -2625 -3545 -3374 -1638 328 2257 3524 3188 1932 40 -2187
3325 -2187 -3361 -3404 -2238 49 2199 3354 3360 2025 168 -1889 -3238 -3456 -2422 -472 1754 3230
$$ packed form
3212F90k379k186m59R82K145K777K079N83p62k389k530k112o35O91K283K370K053
3229C201J008n31k200k471k221j049O72J993K353K347R75k76j776k714k224j125
3245d038J86J787K387K494J146q5j579k505k130j750L00J570K204K306J473P6
3261C842j473k357k166j569m6J119K268K319J607M57j302j968k705j439k57Q25
3277b845K129K362J746L95p84k274k164j745n11P44K073K067J978M84q01j635
3293A219k356j939o99O27K031K067J960P79m50j693k381j755j217P64J569K138
3309F64K111P52j28j639k108k277r20J71J736J966J929J267l36j256j892k227
3325b187j174m3J166K287K150J155Oj335j857k057j349k18J034J950K226J476
$$ plain form
3341 3230 3161 2396 437 -1412 -2951 -3235 -2512 -518 1275 2857 3285 2487 686 -1218 -2840 -3261 -2608
3358 -2608 -911 930 2838 3286 2558 871 -970 -2537 -3225 -2801 -1168 720 2174 3393 2686 1297
3374 1297 -668 -2325 -3075 -2749 -1314 537 2340 2976 2917 1611 -123 -2009 -3118 -2776 -1377 180
3390 180 1907 2873 2790 1591 -237 -1958 -2708 -2723 -1826 -2 1647 2714 2782 1842 172 -1546 -2525 -2799
3408 -2799 -1894 -282 1436 2599 2914 1991 379 -1259 -2347 -2759 -2066 -528 1234 2369 2728 2122 986
3425 986 -650 -2324 -2758 -2222 -920 878 2277 2585 2351 961 -569 -2068 -2769 -2370 -1132 634 1882
3442 1882 2688 2512 1018 -376 -2002 -2565 -2430 -1380 633 1850 2529 2342 1144 -102 -1755 -2389 -2484
3459 -2484 -1477 -16 1548 2337 2486 1433 86 -1452 -2171 -2411 -1700 -133 1343 2427 2400 1748 403
$$ packed form
3341C230o9p65j959j849j539k84P23J994J793J582M28p98j801j904j622m21O53
3358b608J697J841J908M48p28j687j841j567o88M24J633J888J454J219p07j389
3374A297j965j657p50L26J435J851J803O36n9j306j734j886j109L42J399J557
3390A80J727R66q3j199j828j721p50j5Q97J824J649J067O8r40j670j718r79k74
3408b799R05J612J718J163L15r23j612j638j088m12O93J538J762J135L59o06j136
3425I86j636j674m34N36J302J798J399L08k34j390j530j499p01L99J238J766J248
3442A882Q06j76j494j394j626n63J35J050K013J217O79j87j198j246j653o34r5
3459b484J007J461J564P89J49j053j347j538p19k40P11J567J476J084k7o52j345
$$ plain form
3476 403 -1218 -2146 -2366 -1612 -265 1154 2107 2385 1619 303 -889 -1911 -2415 -1638 -344 482 1977
3493 1977 1992 1699 847 -737 -2042 -2270 -1770 -691 492 1523 2402 2088 1001 -412 -1710 -2346 -1921
3510 -1921 -964 683 1689 2298 2181 1222 -163 -1579 -2076 -1979 -1173 361 1235 2042 1795 1053 35 -1307
3528 -1307 -2028 -1957 -1278 -8 1152 1815 1941 1271 233 -1057 -1835 -2030 -1457 -314 1268 2100 2033 1460
3546 1460 369 -974 -1768 -1850 -1396 -447 856 1830 1946 1353 390 -898 -1680 -1979 -1476 -529 436 1540
3564 1540 1882 1291 597 -471 -1610 -1888 -1451 -774 390 1507 1653 1408 528 -482 -1321 -1824 -1531 -897
3582 -897 331 1297 1543 1671 843 -142 -1040 -1810 -1696 -1031 119 1323 1732 1519 1147 132 -914 -1487
3600 -1487 -1654 -912 -83 1074 1276 1481 1035 153 -455 -1491 -1360 -1052 -210 774 1498 1616 1122 468 -584
$$ packed form
3476D03j621r28k20P54J347J419R53K78p66j316j192j022n04P77J294Q26J495
3493A977J5k93q52j584j305k28N00J079J183J031Q79l14j087j413j298o36M25
3510a921R57J647J006O09j17r59j385j416m97R7Q06J534Q74Q07k47p42j018j342
3528a307p21P1O79J270J160O63J26o70j038j290p78j95N73J143J582Q32o7n73
3546A460j091j343p94q2M54R49J303R74J16n93r63j288p82k99N03R47R65J104
3564A540L42n91o94j068j139k78M37O77J164J117J46k45q80j010q39n03K93O34
3582h97J228R66K46J28q28r85q98p70J14O65J150J204M09k13l72j015j046n73
3600a487j67P42Q29J157K02K05m46q82o08j036J31L08Q42R84P24J18m94o54j052
$$ plain form
3619 -584 -1189 -1691 -1224 -355 557 1266 1577 1373 459 -392 -1237 -1257 -1106 -692 382 1346 1612 1244 556 -409
3639 -409 -1129 -1461 -1369 -780 458 1249 1440 1477 488 -44 -1056 -1266 -1265 -731 83 817 1524 1260 875 -91 -726
3660 -726 -1176 -1102 -625 170 584 1170 1464 657 190 -540 -1277 -1177 -825 -214 530 1191 1213 1103 99 -489
3680 -489 -1114 -1223 -977 -154 490 1147 1339 838 309 -369 -1171 -1220 -991 -361 336 1028 1339 1016 322 -348
3700 -348 -962 -1110 -992 -425 251 729 993 1000 405 -199 -857 -1187 -874 -363 164 800 898 1037 734 -27 -732
3721 -732 -755 -721 -743 69 459 659 1147 855 -80 -597 -860 -1078 -866 -97 349 946 847 647 -11 -226 -840
3742 -840 -759 -817 -419 254 848 958 710 436 -487 -892 -899 -620 -212 261 689 1016 675 296 -269 -617 -995
3763 -995 -768 -235 17 447 836 922 490 107 -600 -993 -361 -569 -27 686 715 786 283 156 -429 -880 -594
$$ packed form
3619e84o05n02M67Q69R12P09L11k04r14q51q45k0J51M14J074R64K66l68o88r65
3639d09p20l32R2N89J238P91J91L7r89n32j012k10JN34Q14P34P07k64l85r66o35
3660g26m50P4M77P95M14N86K94q07m67p30p37J00L52O11P44O61K2j10j004n88
3680d89o25j09K46Q23O44O57J92n01n29o78q02m9K29O30O97O92L11l23o94o70
3700c48o14j48J18N67O76M78K64Pn95o04o58l30L13N11N27O36R8J39l03p61p05
3721g32k3L4k2Q12L90K00M88k92r35n17k63k18K12P69M46N97r9k00o58k15o14
3742h40Q1n8L98O73N94J10k48k74r23m05pK79M08M73M28L27l41l79n65l48l78
3763i95K27N33K52M30L89Q6m32l83p07l93O32k08N42P13K9P1n03j27n85m51K86
$$ plain form
3784 -594 -558 5 515 736 817 461 -44 -539 -684 -855 -396 55 303 805 946 656 -1 -300 -817 -703 -652
3805 -652 -351 314 442 625 672 340 -131 -642 -783 -493 -280 235 665 885 673 384 -4 -458 -796 -562
3825 -562 -336 181 395 388 478 345 -181 -396 -798 -488 -401 80 603 647 741 554 107 -268 -505 -630 -409 -9
3847 -9 172 409 598 466 29 -155 -447 -727 -321 7 174 518 353 381 392 -348 -548 -377 -470 -184 196 300
3869 300 625 367 205 -192 -542 -362 -310 -234 -12 391 586 253 191 -264 -310 -595 -394 -244 60 382 314 457
3891 457 204 -11 -65 -394 -482 -314 -127 166 241 271 274 -14 -105 -304 -621 -102 -39 -117 452 498 448 104 -64 -331
3915 -331 -462 -499 -139 -81 234 474 376 4 -66 -266 -425 -234 -165 65 153 498 89 357 -37 -154 -285 -349
3937 -349 -307 56 325 473 128 179 47 -176 -431 -428 -333 71 294 77 202 72 134 23 -162 -334 -47 -197
$$ packed form
3784e94L6N63N10K21Q1l56n05m95j45j71M59M51K48N02J41k90o57k99n17J14N1
3805f52L01O65J28J83M7l32m71n11j41K90K13N15M30K20k12k89l88m54l38K34
3825e62K26N17K14pR0j33n26k15m02L10Q7M81N23M4R4j87m47l75k37j25K21M00
3847iJ81K37J89j32m37j84k92k80M06L28J67L44j65K8J1p40k00J71r3K86L80J04
3869C00L25k58j62l97l50J80N2P6K22M03J95l33o2m55m6k85K01J50L04L22o8J43
3891D57k53k15n4l29q8J68J87K93P5L0Lk88r1j99l17N19O3p8N69M6n0l44j68k67
3915c31j31l7L60N8L15K40r8l72p0k00j59J91O9K30Q8L45m09K68l94j17j31o4
3937c49M2L63K69J48l45N1j32k23k55LR5M04K23k17J25j30O2j11j85j72K87j50
$$ plain form
3959 -197 301 126 344 287 166 -40 -285 -263 -319 -58 -83 268 208 375 161 231 -266 -432 -383 -285 -73 246 366
3982 366 546 12 -23 -170 -189 -343 -185 -162 204 268 210 432 99 -132 -281 -193 -325 -80 133 132 155 506 170
4005 170 -35 -194 -367 -269 -97 -33 130 371 470 244 193 -329 -276 -105 -49 71 232 178 210 163 110 -104 -365
4028 -365 -42 -392 22 72 307 406 312 -15 5 -112 -266 -69 46 139 390 346 279 152 -161 -279 -66 -310
4050 -310 -169 -74 51 305 238 193 76 -269 -348 -250 -84 134 141 388 155 -35 -144 -136 -156 -394 -367 15 219 569
4074 569 370 149 192 13 -295 -247 -306 -66 206 249 303 217 307 -117 -348 -398 -284 -60 146 206 172 49 181
4097 181 32 -283 -219 -229 -2 -36 80 285 272 183 70 -107 -261 -269 86 -41 -15 175 226 318 68 -49 -198
4120 -198 -20 -167 51 178 211 166 159 29 8 -403 -309 -296 -144 -13 291 312 405 133 -149 -149 -319 -252 -223 53
$$ packed form
3959a97M98j75K18n7j21k06k45K2n6K61k5L51o0J67k14P0m97j66M9R8K12L19J20
3982C66J80n34l5j47j9j54J58K3L66O4n8K22l33k31j49Q8j32K45K13jK3L51l36
4005A70k05j59j73R8J72O4J63K41R9k26n1n22N3J71N6J20J61n4L2m7n3k14k61
4028c65L23l50M14N0K35R9r4l27K0j17j54J97J15R3K51m4o7j27l13j18K13k44
4050c10J41R5J25K54o7m5j17l45p9R8J66K18PK47k33j90j09Qk0k38K7L82K04L50
4074E69j99k21M3j79l08M8n9K40K72M3N4q6R0m24k31n0J14K24K06O0l4j23J32
4097A81j49l15O4j0K27l4J16K05j3q9j13j77j54qL55j27K6J90N1R2k50j17j49
4120a98J78j47K18J27L3m5pj30k1m11R4J3J52J31L04K1R3k72k82%j70O7K9K76
$$ plain form
4144 53 14 209 133 139 -35 -128 -241 -145 -126 -143 183 384 276 316 123 -101 -317 -282 -185 -39 59 261 373 89
4168 89 60 -113 -242 -148 -432 -227 129 178 280 174 -55 27 -110 -225 -415 -231 -109 -16 220 381 29 263
4190 263 -249 -194 -170 -228 -37 332 219 169 172 43 -29 -176 -196 69 -67 13 342 238 232 123 149 -240 -347 -243
4214 -243 -261 -60 271 241 182 268 178 -113 -195 -226 -174 -24 43 157 271 177 38 -204 -90 -405 -36 -15 282 178
4238 178 192 390 12 -251 -85 -361 -97 -66 234 197 138 312 139 -49 -407 -445 -217 106 -162 382 273 375
4260 375 28 -107 -290 -286 -340 -216 71 44 270 528 141 -19 -93 -445 -159 -161 92 145 243 95 337 180 -282
4283 -282 -226 -70 -120 227 150 185 391 66 -42 -151 -186 -204 -227 -138 72 52 414 490 174 -106 -521 -359 -231
4306 -231 -134 -21 179 331 301 -44 -235 -203 -341 -298 -451 32 216 34 326 283 306 -329 -331 34 -353 -195 127
$$ packed form
4144E3l9J95p6Oj74r3j13R6J9j7L26K01j08M0j93k24k16L5R7J46R8K02J12k84
4168H9k9j73j29R4k84K05L56M9J02j06k29Q2j37j15j90J84J22R3K36J61l52K34
4190B63n12N5K4n8J91L69j13n0Lj29p2j47k0K65j36Q0L29j04oj09K6l89j07J04
4214b43j8K01L31l0n9Q6r0k91q2l1N2J50O7J14J14r4j39k42J14l15L69K1K97j04
4238A78J4J98l78k63J66k76K64L1L00l7n9J74j73j88l58l8K28L23k68N44j09J02
4260C75l47j35j83Mn4J24K87k7K26K58l87j60p4l52K86kK53N3R8j48K42j57m62
4283b82N6J56n0L47p7L5K06l25j08j09l5j8k3Q9K10k0L62P6l16k80m15J62J28
4306b31R7J13K00J52l0l45j91L2j38M3j53M83J84j82K92m3K3o35kL65l87J58L22
$$ plain form
4329 127 240 351 62 -102 -274 -301 -465 -49 -83 209 488 259 318 237 -54 -313 -352 -158 -93 205 391 229
4351 229 460 192 77 -294 -459 -216 -38 131 271 612 200 177 -35 -285 -291 -288 44 59 -29 296 523 148
4373 148 -19 -191 -392 -441 -240 13 230 300 541 137 281 -11 -387 -300 -3 -121 232 159 545 360 -63
4394 -63 -238 -509 -348 -461 -26 189 293 532 230 208 -92 -535 -241 -204 -116 -5 337 446 410 125 -108 -298
4416 -298 -351 -429 -40 26 302 538 360 142 -101 -25 -323 -128 -104 -55 92 316 505 89 -59 -223 -450 -324
4438 -324 -181 -85 54 348 276 175 2 -51 -153 -381 -241 -243 168 253 392 88 201 -375 -399 -390 -465 -60 162
4461 162 262 247 550 127 -144 -501 -327 -423 -481 51 281 295 341 113 20 -327 -452 -264 -358 122 329 357 156
4484 156 -102 -43 -339 -479 -476 -295 59 76 245 475 81 10 -145 -444 -325 -206 20 128 488 471 421 45
$$ packed form
4329A27J13J11k89j64j72k7j64M16l4K92K79k29N9q1k91k59l9J94O5K98J86j62
4351B29K31k68j15l71j65K43J78J69J40L41m12k3k12k50oLL32J5q8L25K27l75
4373A48j67j72k01m9K01K53K17P0K41m04J44k92l76Q7K97j18L53p3L86j85m23
4394f3j75k71J61j13M35K15J04K39l02k2l00m43K94L7Q8J11L42J09l6k85k33j90
4416b98n3p8L89O6K76K36j78k18k43P6k98J95K4M9J47K24J89m16j48j64k27J26
4438c24J43R6J39K94p2j01j73n3j02k28J40kM11Q5J39l04J13n76k4Rp5M05K22
4461A62J00j5L03m23k71l57J74r6n8N32K30J4M6k28r3l47j25J88r4M80K07K8k01
4484A56k58N9k96j40LJ81L54J7J69K30l94p1j55k99J19J19K26J08L60j7n0l76
$$ plain form
4506 45 -194 -577 -476 -197 20 134 302 214 398 144 -225 -447 -532 -343 -102 -43 277 347 247 373 39 -286
4528 -286 -302 -235 -215 -20 139 338 407 119 -157 -393 -471 -249 -82 58 120 420 434 367 -19 -15 -382 -316 -308 10
4552 10 486 322 199 250 195 -180 -171 -289 -445 -123 24 331 469 236 60 -191 -332 -475 -263 -215 144 269
4574 269 512 284 88 -133 -228 -315 -113 -207 -104 182 321 461 -14 -366 -260 -218 -395 -187 7 322 166
4595 166 365 120 49 -458 -243 -359 -304 -240 83 395 490 177 97 -108 -242 -432 -323 -175 199 503 295 295
4617 295 36 -354 -380 -495 -328 -21 186 269 556 396 -3 -146 -429 -308 -187 -51 97 494 619 184 218
4638 218 -119 -315 -344 -321 -327 137 206 290 394 295 272 -396 -247 -504 -240 73 443 449 325 394 179 -364 -430 -417
4662 -417 -224 -34 217 302 374 342 360 -260 -328 -459 -389 -150 241 403 416 263 313 -104 -427 -486 -274 -114 -32
$$ packed form
4506D5k39l83J01K79K17J14J68q8J84k54l69k22q5J89K41N9L20P0j00J26l34l25
4528b86j6O7K0J95J59J99O9k88k76k36p8K22J67J40O2L00J4o7l86Ml67O6QL18
4552A0M76j64j23N1n5l75Rj18j56L22J47L07J38k33j76k51j41j43K12M8L59J25
4574B69K43k28j96k21r5q7K02r4J03K86J39J40m75l52J06M2j77K08J94L15j56
4595A66J99k45p1n07K15j16N5O4L23L12R5l13q0k05j34j90J09J48L74L04k08%
4617B95k59l90k6j15J67L07K07Q3K87j60l99j43k83J21J21J36J48L97J25m35L4
4638B18l37j96k9K3oM64O9Q4J04r9k3o68J49k57K64L13L70Oj24O9k15n43o6J3
4662d17J93J90K51Q5P2l2J8o20o8j31P0K39L91J62J3j53N0m17l23n9K12J60Q2
$$ plain form
4685 -32 332 527 303 3 -229 -147 -397 -620 -46 315 444 536 442 359 -157 -181 -413 -420 -357 -116 248 441 422
4708 422 61 19 -298 -433 -454 -240 63 355 312 517 145 -21 -301 -370 -418 -309 -117 199 441 459 241 87
4730 87 48 -252 -442 -447 -180 327 250 319 270 89 36 -509 -320 -214 -117 63 375 521 302 53 -191 -324 -501
4753 -501 -339 -411 0 203 439 467 -94 -87 -238 -460 -321 -203 10 357 455 188 167 79 -138 -495 -587 -93 238
4776 238 111 -1 446 328 101 -75 -351 -392 -350 24 138 337 286 236 110 -183 -397 -385 -153 -39 286 561
4798 561 296 345 74 -36 -451 -229 -392 -149 187 253 464 314 266 -53 -394 -477 -424 -316 30 229 442 259
4820 259 295 43 -322 -611 -148 -365 -309 203 204 472 125 37 -2 -330 -216 -353 -104 304 399 189 192 -4 -141
4843 -141 -323 -326 -441 -130 165 239 645 407 101 -9 -456 -569 -190 -186 173 349 335 419 34 3 -366 -592 -358
$$ packed form
4685c2L64J95k24l00k32Q2k50k23N74L61J29R2r4q3n16k4k32pO3K41L64J93j9
4708D22l61m2l17j35k1K14L03K92m3K05l72j66k80o9m8J09J92L16K42J8k18j54
4730H7l9l00j90nK67N07p7O9m9j81n3n45J89J06R7J80L12J46k19k49k44j33j77
4753e01J62p2M11K03K36K8n61Pj51k22J39J18K13L47R8k67k1q8k17l57r2M94L31
4776B38j27j12M47j18k27j76k76m1M2L74J14J99n1n0j26k93k14J2K32J14L25K75
4798E61k65M9k71j10m15K22j63K43L36O6K11j50m8l19l41q3N3J08L46J99K13j83
4820B59L6k52l65k89M63k17N6N12JK68l47q8l9l28J14j37K49M08R5k10Lj96j37
4843a41j82lj15L11K95P4M06k38l06j10m47j13L79ML59J76j4Q4l85l1l69k26K34
$$ plain form
4866 -358 -201 43 497 39 315 99 -67 -574 -542 -412 -178 -156 244 490 592 229 -5 -211 -291 -428 -434 33
4888 33 158 317 397 271 322 -299 -540 -350 -452 -54 67 439 357 409 0 -6 -416 -343 -353 27 134 214 362
4911 362 392 164 -158 -726 -293 -451 -125 230 356 398 513 268 -76 -133 -482 -393 -146 178 215 494 359 192
4933 192 12 -232 -422 -491 -80 -149 189 461 435 270 -91 -441 -288 -292 -408 -153 247 391 442 137 80 -68
4955 -68 -424 -596 -419 -264 9 545 458 297 -44 -302 -193 -440 -332 -18 85 450 299 396 169 -308 -507
4976 -507 -518 -288 -275 89 284 542 504 242 -229 -391 -652 -494 -148 104 483 435 233 176 3 -276 -608 -539
4998 -539 -397 92 152 605 424 163 208 -81 -356 -362 -436 -151 91 628 342 259 77 -408 -458 -494 -350 -153 390
5021 390 329 510 47 5 -311 -460 -625 -288 -111 70 437 422 438 197 -207 -439 -156 -649 -182 103 522
$$ packed form
4866c58J57K44M54m58K76k16j66n07L2J30K34K2M00K46J02l63k34k06q0j37oM67
4888C3J25J59Q0j26N1o21k41J90j02L98J21L72q2N2m09om10P3j0L80J07Q0J48
4911C62L0k28l22n68M33j58L26L55J26M2J15k45l44n7l49Q9K47L24L7K79j35j67
4933A92j80k44j90o9M11o9L38K72k6j65l61l50J53mj16K55M00J44N1l05n7j48
4955f8l56j72J77J55K73N36q7j61l41k58J09k47J08L14J03L65j51R7k27m77j99
4976e07j1K30J3L64J95K58l8k62m71j62k61J58L46K52L79m8k02n7j73k79l32O9
4998e39J42M89O0M53j81k61M5k89k75op4K85K42N37k86q3j82m85n0l6J44J97N43
5021C90o1J81m63m2l16j49j65L37J77J81L67j5J6k41m04k32K83m93M67K85M19
$$ plain form
5042 522 458 421 319 -192 -713 -602 -419 -252 78 314 609 671 117 -123 -210 -359 -508 -181 4 112 362
5063 362 451 347 180 -402 -591 -582 -272 -71 409 578 248 416 202 -407 -461 -583 -410 -208 213 345 554
5084 554 500 165 -62 -494 -537 -524 -420 103 540 486 570 234 -206 -364 -459 -505 -260 -1 348 504 405 82 62
5107 62 -494 -638 -338 -225 -4 235 512 445 284 172 -447 -297 -750 -529 29 212 572 393 396 -160 -202 -675
5129 -675 -461 -242 -91 392 338 675 349 -16 -360 -303 -495 -293 -258 210 253 530 476 36 -298 -429 -532 -494
5151 -494 -54 59 436 651 543 320 -68 -446 -574 -644 -419 246 376 537 597 329 200 -454 -493 -389 -197
5172 -197 -25 577 466 674 219 20 -192 -388 -603 -211 -77 91 460 449 300 89 -198 -420 -639 -565 -1
5193 -1 248 469 686 407 232 -146 -571 -551 -585 -192 97 502 676 376 371 -240 -672 -528 -381 -86 155 420
$$ packed form
5042E22o4l7j02n11n21J11J83J67L30K36K95O2n54k40q7j49j49L27J85J08K50
5063C62Q9j04j67n82j89RL10K01M80J69l30J68k14o09n4j22J73K02M21J32K09
5084E54n4l35k27m32m3J3J04N23M37n4Q4l36m40j58r5m6K45K59L49J56r9l23k0
5107F2n56j44L00J13K21K39K77o7j61j12o19J50m53K21N58J83L60j79Ln56m2m73
5129f75K14K19J51M83n4L37l26l65l44N7j92K02L5M68M3K77n4m40l34j31j03L8
5151d94M40J13L77K15j08k23l88l78j28p0K25O65J30J61O0k68j29o54l9J04J92
5172a97J72O02j11K08m55j99k12j96k15L92J34J68L69j1j49k11k87k22k19P4N64
5193aK49K21K17k79j75l78m25K0l4L93K89M05J74l00no11m32J44J47K95K41K65
$$ plain form
5215 420 590 384 65 -150 -270 -413 -450 -381 -14 558 444 482 294 122 -285 -763 -498 -265 61 385 511
5236 511 487 220 -218 -426 -643 -517 -343 -159 299 640 634 547 -75 -173 -748 -497 -571 -158 262 484 812 437
5258 437 310 -336 -604 -622 -381 -94 262 577 724 785 228 -122 -532 -518 -553 -83 -1 400 728 518 308 73
5280 73 -507 -537 -464 -451 290 335 669 662 377 126 -190 -678 -699 -547 -238 403 590 678 343 134 -484 -687 -840
5303 -840 -274 -85 518 642 724 448 -49 -438 -696 -536 -484 -43 158 432 497 410 137 -253 -605 -621 -461 -256
5325 -256 118 598 711 579 331 -279 -489 -582 -680 -180 245 628 850 541 333 -41 -580 -595 -648 -319 228
5346 228 525 463 765 121 151 -467 -709 -680 -368 -93 681 822 623 378 -33 -304 -669 -763 -675 89 271 953
5368 953 657 531 7 -383 -611 -712 -676 -199 409 586 600 600 19 -338 -625 -600 -604 -230 292 454 700 479
$$ packed form
5215D20J70k06l19k15j20j43l7O9L67N72j14L8j88j72m07m78K65K33L26L24J26
5236E11k4k67m38k08k17J26J74J84M58L41oq7o22r8n75K51p4M13M20K22L28l75
5258D37j27o46k68j8K41K87L56L15J47O1n57l50m10J4l5M70Q2M01L28k10k10k35
5280G3n80l0P3J3P41M5L34pk85k51l16m88k1J52L09O41J87Q8l35k09o18k03j53
5303h40N66J89O03J24Q2k76m97l89k58J60N2M41K01K74O5q7k73l90l52j6J60K05
5325b56L74M80J13j32k48o10k10r3r8N00M25L83K22l09k08l74n39j5n3L29N47
5346B28K97o2L02o44L0o18k42K9L12K75P74J41j99k45m11k71l65r4Q8P64J82O82
5368I53k96j26n24l90k28j01L6M77O08J77J4%n81l57k87K5mL74N22J62K46k21
$$ plain form
5390 479 187 -383 -671 -657 -756 -156 356 683 637 629 297 -119 -621 -896 -729 -172 320 294 850 573 480 52
5412 52 -531 -691 -786 -420 188 384 614 709 473 4 -289 -787 -570 -406 157 446 564 669 410 60 -622
5433 -622 -622 -797 -465 -41 425 812 953 421 -89 -492 -675 -678 -720 -127 283 615 552 508 282 -325 -760 -699 -679
5456 -679 -112 280 563 710 840 308 -86 -505 -557 -691 -388 270 503 959 899 395 -169 -599 -912 -553 -513
5477 -513 -56 457 810 990 377 -193 -426 -626 -631 -410 -94 500 902 730 492 24 -298 -598 -983 -489 -32
5498 -32 446 689 861 562 76 -502 -695 -779 -585 -174 513 676 526 803 291 -627 -749 -800 -492 -276 208
5519 208 724 968 811 389 -285 -648 -944 -737 -200 203 658 902 907 393 -199 -618 -1011 -514 -499 153 817
5540 817 980 795 212 40 -619 -686 -703 -428 358 464 1116 790 555 -264 -624 -1022 -925 -385 -157 549 955
$$ packed form
5390D79k92n70k88J4r9O00N12L27m6ql32m16n02k75J67N57M92k6N56k77r3m28
5412E2n83j60r5L66O08J96K30R5k36m69k93m98K17J64N63K89J18J05k59l50o82
5433f22%j75L32M24M66L87J41n32n10m03j83lm2N93M10L32o3m4k26o07m35O1K0
5456f79N67L92K83J47J30n32l94m19n2j34L03O58K33M56o0n04n64m30l13L59M0
5477e13M57N13L53J80o13n70k33k00nK21L16N94M02j72k38m68l22l00l85M94M57
5498c2M78K43J72k99m86n78j93q4J94M11O87J63j50K77n12r18j22n1L08K16M84
5519B08N16K44j57m22o74l63k96K07N37M03M55K44Nn14n92m19l93M97J5O52O64
5540H17J63j85n83j72o59o7j7K75P86J06O52l26k35q19l60l98R7N40K28P06M06
$$ plain form
5561 955 893 541 21 -479 -769 -1027 -608 3 336 870 889 634 154 -374 -643 -1222 -512 -95 442 887 815
5582 815 805 66 -419 -691 -1063 -565 -199 300 731 1140 651 438 -268 -739 -901 -872 -501 380 668 937 744
5603 744 316 -351 -839 -930 -816 -588 302 780 809 1037 382 -164 -792 -925 -1039 -670 218 896 877 611 326
5624 326 12 -567 -953 -932 -581 106 429 941 962 486 -19 -485 -880 -1064 -749 105 477 725 884 692 287
5645 287 -458 -1131 -982 -737 -324 531 895 781 855 413 -394 -917 -910 -735 -309 406 918 919 883 286 -305 -854
5667 -854 -1003 -991 -464 378 608 907 758 579 -241 -807 -912 -787 -310 151 595 1082 788 542 -143 -876
5687 -876 -1027 -1219 -423 -46 604 990 1063 629 208 -664 -995 -904 -548 -27 764 951 1026 494 -162 -526 -897
5708 -897 -873 -638 -105 434 828 1059 640 91 -713 -1078 -1084 -774 -186 643 754 1176 654 77 -340 -917 -1053
$$ packed form
5561I55o2l52n20n00k90k58M19O11L33N34J9k55m80n28k69n79P10M17N37M45p2
5582H15j0p39m85k72l72M98L66M99M31M09m89k13p06m71j62K9L71Q81K88K69j93
5603G44m28o67m88r1J14K28Q90M78K9K28o55n46o28j33j14L69Q88O78j9k66k85
5624C26l14n79l86K1L51O87L23N12K1m76n05m66l95j84L15Q54L72K48J59j92m05
5645B87p45o73J49K45M13Q55L64j14P4m42q07n23PJ75M26P15N12Jl6n97n91n49
5667h54j49J2N27Q42K30K99j49j79q20n66j05J25M77M61M44M87k94k46o85p33
5687h76j51j92P96L77O50L86P3m34m21q72l31R1L56N21P91J87P5n32o56l64l71
5708h97K4K35N33N39L94K31m19n49q04l65oL10N88Q29J11M22n22n77m17n77j36
$$ plain form
5729 -1053 -794 -118 750 913 1205 687 219 -256 -893 -917 -768 -354 104 1043 1125 865 231 -362 -765 -814 -917
5750 -917 -454 130 793 936 955 561 39 -838 -974 -1033 -653 225 702 992 1065 427 31 -674 -1265 -942 -526
5771 -526 -48 591 1234 887 471 -38 -574 -1264 -1012 -669 20 550 1023 1072 764 57 -537 -1188 -1185 -695 -160
5792 -160 555 1087 1178 642 202 -502 -994 -1066 -843 -245 378 949 1025 885 234 -265 -1051 -1168 -1067 -215 486
5813 486 938 1027 988 183 -317 -754 -1283 -928 -394 404 1031 1073 951 331 -29 -918 -1274 -933 -711 273 692
5834 692 1234 1014 554 63 -751 -1027 -1011 -563 17 772 1254 1223 505 -7 -691 -1085 -1039 -796 58 762 1004
5855 1004 990 633 72 -591 -869 -1079 -860 -26 497 1234 1097 748 265 -391 -1129 -1125 -777 -100 566 842 1035
5876 1035 804 455 -390 -1023 -931 -790 -316 267 1025 1257 846 308 -445 -918 -1078 -867 -417 286 1008 1097
$$ packed form
5729a053K59O76Q68J63K92n18m68m75o37k4J49M14M58R39Q2k60o34n93m03m9j03
5750i17M63N84O63J43J9l94n22q77j36n9L80Q78M77K90P3o38l96p05n91L23M16
5771e26M78O39O43l47m16n09n36o90K52L43O89N30M73M9l08p07n94o51LM90N35
5792a60P15N32R1n36m40p04m92p2K23N98O23N71P6j40o51m99p86j17J01Q52P01
5813D86M52Q9l9q05n00m37n29L55N34P98O27M2j22o20l60q89l56L41K22R84M19
5834F92N42k20m60m91q14k76J6M48N80P55M82l1p18n12o84l94M6K43Q54P04K42
5855A004j4l57n61o63k78k10K19Q34N23P37j37l49m83o56p38ML48O77O66K76J93
5876A035k31l49q45o33R2J41M74N83P58K32m11n38p53m73j60K11M50P03P22Q9
$$ plain form
5896 1097 834 416 -290 -1101 -1387 -770 -645 112 859 1091 984 587 10 -848 -1122 -1056 -618 45 694 1194
5916 1194 1022 677 -206 -721 -1074 -945 -516 86 581 1380 1184 798 -45 -513 -1076 -1001 -587 -133 714 1055
5936 1055 1075 776 179 -615 -1042 -1086 -742 5 394 904 999 732 10 -605 -795 -1193 -907 -326 469 979 1137
5957 1137 757 145 -584 -999 -1007 -741 -304 388 730 1299 818 476 -217 -715 -1338 -886 -533 288 919 1081
5977 1081 838 351 -420 -993 -1190 -1164 -538 175 779 1060 963 451 -163 -945 -1089 -876 -341 40 815 1291
5997 1291 1036 588 -133 -894 -986 -1048 -428 -95 743 1166 1280 773 58 -581 -1079 -953 -465 121 510 699
6017 699 959 594 5 -429 -1059 -1262 -726 0 448 998 1093 850 150 -552 -980 -1179 -921 -188 366 720
6037 720 1214 833 476 -381 -731 -859 -859 -153 436 742 1211 894 314 -247 -893 -1316 -823 -368 354 1029 1276
$$ packed form
5896A097k63m18p06q11k86O17J25P57P47K32j07l97n77q58k74O6M38O63O49N00
5916A194j72l45q83n15l53J29M29O02M95P99j96l86q43m68n63P5M14M54Q47L41
5936A055K0k99n97p94m27m4L44P47L89N10R5k67p22o15j90l98K86N81P95N10J58
5957A137l80o12p29m15qK66M37O92L42N69m81l42o93m98o23M52L53Q21O31J62
5977A081k43m87p71n73j97K6O26P13O04K81r7n12o14p82j44K13N35L81P75M76
5997A291k55m48p21p61r2o2O20L33Q38M23J14n07p15o39m98J26M88N86L89J89
6017F99K60l65n89m34o30k03N36P26M48N50R5k43p00p02m28j99K58P33N54L54
6037G20M94l81l57q57l50j28%P06N89L06M69l17n80n61o46m23M93M55P22O75K47
$$ plain form
6058 1276 942 271 -334 -1196 -1239 -925 -460 273 1143 1102 988 749 -340 -888 -1017 -1057 -571 241 683 881
6078 881 1011 592 43 -792 -1076 -1050 -576 6 621 1077 1063 638 138 -686 -1055 -1091 -900 -325 531 848 1122
6099 1122 732 140 -513 -910 -892 -804 -206 674 1165 1296 1098 429 -439 -979 -1218 -826 -347 356 1009 1022 910
6120 910 282 -344 -1006 -1223 -720 -484 319 791 1213 731 453 -73 -756 -1058 -765 -265 165 984 1231 1028
6140 1028 240 -377 -908 -1141 -1226 -448 224 788 1011 1057 498 59 -683 -1036 -1141 -619 134 882 988 1126
6160 1126 691 94 -673 -990 -1092 -699 -84 750 1035 1170 599 -35 -593 -1024 -1108 -803 3 633 1089 1171
6180 1171 842 114 -540 -1018 -1189 -790 -26 466 1027 1034 856 274 -451 -967 -1114 -891 -310 428 918 1158
6200 1158 847 244 -478 -917 -1208 -919 -221 240 784 1081 824 435 -279 -884 -1241 -998 -408 151 1018 1315
$$ packed form
6058A276l34o71o05q62m3L14M65P33Q70m1j14k39j089n48j29m0M86Q12M42J98
6078H81J30m19n49q35k84K6M74N82O15M56j4m25n00q24l69l6J91N75Q56L17K74
6099A122l90n92o53l97J8Q8N98Q80M91J31j98o69q68n40k39L92M79P03O53J3j12
6120I10o28o26o62k17N03K36Q03M72M22m82k78n26o83l02K93N00M30Q19K47k03
6140A028p88o17n31k33q5P78O72N64K23M6n59m39p42l53j05N22P53P48J06J38
6160A126m35n97p67l17j02L93O15Q34K85J35n71o34n58m31q4L05Q06O30M56Q2
6180A171l29p28o54m78j71L99P64M92N61Pj78n82p25n16j47K23N81P38M90K40
6200A158l11o03p22m39k91K89O98M61N44K97k57l89p14o05l57K43N90N59Q67K97
$$ plain form
6220 1315 979 419 -44 -754 -1089 -1193 -575 204 699 1180 960 431 -40 -675 -1143 -1142 -639 157 746 1160
6240 1160 1062 450 53 -815 -1057 -1122 -729 -51 707 881 892 578 19 -629 -1084 -1320 -736 51 654 972 1013
6261 1013 688 -11 -585 -1220 -1111 -758 -30 456 909 1189 709 339 -412 -909 -1112 -1130 -153 675 1004 1055
6281 1055 753 153 -293 -932 -1151 -743 -193 361 1162 1215 963 260 -290 -951 -1105 -1097 -239 377 809 1229 1011
6302 1011 628 -144 -755 -1172 -1060 -530 241 993 887 1053 616 -100 -651 -1126 -901 -668 194 759 1113 1076
6322 1076 485 149 -962 -1095 -957 -381 -94 523 1187 1000 578 43 -654 -1289 -1120 -837 -2 535 973
6341 973 1246 718 -61 -679 -1153 -1091 -525 -139 657 1084 1206 701 185 -579 -1100 -1160 -1032 -314 547 1107 1025
6362 1025 970 247 -514 -1076 -1307 -1134 -256 586 827 1173 911 390 -496 -811 -1201 -910 -496 411 873 1254
$$ packed form
6220A315l36n60m63p10l35j04O18P79M95M81k20n29m71o35m68JN03P96N89M14
6240A160r8o12l97q68k42o5L93O78P58J74J1l14n59o48m55k36N84P87O03L18M1
6261A013l25o99n74o35J09L53P28M86M53K80m80l70p51m97k03j8R77Q28L29N1
6281A055l02o00m46o39k19M08N50N54Q01N3k52p03n50o61j54QQ58O16M32M20k18
6302A011l83p72o11m17J12N30P71P52j06J66m37p16n51m75K25K33Q62N65L54l7
6322A076n91l36j111j33J38N76K87O17O64j87m22n35o97o35J69K83Q35N37M38
6341I73K73n28p79o18m74O2N66L86P96M27J22n05n16p64n21o0J28P18Q61N60q2
6362A025n5p23p61n62k31J73Q78Q42K41L46k62n21q86l15l90K91M14R07M62L81
$$ plain form
6382 1254 813 284 -388 -959 -1174 -1062 -357 152 751 875 850 382 -278 -745 -1139 -962 -411 283 769 1387
6402 1387 1121 508 -166 -678 -1214 -938 -498 114 838 1238 1185 769 -89 -841 -1032 -1113 -777 315 790 1116
6422 1116 1173 769 75 -626 -1356 -1313 -874 -188 476 1181 1334 695 250 -606 -1024 -1377 -744 -1 503 982
6442 982 1313 859 87 -398 -1102 -1129 -1003 -440 508 1087 1196 1023 332 -176 -1066 -1233 -935 -398 323 583
6462 583 1289 765 496 -183 -857 -990 -1065 -257 322 782 1168 837 492 -259 -930 -1243 -959 -339 140 944
6482 944 1125 907 384 -330 -887 -1147 -985 -638 270 940 1290 1437 621 -43 -868 -1110 -972 -755 -53 646
6502 646 1019 1186 621 -123 -828 -1197 -1161 -661 -51 592 1058 1219 759 71 -752 -1240 -1427 -919 -3 599
6522 599 1080 1198 778 103 -570 -1018 -1121 -683 -22 545 1053 1422 864 101 -498 -1081 -1143 -938 -359 522
$$ packed form
6382A254m41n29o72n71k15J12P05N09N99J24k5m68o60m67l94J77N51O94M86O18
6402A387k66o13o74n12n36K76M40O12P24M00n3m16q58p52j91q1L36J092M75L26
6422A116N7m04o94p01p30M3M39O86O64P05J53o39m45q56m18l53O33P43N04M79
6442I82L31m54p72m85p04k7J26N63R48N79J09j73o91n08q90j67K98N37P21K60
6462E83P06n24k69o79o74j33p5Q08N79M60L86l31l45p51o71l13K84O20M79Q04
6482I44J81k18n23p14n57k60J62L47R08O70L50J47q16o64q25k42J38K17P02O99
6502F46L73J67n65p44p05l69L6N00O10O43M66J61m60o88q23m88j87N08R16O02
6522E99M81J18m20o75o73m48j03M38O61N67N08L69n58p63n99n83o2K05N79Q81
$$ plain form
6542 522 1115 1202 739 340 -275 -1021 -1228 -1169 -516 331 888 1158 1008 438 -369 -943 -1193 -934 -480 271 950
6563 950 1167 876 573 -153 -882 -1383 -1096 -387 255 793 1201 1186 471 55 -736 -1219 -1085 -672 102 660
6583 660 1172 1136 861 -167 -951 -1233 -1226 -747 260 755 1029 1229 767 -91 -836 -1113 -1199 -811 -105 664 1065
6604 1065 1321 1037 70 -653 -930 -1350 -931 -55 762 945 1245 946 189 -631 -1064 -1330 -836 -292 491 829
6624 829 1273 1041 395 -385 -1087 -1235 -1109 -401 496 1360 1262 838 580 -287 -908 -1254 -999 -415 361 996
6644 996 1283 1103 682 -215 -1000 -1211 -1002 -606 96 1048 1234 1010 497 -72 -773 -1109 -1094 -677 -6 880
6664 880 1322 1307 657 -99 -905 -1400 -1161 -649 122 727 1333 1085 700 254 -742 -1212 -1229 -1047 125 841
6684 841 1218 1332 716 -20 -652 -1170 -1287 -934 -167 674 1075 1145 988 181 -622 -1150 -1343 -953 -388 541
$$ packed form
6542E22N93Q7m63l99o15p46k07N9O53Q47N57K70j50n70q07n74k50K59M54P51O79
6563I50K17k91l03p26p29n01K87P09O42N38M08j5p15m16p91m83J34M13P74N58
6583F60N12l6k75j028p84k82PM79J007M95K74K00m62q58p45k77q6L88P06P69M01
6604A065K56k84r67p23k77m20M19Q76Q17J83L00k99p57q20m33k66M94N44P83L38
6624H29M44k32o46p80p02j48J26P08Q97Q64r8m24k58q67o21l46K55N84P76O35
6644I96K87j80m21q97p85k11K09L96P02R52J86k24n13n69p01l36J5M17O71Q86
6664H80M42j5o50p56q06m95K39N12P71O05O06k48l85m46r96m70j7J82J172P16
6684H41L77J14o16p36o32n18j17L53P67Q41M01P0j57q07q03n28j93L90N65R29
$$ plain form
6704 541 978 1282 950 230 -611 -978 -1375 -1084 -303 545 1190 1342 1071 450 -336 -1110 -1081 -1064 -346 178 643
6725 643 1358 929 379 -234 -1359 -1397 -1059 -653 403 1003 1328 1248 555 -158 -890 -1285 -1357 -542 31 833
6745 833 1251 1310 631 48 -963 -1210 -989 -765 58 806 1306 1433 868 52 -759 -1136 -1286 -924 -101 732
6765 732 1421 1503 914 -26 -1044 -1386 -1273 -816 -295 475 1304 1314 882 123 -208 -1105 -1399 -906 -75 255
6785 255 1075 1335 870 272 -530 -1155 -1258 -901 -172 568 1181 1325 1054 348 -395 -1218 -1480 -1131 -577 494
6805 494 1021 1382 1114 416 -370 -846 -1303 -961 -540 282 908 1418 1199 533 -156 -963 -1331 -1183 -639 50
6825 50 871 1242 1311 559 -367 -986 -1295 -1145 -762 -48 706 1380 1304 732 -58 -836 -1209 -1384 -643 23 676
6846 676 1438 1590 802 -6 -845 -1189 -1524 -842 -180 841 1351 1427 1003 405 -563 -1148 -1367 -1081 -142 303
$$ packed form
6704E41M37L04l32p20q41l67l97K91P81Q48O45J52k71o21p86p74K9J7P18N24M65
6725F43P15m29n50o13j125l8L38M06J056O00L25q0o93p13p32l95p2Q15N73Q02
6745H33M18N9o79n83j011k47K21K24Q23P48N00J27n65q16q11l77j50L62Q23Q33
6765G32O89Q2n89r40j018l42J13M57N21P70Q29J0m32p59l31q97k94M93Q31L30
6785B55Q20K60m65n98q02o25j03L57P29P40O13J44k71p06p43q23k62L49N54J071
6805D94N27L61k68o98p86m76m57L42M21Q22O26N10k19o66o89q07l68J48N44O89
6825E0Q21L71O9p52r26o19l09J50L83P14P54O74p6n72p90p78l73j75P41O66O53
6846F76P62J52p88q08q39l44l35O82O62J021N10P6m24n98r68n85k19K86R39M45
$$ plain form
6866 303 1056 1105 1029 251 -482 -1286 -1335 -1188 -468 409 913 1338 1212 383 -527 -1222 -1565 -991 -583 333 1090
6887 1090 1445 1078 355 -200 -1061 -1520 -1203 -787 43 1196 1582 1251 446 -289 -850 -1203 -1372 -757 53
6906 53 1162 1266 1289 875 -55 -944 -1394 -1416 -647 191 728 1567 1342 744 -20 -753 -1309 -1470 -813 -159 927
6927 927 1359 1334 886 173 -573 -1279 -1458 -954 -413 686 1162 1100 1058 244 -470 -1321 -1231 -1171 -174 577 1089
6948 1089 1508 1049 464 -617 -1110 -1523 -1094 -532 581 1098 1508 1115 402 -370 -1070 -1731 -1317 -416 356
6967 356 1097 1404 1047 546 -337 -822 -1543 -1174 -520 477 1143 1467 1432 647 -59 -959 -1591 -1380 -755 64
6987 64 924 1430 1246 687 -101 -932 -1231 -1447 -862 -101 732 1435 1178 728 18 -757 -1561 -1450 -980 -171
7007 -171 655 1407 1309 812 163 -794 -1375 -1383 -865 -97 489 1278 1462 933 153 -823 -1253 -1171 -899 -536 586
$$ packed form
6866C03P53M9p6p78p33q04m9J47P20Q77N04M25j26q29r10o95l43N74M08R16P57
6887A090L55l67p23n55q61m59L17M16Q30J153L86l31q05p35n61l53j69O15Q10
6906E3J109J04K3m14r30q89m50k2P69Q38N37Q39k25n98p64p33n56j61O57O54J086
6927I27M32k5m48p13p46p06j79N04N41J099M76o2m2q14p14q51R0O0R97P51N12
6948A089M19m59n85j081m93m13M29N62J113N17M10l93p13p72p00o61M14R01P72
6967C56P41L07l57n01q83m85p21L69O54R97O66L24l5p85p06r00o32K11O25Q19
6987F4Q60N06j84n59p88q31k99k16N85P61Q33P03k57m50p10p75q04J11M70Q09
7007a71Q26P52r8m97o49r57n81qN18P68N86P89J84n29p80r76m30Q2K72L63J122
$$ plain form
7028 586 1514 1252 991 233 -820 -1072 -1392 -1264 -504 526 1182 1572 1133 399 -336 -1303 -1257 -1408 -502 252
7048 252 970 1273 1201 633 -247 -1002 -1434 -1295 -680 244 1124 1524 1242 612 -110 -944 -1378 -1385 -859 108 901
7069 901 1492 1450 895 -28 -838 -1429 -1265 -727 14 952 1447 1349 854 63 -802 -1427 -1260 -948 -319 639 1272
7090 1272 1342 987 -72 -562 -1231 -1611 -1131 -239 608 1152 1605 1037 216 -558 -1175 -1394 -1073 -472 548
7109 548 1505 1256 1285 321 -576 -1104 -1506 -1253 -618 465 1047 1567 1312 346 -465 -1340 -1493 -1157 -789 360
7129 360 1183 1234 1222 482 -32 -832 -1483 -1173 -634 74 1160 1283 1174 730 -47 -804 -1495 -1288 -792 -63
7149 -63 878 1312 1384 773 22 -780 -1419 -1373 -958 31 952 1385 1368 855 66 -732 -1165 -1275 -987 16 943
7170 943 1123 1156 1112 421 -663 -1163 -1142 -1015 -166 598 1123 1549 1093 334 -401 -1297 -1445 -1191 -300 566 1220
$$ packed form
7028E86R28k62k61p58j053k52l20J28P60J030O56L90m39p34p35r67M6j51R06P54
7048B52P18L03p2n68q80p55m32J39O15R24Q80M00k82o30p22q34m34pN26R67P93
7069I01N91m2n55r23q10n91J64N38P41R38M95r8m95p91q65o25J67L12O29R58O33
7090A272P0l55j059m90o69l80M80Q92Q47N44M53n68q21p74o17k19L21O01J020
7109E48R57k49K9r64q97n28m02K53O35J083N82N20k55r66q11q75j53L36L68J149
7129C60Q23N1j2p40n14q00o51L10N39P08J086J23j09m44p77p57o91K07M96P29
7149f3R41M34P2o11p51q02o39M6M15R89R21M33j7n13p89p98m33j10K88J003R27
7170I43J80L3m4o91j084n00K1J27Q49P64N25M26m56p59p35q96j48K54Q91Q66O54
$$ plain form
7191 1220 1701 1144 637 -649 -1241 -1533 -1209 -509 318 1178 1339 1015 642 -458 -1108 -1489 -1172 -541 328
7210 328 1130 1255 1216 755 -285 -768 -1291 -1287 -595 118 981 1323 1308 656 -213 -1045 -1267 -1260 -688 56 730 1233
7232 1233 1371 1018 -25 -586 -1381 -1390 -758 -107 957 1244 1385 1132 77 -696 -1441 -1628 -978 -321 634
7251 634 1283 1463 954 230 -686 -1414 -1484 -995 -433 613 1287 1463 1258 380 -581 -1062 -1557 -1236 -410 467
7271 467 1312 1207 1261 529 -564 -1080 -1235 -1255 -291 297 1090 1407 1157 503 -451 -1116 -1380 -1487 -569 88
7291 88 976 1346 1297 855 -92 -804 -1468 -1445 -695 47 1060 1499 1506 755 -31 -616 -1177 -1349 -974 290 987
7312 987 1281 1472 829 146 -614 -1329 -1469 -986 -81 805 1356 1365 965 215 -724 -1270 -1527 -980 -330 583 1231
7333 1231 1387 961 235 -532 -1126 -1474 -1080 -344 535 1000 1054 1086 285 -302 -1295 -1463 -989 -644 546 1055
$$ packed form
7191A220M81n57n07j286n92k92L24P00Q27Q60J61l24l73j100o50l81L17O31Q69
7210C28Q02J25l9m61j040m83n23MO92P13Q63L42j5o52q69q32k22PN72P44O74N03
7232A233J38l53j043n61p95rO32O51J064K87J41k53j055p73p45j87O50O57R55
7251F34O49J80n09p24r16p28p0M89N62J046O74J76k05q78r61m81m95L21Q26Q77
7271D67Q45j05N4p32j093n16j55k0R64N88P93L17k50o54r54o65k64j07R18O57
7291H8Q88L70m9m42r47p12o64K3P50P42J013M39Pp51p86n85n61j72L75J264O97
7312I87K94J91o43o83p60p15j40M83R05Q86N51Rm00p50r39n46k57N47O50R13O48
7333A231J56m26p26p67n94l48L94P36Q79M65N4L2q01n87r93j68M74L45J190N09
$$ plain form
7353 1055 1441 1309 534 -377 -1204 -1400 -1457 -579 262 975 1266 1268 509 -471 -1030 -1238 -1057 -634 107 963 1388
7374 1388 1340 608 -132 -946 -1465 -1133 -836 -24 793 1394 1459 941 92 -805 -1400 -1325 -806 -75 784 1132 1326
7395 1326 871 148 -624 -1077 -1395 -847 -145 623 1225 1455 981 265 -596 -1046 -1197 -1071 -325 589 1134 1188
7415 1188 996 503 -510 -1111 -1352 -797 -268 526 1295 1470 1114 530 -329 -1066 -1577 -1071 -378 259 908
7434 908 1559 980 445 -58 -1095 -1179 -1151 -642 118 843 1423 1412 689 -177 -774 -1301 -1293 -877 281 1030 1172
7455 1172 1404 554 37 -803 -1123 -1372 -861 3 573 1273 1250 774 -70 -813 -1262 -1415 -833 -117 513 1483
7475 1483 1335 966 239 -607 -1142 -1194 -670 -249 630 1176 1261 1030 356 -511 -1127 -1259 -947 -489 355 1225
7495 1225 1177 942 229 -409 -1164 -1237 -1104 -382 264 968 1136 968 546 -320 -938 -1526 -1176 -617 336 887
$$ packed form
7353A055L86j32p75r11q27j96n7Q78Q41P13K91Kp59r80n59k08J81M23P41Q56M25
7374A388m8p32p40q14n19L32K97Q12Q17O01O5n18q49q97n95P5N19P31Q59L48J94
7395A326m55p23p72m53l18N48P02P68O02K30m74p16q61m50j51J26P46R14N45N4
7415A188j92m93j013o01k41N55N29P94P69J75l56n84q59p37n11N06O93O37O49
7434I08O51n79n35n03j037q4K8N09P60P25N80j1p23q66n97n27QM16J158P49J42
7455A172K32q50n17q40l20k49N11Q64N70P00k3m76q44p43m49j53N82P16O30R70
7475A483j48l69p27q46n35n2N24M21Q79N46Q5k31o74q67o16j32L12M58Q44Q70
7495A225m8k35p13o38p55p3J33P22O46P04J68j68m22q66o18n88L50N59R53N51
$$ plain form
7515 887 1268 1365 443 -142 -1030 -1409 -1211 -663 58 887 1117 1413 703 -114 -717 -1250 -1362 -781 151 715
7535 715 1212 1149 752 9 -862 -1183 -1230 -911 -104 486 1218 1427 852 289 -627 -1290 -1411 -897 -315 568 1368
7556 1368 1256 899 141 -348 -1107 -1388 -800 -196 338 982 1199 1022 729 -624 -1131 -1174 -904 -280 456 850
7576 850 1477 1245 377 -357 -960 -1278 -1070 -554 454 902 1357 1255 545 -24 -888 -1363 -1233 -290 83 828
7596 828 1252 1244 526 -44 -751 -1280 -1142 -782 118 902 1056 1090 578 -104 -744 -1137 -1217 -901 -91 742 1266
7617 1266 1156 809 117 -626 -1195 -1502 -812 -194 570 1056 1313 865 147 -423 -1263 -1224 -1033 -161 333 939
7637 939 1224 916 288 -395 -1047 -1544 -1100 -581 284 1085 1290 942 249 -344 -920 -1150 -964 -514 417 967
7657 967 1018 1122 580 -396 -840 -1119 -1064 -595 136 1090 1214 1144 562 -186 -941 -1282 -1183 -651 115 1016 1077 1211
$$ packed form
7515H87L81R7r22n85q88l79J98N48P21Q29K30K96p10q17o03n33j12N81R32N64
7535G15M97o3l97p43q71l21m7L19Q07N90P32K09n75n63r16o63j21N14N82Q83Q00
7556A368j12l57p58m89p59k81N88O04N34O44K17j77k93j353n07m3K70O24P36L94
7576H50O27k32q68p34o03l18K08N16J008M48M55j02p10n69q64m75J30R43L73P45
7596H28M24qp18n70p07n29J38L60R00P84J54L4n12o82o40l93q0L16Q10Q33N24
7617A266j10l47o92p43n69l07O90O18P64M86K57m48p18n70q40L9J91Q72M94O06
7637I39K85l08o28o83o52m97M44N19Q65Q01K05l48o93n93n76k30J86M50R31N50
7657I67N1J04n42r76m44k79N5M69P31R54J24p0n82p48p55l41R9N32P66R01O1J34
$$ plain form
7679 1211 877 -152 -794 -1202 -1244 -876 23 610 1384 1118 722 95 -886 -960 -1292 -914 -166 556 1047 1196
7699 1196 819 98 -722 -1130 -1035 -937 -74 278 1009 1220 868 309 -473 -930 -1204 -1091 -239 399 919 1127
7719 1127 819 433 -395 -949 -1071 -1061 -595 395 1015 1121 1151 463 -304 -788 -937 -1160 -539 67 851 1241
7739 1241 855 481 -71 -631 -1044 -943 -544 198 760 1052 937 492 -52 -557 -1066 -1112 -551 43 606 933
7759 933 1223 769 322 -551 -1225 -1109 -752 -118 480 1237 1311 676 39 -584 -886 -1114 -621 -240 542 955
7779 955 1317 849 263 -583 -1058 -1128 -861 -333 157 881 906 1068 389 -409 -1029 -1143 -910 -441 333 916 1017
7800 1017 1074 284 -353 -783 -1140 -768 -777 485 627 1052 1080 677 -86 -799 -1035 -1228 -705 143 923 1180 1239
7821 1239 700 26 -613 -1071 -1218 -516 -220 530 1142 1162 488 84 -487 -1222 -1100 -702 -156 622 904 1346
$$ packed form
7679A211l34j029o42m08m2L68Q99N87P74k66l96o27r81p4l32L78P48P22M91J49
7699A196l77p21q20m08R5R8Q63L52P31K11l52n59p82m57k74J13Q52O38N20K08
7719A127l08l86q28n54j22J0M66R90O20J06L0o88p67m84j49k23O21O06P84L90
7739A241l86l74n52n60m13J01L99P42N62K92j15m45n44n05n09m6N61N94N63L27
7759I33K90m54m47q73o74J16L57O34N98P57P4o35o37o23l02k28M93L81P82M13
7779I55L62m68n86q46m75p0K67N28M90P24K5J62o79p98o20j14K33M69P74N83J01
7800A017N7p90o37m30l57L72rJ262J42M25K8m03p63p13k36j93N23Q48P80K57N9
7821A239n39o74o39m58j47P02K96P50O12K0o74m04n71p35J22L98N46P78K82M42
$$ plain form
7841 1346 1020 -23 -330 -967 -923 -552 -2 575 868 1084 670 479 -473 -864 -1008 -941 -44 500 1078 872
7861 872 921 90 -469 -961 -1114 -972 -199 274 874 1022 723 403 -250 -773 -998 -1138 -420 46 815 940
7881 940 768 570 -85 -611 -951 -783 -705 53 670 1111 1025 477 -153 -694 -1014 -780 -563 -15 412 1011 930
7902 930 787 -67 -723 -920 -1025 -574 -28 633 1091 1081 604 292 -415 -1151 -962 -748 -30 446 880 921 775
7923 775 -15 -388 -820 -894 -926 -343 354 827 852 812 176 -385 -975 -1011 -831 -232 158 1095 1014 969 375 -272
7945 -272 -665 -850 -582 -384 194 756 1101 956 273 -74 -692 -1103 -819 -596 -54 718 802 882 649 -120 -666
7966 -666 -982 -874 -688 37 639 876 970 770 277 -766 -1082 -842 -552 -265 588 886 938 949 143 -471 -718
7987 -718 -825 -595 -297 427 839 953 601 187 -607 -819 -1021 -817 -215 91 776 865 563 342 -87 -863
$$ packed form
7841A346l26j043l07o37M4L71N50N77K93K16m14j91r52l91j44O7Q97N44N78k06
7861H72M9q31n59m92j53J42P73M73O00J48k99l20o53n23k25j40P18M66P69J25
7881I40j72j98o55n26l40J68P8P58O17M41q6n48o30n41l20K34K17N48M27N99q1
7902I30j43q54o56j97j05M51N46O61M58j0m77l12p07p36J89K14P18M76M34M1j46
7923G75p90l73m32p4l2N83O97M73K5m0o36n61n90l6J80N99L90R37q1m5n94o47
7945b72l93j85K68J98N78N62L45j45o83l47o18m11K84K23N42P72Q4Q0k33p69n46
7966f66l16J08J86P25O02K37R4k00m93j043l16K40K90K87Q53K98N2J1q06o14k47
7987g18j07K30K98P24M12J14l52m14p94k12k02K04O02L06O85Q9l02k21m29p76
$$ plain form
8007 -863 -824 -785 -595 444 839 1031 910 404 -187 -692 -756 -816 -407 268 710 924 732 461 -99 -579 -770
8028 -770 -969 -471 -2 530 860 923 594 108 -586 -657 -839 -670 93 461 640 660 554 107 -364 -813 -1010
8049 -1010 -434 -25 391 937 923 733 259 -443 -899 -1010 -481 -54 278 655 779 635 145 -278 -990 -815
8069 -815 -730 -312 227 740 715 647 310 -220 -786 -870 -730 -229 157 593 908 888 394 -132 -553 -784 -815 -388
8091 -388 204 428 722 826 325 -137 -563 -860 -863 -321 94 686 753 736 395 141 -431 -849 -787 -431 -30 408
8113 408 875 655 471 -38 -528 -768 -578 -634 -208 389 853 847 562 176 -408 -563 -895 -744 52 365 780
8134 780 708 657 68 -403 -701 -872 -720 -221 86 700 838 641 326 -137 -780 -766 -714 -358 190 545 889
8155 889 941 190 -164 -744 -920 -629 -523 200 740 862 602 509 -41 -547 -1041 -808 -538 252 290 867 579
$$ packed form
8007h63L9L9J90J039L95J92j21n06n91n05o4o0M09O75M42K14j92k71n60m80j91
8028g70j99M98M69N32L30O3l29m86o94p1j82J69P63L68J79K0j06m47m71m49j97
8049a010N76M09M16N46j4j90m74p02m56j11N29M27L32L77J24j44m90m23p12J75
8069h15Q5M18N39N13k5o8l37n30n66q4J40N01L86M36L15k0m94n26m21k31l1M27
8091c88N92K24K94J04n01m62m26k97lN42M15N92O7j7l41k54n72m18O2L56M01M38
8113D08M67k20j84n09m90k40J90n6M26N97M64ok85l86n84j55l32J51P96L13M15
8134G80p2n1n89m71k98j71J52M99L07O14J38j97l15m63o43J4N2L56N48L55L44
8155H89N2p51l54n80j76K91J06P23N40J22k60r3n50n06m94K33K70P90L8N77k88
$$ plain form
8176 579 449 -19 -604 -767 -874 -525 44 514 763 601 465 -11 -477 -668 -1083
8191 -1083
$$ packed form
8176E79j30m68n85j63j07L49N69M70K49j62j36m76m66j91m15
8191a083
$$ Imaginary data points
##PAGE= N=2
##DATA TABLE= (X++(I..I)), XYDATA
$$ plain form
0 0 0 0 0 0 0 0 0 0 0 2 0 8 -8 8 -11 14 -19 20 -27 34 -37 48 -55 65 -76 89 -104 120 -139 160 -180 209 -233
33 -233 266 -301 339 -380 424 -476 529 -587 656 -725 804 -890 982 -1085 1193 -1318 1453
50 1453 -1599 1765 -1942 2144 -2370 2624 -2917 3248 -3637 4095 -4646 5328 -6187 7321 -8875
65 -8875 11168 -14899 22016 -40665 203522 467821 242301 23431 -257744 -406511 -435193
76 -435193 -271978 -30782 238919 404162 432506 283667 43541 -220496 -393312 -428542
86 -428542 -294399 -57942 204149 383019 423708 300975 71671 -185929 -370438 -419358
96 -419358 -307747 -84678 169751 357858 413541 312539 97668 -152110 -343899 -409174
106 -409174 -318166 -109261 137048 329564 402159 323500 122506 -121742 -316844 -395404 -327359
$$ packed form
0@%%%%%%%%%KkQj6J6j9K5l3L9m7O1p1Q5j03J20j41J65j93K24k59K99l40L89m42
33b33M99n67O40p19Q04r00J005j116J243j381J529j694J872k067K278k511K771
50A453l052L364l707M086m514M994n541O165o885P732q741R974j1515J3508j6196
65h875K0043k6067L6915o2681K44187K64299k25520k18870k81175j48767k8682
76d35193J63215K41196K69701J65243K8344j48839k40126k64037j72816l5230
86d28542J34143K36457K62091J78870M0689j22733k29304k57600j84509m8920
96d19358J11611K23069K54429J88107N5683j01002k14871k49778j91789o5275
106d09174R1008K08905K46309J92516P2595p8659k00994k44248j95102p8560O8045
$$ plain form
117 -327359 -135765 105780 303950 388917 330643 148120 -90384 -290967 -381480 -332561 -160715
128 -160715 72552 278327 377539 335659 169824 -58112 -263108 -369334 -339257 -182511
138 -182511 42943 251060 363216 340293 191726 -28043 -236210 -355672 -342943 -202962
148 -202962 13743 223919 348453 343130 212044 1492 -209844 -341075 -344359 -221366 -15726
159 -15726 197064 333657 344041 228869 30584 -181593 -326287 -346164 -236999 -42264
169 -42264 167949 316152 345343 245889 56073 -154432 -307726 -344979 -253049 -68863 140432
180 140432 297984 343988 260939 81746 -126851 -288052 -341419 -267508 -94981 112570 278833
191 278833 339956 273442 106357 -98791 -267933 -337099 -279528 -118351 85113 257692 334340
$$ packed form
117c27359J91594K41545J98170Q4967n8274j82523k38504k00583r0513M8919J71846
128a60715K33267K05775R9212m1880j65835k27936k04996j06226L0077J56746
138a82511K25454K08117J12156k2923j48567k19769k08167j19462J2729J39981
148b02962K16705K10176J24534n323j31086k10552k11336j31231l284J22993K05640
159a5726K12790J36593J0384j15172j98285k12177j44694j9877J09165J94735
169d2264K10213J48203K9191r9454j89816k10505j53294l7253R1930J84186K09295
180A40432J57552M6004q3049j79193k08597j61201n3367P3911J72527K07551J66263
191B78833O1123o6514j67085k05148j69142o9166N7571J61177K03464J72579P6648
$$ plain form
202 334340 284850 129391 -72028 -246493 -330342 -290317 -140803 59216 235521 325587 293920
213 293920 151917 -45925 -224594 -320741 -298057 -162743 32553 213954 315434 300296
223 300296 173216 -18319 -202527 -310580 -303034 -182539 5815 190228 303798 305040 192393
234 192393 7929 -178852 -297657 -306380 -201078 -20497 166403 290999 307652 209753 33289
245 33289 -154592 -283455 -307435 -218038 -46288 142613 276536 307266 224803 58635 -130003
256 -130003 -269068 -306692 -231483 -70581 117460 260764 305944 237765 82178 -104890 -252134
267 -252134 -304450 -243887 -93336 92154 243187 302542 249087 104006 -79724 -234015 -299952
278 -299952 -254381 -114546 67569 224533 297094 258872 125092 -54940 -215058 -294127 -262784
$$ packed form
202C34340m9490j55459k01419j74465q3849M0025J49514K00019J76305R0066l1667
213B93920j42003j97842j78669r6147K2684J35314J95296J81401J01480j5138
223C00296j27080j91535j84208j08053P546J20495J88354J84413J13570J242j12647
234A92393j84464j86781j18805q723J05302J80581J86900J24596J6653r7899j76464
245C3289j87881j28863k3980Q9397J71750J88901J33923L0730q2463j66168j88638
256a30003j39065l7624P5209J60902J88041J43304M5180o8179j55587j87068j47244
267b52134n2316O0563J50551J85490J51033N9355n3455j45081j83730j54291o5937
278b99952M5571J39835J82115J56964P2561l8222j33780j80032j60118p9069L1343
$$ plain form
289 -262784 -135020 42315 204581 289960 266735 144867 -30131 -194262 -285882 -269945 -154007
300 -154007 18331 183639 280922 272698 162468 -6860 -173073 -275540 -275105 -171619 -4799
311 -4799 162991 269902 276728 179676 16431 -151950 -264226 -277784 -187334 -27487 141287
322 141287 257921 278363 194524 38876 -130771 -251316 -278743 -201602 -49558 119736 244038
333 244038 278031 208141 59944 -109194 -237046 -277434 -214253 -70445 98258 229775 275879
344 275879 219451 80940 -87558 -222168 -273907 -224661 -90689 76348 214034 271986 229133
355 229133 100764 -65401 -206068 -269601 -233153 -110343 53959 197464 266465 236840 119498
366 119498 -43023 -188322 -263034 -240181 -128102 31661 179435 259169 243093 136969 -20605
$$ packed form
289b62784J27764J77335J62266Q5379k3225j21868j74998j64131r1620J5937J15938
300a54007J72338J65308R7283q224j10230j69328j66213j02467M35J03486J66820
311d799J67790J06911O826r7052j63245j68381j12276j3558R0450J59847J68774
322A41287J16634K0442q3839j55648j69647j20545k7427P7141J52044J69294J24302
333B44038L3993o9890j48197j69138j27852m0388O3181J43808J68703J31517M6104
344B75879n6428j38511j68498j34610n1739M9246J33972J67037J37686N7952m2853
355B29133j28369j66165j40667o3533L6448J22810J64302J43505O9001k9625j17342
366A19498j62521j45299p4712K2853J12079J59763J47774P9734j6076j06124j57574
$$ plain form
377 -20605 -169959 -255398 -245358 -144841 9832 160626 250750 247266 152279 795 -150728
388 -150728 -245723 -248949 -159796 -11824 141109 240653 249849 166922 22240 -130994 -234927
399 -234927 -250621 -173557 -32084 120583 228880 251239 179780 42234 -110371 -222473 -250901
410 -250901 -185854 -51839 100670 215655 250405 191095 61182 -90436 -208927 -249350 -196327
421 -196327 -70489 80495 201564 247664 201109 79674 -70362 -194196 -245821 -205516 -88794
432 -88794 60373 186526 243244 209351 97191 -50516 -178429 -240505 -212780 -105317 40545
443 40545 170583 237469 215689 113070 -30553 -162519 -233682 -218369 -121261 20846 154311
454 154311 229917 220192 128629 -10876 -145356 -225786 -222255 -135505 1431 137532 221291
$$ packed form
377b0605j49354q5439J0040J00517J54673J50794R0124l484r4987j51484j51523
388a50728r4995l226Q9153J47972J52933R9544R196q2927j44682j53234j03933
399b34927j5694P7064J41473J52667J08297K2359p1459j37546j52605j12102k8428
410b50901O5047J34015J52509J14985L4750n9310j29913j51618j18491m0423N3023
421a96327J25838J50984J21069M6100m6555j21435j50036j23834n1625M0305J16722
432h8794J49167J26153N6718l3893j12160j47707j27913o2076K7725J07463J45862
443D0545J30038O6886k1780j02619j43623j31966p1163J5313R7108J42107J33465
454A54311P5606r725r1563j39505j34480q0430L531Q6750J36936J36101Q3759
$$ plain form
465 221291 223130 142289 7926 -128363 -216772 -224255 -148334 -17269 120032 211653 224484
476 224484 154350 26742 -110673 -206414 -225029 -159932 -35394 101776 200548 224537 165385
487 165385 44986 -92655 -194962 -224037 -170143 -53289 83358 188409 223065 174580 61691
498 61691 -74249 -182101 -221913 -178888 -69562 64742 175078 219853 182699 77982 -55729
509 -55729 -168503 -217891 -185930 -85688 46193 161225 215650 189447 93229 -37313 -153675
520 -153675 -213049 -192315 -100264 28522 145861 209248 194556 107266 -18984 -138531 -206256
531 -206256 -196649 -113519 10117 130483 202233 198034 120390 -1469 -122337 -197947 -199407 -125913
543 -125913 -6526 114479 193110 199766 132079 14953 -107075 -189000 -200112 -136887 -23159
$$ packed form
465B21291J839q0841j34363j36289q8409p483P5921J31065J37301R1621J2831
476B24484p0134j27608j37415r5741j8615O5097J24538J37170R8772K3989n9152
487A65385j20399j37641j02307k9075N3894J16854J36647J05051L4656m8485j12889
498F1691j35940j07852l9812M3025J09326J34304J10336M4775l7154j04717j33711
509e5729j12774m9388L1961J00242J31881J15032N4425k6203r6218j30542j16362
520a53675n9374K0734R2051J28786J17339O3387j4692q7290j26250j19547o7725
531b06256R607Q3130J23636J20366P1750m199p7644j21859j20868p5610j460P3494
543a25913J19387J21005P8631O656o7687j17126j22028q1925j1112O3225J13728
$$ plain form
554 -23159 98474 183771 200658 142346 31066 -90694 -178618 -199882 -147023 -39145 82540
565 82540 173093 199368 151593 46787 -74645 -167678 -198089 -155271 -54419 66077 161705
576 161705 197142 159314 61655 -58149 -155656 -195115 -162301 -69254 49663 149642 193214
587 193214 165157 75893 -41413 -143047 -191216 -167993 -82629 33446 136490 188498 170279
598 170279 89004 -25252 -130094 -185596 -172118 -94887 17389 122979 182365 173682 101018
609 101018 -9374 -116344 -179100 -175095 -106297 1586 108897 175247 176232 111775 6225
620 6225 -101542 -171329 -176930 -117038 -13997 94007 167077 177267 121618 21322 -86828
631 -86828 -162378 -177203 -125997 -28713 79331 157744 177330 130219 35639 -71904 -152646 -176359
$$ packed form
554b3159J21633Q5297J6887n8312j11280j21760q7924k1264N2859J07878J21685
565H2540R0553K6275m7775j04806j21432r3033l0411M2818J00852J20496R5628
576A61705L5437l7828r7659j19804r7507l9459L2814R3047J18917R9979M3572
587A93214k8057q9264j17306j01634m8169K3223Q5364J16075J03044N2008j8219
598A70279q1275j14256j04842n5502J3478P7231J12276J05590N9386q683p2664
609A01018j10392j06970o2756M005O8798J07883J07311O6350R85o4457j05550
620F225j07767o9787n601N9892J03041J08004P3070J0190n5649j00296j08150
631h6828p5550j4825N1206R7284J08044P8413J9586m7111r4580j07543q0742k3713
$$ plain form
643 -176359 -134341 -42420 64671 147445 175340 137673 49100 -57154 -142157 -174089 -140845
654 -140845 -55359 50104 136598 172636 143961 61735 -42807 -131366 -170597 -146350 -67576
665 -67576 35484 125292 168360 148860 73664 -28483 -119558 -166024 -150560 -79236 21378
676 21378 113382 163161 152403 84630 -14468 -107572 -160423 -153635 -89757 7429 101210 157241
688 157241 154829 94829 -262 -94863 -153763 -155342 -99509 -6548 88617 150208 155892 103627
700 103627 13016 -81981 -146267 -156132 -107917 -19763 75304 142252 155906 111504 26273 -68959
712 -68959 -138133 -155359 -115296 -32478 62232 133721 154909 118572 38514 -55878 -128893 -153892
724 -153892 -121587 -44560 48970 124275 152739 124178 50202 -42602 -119578 -151183 -126846 -55544
$$ packed form
643a76359M2018R1921J07091Q2774K7895l7667q8573j06254q5003l1932L3244
654a40845Q5486J05463Q6494L6038k8675q2226j04542q8559l9231K4247P8774
665f7576J03060Q9808M3068j9500p5196j02147r1075m6466J5464P1324J00614
676B1378R2004M9779j0758o7773r9098r3104n2851O788O3878R7186R3781N6031
688A57241k412o0000r5091r4601n8900j579N5833R2961R5165O1591N684n2265
700A03627r0611r4997o4286r865M8215Q8154R5067O6948J3654m4402q5231r5232
712f8959o9174j7226M0063Q2818R4710P1489K1188l6337q0058r4392p3015k4999
724a53892L2305P7027R3530P5305K8464k8561p3976r2804p6976l1605K4337P1302
$$ plain form
736 -55544 36144 114344 149415 129074 60885 -29712 -109043 -147544 -130908 -65777 23302 103756
748 103756 145522 132606 70737 -17214 -98398 -142788 -133881 -75285 11081 92964 140160 135139
760 135139 79522 -5072 -87745 -137320 -136205 -83981 -834 81613 134314 136639 87956 6921
772 6921 -76239 -130966 -136920 -91611 -12974 70518 127553 136843 95380 18649 -64903 -123791 -136769
785 -136769 -99047 -24456 58854 119990 136212 101955 29897 -53154 -115792 -135782 -104847 -35141
797 -35141 47234 111788 134370 107424 40369 -41500 -107493 -133250 -109804 -45525 35673 103171
809 103171 131997 111877 50309 -29949 -98593 -130336 -113687 -55053 24165 94083 128520 115268
821 115268 59151 -18617 -89381 -126491 -116665 -63629 13102 84618 124171 117705 67421 -7675
$$ packed form
736e5544R1688P8200L5071k0341o8189r0597p9331l8501J6636O5131Q9079Q0454
748A03756M1766j2916o1869q7951q1184m4390Q907N8596Q6366Q1883M7196n021
760A35139n5617q4594q2673m9575J115N2224Q3147Q2447N2701K325m8683q1035
772F921q3160n4727n954M5309P8637Q3492N7035R290m1463p6731q3552n8888j2978
785a36769L7722P4591Q3310O1136J6222l4257p2058q3051o2638j9990L0935O9706
797c5141Q2375O4554K2582k6946o7055q1869o5993k5757K3446O4279Q1198O7498
809A03171K8826k0120o1568q0258o8644l1743J6649N8634P9218O9918L4437j3252
821A15268n6117p7768p0764l7110R826N3036P6731P1516L9553o466n0284p5096
$$ plain form
833 -7675 -79885 -121675 -118482 -71318 2469 75036 119393 118883 74738 2753 -70145 -116557 -119536
846 -119536 -78147 -7953 65126 113588 119498 81254 12949 -59760 -110548 -119758 -84057 -17933
858 -17933 54892 107109 119434 86956 22890 -49698 -103661 -119032 -89930 -27649 44585 99839
870 99839 118128 92485 32482 -39279 -96320 -117281 -94662 -36761 34105 92107 116091 96646
882 96646 41278 -28696 -88328 -114716 -98354 -45432 23803 84426 113266 100140 49790 -18810
894 -18810 -79931 -111428 -101394 -53527 13764 75807 109304 102397 57209 -9031 -71748 -107484
906 -107484 -103244 -60768 4016 67086 105063 103882 64041 593 -62556 -102852 -104262 -67120
918 -67120 -5291 58164 100074 104516 70006 9690 -53902 -97305 -104318 -72765 -14400 49619
$$ packed form
833g675p2210m1790L193M7164P3787P2567M4357n10m4145p1985p2898m6412k979
846a19536M1389P0194P3079M8462N910l8244o8305p2709n0788r210L5701O6124
858a7933P2825N2217J2325l2478o4066p2588n3963j5371K9102O2281P2234N5254
870I9839J8289k5643o0003p1761n7041k0961K2619N7901P0866N8002K3984j9445
882I6646n5368o9974n9632k6388J6362N2922O9235O0623K8840j3126n0350o8600
894a8810o1121l1497J0034M7867O7291O2043L3497o907m5188o6240o2717l5736
906a07484M240M2476O4784O3070L7977j181l9841o3448o3149m0296j410L7142
918f7120O1829O3455M1910M442l4510o0316o3592m3403p013L1553N8365O4019
$$ plain form
930 49619 94589 104085 74989 18437 -44808 -91496 -103738 -77495 -22516 40725 88529 103214
942 103214 79473 26455 -36166 -85390 -102522 -81463 -30573 31575 81885 101283 83127 34007
954 34007 -27234 -78485 -100225 -84718 -37851 22816 74912 99024 86151 41581 -18199 -71075
966 -71075 -97476 -87568 -45025 13873 67510 95878 88367 48217 -9453 -63762 -94168 -89222 -51562
979 -51562 5186 60101 92099 90005 54230 -1267 -55861 -90034 -90334 -56743 -2852 52144 87636
992 87636 90448 59756 6727 -48295 -85276 -90794 -61967 -10639 44311 82835 90347 64412 14643
1005 14643 -40446 -80070 -90180 -66625 -18171 36569 77416 89707 68447 21934 -32592 -74700
1017 -74700 -88850 -70260 -25233 28879 71702 88155 71776 28637 -24943 -68762 -87058 -73194
$$ packed form
930D9619M4970R496k9096n6552o3245m6688j2242K6243N4979O3241M7804J4685
942A03214k3741n3018o2621m9224j7132K1059N0890O2148N0310J9398j8156m9120
954C4007o1241n1251k1740J5507M6867O0667N2096K4112j2873m4570n9780n2876
966g1075k6401R908M2543N8898N3637K8368p511m0150n7670n4309l0406M946L7660
979e1562N6748N4915L1998k094l5775n5497n4594l4173l00L3591N3891N4996L5492
992H7636K812l0692n3029n5022l6981n518K8827N1328N4950L8524P512k5935m9769
1005A4643n5089l9624j0110K3555M8454N4740M0847J2291k1260m6513n4526m2108
1017g4700j4150J8590M5027N4112M2823J6453j6379m3139n3580m3819j8296J3864
$$ plain form
1029 -73194 -31775 21188 65643 85830 74401 35034 -17314 -62747 -84862 -75138 -37573 13492
1041 13492 59691 83391 75733 40713 -9522 -56426 -81593 -76672 -43035 6102 53088 79985
1053 79985 77270 45744 -2385 -49583 -78277 -77647 -48178 -1287 46216 76176 78038 50747 5044
1066 5044 -42687 -74264 -77874 -52669 -8118 39038 72077 77892 54876 11255 -35932 -69775
1078 -69775 -77659 -56535 -15023 32318 67443 77173 58119 18117 -28736 -64959 -76752 -59855
1090 -59855 -21152 25182 62138 75768 61340 23910 -21762 -59818 -75008 -62426 -26649 18727
1102 18727 56809 73887 63539 29439 -15016 -54203 -72879 -64364 -32328 11818 51478 71418
1114 71418 65234 34612 -8339 -48246 -70177 -65937 -36962 5425 45250 68783 66158 39364
$$ packed form
1029g3194M1419N2963M4455K0187j1429l9367n2348m5433k2115R724L7565N1065
1041A3492M6199K3700p658l5020n0235m6904k5167M921L3637M9137M6986K6897
1053G9985k715l1526m8129m7198k8694O30K9469M6891M7503K9960J862k7291m5703
1066E044m7731l1577l610K5205M4551M7156L3039N815k3016m3621m7187l3843
1078f9775p884K1124M1512M7341L5125R730j9054m0002m6853l6223j1793J6897
1090e9855L8703M6334L6956J3630j4428l7430m5672l8056j5190J2582L5777M5376
1102A8727L8082J7078j0348l4100m4455l9187j8676Q515L2036M4146L9660J9940
1114G1418o184l0622m2951l9907k1931M240K8975M2387L9825K3533k625k6794
$$ plain form
1126 39364 -2010 -42301 -67015 -66685 -41475 -1191 39369 65060 66678 43294 3919 -36491
1138 -36491 -63487 -66813 -45255 -7002 33642 61610 66428 46849 9761 -30740 -59426 -66222
1150 -66222 -48439 -12586 27555 57650 65615 49766 15259 -24541 -55313 -65311 -51074 -17987
1162 -17987 21573 53139 64721 52213 20276 -18741 -50896 -63605 -53219 -22905 15724 48378
1174 48378 63109 54235 25309 -13032 -45961 -61798 -54618 -27347 9980 43258 61147 55425
1186 55425 29484 -7048 -41167 -59576 -55946 -31413 4325 38320 58306 56574 33223 -1844
1198 -1844 -35767 -56884 -56498 -35166 -1055 33409 55220 56590 37073 3674 -30670 -53641 -56765
1211 -56765 -38594 -6365 28002 51894 56481 39973 8867 -25380 -50316 -56128 -41341 -11390
$$ packed form
1126C9364m1374m0291k4714L30K5210M0284M0560K5691J618k3384l9375m0410
1138c6491k6996l326K1558L8253M0644K7968M818j9579l7088m0501k8686o796
1150f6222J7783L5853M0141L0095P965j5849l4507l9800l0772r998J4237L3087
1162a7987L9560L1566J1582j2508l1937l9017l2155j2709J0386L0314L8629L2654
1174D8378J4731q874k8926l8341l2929j5837P180K7271L7327L3278J7889n722
1186E5425k5941l6532l4119j8409L630K4533L5738L3995J9986j732k3351l5067
1198a844l3923k1117L86K1332L4111L4464K1811J370j9517l3399l4344k2971l124
1211e6765J8171L2229L4367K3892M587j6508l1106l4247k4936n812J4787K9951
$$ plain form
1223 -11390 22873 48114 55859 42399 13630 -20264 -46250 -55509 -43592 -15728 17498 44513
1235 44513 54505 44516 17935 -14967 -42418 -53571 -45203 -19978 12553 40247 53214 46154 22167
1248 22167 -9956 -38236 -52273 -46626 -23783 7569 36061 50975 47108 25692 -5446 -33863
1260 -33863 -49881 -47560 -27237 2780 31744 48791 47699 29147 -466 -29576 -47404 -47720 -30272
1273 -30272 -1819 27151 46038 47527 31699 4114 -25046 -44812 -47546 -32780 -6250 22602
1285 22602 43231 47493 34252 8225 -20503 -41734 -46887 -35133 -10383 18127 39774 46784
1297 46784 36012 12338 -16099 -38192 -46203 -37035 -14379 13654 36533 45650 37871 16108 -11265
1310 -11265 -34512 -44875 -38278 -17792 9161 32942 44244 38947 19470 -7010 -30744 -43114
$$ packed form
1223a1390L4263K5241P745j3460k8769l3894k5986r259J1917K7864L3226K7015
1235D4513R992r989k6581l2902k7451j1153Q368K5225L2531K7694J2967p060k3987
1248B2167l2123k8280j4037N647K2843L1352K8492J4914l867k1416l1138k8417
1260c3863j6018K321K0323L0017K8964J7047j092j8552k9613k9110j7828l16J7448
1273c0272K8453K8970J8887J489j5828k7585k9160j9766k734J4766K6530K8852
1285B2602K0629M262j3241k6027k8728k1231n153J1754K4750K8510K1647P010
1297D6784j0772k3674k8437k2093q011R168K2656K8033K2879R117p779k1763k7373
1310a1265k3247j0363O597K0486K6953K3781J1302n297j9477k6480k3734j2370
$$ plain form
1322 -43114 -39466 -21358 5197 29022 42378 39741 22531 -2747 -27151 -41114 -39970 -24144
1334 -24144 672 25086 40097 40116 25099 1391 -22918 -38675 -39934 -26549 -3235 20964 37476
1347 37476 40096 27495 5121 -19111 -36056 -40037 -28629 -7080 17222 34690 39617 29662 8591
1360 8591 -15158 -33190 -39330 -30292 -10362 13366 31920 38683 31189 12199 -11235 -30350 -38048
1373 -38048 -31596 -13867 9209 28652 37449 32462 15065 -7591 -27228 -36835 -32673 -16527 5516
1386 5516 25442 36067 33211 17634 -3727 -23909 -35025 -33128 -19017 1812 22421 34211
1398 34211 33320 20205 -124 -20480 -33123 -33222 -21505 -1333 18886 32064 33169 22804 3440
1411 3440 -17082 -31076 -33183 -23441 -4749 15411 29840 33056 24188 6429 -13800 -28549 -32938
$$ packed form
1322d3114L648J8108K6555K3825J3356k637j7210k5278k4404j3963J144J5826
1334b4144K4816K4414J5011J9j5017k3708k4309j5757j259J3385K3314K4199J6512
1347C7476K620j2601k2374k4232j6945l981J1408K1549K4302J7468M927r955k1071
1360H591k3749j8032o140R038J9930K3728J8554O763p494j8990k3434j9115p698
1373c8048O452J7729K3076J9443Q797m987j7397k2656j9637r607M162J6146K2043
1386E516J9926J0625k856j5577k1361k0182j1116J897J4111K0829K0609J1790
1398C4211q91j3115k0329k0356j2643r9J1717K0172K0219J3178J105j0365j9364
1411C440k0522j3994k107R742J8692K0160J4429L216q868j7759k0229j4749m389
$$ plain form
1424 -32938 -25043 -7790 12077 27368 32590 25678 9178 -10247 -26095 -32153 -26278 -10538 8698
1437 8698 24782 31762 26590 12181 -7046 -23464 -31007 -27083 -13362 5241 21974 30390 27695
1450 27695 14515 -3852 -20633 -29583 -27724 -15619 2307 19206 28663 28037 16552 -670 -17522
1463 -17522 -28117 -27956 -17440 -667 16170 27054 27996 18376 2186 -14916 -26289 -27976 -19269
1476 -19269 -3749 13181 25047 27689 20050 5023 -11624 -24055 -27570 -20689 -6632 10588 22963
1489 22963 27191 21524 7727 -8776 -21967 -27156 -22147 -8808 7248 20948 26630 22546 10150
1502 10150 -5748 -19814 -26218 -22986 -11269 4359 18350 25652 23247 12194 -2947 -17072 -25027
1515 -25027 -23486 -13199 1494 15778 24189 23501 14001 -206 -14867 -23652 -23745 -15233 -966 13535
$$ packed form
1424c2938P895J7253J9867J5291N222o912j6500j9425j5848o058N875J5740J9236
1437H698J6084O980n172j4409j9227j6418p543L924J3721J8603J6733Q416k695
1450B7695j3180j8367j6781q950J859J2105J7926J6899R457o26j1485j7222j6852
1463a7522j0595J61J0516J6773J6837J0884R42r620j6190j7102j1373j687Q707
1476a9269J5520J6930J1866K642p639j5027j6647j2431l515O881J4057J7220J2375
1489B2963M228n667j3797j6503j3191n189N009J3339J6056J3700N682m084j2396
1502A0150j5898j4066o404L232J1717J5628J3991P302k405j1053j5141j4125p955
1515b5027J541J0287J4693J4284Q411o88r500j4207j4661q785r3Q512J4267J4501
$$ plain form
1529 13535 22640 23775 15829 2330 -12027 -21926 -23611 -16481 -3280 10700 21048 23555 17367
1542 17367 4820 -9466 -20297 -23591 -17752 -5602 8118 19401 23191 18361 6878 -7087 -18479
1555 -18479 -22650 -18976 -7949 5748 17278 22303 19272 9153 -4577 -16227 -22014 -19677 -10059
1568 -10059 3082 15120 21575 19921 10867 -1987 -14071 -21214 -20106 -11720 868 12892 20590
1581 20590 20400 12728 316 -11970 -19707 -20511 -13439 -1730 10588 19184 20508 14140 2663 -9723
1595 -9723 -18422 -20317 -14829 -3923 8362 17651 20374 15482 4800 -7112 -16950 -20214 -15763 -5945
1609 -5945 6030 15946 19749 16364 7063 -5058 -14961 -19511 -16649 -7701 3952 14296 19429 17113
1623 17113 8534 -3093 -13331 -18781 -17499 -9464 1872 12203 18665 17675 10442 -953 -11518
$$ packed form
1529A3535R105J135p946j3499j4357r899j685P130J3201J3980J0348K507o188
1542A7367j2547j4286j0831l294N839J2150J3720J1283L790m830j1483j3965j1392
1555a8479m171L674J1027J3697J1530N025l031j0119j3730j1650n787K337R618
1568a0059J3141J2038O455j654r054j2854j2084p143J108Q386J2588J2024P698
1581B0590j90p672j2412j2286p737q04P072J1709J2318Q596J324o368j1477j2386
1595i723q699j895N488J0906J2285R289K723m892j0682j1912r838l264M451R818
1609e945J1975R916L803l385r301j2121r903m550K862Q948J1653J0344N133k316
1623A7113q579j1627j0238n450J282Q035J1336J0331O462r90p233j1395j0565
$$ plain form
1636 -11518 -18014 -18007 -11038 -121 10694 17381 17888 11682 1278 -9586 -16949 -17967 -12480 -2273
1650 -2273 8449 16346 18142 12972 3195 -7717 -15786 -17740 -13466 -4151 6554 15052 17583 13937
1664 13937 5342 -5627 -14253 -17825 -14415 -5813 4652 13636 17049 15052 6907 -3448 -12574 -17281
1678 -17281 -15346 -7829 2796 11818 16752 15509 8441 -1524 -11079 -16507 -15671 -9285 570 10255 16068
1693 16068 15933 10165 451 -9242 -15766 -16191 -10352 -1485 8481 15063 16208 11429 2113 -7642 -14635
1708 -14635 -16136 -11852 -3278 6680 13954 16418 12284 4031 -5925 -13549 -16010 -12915 -5003 4839 12760
1723 12760 16084 13414 5757 -3940 -12149 -15771 -13533 -6566 3243 11679 15571 13962 7312 -2069 -10761
1738 -10761 -15498 -14331 -7941 1097 9934 15231 14502 8629 -352 -9309 -14837 -14973 -9586 -538 8638
$$ packed form
1636a1518o496PO969J0917J0815O687N07o206j0404j0864p363j018N487J0207
1650b273J0722P897J796n170r777j0912q069j954M274R315J0705Q498K531l646
1664A3937q595j0969q626l572L410Q602J0465Q984L413j997q145j0355r126m707
1678a7281J935P517J0625R022M934j243p068r965r555n428Q36O386R855R685N813
1693A6068j35n768r714r693o524m25N839Q867R966O582J145m779r316r755o993
1708a4635j501M284Q574R958P274K464m134q253r956p624k461L095P912R842P921
1723A2760L324k670p657r697q209l622K238O967R809Q436L892j609o650r381q692
1738a0761m737J167O390R038Q837N297p29n873q981q957n528j36N387R048R176
$$ plain form
1753 8638 14467 15042 9822 1491 -7703 -13987 -14989 -10585 -2260 7071 13502 15140 11199 3087 -5934
1768 -5934 -12967 -15392 -11583 -3949 5131 12600 15125 12052 4599 -4458 -11890 -15063 -12530 -5421 3675
1783 3675 11546 14912 12829 6152 -2701 -10791 -14545 -13340 -6746 2088 9997 14445 13557 7697 -970
1798 -970 -9240 -14269 -13850 -8494 241 8835 13915 13976 8813 486 -7967 -13737 -14195 -9714 -1537 7367
1814 7367 13170 14282 10018 2173 -6533 -12667 -14495 -10609 -2844 5744 12444 14448 11183 3501 -5147
1829 -5147 -11932 -14546 -11687 -4681 4277 11742 14478 12169 5280 -3520 -10703 -14248 -12447 -5879 2760
1844 2760 10239 14157 12723 6455 -1874 -9899 -13803 -12909 -7399 1020 9102 13791 13315 7895 -370
1859 -370 -8652 -13645 -13363 -8395 -407 7833 13087 13594 9243 1054 -7143 -12913 -13572 -9555 -1966 6647
$$ packed form
1753H638N829N75n220q331r194o284j002M404Q325R331O431J638l941q112r021
1768e934p033k425L809P634R080P469K525l073p453r057p432l173K533P109R096
1783C675P871L366k083o677q853q090l754J205O594Q834P909M448q88n860q667
1798i70q270n029M19N356Q735Q594N080O1n163q327q453n770m58M481Q177Q904
1814G367N803J112m264p845q706o134j828L886P765Q588O700K004l265p682q648
1829e147o785k614K859P006Q958P465K736k309o889q800p183l545J801O568Q639
1844B760P479L918j434o268q329q025l904Q94N510Q419Q082M689m76n420q265
1859c70q282m993K82M968P988Q240N254N07m351q189q197n770o59M017P589Q613
$$ plain form
1875 6647 12672 13848 10102 2628 -5712 -12158 -13877 -10591 -3410 5309 11687 13876 11106 4165 -4214
1890 -4214 -11152 -13865 -11633 -4911 3457 10885 13910 12143 5503 -2902 -10085 -13650 -12364 -6101 2066
1905 2066 9655 13724 12486 6883 -1317 -9236 -13351 -12656 -7334 763 8339 13192 13288 8018 32 -7868
1921 -7868 -12834 -13365 -8732 -804 7122 12759 13122 8842 1678 -6563 -12390 -13460 -9652 -2170 5877
1936 5877 12154 13612 10151 2948 -5178 -11684 -13613 -10602 -3567 4581 11257 13628 11010 4190 -4012
1951 -4012 -10502 -13512 -11517 -4886 3308 10541 13480 11719 5661 -2758 -9638 -13431 -12018 -5855 1799
1966 1799 9188 12950 12333 6754 -1204 -8667 -13071 -12590 -7432 617 8301 12675 12768 8157 186 -7374
1982 -7374 -12485 -12938 -8606 -793 6968 12283 13136 8953 1714 -6336 -11839 -13142 -9313 -2316 5808
$$ packed form
1875F647O025J176l746p474q340o446j719L286P181Q719O378K189k770o941q379
1890d214o938k713K232O722Q368P428L025j767o640q405p183l565J286O263Q167
1905B066P589M069j238n603q200p919m115O95N322Q097P576M853R6n270p986p900
1921g868m966n31M633P928P926N637L63m280p164q241n827j070L808P482Q047
1936E877O277J458l461p203q126o506j929L011P035Q148O676K371k618o820q202
1951d012o490l010J995O631Q194P233K939j761o058q419o880l793J413O163P654
1966A799P389L762o17n579p958p463m404M81N158Q049P684M374R3m611p971p560
1982g374n111m53M332P813P761N315Q53m183p239q050n503j303L829O997Q124
$$ plain form
1997 5808 11846 13316 9954 3013 -5195 -11244 -13246 -10463 -3631 4364 11062 13306 10677 4226 -3726
2012 -3726 -10356 -13472 -11189 -4872 3017 10026 13268 11349 5521 -2411 -9630 -13031 -11839 -6010 1631
2027 1631 8857 12900 11991 6942 -1060 -8580 -12816 -12275 -7222 224 7808 12660 12347 7799 414 -7265
2043 -7265 -12447 -12756 -8457 -986 6600 12127 12489 8755 1498 -6259 -11765 -12931 -9284 -2151 5620
2058 5620 11343 12937 9530 2760 -4946 -11166 -12967 -10198 -3591 4157 10652 12874 10625 4132 -3738
2073 -3738 -10147 -12822 -10780 -4829 3020 9877 12942 11176 5184 -2472 -9241 -12807 -11368 -5873 2021
2088 2021 8873 12481 11602 6153 -1284 -8306 -12448 -11772 -6789 759 7921 12065 11979 7425 19 -7419
2104 -7419 -11947 -12032 -7787 -727 6885 11613 12091 8387 1234 -6440 -11551 -12465 -8973 -1734 5552 11047
$$ packed form
1997E808O038J470l362o941q208o049k002K783O832P995O698K244k629o451p952
2012c726o630l116K283O317P889P009L242j919n828p932p219l401J192N829P641
2027A631P226M043r09n049q002p520m236N41N053P446P584M852l13m548p385p679
2043g265n182l09M299P471P586N527L62l734p257p757n506j166L647P133P771
2058E620N723J594l407o770p706o220j801K769O607P748O495K222k249o493p870
2073c738o409k675K042N951P849O857L065j766n992p656o769l566J439N495P894
2088B021O852L608q79n449p437p022m142O76M983P548P162M144q6m554p406p438
2104g419m528q5M245P060P612M728M78l704p153p674n111r14L492P239P286N495
$$ plain form
2120 11047 12392 9219 2458 -4972 -10830 -12504 -9554 -3158 4331 10509 12480 10051 3860 -4022 -10051
2135 -10051 -12402 -10299 -4266 3233 9932 12418 10694 4837 -2769 -9199 -12343 -10921 -5342 2192 8518
2150 8518 12012 11295 5962 -1629 -8518 -12222 -11390 -6347 910 7813 11766 11636 6815 -170 -7362 -11771
2166 -11771 -11663 -7513 -366 6666 11425 11831 7881 1079 -6183 -11122 -11984 -8419 -1461 5563 10644
2181 10644 11987 8724 2102 -4888 -10558 -11980 -9014 -2699 4369 10172 11931 9686 3375 -3897 -9826
2196 -9826 -12239 -9732 -4056 3376 9445 12059 10079 4448 -2679 -9262 -12003 -10502 -5127 2004 8675
2211 8675 11982 10651 5573 -1747 -8175 -11865 -10939 -5872 1019 7619 11501 11348 6540 -505 -7266
2226 -7266 -11185 -11102 -7024 -135 6901 11261 11494 7417 513 -6348 -10990 -11614 -7833 -1373 5720 10736
$$ packed form
2120A1047J345l173o761p430n858j674K950O396P489O178J971k429o191p882o029
2135a0051k351K103O033P499O699K486j724n857p606o430l144J422N579P534O326
2150H518L494p17n333p591o889l704Q32N043P257O903L953j30m821o985p192m409
2166a1771J08M150P147P032M759M06l950o802p262m939q62L565O958P024N081
2181A0644J343l263o622o990n670j422K966O315P068N803J759k245o311p272n929
2196i826k413K507N676P432O069K614j980n631p127o583k741J501N375P131O671
2211H675L307j331n078p320o428l690R26N067O891O600L882j53m808p045o761
2226g266l919Q3M078O889P036M360K33m077o904o861m642o24L781O460P093N016
$$ plain form
2242 10736 11545 8181 1794 -5074 -10295 -11625 -8365 -2308 4610 9828 11840 9053 3116 -4168 -9455
2257 -9455 -11574 -9277 -3438 3418 9173 11506 9606 4202 -3024 -9063 -11364 -9864 -4647 2394 8720
2272 8720 11509 10084 5017 -1829 -8210 -11237 -10149 -5746 1413 7721 11140 10607 5955 -672 -7059
2287 -7059 -11015 -10571 -6428 214 6564 10774 10831 6822 340 -6311 -10570 -11076 -7411 -908 5716 10226
2303 10226 11009 7663 1532 -5443 -9989 -11145 -8012 -1819 4681 9735 11174 8411 2545 -4448 -9402
2318 -9402 -11286 -8579 -3165 3691 8916 11292 9012 3426 -3233 -8779 -11010 -9489 -4098 2667 8477
2333 8477 10913 9561 4486 -2254 -8053 -10884 -10004 -4947 1576 7723 10877 9974 5305 -965 -7263
2348 -7263 -10652 -10150 -5983 524 6689 10487 10497 6388 -86 -6255 -10254 -10620 -6927 -352 5844 10052
$$ packed form
2242A0736Q09l364o387o868n221j330L260O057O918N218K012k787n937p284n287
2257i455k119K297N839O856N755K333j900n404p226o039k301J500N217P041O326
2272H720K789j425n067o846o381l027J088M403P159O308L419n33m652o627o387
2287g059l956M44M143O642O350M210N7m009o482o651m259n06L665O503O624M510
2303A0226P83l346o131o975m546j156L133O193O500N054J439k763n866o993m954
2318i402j884K707N414O856N225K376k280n586o659n546k231J521N391O765N810
2333H477K436j352n075o740n799k831Q80N057O523O147L154r03m669o270o298
2348g263l389N02M167O507O165L798J0m109o474o169l999l66L693O575O196M208
$$ plain form
2364 10052 10399 7148 934 -5209 -9818 -10598 -7493 -1935 4906 9541 10730 7826 2129 -4284 -9231
2379 -9231 -10694 -7922 -2538 3897 8913 10644 8510 3266 -3386 -8697 -10664 -8787 -3711 2764 8199
2394 8199 10552 8853 4109 -2482 -7886 -10632 -9192 -4510 1716 7639 10258 9315 5101 -1217 -7267
2409 -7267 -10366 -9535 -5494 699 6464 10236 9573 5577 -327 -6304 -10060 -10184 -6278 -210 5791 9713
2425 9713 10116 6717 626 -5256 -9565 -10277 -7041 -1424 4883 9159 10058 7208 1846 -4356 -8948 -10194
2441 -10194 -7669 -2259 4100 8658 10102 7883 2703 -3413 -8318 -10249 -8137 -3226 2999 8169 10158
2456 10158 8471 3710 -2466 -7778 -10140 -8613 -4178 2031 7407 10016 8778 4572 -1483 -7031 -9932
2471 -9932 -9271 -5014 867 6714 9862 9032 5537 -591 -6089 -9504 -9304 -5584 108 5863 9397 9437
$$ packed form
2364A0052L47l251o214o143m609p80L105N558O841M635J189k904n697o413m947
2379i231j463K772N384O435N016J731k134n244o652n311j967J877N076O475N435
2394H199K353j699m744o591n404k746J440M682O226N923K619r43m214o318o050
2409g267l099Q31M041O193N765L772o63l996n904n977l756j24L906O068O001L922
2425I713M03l399o091n882m309p12L236N617O307M276Q99k850n362o202m592j246
2441a0194K525N410O359M558J444k219n180o116m905j931K112M911O225N170J989
2456A0158j687m761o176n312k362J527M435O209N376K609j238m206o055n548k901
2471i932O61M257N881N847L148q30l495o128n498l415K00L720N692N755L534M0
$$ plain form
2487 9437 6014 471 -5487 -9067 -9440 -6470 -937 4997 8947 9609 6695 1419 -4430 -8704 -9835
2502 -9835 -7021 -1955 4128 8364 9737 7377 2353 -3556 -8264 -9758 -7398 -2875 3066 7985 9737
2517 9737 7840 3143 -2599 -7482 -9665 -8254 -3802 2237 7193 9516 8121 4125 -1972 -7060 -9469
2532 -9469 -8441 -4224 1536 6446 9454 8619 4722 -750 -6244 -9465 -8840 -5258 141 5760 9014
2547 9014 8772 5512 233 -5479 -8941 -9031 -6000 -474 5296 8842 9203 6137 922 -4543 -8537 -9041
2563 -9041 -6578 -1344 4322 8201 9046 6764 1698 -4051 -8130 -9372 -7160 -2347 3194 7685 9081
2578 9081 7523 2687 -3053 -7592 -9146 -7453 -3096 2555 7004 9117 7699 3475 -2086 -6891 -8952
2593 -8952 -7953 -3811 1572 6241 9135 8044 4190 -1033 -6279 -8966 -8420 -4557 849 5810 8868
$$ packed form
2487I437l423n543n958l580l73K970N533N934L950O62k914n276n849m274j131
2502i835K814N066O083M236J373k360n024n909m708j494K360M523N941M919J752
2517I737j897m697n742m883k183J411M452O039M956K323j395l996o097n088k409
2532i469J028M217N760M910L008q35l897n472n494l221O25L582N399N619L254
2547I014k42l260n279n712l462r0L031N526N770L546L61l066n215n465l994n04
2563i041K463N234N666L879Q45k282n066n749m079j242K212M813N541M491J396
2578I081j558m836n740m539j554J693M357N651M449K113j418m224n561m805k061
2593h952R99M142N383M669K894j091l854n223n246k687N46L863N406M961L058
$$ plain form
2608 8868 8530 4746 -364 -5479 -8791 -8618 -5312 -118 5093 8524 8540 5545 590 -4635 -8210 -8704
2624 -8704 -6038 -1170 4655 8006 8772 6450 1444 -4090 -7795 -8724 -6649 -2003 3566 7704 8795
2639 8795 6756 2365 -2947 -7443 -8806 -6982 -2675 2528 6973 8810 7207 2941 -2359 -6660 -8645
2654 -8645 -7625 -3285 1895 6467 8464 7653 3845 -1610 -6160 -8603 -7989 -4195 1037 5951 8419
2669 8419 7964 4362 -677 -5501 -8305 -8239 -4938 215 5219 8198 8287 5113 7 -4673 -8028 -8281
2685 -8281 -5334 -698 4404 7882 8360 5795 884 -4237 -7629 -8180 -5981 -1278 3795 7473 8349 6173
2701 6173 1757 -3268 -7318 -8337 -6656 -2081 2967 6940 8461 6800 2792 -2590 -6503 -8384 -6959
2716 -6959 -2814 2189 6474 8380 7177 3313 -1887 -6229 -8059 -7238 -3431 1425 5825 7994 7624
$$ packed form
2608H868l38l784n110n115l312J73L306N194N211L431J6k995m955n225l575m94
2624h704K666M868N825L351P66k322n006n534l705r29K075M646N569M138J091
2639H795k039m391n312m496j363J824M307N203M445J837j603m266n300m301j985
2654h645J020M340N180M572J997q11l808n455m550k443O14L794N232M914K468
2669H419m55l602n039m824k804O6L301N153N004K979Q9l174n106m680l355k53
2685h281K947M636N102L478M78k565m911n121l392n51K199M703N073L678Q76k176
2701F173m416n025m050j019J681M575N048L973J521j661m008n382l913j881J425
2716f959M145N003M285J906j203l864n200m342j830Q21L807M856M400K169l70
$$ plain form
2731 7624 4055 -1226 -5420 -7850 -7499 -4434 510 5150 7767 7729 4514 -249 -4716 -7721 -7826 -4969
2747 -4969 -130 4582 7672 7889 5178 485 -4244 -7400 -7887 -5253 -963 3913 7097 7801 5670 1259
2763 1259 -3469 -6971 -7765 -5936 -1843 3250 6871 7737 6225 2165 -2662 -6682 -7733 -6107 -2258
2778 -2258 2478 6419 7641 6285 2722 -2165 -6089 -7681 -6507 -3190 1917 5886 7789 6625 3323
2793 3323 -1441 -5393 -7698 -6723 -3326 949 5425 7635 6996 3883 -655 -5032 -7384 -7074 -3977 347
2809 347 4676 7376 7147 4332 69 -4417 -7064 -7173 -4966 -371 4034 7081 7428 4961 850 -3607
2825 -3607 -6736 -7375 -5426 -1165 3298 6631 7558 5216 1438 -2896 -6488 -7484 -5514 -1848 2771 6217
2841 6217 7193 5888 1929 -2357 -5957 -7349 -6007 -2194 2139 5824 7314 6078 2706 -1719 -5573
$$ packed form
2731G624l569n281m194k430L51L065M944M640K617l8l215m763m467l005j05K857
2747d969M839M712L090K17k711m693m729l156m87K634M290M876L184P04k131m411
2763A259m728l502p94J829M093N093L621Q66j512m060m827m020j051J626L849
2778b258M736L941J222j356l563m887l924j592J174L317N107L969J903j164l302
2793C323m764l952k305R75L397M275M476K210o39l113m538m377k352L10L097M324
2809C47M329K700k29k815m263m486k647j09K207M595M405L047L47k467m111m457
2825c607l129o39J949M261M463L333R27k342l778m334l592r96J970L666M619L446
2841F217R76j305l959m286l600j392J342L813M333L685J490j236l372m425l854
$$ plain form
2856 -5573 -7171 -6229 -2974 1415 5041 7232 6245 3294 -1170 -4880 -7212 -6404 -3504 790 4604 6989
2872 6989 6627 3890 -483 -4480 -6835 -6574 -3963 48 4206 6773 6751 4467 427 -3921 -6693 -6577
2888 -6577 -4684 -691 3483 6316 6893 4817 865 -3268 -6356 -6975 -4801 -1310 3013 5842 6830 5156
2904 5156 1485 -2764 -5899 -7080 -5479 -1987 2277 5692 6724 5500 2178 -1884 -5335 -6918 -5707
2919 -5707 -2229 1603 5159 6619 5872 2769 -1322 -4874 -6661 -5949 -3044 1137 4712 6467 6003 3342
2935 3342 -819 -4460 -6622 -6106 -3559 528 4014 6386 6284 3819 -138 -3983 -6244 -6397 -3943 -188
2951 -188 3697 6132 6508 4359 311 -3175 -5956 -6217 -4480 -846 3001 5778 6368 4629 1039 -2864
2967 -2864 -5641 -6381 -4717 -1450 2468 5578 6255 4705 1561 -2271 -5333 -6428 -4918 -1818 2104
$$ packed form
2856e573j598R42L255M389L626K191r87k951m464l710k332Q08K900M294L814K385
2872F989l62k737m373l997k355K61K611M011M158K567k2k284m040m348k772J16
2888f577J893L993M174K833N77k076l952m133l088o19K174L491M323K829R88j674
2904E156l671m249l135j181J601L492M264L415J032j224l322m062l451j583J211
2919e707L478L832L556J460p47l103m091l552j787P12K905M181L575J755m64k661
2935C342m161l641k162N16K547M087L486K372j02k465l957l845k261j53K454L755
2951a88L885K435L76k149m048l486k781k61J737L634L847K777N90j739l590l903
2967b864k777p40J664L267L918L110O77j550l144l832l062j095J510L100L922
$$ plain form
2982 2104 5100 6219 5197 2212 -1796 -4885 -6179 -5439 -2448 1597 4703 6389 5591 2544 -1231
2997 -1231 -4539 -6008 -5505 -3028 905 4109 5901 5572 3068 -420 -3808 -6021 -5518 -3078 281 3760
3013 3760 5880 5878 3335 -118 -3637 -5730 -5669 -3693 -364 3087 5689 5902 3805 493 -3031 -5245
3029 -5245 -5917 -4140 -877 2868 5319 5618 4082 1065 -2517 -5338 -5725 -4384 -1517 2236 4907 5825
3045 5825 4402 1430 -1867 -4497 -5689 -4662 -1936 1710 4370 5602 4789 1903 -1549 -4474 -5478
3060 -5478 -4812 -2302 1138 4028 5509 4632 2434 -843 -3941 -5607 -4864 -2675 733 3688 5400 5110
3076 5110 2799 -484 -3510 -5190 -5063 -3186 100 3326 5220 4964 3366 -62 -2986 -5082 -5243 -3350
3092 -3350 -286 2779 4925 5187 3451 647 -2543 -4641 -5103 -3643 -785 2288 4582 5124 3775 941
$$ packed form
2982B104K996J119j022k985m008l089j294P40K991M045L106J686p98l047l775
2997a231l308j469N03K477L933L204J792l29k504l488l388k213N03K440L359L479
3013C760K120kk543l453l519k093O1J976L329L451K602K13k097l312l524k214
3029e245o72J777L263L745K451K99j536l017l582k821l87J341K867L753K671R18
3045E825j423k972l297k630j192J027K726L646K660J232q13k886l452k925j004
3060e478O66K510L440K890J481q77k198l277l098j666P43K189L408K955J712k90
3076E110k311l283l026j680J27J877L286L226J894k56j598l428k924k096j61J893
3092c350L064L065K146K62j736k804l190k098m62J460K858L073K294N42j349k834
$$ plain form
3108 941 -2242 -4537 -5281 -3675 -1236 1816 4318 5266 3942 1452 -1866 -4134 -4989 -4182 -1613 1377
3124 1377 3768 5175 4048 1858 -1162 -3907 -4892 -4249 -2008 968 3707 5093 4281 2342 -833 -3252
3140 -3252 -4895 -4445 -2276 392 3199 4874 4675 2398 -197 -2994 -4652 -4667 -2844 -105 2802 4580
3156 4580 4533 3053 92 -2690 -4496 -4714 -2914 -314 2469 4142 4513 3281 660 -2048 -4157 -4657
3172 -4657 -3257 -802 1903 4057 4623 3482 1085 -1724 -3868 -4706 -3649 -1170 1405 3850 4667 3752
3188 3752 1575 -1330 -3664 -4639 -3610 -1502 1118 3595 4590 3842 1849 -1079 -3203 -4517 -3805 -2033
3204 -2033 844 3276 4277 3842 1948 -547 -3001 -4363 -4053 -2381 361 2627 4222 4107 2547 -175
3220 -175 -2575 -4160 -3952 -2507 45 2554 4165 3816 2619 167 -2292 -3804 -4002 -2808 -381 2067
$$ packed form
3108I41l183k295p44J606K439L052K502R48j324k490l318k268q55Q07K569K990
3124A377K391J407j127k190l020k745r85O43K241K976K739J386q12j939l175k419
3140c252j643M50K169K668K807J675j99k277k595k797j658j5J823K739K907J778
3156D580m7j480k961k782j806k18J800K600K783J673L71j232k621k708k109n00
3172d657J400K455K705K154N66j141k397k809k144q38J057K479K575K445Q17r15
3188C752k177k905k334r75J029K108K620K477R95p48j993k928k124j314P12J772
3204b033K877K432J001m35j894k495k454j362L10J672K742K266J595j15j560k722
3220a75k400j585K08J445K552K509J611l49j197k452k459j512j98J194K427K448
$$ plain form
3236 2067 3816 3901 2797 592 -1887 -3644 -4016 -2872 -833 1538 3649 3976 2998 971 -1531 -3510
3252 -3510 -4140 -3123 -1308 1155 3379 4323 3095 1308 -1127 -3276 -3864 -3129 -1599 1104 2947 3889
3268 3889 3418 1676 -1076 -2792 -3850 -3446 -1852 701 2822 3850 3559 1761 -471 -2563 -3816 -3425
3284 -3425 -1827 250 2419 3739 3537 2117 -126 -2322 -3628 -3644 -2258 26 2004 3521 3557 2229
3300 2229 199 -1754 -3258 -3477 -2428 -383 1708 3216 3591 2546 606 -1552 -3263 -3615 -2524 -782
3316 -782 1540 3209 3449 2578 966 -1519 -3049 -3708 -2859 -1175 1167 2984 3187 2721 1269 -906 -2606
3333 -2606 -3496 -2944 -1345 678 2554 3263 3086 1387 -794 -2331 -3423 -3119 -1544 630 2322 3311
3349 3311 3295 1577 -266 -2112 -3081 -3175 -1764 79 2058 3053 2983 1915 138 -2063 -3056 -3093 -1862 -102
$$ packed form
3236B067J749Q5j104k205k479j757l72J144K039K371K111L27r78k027k502j979
3252c510o30J017J815K463K224R44j228j787k435k149n88P35J530K703J843R42
3268C889m71j742k752j716j058M04J594K553K121J028k91j798k232k092j253L91
3284c425J598K077K169J320k02j420k243k196j306j6J386K284J978J517L6j328
3300B229k030j953j504k19J049K045K091J508L75j045j940k158j711l52J091J742
3316g82K322J669K40q71j612k485j530o59Q49J684K342J817K03m66j452k175j700
3333b606q90N52J599K023J876P09j77j699k181j537j092L04J575K174J692R89
3349C311j6j718j843j846r69r4J411J843J979R95p0j068j777k201r93l7J231J760
$$ plain form
3367 -102 1680 3109 3070 1971 209 -1569 -2787 -3183 -2264 -490 1490 2934 3217 2208 497 -1320
3383 -1320 -2756 -3034 -2225 -582 1104 2659 3027 2415 616 -1111 -2376 -2811 -2331 -890 834 2366
3399 2366 2943 2401 967 -761 -2229 -2942 -2405 -1170 649 2025 2948 2549 1500 -438 -2008 -3037
3415 -3037 -2828 -1538 322 2002 2657 2660 1492 -286 -1762 -2879 -2692 -1444 218 1594 2486 2695 1456
3432 1456 -12 -1414 -2482 -2564 -1623 -292 1472 2451 2533 2023 328 -1268 -2387 -2633 -2044 -457 1244
3449 1244 2187 2536 2069 623 -961 -2251 -2426 -1904 -695 915 2099 2376 2192 790 -760 -1892 -2477
3466 -2477 -1830 -789 659 1994 2395 2216 1171 -493 -1703 -2314 -2108 -1022 348 1697 2325 2298 1324
3483 1324 -290 -1556 -2333 -1959 -1268 133 1488 2294 2186 1221 22 -1419 -2438 -2100 -1567 -12 1332
$$ packed form
3367a02J782J429l9j099j762j778j218l96R19J774J980J444K83j009j711j817
3383a320j436k78Q09J643J686J555L68o12j799j727j265m35M80J441J724J532
3399B366N77n42j434j728j468p13N37J235J819J376R23l99j049j938j570j029
3415c037K09J290J860J680O55Lj168j778j476j117J87J248J662J376Q92K09j239
3432A456j468j402j068q2R41J331J764R79Q2n10j695j596j119k46N89J587J701
3449A244R43L49m67j446j584j290j75N22J209J610J184K77j84j402j550j132n85
3466b477O47J041J448J335M01j79j045j664j210o11K06J086J370J349O28k7r74
3483A324j614j266p77L74O91J401J355Q06j08r65j199j441j019L38N33J555J344
$$ plain form
3500 1332 2210 2179 1508 137 -1290 -2108 -2055 -1586 -321 1137 2138 2340 1534 454 -1056 -1959 -2074 -1529
3518 -1529 -369 806 1959 2339 1455 594 -617 -1737 -2031 -1890 -502 690 1818 2032 1786 500 -730
3535 -730 -1677 -2268 -1667 -790 465 1444 2271 1833 963 -374 -1472 -2072 -1865 -1110 227 1350 1956 1774
3553 1774 900 -116 -1255 -1548 -1877 -947 54 1284 1727 1943 852 -143 -950 -1558 -1704 -1075 47 965
3571 965 1647 2036 1229 326 -796 -1507 -1768 -1337 -344 773 1739 1795 1516 339 -927 -1538 -1632 -1199 -513
3590 -513 419 1490 1865 1520 676 -606 -1418 -1712 -1530 -683 554 1388 1724 1393 615 -401 -1223 -1541 -1239
3609 -1239 -471 282 1189 1601 1351 771 -303 -986 -1548 -1572 -778 -117 1035 1599 1394 811 -66 -979 -1492
3628 -1492 -1294 -997 171 1063 1637 1365 817 101 -832 -1350 -1495 -1118 159 715 1345 1434 939 291 -735
$$ packed form
3500A332Q78l1o71j371j427q18N3M69J265J458J001K02q06j080j510r03j15N45
3518a529J160J175J153L80q84q61j211j120k94J41J388J192J128K14k46j286j230
3535g30r47n91O01Q77J255R79Q27m38q70j337j098o00K07P55J337J123O06j82
3553A774q74j016j139k93l29R30J001J230M43K16j091r95q07o08j46O29J122R18
3571I65O82L89q07r03j122p11k61M31R93J117R66N6k79j177j266o11r4M33O86
3590e13R32J071L75l45q44j282q12k94J82Q47J237Q34L36l31p78j016q22l18L02
3609a239P68P53R07M12k50n80j074o83n62k4P94O61J152N64k05n83q77r13n13
3628a492J98K97J168Q92N74k72n48p16r33n18j45L77J277N56O30Q9m95o48j026
$$ plain form
3647 -735 -1308 -1343 -1105 -308 327 1261 1511 1067 274 -567 -1092 -1458 -1007 -484 438 1109 1415 1022 639 -498
3667 -498 -878 -1189 -1198 -398 308 776 1256 1060 404 -231 -1018 -1330 -974 -736 254 797 1171 1232 617 -51 -856
3688 -856 -1148 -1029 -587 3 709 947 1300 749 -104 -649 -1030 -1260 -643 23 479 891 1013 657 363 -480
3708 -480 -935 -1254 -820 -151 426 1108 911 987 172 -372 -1080 -1097 -895 -210 228 737 1177 945 278 -276 -845
3729 -845 -999 -783 -256 294 830 1225 924 174 -152 -805 -979 -829 -379 114 713 1076 850 291 55 -590
3749 -590 -828 -752 -575 -44 675 1015 834 404 155 -366 -1008 -859 -587 -106 427 635 823 436 399 -321 -656
3770 -656 -860 -639 -84 384 941 706 771 223 -251 -725 -1029 -708 -235 144 792 839 681 312 -191 -884 -780
3791 -780 -732 -212 53 319 826 661 427 26 -384 -755 -681 -375 138 510 582 774 326 121 -446 -663 -522
$$ packed form
3647g35n73l5K38P97O35R34K50m44p93q41n25l66M51N23R22O71L06l93l83j137
3667d98l80l11rQ00P06M68M80j96o56o35p87l12L56K38R90N43L74O1o15o68q05
3688h56k92J19M42N90P06K38L53n51q53n45l81k30O17O66M56M12J22l56k94q43
3708d80m55l19M34O69N77O82j97P6q15n44p08j7K02O85M38N09M40k32o67n54n69
3729h45j54K16N27N50N36L95l01p50l26o53j74J50M50M93N99L63k26n59k36o45
3749e90k38P6J77N31P19L40j81m30k49n21o42J49K72M81N33K08J88l87l7p20l35
3770f56k04K21N55M68N57k35O5n48m74m74l04L21M73L79O48M7j58l69n03o93J04
3791g80M8N20K65K66N07j65k34m01m10l71P4L06N13L72P2J92m48k05n67k17J41
$$ plain form
3812 -522 -460 -117 649 641 655 482 148 -146 -667 -578 -439 -75 377 403 795 665 -45 -175 -822 -705 -490 -157
3834 -157 193 563 763 262 348 -72 -462 -411 -237 -360 173 400 701 635 258 -163 -469 -451 -358 -192 37 350
3856 350 416 451 465 -116 -347 -467 -756 -260 3 250 555 522 409 149 -380 -666 -635 -288 -268 153 336 339 459
3879 459 262 -303 -409 -550 -395 -118 154 483 404 498 93 -119 -196 -676 -521 -263 274 335 533 476 156 -85
3901 -85 -399 -547 -382 -227 102 285 315 375 160 -75 -238 -448 -610 -217 65 163 405 411 489 -117 4 -371
3923 -371 -169 -280 -309 74 309 480 251 104 -300 -416 -335 -224 -304 66 188 478 227 158 -296 -130 -495
3944 -495 -371 -164 -208 166 474 119 342 -277 -287 -271 -276 -107 -36 370 153 187 342 26 -80 -306 -273 -282 -222 191
3968 191 340 464 169 -235 -107 -267 -457 -375 84 37 308 202 131 173 -5 -116 -373 -143 -14 55 110 318
$$ packed form
3812e22O2L43P66qJ4j73l34k94n21Q9J39L64M52K6L92j30p10j30o47J17K15L33
3834a57L50L70K00n01Q6m20l90N1J74j23N33K27L01o6l77m21l06J8R3J66K29L13
3856C50O6L5J4n81k31j20k89M96K63K47L05l3j13k60n29k86L1L47K0M21J83LJ20
3879D59j97n65j06j41J55K77K72L29p9R4m05k12p7m80J55K58N37O1J98n7l20k41
3901h5l14j48J65J55L29J83L0O0k15k35j63k10j62L93K82R8K42OP8o06J21l75
3923c71K02j11k9L83K35J71k29j47m04j16Q1J11q0L70J22K90k51o9m54J66l65
3944d95J24K07m4L74L08l55K23o19j0J6nJ69P1M06k17L4J55l16j06k26L3rO0M13
3968A91J49J24k95m04J28j60j90Q2M59m7K71j06p1M2j78j11k57K30J29O9N5K08
$$ plain form
3990 318 343 260 -8 -246 -78 -283 -17 -49 219 366 296 159 70 -266 -156 -260 -194 -98 -30 182 297 379 87
4013 87 6 -100 -274 -265 -180 258 256 192 123 -39 -56 -269 -318 -280 -58 261 166 394 345 -13 117 -239 -217 -451 -130
4038 -130 -86 -129 198 300 222 224 128 -508 -447 -288 -136 9 159 329 322 266 -455 -388 -246 44 -82 201 234 482
4062 482 331 251 62 -134 -291 -263 44 318 169 170 215 74 37 -230 -299 -566 -104 105 -46 88 98 219 133
4085 133 43 -93 -302 -336 -62 88 -38 339 216 -157 -173 -207 -409 -63 -188 0 113 239 409 33 -205
4106 -205 -297 -349 -147 -306 56 397 345 26 280 -104 -143 -150 -107 -184 -172 98 156 137 30 -2 -37 -337 -329 -114 -132
$$ packed form
3990C18K5q3k68k38J68k05K66l2K68J47p0j37q9l36J10j04O6R6O8K12J15Q2k92
4013H7q1j06j74RQ5M38ko4o9j62j7k13m9L8K22L19r5K28m9l58J30l56K2k34L21
4038a30M4m3L27J02p8Kr6o36O1J59J52J45J50J70pn6p21O7J42K90j26K83L3K48
4062D82j51q0j89j96j57K8L07K74j49JM5j41l7k67o9k67M62K09j51J34J0J21q6
4085A33r0j36k09l4K74J50j26L77j23l73j6l4k02L46j25J88J13J26J70l76k38
4106b05r2n2K02j59L62L41n2l19K54l84l9pM3p7J2K70N8j9j07l2l5l00QK15j8
$$ [...]
8191E
##END NTUPLES=NMR FID
##END=
