##TITLE=1H_Pr C2-lth`
 200.13Hz, CDCl3.
 8 sc
 18.8.2026
##JCAMPDX= 6.0         $$ Bruker NMR JCAMP-DX V2.0
##DATA TYPE= NMR FID
##DATA CLASS= NTUPLES
##ORIGIN= UXNMR, Bruker Analytische Messtechnik GmbH
##OWNER= pz
$$ XWIN-NMR		Version 3.5
$$ Tue Aug 18 13:27:58 2026 Russian Standard Time (UT+4h)  she@DPX200
##.OBSERVE FREQUENCY= 200.1313
##.OBSERVE NUCLEUS= ^1H
##.DELAY= (6, 6)
##.ACQUISITION MODE= SIMULTANEOUS
##.ACQUISITION SCHEME= undefined
##.AVERAGES= 8
##.DIGITISER RES= 18
##SPECTROMETER/DATA SYSTEM= spect
##.PULSE SEQUENCE= zg30
##.SOLVENT NAME= CDCl3
##.SHIFT REFERENCE= (INTERNAL, CDCl3, 0, 14.3821)
##AUDIT TRAIL= $$ (NUMBER, WHEN, WHO, WHERE, WHAT)
$$ ##TITLE= Audit trail, XWIN-NMR		Version 3.5
$$ ##JCAMPDX= 5.01
$$ ##ORIGIN= Bruker BioSpin GmbH
$$ ##OWNER= she
$$ F:/spectra/data/she/nmr/H-C/1/audita.txt
$$ ##AUDIT TRAIL=  $$ (NUMBER, WHEN, WHO, WHERE, WHAT)
(   1,<2026-08-18 13:26:43.57 +0400>,<she>,<DPX200>,
      <created by zg, POWCHK disabled, PULCHK disabled
       configuration hash MD5:
       00 E9 B6 7A A2 85 ED C7 34 08 36 98 17 FE 4E 26
       data hash MD5: 16K
       A4 95 34 F1 57 2D 1C BE D0 62 DB A0 45 45 B7 9C>)
$$ ##END=
$$ 
$$ hash MD5
$$ AE E7 6B B6 7B 05 C1 8F A8 2D 2B B4 EF F7 B8 62
##$RELAX= 
##$RELAX= 
##$RELAX= 
##$RELAX= 
##$RELAX= 
##$RELAX= 
$$ Bruker specific parameters
$$ --------------------------
##$DU= <F:/spectra>
##$EXPNO= 1
##$NAME= <H-C>
##$PROCNO= 1
##$TYPE= <nmr>
##$USER= <she>
##$AMP= (0..31)
100 100 100 100 100 100 100 100 100 100 100 100 100 100 100 100 100 100 
100 100 100 100 100 100 100 100 100 100 100 100 100 100 
##$AQSEQ= 0
##$AQ_mod= 1
##$AUNM= <au_zg>
##$AUTOPOS= <>
##$BF1= 200.13
##$BF2= 200.13
##$BF3= 200.13
##$BF4= 200.13
##$BF5= 200.13
##$BF6= 200.13
##$BF7= 200.13
##$BF8= 200.13
##$BYTORDA= 1
##$CFDGTYP= 0
##$CFRGTYP= 5
##$CHEMSTR= <none>
##$CNST= (0..31)
1 1 145 1 1 1 1 1 1 1 1 1 1 1 1 1 1 1 1 1 1 1 1 1 1 1 1 1 1 1 1 1 
##$CPDPRG= <>
##$CPDPRG1= <>
##$CPDPRG2= <>
##$CPDPRG3= <>
##$CPDPRG4= <mlev>
##$CPDPRG5= <mlev>
##$CPDPRG6= <mlev>
##$CPDPRG7= <mlev>
##$CPDPRG8= <mlev>
##$CPDPRGB= <>
##$CPDPRGT= <>
##$D= (0..31)
0 0.7 0 0 0 0 0 0 0 0 0 0.03 0 0 0 0 0 0 0 0 0 0 0 0 0 0 0 0 0 0 0 0 
##$DATE= 1787045202
##$DBL= (0..7)
120 120 120 120 120 120 120 120 
##$DBP= (0..7)
150 150 150 150 150 150 150 150 
##$DBP07= 0
##$DBPNAM0= <>
##$DBPNAM1= <>
##$DBPNAM2= <>
##$DBPNAM3= <>
##$DBPNAM4= <>
##$DBPNAM5= <>
##$DBPNAM6= <>
##$DBPNAM7= <>
##$DBPOAL= (0..7)
0.5 0.5 0.5 0.5 0.5 0.5 0.5 0.5 
##$DBPOFFS= (0..7)
0 0 0 0 0 0 0 0 
##$DE= 6
##$DECBNUC= <off>
##$DECIM= 32
##$DECNUC= <off>
##$DECSTAT= 4
##$DIGMOD= 1
##$DIGTYP= 9
##$DL= (0..7)
0 120 120 120 120 120 120 120 
##$DP= (0..7)
150 150 150 150 150 150 150 150 
##$DP07= 0
##$DPNAME0= <>
##$DPNAME1= <>
##$DPNAME2= <>
##$DPNAME3= <>
##$DPNAME4= <>
##$DPNAME5= <>
##$DPNAME6= <>
##$DPNAME7= <>
##$DPOAL= (0..7)
0.5 0.5 0.5 0.5 0.5 0.5 0.5 0.5 
##$DPOFFS= (0..7)
0 0 0 0 0 0 0 0 
##$DQDMODE= 0
##$DR= 18
##$DS= 0
##$DSLIST= <SSSSSSSSSSSSSSS>
$$ [...]
##$SUBNAM0= <"">
##$SUBNAM1= <"">
##$SUBNAM2= <"">
##$SUBNAM3= <"">
##$SUBNAM4= <"">
##$SUBNAM5= <"">
##$SUBNAM6= <"">
##$SUBNAM7= <"">
##$SUBNAM8= <"">
##$SUBNAM9= <"">
##$SW= 18.0517328524113
##$SWIBOX= (0..15)
0 0 2 0 0 0 0 0 0 0 0 0 0 0 0 0 
##$SW_h= 3612.71676300578
##$TD= 16384
##$TD0= 1
##$TE= 0
##$TE2= 300
##$TE3= 300
##$TEG= 300
##$TL= (0..7)
0 120 120 120 120 120 120 120 
##$TP= (0..7)
150 150 150 150 150 150 150 150 
##$TP07= 0
##$TPNAME0= <>
##$TPNAME1= <>
##$TPNAME2= <>
##$TPNAME3= <>
##$TPNAME4= <>
##$TPNAME5= <>
##$TPNAME6= <>
##$TPNAME7= <>
##$TPOAL= (0..7)
0.5 0.5 0.5 0.5 0.5 0.5 0.5 0.5 
##$TPOFFS= (0..7)
0 0 0 0 0 0 0 0 
##$TUNHIN= 0
##$TUNHOUT= 0
##$TUNXOUT= 0
##$USERA1= <user>
##$USERA2= <user>
##$USERA3= <user>
##$USERA4= <user>
##$USERA5= <user>
##$V9= 5
##$VALIST= <valist>
##$VCLIST= <CCCCCCCCCCCCCCC>
##$VD= 0
##$VDLIST= <DDDDDDDDDDDDDDD>
##$VPLIST= <PPPPPPPPPPPPPPP>
##$VTLIST= <TTTTTTTTTTTTTTT>
##$WBST= 1024
##$WBSW= 4
##$XGAIN= (0..3)
0 0 0 0 
##$XL= 0
##$YL= 0
##$YMAX_a= 232209
##$YMIN_a= -210383
##$ZGOPTNS= <>
##$ZL1= 120
##$ZL2= 120
##$ZL3= 120
##$ZL4= 120
##$ABSF1= 10
##$ABSF2= 0
##$ABSG= 5
##$ABSL= 3
##$ALPHA= 0
##$AQORDER= 0
##$ASSFAC= 0
##$ASSFACI= 0
##$ASSFACX= 0
##$ASSWID= 0
##$AUNMP= <proc_1d>
##$AZFE= 0.1
##$AZFW= 0.1
##$BCFW= 1
##$BC_mod= 2
##$BYTORDP= 1
##$COROFFS= 0
##$CY= -3
##$DATMOD= 1
##$DC= 2
##$DFILT= <>
##$DTYPP= 0
##$F1P= 0
##$F2P= 0
##$FCOR= 0.5
##$FTSIZE= 0
##$FT_mod= 4
##$GAMMA= 1
##$GB= 0.15
##$INTBC= 1
##$INTSCL= 1
##$ISEN= 128
##$LB= 0.25
##$LEV0= 0
##$LPBIN= 0
##$MAXI= 10000
##$MC2= 0
##$MEAN= 0
##$ME_mod= 0
##$MI= 1.114404
##$NCOEF= 0
##$NC_proc= 0
##$NLEV= 6
##$NOISF1= 3.799351
##$NOISF2= 2.8
##$NSP= 1
##$NTH_PI= 0
##$NZP= 0
##$OFFSET= 14.38212
##$PC= 1
##$PHC0= -4584.024
##$PHC1= 15.9923
##$PH_mod= 1
##$PKNL= yes
##$PPARMOD= 0
##$PSCAL= 0
##$PSIGN= 0
##$REVERSE= no
##$SF= 200.129724274929
##$SI= 16384
##$SIGF1= 3
##$SIGF2= 2
##$SINO= 400
##$SIOLD= 16384
##$SREGLST= <1H.CDCl3>
##$SSB= 0
##$STSI= 0
##$STSR= 0
##$SW_p= 3205.1282051282
##$SYMM= 0
##$S_DEV= 0
##$TDeff= 0
##$TDoff= 0
##$TI= <>
##$TILT= no
##$TM1= 0
##$TM2= 0
##$TOPLEV= 0
##$USERP1= <user>
##$USERP2= <user>
##$USERP3= <user>
##$USERP4= <user>
##$USERP5= <user>
##$WDW= 1
##$XDIM= 8192
##$YMAX_p= 0
##$YMIN_p= 0
$$ End of Bruker specific parameters
$$ ---------------------------------
##NTUPLES= NMR FID
##VAR_NAME=  TIME,          FID/REAL,        FID/IMAG
##SYMBOL=    X,             R,               I
##VAR_TYPE=  INDEPENDENT,   DEPENDENT,       DEPENDENT
##VAR_FORM=  AFFN,          ASDF,            ASDF
##VAR_DIM=   8192,          8192,            8192
##UNITS=     SECONDS,       ARBITRARY UNITS, ARBITRARY UNITS
##FACTOR=    0.0002768,     1,               1
##FIRST=     0,             0,               0
##LAST=      2.2672688,     0,               0
##MIN=       0,             -210383,         0
##MAX=       2.2672688,     232209,          0
$$ Real data points
##PAGE= N=1
##DATA TABLE= (X++(R..R)), XYDATA
0@%%%%%%%%%%%%%%%%Qj6J6j6J6k2L0l2L9m7N1n9P1q2R2j06J22j40J58j79K02k27
$$ 0 0 0 0 0 0 0 0 0 0 0 0 0 0 0 0 0 8 -8 8 -8 8 -14 16 -16 23 -24 27 -32 39 -43 49 -57 65 -75 83 -96 106 -121
38a21K55k84L18l55L95m37M85n39N95o57P23p95Q77r67J063j170J292j427J579
$$ -121 134 -150 168 -187 208 -229 256 -283 312 -345 378 -417 460 -507 556 -614 678 -749 830
57H30j749J940k161K423k731L100l554M125m870N866p224Q901r815K37128q7527
$$ 830 -919 1021 -1140 1283 -1448 1652 -1902 2223 -2647 3219 -4005 4896 -4919 232209 144682
72A44682l05068P4899J44925m2417m4441M2979m0368j3531R4901J2207j15290
$$ 144682 -160386 -85487 59438 17021 -27420 15559 -24809 -38340 56561 68768 -46522
83d6522j2800O5472K2318J4628j6560q3836J9202J18315j9539j38076Q549J13884
$$ -46522 -59322 6150 28468 43096 26536 -57300 -38098 80217 60678 -77398 -68849 45035
95D5035j0184n6059N4965J24j05098K3746J15122l3283q4475N2936O2691o0514
$$ 45035 34851 -21208 33757 33881 -71217 -47471 67651 34368 -50107 2829 65520 5006
107E006m0700M7770p492l5591P0518M1743r9009n5209P1229M7039l0194l3813
$$ 5006 -35694 12076 4584 -31007 39511 81254 -17755 -72964 -1735 45304 15110 -18703
119a8703j484K4547L1754j2365n6646K276O2151q619m0977L4292J2170n2119K0836
$$ -18703 -20187 4360 36114 23749 -32897 -30621 31530 22911 -18066 16226 28396 -23723 -2887
132b887O0365n5204p8292P2819J00500o7114j01116M5072O1534l4355k1092L0999
$$ -2887 57478 2274 -76018 -3199 97301 30187 -70929 -25857 35677 1322 -19770 11229
144A1229P648j8024l970L615o412J526J8878N787j2545j2524q200J8494K4298
$$ 11229 18877 853 -3117 498 -5914 -4388 14490 20277 7732 -4792 -12992 5502 29800
157B9800k9841l0005L5554K3551l5991j5885L4531N909m1206M92M5232m103l0060
$$ 29800 -41 -30046 5508 29059 -6932 -22817 11714 17623 -23583 -23091 22141 18038 -12022
170a2022J2909J2807j9399o541J8971J1128j2207q512Q545n932j4154J3829J5477
$$ -12022 887 13694 -5705 -12246 6725 17853 5646 -2866 5679 -253 -14407 -578 14899
183A4899j2029j6127M520J7946m684k3680O991K7943j271k2526q300J8275J6549
$$ 14899 2870 -13257 -8737 9209 4525 -19155 -12164 15779 14508 -8018 -16318 1957 18506
196A8506j3678j3185Q297J225j146Q524k487j6198n117J9548J2473k6025j6566
$$ 18506 4828 -8357 -60 1165 19 8543 6056 -10142 -15259 4289 16762 -9263 -25829
209b5829K8404J6483k3557j7551J3207K0716k859j3393L971l80p697J1659J1396
$$ -25829 2575 19058 -4499 -22050 -8843 11873 9014 -4379 -408 -788 -8485 3174 14570
222A4570j2835j3789N409J5366m694j9567N137J6862l875j0555k007N430O533
$$ 14570 1735 -12054 -6645 8721 4027 -15540 -10403 6459 2584 -7971 -9978 -4548 1985
235A985n047k126Q702k744p062N616P079l044j0309J569J2971o432r394J0998
$$ 1985 -3062 -5188 3514 770 -6292 -676 6403 3359 -6950 -5381 7590 1158 -8236 2762
249B762j914j5932P342J5339o524j5865N024J8784o044j6440P283J0002k92J524
$$ 2762 848 -15084 -7742 7597 1073 -14792 -9768 9016 2972 -13468 -6185 3817 3525 5049
263E049n588m543O227K245j694k343l557J833L970o05n381p824P976J2162j1485
$$ 5049 -539 -5082 1145 3390 1696 -647 -4204 -2371 1599 994 -4387 -12211 -4235 7927 -3558
278c558q223J3362L834q425j400N251M209m704j190P500l269n891L640j39j525
$$ -3558 -11781 1581 5415 -3010 -4410 841 5050 346 -844 6656 3387 -2504 1136 997 -528
293e28P23j316J941k285n323O200K756p317J149N749K623k515n714M840O218n497
$$ -528 195 -1121 820 -1465 -6788 -588 2168 -5149 -4000 1749 4372 1857 -3857 983 7201 1704
309A704j251L459n57M85l434j156L505n406j309Q271k938o656K710M683J36o337
$$ 1704 453 3912 3355 3840 406 -750 2755 -2651 -3960 4311 1373 -5283 -2573 2110 2246 -4091
325d091Q61R923k551n745N544M78l154J461n70J322J55l756J746K76m055O61q4
$$ -4091 -3230 6693 4142 -1603 3941 4419 1265 2726 2156 3478 3633 -123 1623 1899 -2156 -1495 -1579
342a579Q26J052l310K837L427o221J156O727j692k103L01K797K122n476j544M556
$$ -1579 -753 299 -3011 -174 3253 -2968 -1812 4915 3223 1120 1421 4218 6340 864 -680 3876
358C876l492m66L400l686k994J660J866J148n575q96P961m81k878J608k489K384
$$ 3876 384 -82 3318 -368 -3362 -1702 164 1312 -4263 -5159 2802 2321 -557 1051 -1438 946
374I46M531l486q09J846p14m71o69J018k220n833N503N975r407k295O434j391
$$ 946 5477 1991 1182 3028 2314 1843 1174 2192 -28 -5861 -358 5617 -3790 -6085 349 -1042
390a042k55J888k536j199L718O707j538r818K004O096j677K051j469q511L880
$$ -1042 -1297 591 -1945 -3144 574 7281 5743 -4075 -2071 4025 2348 4399 2930 -5581 -1701
405a701P775n036p970l63P314M063m193k545k640j15J1001J692j2985K68J0344
$$ -1701 6074 1038 -6932 -7295 19 4082 -111 -2656 -5296 -5411 5590 7282 -5703 -5435 4909
420D909L007l660n646j543J981J029N728k288j0505K545P899l807o573j890P710
$$ 4909 7916 4256 -1390 -2933 -952 77 5805 3517 -6988 -4443 3456 -351 -6924 -8814 -1104
435a104Q920m032p032l478N12J0516M523q181j363L002k224M46J232k080l756
$$ -1104 7816 3784 -3248 -6726 -6214 4302 8825 644 -719 2283 59 505 1737 -343 -4099
450d099m0R144r28j2453J936P937l649l004J733K987N122L91m435n650k194Q385
$$ -4099 -4139 5005 4077 -8376 -6440 1497 -2152 -5156 -3423 -436 4686 5077 642 -5008 -7202 1183
466A183O056k072K144n506j2825L481J1927o32p357K67P643l803j2386N564R929
$$ 1183 7239 5167 7311 1805 -11020 -7539 4388 3756 -3601 -3334 4309 506 -11880 -6316 3613
481C613m448J22M756k473k292R21N19m50L86K300l826r43J2698m432k2370M271
$$ 3613 -835 -713 4043 1570 -722 199 718 268 654 2954 -872 -1815 10883 6451 -15919 -11648
497a1648J7151m547n439J0685J997j8545n519J9241K975j1421J1134Q186j5146
$$ -11648 5503 956 -4483 6202 8199 -10346 -15865 3376 6351 -5070 6064 14250 -896
510h96m860L138m681Q962J7800r357k5670M274K1154r018j2614J7072r30k0703
$$ -896 -5756 -2618 -7299 1663 19463 10106 -15564 -11290 9864 846 -11768 5304 4374 -16329
524a6329J6146K0666k2374j7813J9098J1364j2886J581J2744r085n063J1405j6914
$$ -16329 -183 20483 -1891 -19704 -606 10758 -2128 -547 12197 3112 -1951 9454 -7460
537g460j7760L3234K4055k8946j9564J1716k384p024K3752J3632l2344j1853L3688
$$ -7460 -25220 8014 32069 3123 -16441 -4725 -7109 -14133 9619 23251 -9093 -20946 12742
550A2742N55l0061Q368J9447o340J472N727j9510j0605K9846J1421l7889q361
$$ 12742 13297 -16764 -8396 11051 4711 6183 11910 -7600 -18205 11641 23062 -14827 -23188
563b3188L6562M99k1513J1525k695k8065J6432L8137j4601l1443J6800J7852k3417
$$ -23188 13374 13873 -7640 3885 1190 -26875 -10443 27694 13093 -18350 -1550 16302 -7115
576g115o824K1250n065j874K5311j5951m1259J5122L5582j1884j5843J7264l414
$$ -7115 -13939 7311 2246 372 25683 9732 -31527 -16405 19177 7293 -8550 8714 5300
589E300k8392J6279K9138k6402j8528L2864P258k6355N285J4092j4041m371J7840
$$ 5300 -23092 -6813 22325 -4077 -22605 10259 17517 -8838 -3553 10539 -3502 -7873 9967
602I967n945j8309K1542J8551l1362j6546K1334j307o710K4933L847l6260q308
$$ 9967 4022 -14287 7255 25806 -5556 -22102 -768 -2075 -8785 16148 19995 -16265 -24573
615b4573K9627M769j8366J1299J4219j8914n657J4003j0496p135K3077M697k4356
$$ -24573 5054 9823 -8543 2756 16975 -1939 -7596 6407 -4089 -11224 11853 16550 -7806
628g806l850J8619j940j3394P286L496j4481R136J9289j4791j5956J3525O421
$$ -7806 -11656 6963 5023 -8371 -1085 2411 -12070 -2934 16355 1564 -14392 -867 5554
641E554j0173K167J2831k049j0096L127l248j1292J2644J6612j2527j0657Q371
$$ 5554 -4619 -2452 10379 8330 -1766 1361 -1887 -13179 -535 16077 3550 -7107 1264
654A264j955j0913N756J2883k793q671N207R62j0655O073J1696n729m653M353
$$ 1264 -691 -11604 -5848 7035 4242 -4429 778 1740 -8915 -2842 8854 3125 -1528 2825
668B825q69k149K328j03n181k735O541K742m167J962q12p811J374O072R04J489
$$ 2825 1956 -193 2135 2032 -3149 -5884 657 3399 -768 1194 382 -7429 -6055 17 921 2410
684B410J393j743m471m258N390Q226o20k659l139m153R67K481J803o62m843J821
$$ 2410 3803 2060 -2411 -6669 -1279 6947 6327 3668 529 -3624 -2657 -176 1627 965 -3878 -2057
700b057N339n219l687N229J211j689J56J236J79K30K652q68p434K568Q680k555
$$ -2057 3282 -1937 -5624 -395 816 -873 -717 519 698 928 3580 2712 -4722 -2154 6526 3971
716C971l509N02m127j115M568L22l413N66N095j509p981L951O264m493R75N693
$$ 3971 462 964 -3163 -4278 290 612 -2801 -2235 2860 1351 -6630 -2679 3585 -908 67 5760
732E760n399m295N499L028l775k467M492m27o168L370L849p041p38N122j580j559
$$ 5760 361 -3934 1565 4593 818 -1649 2843 2416 -3752 -382 3467 -3574 -4312 810 -770 -2329
748b329K100P37j340K64K462j734k611O536K519q689K38N201l283j092L476j080
$$ -2329 -229 508 -832 -568 1894 160 -2451 4085 6604 -2085 -1847 3354 71 -1021 2455 1375
764A375m213K1M742k054n619N918K957o274J457M196l378J59M249j774l028J385
$$ 1375 -2838 -2817 1925 -129 -5748 170 3127 -3147 -1690 2506 -872 -713 3536 1762 -1266 119
780A19M305k662m191L887L12m941L714J138n047J388L054k304j485J861K115k104
$$ 119 4424 1762 -2429 1458 1770 -3171 543 1681 -3366 -1978 1076 -1228 -2713 -852 1263 -841
796h41n46M495j704l790M771J544m490O13J678j226n55j23K56j268j083K465p91
$$ -841 -1387 3108 1404 -2386 2385 3929 -561 52 1730 504 -51 -174 82 -1186 -2269 196 -595
813e95k331K484l6j365K785j65j738J547Q35M32r25j353K609k49k640J821p39
$$ -595 -2926 -442 -478 -1843 942 777 -961 586 1421 1853 928 -425 2184 1935 -705 1116 377
830C77j737J562o33j137J11n0J360q93j341L423p4k269K300N17j331J027J46l69
$$ 377 -1360 202 -431 -1568 -1457 -1507 -147 -1040 -2381 1042 968 -1301 999 1516 185 1212 1358 989
848I89Qm00M83j314j176K557j549k386K728q29j488K313j19j121M50J273J481
$$ 989 997 597 1080 -234 -1410 1147 -402 -2788 -60 -889 -2377 -64 -183 -1304 -854 419 1900
865A900j696p84K707q16r62K319k377j414K682j058j582N7n09R84m37n54J305
$$ 1900 204 -580 2127 1311 349 2668 291 -1123 1559 501 -1081 -1024 -1533 -549 -986 -1540 -235
882b35j795L00L328j554n71J665q37Q25J169j521p09k36J417J961m121k286L407
$$ -235 -2030 -1730 1598 44 -527 1138 301 1126 2295 774 65 -171 1246 3207 -914 -3200 207
899B07K99j622m87m79J746K58n98O72j750J90L908Mj390m66j740J880K888k515
$$ 207 506 -1116 -1603 -2082 -336 -78 -676 -4 -1754 -1564 2344 2348 958 492 -1248 632 3520 1005
917A005k793N10K813Q16m451j037L038q82o81J684j198l0J513rL85j351o36L492
$$ 1005 -1788 -1278 1535 2351 -2100 -3137 -99 -981 -1662 22 -1176 -1206 307 298 683 -668 -1304 2188
935B188J046p17j937k958J450L360j332j378p06L86J254k441j734L192L95n05
$$ 2188 3234 2517 580 -2378 -928 2432 1100 -278 -984 -598 656 -1785 -3519 -327 68 -437
951d37J881p27k150N22J601K151j781j462J748k05L28P42m863j355N771l3l635
$$ -437 1444 717 -1433 -911 690 2841 1060 -402 1346 1141 1469 2211 -2652 -4007 1764 1731 -1904
968a904J288K111k508m359L335M773l071J45N454m128n902L362L377J99R01l02
$$ -1904 -616 1495 -1013 -5372 -2037 2736 -335 -190 5264 1136 -4766 -1404 1973 2172 3073 2771
984B771l156k814K636J589l799K577L814o599j769P715j308o267K511M815k230
$$ 2771 -385 -3199 -563 1026 -2773 -196 3618 -2981 -4750 2965 1657 -4610 -2099 2716 486
999D86k413N983J654q922j57O050l386o93P418j448p683j387K747j123P34P563
$$ 486 -1927 4056 5710 -3212 -3369 2681 -705 -1398 6020 4572 -3111 -4498 -1751 -2874 -2140 5423
1015E423l81j0945J417P498n310j751Q581K66o574K408L250n896k703Q873J144
$$ 5423 5042 -5903 -4486 3012 -2298 -4049 4532 4798 -1776 632 3882 -2014 -4717 4156 5300
1030E300r987L723O306p749j446P662o230p283J1103Q449r901o075Q501j120r628
$$ 5300 -4687 -964 5342 -2407 -3853 3809 -2421 -9704 1399 9848 -53 -6128 2373 1253 -8375
1045h375Q595J0225r015k713O474o739q167Q275Q857m114l793K661o826n152J2095
$$ -8375 220 10445 1430 -1283 5191 -1548 -9715 -1440 7417 3303 -490 2171 -4655 -9807 2288
1060B288M878j2332J556J0002o662n876R260K742j0789O54J1875l677r208R094
$$ 2288 7166 -5166 -3610 6392 -270 -6146 3114 5856 -4933 -4279 7596 3919 -5289 3805
1074C805L461j4410q29J1091j376k112O288l538j2784J741J2983j029n212P779
$$ 3805 7266 -7144 -7973 3118 1742 -370 5918 2380 -10404 -8663 4320 3291 -1921 5858
1088E858j454j2272M079R412o093k144R265p98j1272J098Q192m938l895R443k257
$$ 5858 4404 -7868 -3789 5623 -470 -2614 6651 5853 -5419 -4321 3871 -1067 -4962 4481 2224
1103B224j0129P939P845j1118m464R382J220o911N593P247q776o482Q616r10o874
$$ 2224 -7905 34 7879 -3239 -7703 1679 2899 -4012 1581 8828 52 -6430 2186 1276 -5598
1118e598P956O611q137m864K475k462j142Q806L764r254k892O391l761l786R575
$$ -5598 2358 8969 832 -4032 -1557 -4019 -5161 3645 7409 -1845 -4737 1654 -2107 -5893 3682
1133C682K623q603N72N653l420l620N066K660p783j109Q265j207m935K431j103
$$ 3682 6305 -2298 -1726 3927 507 -3113 1953 4613 -3170 -4279 3986 2779 -2156 275 -828
1148h28n131L211O272m22k817n77p36l350K493O299j251j922J588l694l908M528
$$ -828 -5959 -2748 3524 3102 285 -292 -1028 -4378 -1885 4414 3163 1241 2829 -865 -4773 -245
1164b45L403j744j770O44o82k986J547L465k460j821L896j23j816J140L72n87
$$ -245 3158 1414 -356 288 -394 -3380 -1833 1632 -828 -2649 1247 1124 -692 448 820 233
1180B33p30J30J799K38q5K51k321j725P50P70K080O48l023p22K56j292J777K474
$$ 233 -497 -367 1432 1670 1585 1836 -485 -2210 -1460 -690 1390 2038 -985 -1707 -1451 -2743 -966 1508
1198A508L44n40j603k52L3n2K120J111k565m9l06j073K396R8k912K9J738l73j081
$$ 1508 1852 1312 -291 -543 -510 -562 1558 2669 104 55 -251 -1324 1072 1170 -1742 -1713 25 -348 -1429
1217a429J429J486l201j449M823Q20l540K753J210l904j264L276P56j679O65Q12
$$ -1429 0 1486 -1715 -3164 1659 2479 -1061 1692 2902 -1002 -2266 1010 1766 87 752 1564
1233A564l163j106L660p14k500K754j03k932J910J902j784o56K455Q97l259N69
$$ 1564 -1599 -2705 955 241 -2259 495 392 -2540 -630 1272 -512 -1168 1287 2184 -1075 -506
1249e06L735k676k364L273k55l380K060K067k405k146K339J176k766L27L434j785
$$ -506 3229 553 -1811 1462 1207 -2173 -113 1954 -451 -2597 -258 918 -1848 -1521 1913 128
1265A28k277K850L19k130J955J310j721o90J048J5j978J023K014l135p52L223
$$ 128 -2149 701 1020 -1110 845 2155 434 -256 792 807 -1171 -148 1866 -1269 -2021 1202
1281A202j415k331K583J069k178m12K360L99k738J316K693k732j193L680r79k396
$$ 1202 -213 -2544 39 1108 -1070 -1482 878 1277 -1461 -145 2548 -184 -1377 2303 1324 -1072
1297a072J664K09j354m03J208m4j788Q76J348k164M19K193j586o06K358p02j146
$$ -1072 592 801 -553 -956 252 208 -1580 -704 644 -1520 -1101 1092 -494 -1100 1258 556 -590
1314e90R87J199o81j557J029J109k102Q2J898j916r82J517k73m56j98P75M16j003
$$ -590 397 1596 915 -642 387 1496 -606 -524 1374 -542 -1524 -7 -280 -736 -934 -159 257 -746
1332g46M74J120r62K11J159j287K09P15l83l28M4rq6q90N44M70j666P05J181j506
$$ -746 -272 848 -114 97 1256 -31 178 893 510 182 226 217 131 -759 -215 255 -1411 -706 475 -1031
1352a031J64J182j49n04K49J071j65j217R23R98j973M09J268j239o04O62nn35
$$ -1031 -867 315 166 -338 -89 982 817 -400 523 1521 -452 -43 1225 -14 -618 44 39 -496
1370d96L9J1n1n42J031M30j580J130J101j243M51Q33p22l61M73M36p31j035J562
$$ -496 -457 -446 -497 -1039 -8 422 -1158 -28 1073 -170 281 1114 392 31 504 940 209 -826 736
1389G36k43j632O69P81j483M73Q39q77J00P23L99l83n90R96M42q77O05J59j385
$$ 736 493 -1139 -470 311 -1172 -699 140 -737 -637 86 485 102 -488 508 950 73 678 837 -548
1408e48J085K70q45k9L4l71j94j51O59n3r89J172N47j439M04Q22j06J75q8L98
$$ -548 537 807 -38 -67 -33 -404 -598 -749 -90 -143 -1132 40 587 -852 -448 374 268 443 355 753
1428G53m3p91M84J09j110N80L94p20J58M0n56l88M35P40l01l17J250N6j582L04
$$ 753 710 -81 403 512 -598 -18 376 -344 -186 -146 -702 -1090 -655 85 -216 -533 717 773 -809 -505
1448e05J084j0K43J51n96m52p02P84L81j074O81N2j241P31J17m73M29O37J87k40
$$ -505 579 569 812 963 367 -85 -787 -3 378 -696 -15 37 -1204 -473 -356 -829 -400 237 424 184
1468A84l43J253l90j905J103J410j266M51R00j027k018L73J423n01k75K210j269
$$ 184 -159 1094 704 -1201 -98 1312 46 497 1397 370 -1648 -1275 148 -353 -628 1582 313
1485C13k662J811Q78j560J105K483j669k038J414J329k030j83K953r48k971K167
$$ 313 -2349 -538 340 -1220 -115 2368 699 -1339 75 1404 -626 -809 2144 1196 -1775 392
1501C92N32k655R50J717k046m97K562N42k746j4K326k222j307N218P19m602N44
$$ 392 924 -1731 -781 936 -1110 -1607 955 1497 -1249 -1263 1063 -1159 -2466 2752 3471 -1131 -587
1518e87K099k763j180M046J604l635p88J736k094j456M586O54l748J334J413k581
$$ -587 1512 -1251 -2431 1615 3219 -416 -1204 532 -1562 -3018 1568 2222 -1526 -192 1221 -1360
1534a360O8L300p44l189J752L333l066j578L838j643m290L192L236l039q58K436
$$ -1360 -1292 2008 1264 -1925 -173 3160 94 -1484 2354 711 -3579 -387 2849 -190 -1048 1388
1550A388j929l737K811M146k438j048L660k999l917L917L089l103K6L222k219
$$ 1388 -541 -4278 -1467 2679 241 -807 2853 -146 -4063 -146 2943 -160 -134 3088 869
1565H69l823K344K545l338K70L696k556l174L808P12l419O63L140k106j411M161
$$ 869 -2954 -610 1935 -1403 -1133 2563 7 -3167 641 1353 -2066 -1403 1737 -369 -1780 2381
1581B381R14n510P2M317k391j541M587O43n239o97K293p91l38L635N39m698o45
$$ 2381 3295 -2215 -2143 2174 -217 -1758 2829 3472 -1767 -2464 -171 -962 -1300 2335 2874 -1824 -2469
1598b469K620j382K73M059j414l350J342J776j901o02K923m76l755J740L156k731
$$ -2469 151 -1231 -958 3101 1687 -1663 -321 1455 -446 -1048 1875 1399 -2356 -616 2540 -191
1614a91j582K304j098k116K673K419j490k018R22m74j688K574K985k228j406R97
$$ -191 -1773 531 -567 -2683 -10 2409 919 -1099 -177 -651 -2339 235 3220 992 -414 583
1630E83j266j418K270J770j106j148L98q39j651K313J190j795K69J446j554p16
$$ 583 -683 -2101 169 1939 833 -315 83 -756 -2407 -94 1096 -699 -430 1016 -538 -1254
1646a254J913M46j728mJ988m55j397J283K85k310l69J712J30K86L63q48j323m98
$$ -1254 659 1105 -623 -627 1361 906 -491 792 1077 -1233 -1602 110 240 526 889 41 -1282 -1780
1664a780J141R80N41L19q62j548N04J180p9O31K91j258o92J99O90j06k54R3m39
$$ -1780 -639 341 882 1201 339 -1209 -705 475 396 1027 1318 60 -632 -433 257 151 -103 -10 -449
1683d49o39J196M69q39J6n90L44J038J15j17J54r18n12K05R15O70l03o27Jj137
$$ -449 -1088 108 577 -262 -246 -836 -492 546 661 544 698 -220 -732 -527 388 1058 755 128 129 -1008
1703a008l50J706J89n89j1m83j36M00J48M50k47l3L05l44j8O86m95k57M31l00
$$ -1008 -1358 348 537 -52 -63 -546 -682 -282 -134 316 69 36 341 -3 -21 665 170 -87 344 44
1723D4l20J46N79n72q87M54P58p34K98J201j194p40J158K06n72M97P89m93j311
$$ 44 -276 -130 449 -123 -1010 -556 202 -532 -234 967 -227 -967 191 397 -175 322 1111 618 -693
1742f93N31O97p68KJ271j133q84Q93j31k21L41K73m27k05P84K58j229O60Q38j269
$$ -693 -162 535 -233 -231 1040 -93 -977 -84 -215 -436 -95 178 -249 -454 330 588 -641 19 857 -412
1762d12j07J641m36j121N09L84o22o14J068K50j319M21Q51j145J82J141l48n64
$$ -412 -519 1122 686 -435 74 458 -164 -778 290 540 -779 -358 493 -652 -470 671 323 -241
1780b41K72L23l52k86P52n1p79N39M76r88O0P14o18l67N42Q1k99j81N02J5p31
$$ -241 31 354 2 -284 468 417 -362 177 653 -335 -275 439 -179 -546 -4 77 -222 -403 99 114 -617
1801f17Q30L62q44K56P23n73k18J98K53k10n01N67j54n97M50K78n58m5M96k29
$$ -617 213 575 -269 -13 710 137 -81 117 370 160 -341 226 72 -525 -75 203 -355 -400 96 -133
1821a33j96L46p7L0k41O02R3o98N97M85j096K63L98k14m09K96J27k53m42M55J31
$$ -133 -329 17 -60 -30 -271 331 424 -274 323 808 -288 -25 373 159 -250 46 173 -80 -522 -67 64
1842F4n25M17M27n44P1L06j63P8P4J58m1k01K70L7p88N90k59n76L11M64m07j28
$$ 64 -461 -44 383 -161 -90 216 53 131 205 363 322 121 391 428 -360 230 -29 -605 -294 170 -237 -365
1864c65P8L05q9n29O91L46p57L59L23n44M95J31m30q2O6K61l71m12N57j50l13
$$ -365 -287 18 -71 -600 91 437 -320 39 362 -182 313 444 14 -68 -2 259 -112 -524 33 -117 -430
1885d30L40J93n07J85M82m81L23jJ37j72nK48l89r0M93n6m29K18N7l95q7K38j73
$$ -430 -90 103 -404 -219 263 -218 105 104 241 69 64 312 -77 -167 326 270 -159 59 116 -279 -366 -128 -301
1908c01k6O5N10j68j68K11p1j72L68J83l98K11n2k32k3N5J51k22l80N83k24l32
$$ -301 -327 -262 248 80 -88 123 52 -120 248 431 33 244 192 -40 -63 -8 143 -79 -459 124 -100 -432
1930d32L29n5%J48Q2K06k53N0K32l88m9M66P1o30O15l37j26k50J20L47l55J52
$$ -432 -103 -158 -158 -10 72 278 25 75 307 -81 -130 336 407 -223 392 55 -71 -321 -201 146 -209 -57
1952e7K33l72k91N82O2l51M28R8k93j70J00K87k38J32M24o39n09P85k52n05M38
$$ -57 176 -196 -487 95 157 -194 234 332 39 -131 -31 256 18 150 574 -65 -574 211 -41 -546 -108
1973a08M24o24L3K38L89n90m58Q30j25r5P17Kp41P5K2q5j13P18L15j057k94P93
$$ -108 316 -308 -275 -37 352 -238 -696 134 9 -86 631 633 -108 -33 -11 -96 -209 509 824 -233 -527 266
1995B66q17k17J049L83r56K1M12l35m57J058K74j043L13R36p82n31R16k44j101
$$ 266 -551 -768 281 664 -292 -271 141 -194 -651 407 681 -362 -49 887 105 -426 490 246 -855
2014h55Q21P38p03o10O98r8j236R99J323q50n69R83p98j111J391Q82p09l32Q94
$$ -855 -34 704 1 -609 89 -9 -1245 -246 1077 227 -342 641 -157 -1268 123 1005 296 -36 858
2033H58n81j657J013J186j215n1J488r72j406J222O35j099r7J399m21j109J398
$$ 858 277 -1380 -367 819 -396 -447 1041 69 -1337 -115 520 -579 -676 723 302 -807 591
2050E91O33j879O5J297m38p02J579j51j988qJ536o47n43J861m8k313P9J873r46
$$ 591 1224 -655 -590 707 269 -433 1146 995 -993 -1001 535 -112 -655 1206 1158 -1155 -1076 797 -149
2069a49l66J853l49k053O48J052p03l96J286r9j849R85J375j575p38J427k08j096
$$ -149 -515 1338 989 -1064 -416 636 -67 -463 823 724 -1125 -140 1235 -340 -1078 349 141 -955
2087i55J087J212j386r92J266j36j094J368J307j535o99R66p30o20J252R24j309
$$ -955 132 1344 -42 -1034 232 96 -998 370 1677 142 -557 409 -321 -941 311 1235 -74
2104g4m55Q55m84j161J501O15j202q6J127r18m15J190L46j090M1P72k20r43J247
$$ -74 -529 326 -158 -1319 182 797 -405 -491 636 -282 -697 493 839 -251 -210 562 342 -601 646
2123F46j57j377K70R68k88k48Q06n85r25J5J181N0o7L35l82j415P99P58j42J27
$$ 646 489 -888 -618 350 62 -186 620 35 -890 -875 306 356 289 624 242 -1173 -374 384 242 369
2143C69M32p97q25N58N49N2o55M97k97o51R03J05l70%R9L7mK81M00p88k82K27
$$ 369 801 4 -821 -263 286 338 -317 180 -117 -768 135 240 -130 -130 -31 6 2 283 683 -105 -387 -160
2165a60R6j56P82p4o40n1j12n7J59M71J89o21j07J76p8K13O24l76q0j64j52oM78
$$ -160 -64 -220 562 488 -152 -203 -315 -372 -213 258 447 -174 -281 -105 -183 30 654 278 198 34 -118 -124 354
2188C54k37k21J38O3j24j78L02K5p10M1O75j84o8L54j77m80M16n3L65K5J77l50
$$ 354 117 -104 34 97 -27 -205 97 122 -588 -547 128 -56 -124 230 53 -427 -11 -64 301 326 503 153
2210A53o17L28K68k5K07p1k88n11M26m8J82j04L41k27l98O97j69l50L88k5l93
$$ 153 -464 -136 132 107 314 243 -45 -556 -130 -178 4 -100 241 14 -384 313 144 -206 182 157 -236
2231b36J63M11n1m49r7K34j31q0N14q4o55L25J18k88K43L14k35K9j60K45j39k91
$$ -236 -73 338 287 -162 -259 -25 -156 -236 278 194 -461 -136 -18 -306 -63 251 16 45 -115 130 -9 -300
2253c00O20L4n04R0K30l38N3J55n2k97J3J13Q7j32J61K41p64N47L47m99K20K34
$$ -300 320 354 -150 -60 170 -168 -115 40 -12 -309 -296 -183 -96 -228 -67 174 -590 -43 304 -195 25 259
2275B59k80j81K96K57k67j29L5j80pJ96J12l95K39J42j71r3M61kn01K41M1j8j27
$$ 259 -21 -202 94 351 84 -45 -10 -190 -197 -1 111 -284 -45 97 -74 -167 294 292 -209 32 73 55 -72
2298g2K21L5k80J89j64k4Mp8K87j42p7m1J73j27R4l4J65Rj38p7J38p9K69j76j7
$$ -72 149 184 -96 93 -71 -95 -91 -169 118 -24 -101 -142 31 -96 -2 -36 129 138 0 -77 61 -18 251 75 58
2323E8pj32k20L06k63J74Kl3O4O4k97K20M74l58J9M7k6q6qN5r9j29K01K6j66K37
$$ 58 51 -81 -301 5 -258 -84 -82 -115 -51 13 -284 -64 410 52 71 118 92 6 -2 53 -46 -175 26 52 -114 123
2349A23j82k95J37J23j26J38N4l9K35p3Q%j31K96j70j85K23oj93J01r1P2k0k07
$$ 123 -59 -354 -217 -94 -220 -82 -28 -67 168 95 103 103 -28 268 98 -87 136 130 -63 38 -53 19 -1 -208
2373b08K05J09j31Pj98o9L69k91K62J14j51Jm1J5P9j5m9q9J03k81L01o3m03N43
$$ -208 -3 106 -25 -18 -216 -285 84 -207 55 169 18 19 -22 -7 72 57 8 -81 22 -259 42 -21 -424 119
2397A19k11k31L21pr1M6J11O5k49n9K58j86L2J16j20J00r9R1r3jN1M6L9k5K13
$$ 119 -92 -323 -2 -9 -100 -54 57 122 -127 -186 72 -114 -82 34 -86 14 -85 6 -87 -88 -37 9 48 23 236
2422B36l53n5K51K40l36K5M8j7J75k50J37J0r3J46k8k04J07j83N0L9j19J1L77
$$ 236 -117 -172 79 319 -17 8 56 39 214 -36 101 111 18 164 136 -68 39 -144 -94 -55 -174 -163 214
2445B14r8q7K3r2L69j38j46N2Q4l3l92K22K1J32J6N4k78J37j47j28j36K68L40
$$ 214 116 29 52 -40 329 191 45 97 181 148 -244 -22 -1 131 147 201 -77 60 -87 -215 -351 -83 257
2468B57j22k41K02J90k90j32M83k27k67L53r9l55M64j96j23j53J10K69k99n6L96
$$ 257 135 -106 96 286 -4 -136 347 120 -147 206 107 -248 216 20 -103 -256 -146 123 -176 -232 164
2489A64l14J88L8r9j53K62N1l25K51J97j22k93J80N0k02q8M30l58L8K62k00l29
$$ 164 -150 38 76 -23 -176 86 137 -188 63 260 138 -155 25 75 -127 -215 215 -143 -105 157 -43 -372
2511c72K36L01q5k57J83L83n17L10J23m30m6M68j5n70K60L35m14r1K72R1j76N4
$$ -372 -136 165 80 -177 6 389 -128 182 305 -125 -171 297 282 -288 -28 307 -107 -198 74 165 -11 43
2533D3K17o45R8M29j06o4J91K49m91j02N70l12l51L78J93o94J04N06j83m84N58
$$ 43 260 -385 -287 142 36 -28 163 412 -79 -181 389 77 -274 104 297 -397 -293 213 30 -454 104
2554A04K14m28Q9M10l27l41N97J4o66J53Q06o51j30J63P7l52J67M27k39m29M15
$$ 104 318 -110 -21 389 62 -279 318 332 -334 -181 625 -26 -156 7 84 -268 -101 326 87 -342 73
2575G3r1n56L26O56m66p0K2K84n09K77M14l42k06L56O2n14K48K03k69j59N62k27
$$ 73 -18 -574 -248 408 -58 -128 -106 178 -331 -54 360 18 -188 168 230 -284 -36 167 -102 -261 301 74
2597G4j57K55k41l83j48Q56j17k86M43j6n61Q7M98k3j58j34J24m11K63K35q1k85
$$ 74 -83 172 -69 -452 -600 256 139 -147 296 280 -281 -194 304 281 123 -11 113 -298 -35 200 119 -166
2619a66M97j22n09K29K89k37j44M11k72%N6K78j24n40L10K44k13K18j66j39k23
$$ -166 331 209 -300 -71 218 -19 -163 248 -24 -24 32 310 186 -354 -44 200 -13 205 39 -100 -323
2640c23L25k2k72M99N9n01r9K90RNJ31O0k77K0N1J16j63k6K30k31k8L66l75J02
$$ -323 2 -20 -292 207 266 -235 -334 -44 -35 -30 101 161 -116 -96 -45 71 -92 -118 112 -119 -147 219 -156 -54
2664e4Q0Jk42K41R1l2k63K89r9j51R3L81k11j00L6j46k58L05J54J8J69l33j56
$$ -54 26 27 -215 26 117 85 -178 111 12 -139 -46 335 124 24 60 -86 -344 -39 115 133 302 -31 -187
2687a87J35R1J84k53O6j40J00J06j17m7J00k20L70j59o0J90k89O3k7o0J23J32
$$ -187 -52 39 223 -30 36 -104 -4 102 -15 -62 38 -182 188 29 -31 159 -130 -67 -94 -154 -31 101
2709A01N0j19j43J47j32K14j31J19m3k33J10p0m4J16Q4j19M1P0j03k66K68K35
$$ 101 151 32 -111 36 -96 118 -13 106 63 -170 -60 -130 -174 -58 26 -93 -52 18 -85 -351 -83 152
2731A52k06J84j54j88L8J63J32N4l88M02p9k18N0j6m7J34L9q9m1R1k49%L45k04
$$ 152 -54 130 -24 -212 -174 -11 121 175 -213 189 110 -108 -58 -74 -121 13 52 -37 -78 13 -236 -236 109 -95
2755i5j48M53k50j15K7J64mn3Q9J49K1m03K44k45J92l7J50j46J03m0J26l00lQ1
$$ -95 -243 210 -40 -155 -128 36 32 -21 68 217 238 -165 79 -166 26 -11 139 -7 96 56 182 -118 -121 -40
2779d0l8L6j39J46j25K01m6j4N5j5j80Q2j9K12P4j93J14j99p3kJ27j70R8M2J71
$$ -40 -78 -42 -181 -35 -160 41 -5 -19 36 21 -159 -77 -96 116 190 -3 111 -88 -161 -163 -36 -206 -108 -66 105
2804A05k15j6J09j18Q9O6J05q7k17J07J79p9p1r8J49J77j11l29J53J77n3J22K3
$$ 105 -110 -126 -17 -135 -46 20 125 38 -179 -72 107 28 -43 -141 8 185 74 -255 -102 75 22 144 167
2827A67l84K95R2k14oK19k05o8M2K7K4m3p1km3L4R3j20K7J26l0k5j23K11r6K20
$$ 167 -217 78 170 -44 -50 169 -36 -104 -62 -35 -11 -54 -125 -127 -170 -136 -43 -163 -136 -10 -40 -65 -188 23 -73 147
2853A47r5j7N5k22M6J14q3M8P6p7r0l9K1j2P7J84rj20J39O6k86k7K30Q8j38j14
$$ 147 52 35 90 -132 -86 28 -55 -7 69 -8 -98 -137 -116 -128 -51 133 124 4 143 209 -77 -104 126 214 76 -38
2879c8k1J08N7m0j19P2j7R5j33j43L82Pk30o1J37M6o9J37k40rK5j64K92p6J00
$$ -38 -59 49 106 66 -53 19 2 97 -36 -179 203 210 -20 -81 56 102 33 170 -70 -79 -54 -218 74 -2 98
2904I8j71j54L96l5j91j81K68q7J51k8j45P8q8J1J85j1n2k33J97n4j03j49J65
$$ 98 -73 -227 169 134 -57 -238 30 -57 94 66 -79 -1 -89 -78 107 96 44 -189 8 -46 -149 -298 -133
2927a33J87k97O5K08l45J23N3K03j34Q2K8q7J82j36n3L3O0k8j5J14j94J41PjJ13
$$ -133 54 -243 -178 30 -315 -192 -139 64 -70 12 40 -47 135 -1 -54 -21 39 11 -4 110 -84 57 64 63 176
2952A76k30P6j81M7J37j72M5J80p7mN6j50J25Qo6J58o0q4n4K10j02j70M71k13
$$ 176 -54 22 -159 -112 25 -147 -102 78 1 -3 53 -97 28 36 -30 128 68 -16 -70 140 38 -132 339 126
2976A26o6J08j16k9r5K68k35P2J97j90j09J58J14l46J55k2O8j70J82k00J1j12
$$ 126 60 168 52 23 -72 196 -39 33 230 40 -69 89 203 -143 12 -10 58 -112 70 -130 -119 -231
2998b31K52R7j6j51K11q9k9j00K02oj94K26Q0l14J15K19l28p5J96j0N8Or1j11
$$ -231 21 118 102 -49 162 73 44 -56 146 140 -54 172 252 -62 53 272 -56 -131 65 55 113 119 28 -83
3022h3P4N1k0O8j04J35j82M2K3O2%K04j45r6k62K67p3p1K46P4k41j85J43J26J8
$$ -83 -9 42 22 90 -14 121 -61 -19 4 66 66 270 125 29 -233 34 -39 -110 136 210 -31 -216 -73 53 71
3047G1K88k61j05j2L33k53l08L64k6M3j64L57m22j05K55J57n31K78O0J54k78K92
$$ 71 359 98 -7 -19 314 61 -247 117 91 134 -30 327 -95 -200 55 212 -319 -41 19 173 -105 187
3069A87j08l38K77L92k86p9J12k31J7j29M11p7k13J13q6k23J46J48k21J54Q8K12
$$ 187 79 -259 18 410 124 45 157 -74 -57 -186 225 148 -65 48 -38 -261 -115 33 -188 -34 54 266
3091B66k34L8Q5k52J02J9k7j23K92K49n02N4K54l50J38Q9r6j54l6J50Q6jJ44j28
$$ 266 32 70 155 -97 5 24 -3 -126 166 415 -87 -33 221 -129 9 98 2 -152 -188 -38 48 47 191 63
3115F3j87NJ62q6K41j70mj38k2N5j21J72K26n0k90L48k83o5K01j68J42j37L75
$$ 63 -124 -119 43 -43 198 28 24 -114 -136 -81 -202 -30 196 146 -144 204 -79 -144 57 -111 31 -106 269
3138B69K9m83O9J18p3k21L00K11j34r8K7j12j30L08J25j63k24r4Q7J10N8K43k14
$$ 269 298 -185 -116 2 -71 -292 8 219 85 -13 14 -98 -228 80 205 42 -182 -276 -189 -79 -21 222 8
3161Hq5MK1j05N0J37j09J18J49j45j21J42m3n9K9R7q8L08k23j49N6k20K36j40
$$ 8 -77 -73 -52 -157 -107 30 -79 39 188 43 -78 64 21 -38 -9 88 0 308 85 -64 -8 -228 8 -132
3185a32M13l25k03L7P5L36l63J42j42J15k0r7J17M3P1o5k46J22K24J34j91j3j10
$$ -132 281 -44 -247 -210 -135 201 -162 -20 -162 -47 -67 -164 -47 -4 67 2 -244 -122 102 236 45 32 -78
3208g8jJ07L19l65P4j30j20Q8L12q7l17K00n4k45J90K66j30QJ23p2k42J16K12
$$ -78 -79 28 347 -18 56 -74 -194 -106 206 119 -198 2 -52 -297 -107 159 29 37 160 88 -154 -38 174
3231A74p3j06N7J1j95N9P3K36l49J17P4K0j08J88l50L8K84m5o2m0J44k23j0J20
$$ 174 101 -5 52 63 -132 -73 0 236 -113 4 78 98 -10 178 -172 -134 150 105 43 3 147 -76 -86 34
3255C4Nj07J73K70m61j72J52K0J41k9j31J53q7K34j79Q3m51N44k89LM30m10N7
$$ 34 39 -68 105 375 -86 -258 -106 -86 55 26 -105 48 -39 195 16 99 -352 192 -97 -94 336 -74 -17
3278a7J39L0m28K35J60j91Q9Q7j52N5J80p5j05J5N4J7k57R9J47l6k64L43j62K3
$$ -17 122 152 -276 -41 119 -72 17 104 -48 7 187 112 7 22 76 93 -164 -65 82 46 -218 125 -37 -14
3302a4n4K07k76R3N7j7%j44K45rk12K16k08K27q4l4J16k53J52l2J21j24J67p0
$$ -14 -68 139 -137 -44 13 -4 -4 -148 97 88 -124 92 -116 111 27 -7 109 -144 8 -24 97 -27 140 70
3326G0k19L6j9K16J2Q6l33K97l5o1j01%N7oo1N2J19l67K04K87j32k42K00O7j11
$$ 70 -149 -113 -132 84 96 182 -151 146 111 50 -51 -51 6 0 -61 -9 110 -257 -53 234 102 -140 60 127 16
3351A6K5r7j5Q0N2n1K6nj86J22JP1j67m8R5R0q0m3L6O1p7N4q0K69m4k76J89M3
$$ 16 41 -56 -71 9 61 10 36 31 -155 -33 -32 39 -128 -176 -81 9 -71 -114 -78 -17 -94 -40 -120 149 105 -171 18 61
3379F1j65J69l7L9Pj15J5P3Pj40J87k78J77J7N5R9j91O1j45R1k8M5j37M0n8J23
$$ 61 -104 65 28 67 74 -41 -26 47 54 -86 101 -177 0 17 72 171 -20 41 -104 -13 -41 4 -133 -93 -151 -28
3405b8J29J16l15K87k68J12Jo5o0J42O8j18n1J27j50K46k6l96L25Q5j67K2j18
$$ -28 101 217 -98 189 -79 33 34 -31 -91 51 119 1 -50 77 -73 173 147 -249 76 161 -6 16 -102
3428a02J19K7o2R7m4j27K84p5j07l7j0qk5rM8J5j3r7L25k18l0Kk68K78Q2K76l23
$$ -102 17 44 -18 79 35 -92 192 117 10 -27 -37 -45 -70 -79 -31 -16 -29 -126 199 -19 -49 -47 -315 -37 45 321 -2
3455bOm6j97K6M38k26p8J29q3k6n0J27l14L74j49j52K65R2o0J5O6j00q3J92l1
$$ -2 4 -42 -239 -213 225 -1 -79 50 -33 -59 -109 18 -296 78 -71 -223 42 134 74 89 155 55 -28 164 133
3480A33k72j0K52o3R1k34m4K10L5j64R1M6q0Q7j31N9j46K02J48k03j3l8q7L06
$$ 133 -139 -149 103 40 131 -103 -147 63 98 -66 25 71 -9 78 -53 6 -140 62 210 7 -6 -44 -131 175
3504A75j94O6j74J54j05J51o1n3J93k16K18j02Q0J7j33k65J77Q8J9j64J40J07
$$ 175 -19 47 -127 27 -78 73 12 -41 152 -64 154 52 132 149 16 -249 -72 16 35 -129 11 118
3526A18k02J91k41L1K45k82j2J69M5j09J75J22j80o5L9M5M3M7k2j48p3M0J80j33
$$ 118 -84 107 -134 -103 142 -140 -152 17 62 -47 128 250 70 5 44 89 132 179 157 9 -64 -24 156 23
3550B3L4k13n4K90j07l6J56m4k40R5k02K78J65l35L21J26k65l2K24m0k44K32J70
$$ 23 57 -156 -210 80 -27 -63 93 49 -191 -96 -298 -20 145 -190 131 257 -8 -40 184 144 -100 132 302
3573C02k29Kp5q0o3jK42j24L5K94m75K83r2K7k8O7O1l52J93M2Pj13J38J4l73J81
$$ 302 73 75 0 -80 -143 -144 98 -26 9 303 -172 111 19 46 18 85 146 -206 -13 29 36 -77 61 75 -298 -117
3599a17L38k97N7k6K18k0j25P5kj34J17j08J11k64K42J36k87J48j50j23L00R6
$$ -117 221 -76 -19 -45 173 153 28 103 101 -33 84 -24 87 -177 65 201 -86 62 -88 -211 89 185
3621A85n3k20Q8k8j20J57J05p0l48K26K72k20j9N8J54j48J4J0j07J33JN1j60n4
$$ 185 132 -88 0 -28 -148 9 114 44 -304 -78 194 -26 -45 13 167 19 33 43 -64 69 70 121 -39 -93
3645i3P8O3j0l6R4k07J42J84k95Ol2J23k13K79J2k60K94k21k11K67K92l02j29
$$ -93 -15 48 38 2 96 -111 31 215 -80 -74 -106 17 -196 83 95 -165 129 -92 -303 -36 256 -46 -175
3668a75o6P5J01J56l4O6j39j11K05k93L77Rj87j73K84j01q6K54j94j05j7j00K24
$$ -175 -241 -166 -65 91 57 123 -16 -127 78 -215 162 171 -16 -189 95 -6 -92 162 -32 -137 -154 -254 -30
3691c0L8J89j47R1j40P5kJ2J1o6J57J8l57R8J07k09J47p2J35J41m15J93k75K93
$$ -30 8 197 50 141 1 76 74 86 97 31 188 206 -151 -53 54 -155 -8 -80 55 196 -219 -26 -301 -8
3715hj00Q6O2j8j20K73r1k32J06K1JJ14j10k07J85J26j10J51q8j44j5K35qL5r2
$$ -8 -108 -22 40 22 -98 175 84 -148 -42 -21 -20 94 -16 -223 -38 88 -22 129 41 -103 -118 117 109 144 52
3740E2q3j0k1N6J56k05j53J81LP4p7J22j85P4k1J09k78L16J22m30K80j32O6k23
$$ 52 -31 -41 -62 -6 150 -55 -208 -27 -24 50 -27 95 -90 -16 -37 72 -206 110 232 -198 82 -50 16 -207
3764b07K78J99l44j51Q4J77l4K4j10M3R7j13J15J78k42r1J60k68K02Qr9K73k61
$$ -207 71 270 -74 -225 -141 36 2 26 -84 -41 56 -57 58 236 -6 -97 63 -205 -3 5 -94 179 -82
3787h2OJ19Mk6N8k6K5j26j72M04k14r1J58j13o6J61k29L8J26K86l48m9K10j1j35
$$ -82 -76 43 47 21 79 53 78 -48 -220 184 -30 -121 37 -76 -142 19 -210 -172 -46 240 -108 -157 53 42 -93
3812i3J00q6J29j8r8J39j50J21M2j03M5K25j81P4j73J42l4j13N3j55L51k12R6
$$ -93 7 -79 50 32 -66 73 -77 44 86 -17 28 253 72 146 -27 115 81 -32 21 -134 217 5 101
3835A01P5j7l04J08J7k26L21J5L4n9k32Q3O8o8%Q1j98R2J19n4K20k19J18l8J05
$$ 101 176 159 -145 -37 -20 -246 75 90 124 65 -167 -84 -16 -84 -84 -3 -201 -109 10 -44 176 -43 75 37 142
3860A42j82N2O7j35J35L2j12l5k%j37L79k54mo7K57j03N1q8K4R8r9J83k68J15
$$ 142 -40 12 79 -56 79 111 -1 -36 -38 -38 -175 204 -50 -54 -121 136 33 84 -4 20 118 19 202 -66 49
3885D9J2Q6j80q2j67L06q1j03J82j70J88r7J15l02K11k3L00k06k9j18R3k4J4J46
$$ 49 61 147 -33 -115 -282 24 -57 -160 22 -148 40 -57 58 -244 -33 -56 244 38 9 -109 -16 -40 -26 120
3909A20k00K44l14n3K49j67L2K17k05QqJ89m7j78L3P2L7oq0N0P3l6j64L8K68j61
$$ 120 -80 164 -150 -203 46 -121 -89 128 -77 -69 -77 112 65 -113 -80 -8 29 23 -57 -7 66 30 -134 -96 172 11
3935A1o3R0j39O0M1J55j1p1J54j97l0o1R5k53M9K67q9m5p0J5K06k6j21O1j82J67
$$ 11 -52 38 -101 -41 0 155 144 73 227 30 0 -61 34 -219 -170 97 8 -37 -107 -92 114 88 -33 28 -154 13
3961A3J41r7j12K42k2j56L6J31j84l3N6j35J25l2K47m03K91l41R7J00n2kR8J08
$$ 13 154 57 -55 187 165 9 45 176 -8 -41 15 -120 5 -27 220 -183 108 -233 -136 -36 -88 -90 8 116
3985A16K0k55J1M6R4L2o9J92j66j9k72K48Q4K5O1j73K30l27L1J57kr1K8m3M7k82
$$ 116 136 -119 -108 -62 32 64 -5 187 21 2 -270 -22 62 87 148 -25 205 -122 -91 66 64 -27 1 -42 5 -277
4011b77L19N6O4k91J41K7j36P4j67j43J93Q6J81j39k0J9R3k34RK10K5J4m1o2j0
$$ -277 42 98 162 -129 12 39 -97 -23 -190 -333 -140 -54 127 -12 -32 -13 80 -154 -145 65 90 104 63 1 -9
4036iK52j26n5M1L6k22j6k9J5J20m4K67k60k03M10l1r0nL7j33L01k49o6j34L49
$$ -9 243 117 62 103 139 -83 -99 -128 -113 7 -37 230 -30 -233 177 146 56 51 88 -45 256 7 -59 -193 156
4061A56j47K97m13J77Q2k18J93p8p2P9K08l22K6q2J86l46J25J77J22j74j4K8o0
$$ 156 9 306 -107 70 152 -66 127 49 -23 56 264 -58 -32 -114 72 -274 -149 28 150 -24 -38 -10 -70
4084g0k0J69o6M7P4Kk17j5K33j25km6J80l04K6J6J10j43M56q1l49O5K52j47J09
$$ -70 -90 79 13 60 134 136 -81 -96 137 12 10 -36 144 -160 -134 -118 -8 -151 305 224 -125 -60 192 45 154
4109A54J2l61Q3L9O5J75j48pj43R3J05j3q0l6R1r2nJ38K36j39j72J6r2k9K63j02
$$ 154 166 -195 -112 -73 -8 167 19 12 -131 -38 67 54 -26 -62 29 -63 -68 70 306 167 -5 11 -81 -110 153 51
4135E1on6R8k55N2K49j28q2n7P1K00k47J04q3J35j10L16j72J7p5j50r4n9M47k28
$$ 51 45 -11 87 -168 -116 133 5 -77 -134 -63 137 -110 -6 -89 46 -64 252 80 97 22 -128 -222 -281 166 -62
4160f2J80j09j6q7PJ08J25RR5j56pk00J87p1K03j65k7K2j09K76k65J50j37J25
$$ -62 118 9 -7 -94 -87 21 146 155 250 94 87 -113 74 3 206 41 14 36 -73 203 -62 88 -49 76
4184G6k11%K07J01l13L44m42K28J74j20o1o9p4o7L09JN8J54m63J22j64K73O3p2
$$ 76 -135 -135 72 173 -140 204 -238 -10 164 44 -17 -86 -160 -227 82 83 141 295 -168 -46 -210 63 126 54
4208E4qk62J68m2J53j30P5k62K12o2j94M21M7k60j0J38j11j4N0J12m13K13L96
$$ 54 46 -216 -48 -90 63 -67 8 -254 -42 -104 -298 123 170 -90 -100 38 -73 -87 -37 75 -338 -125 271
4231B71m28L7J45J62l87l6K37p5K83l5k79k1J23q6P4l4J97q5n7PJ28p6n1P5p4
$$ 271 -157 -120 25 187 -200 -236 1 -74 209 174 -105 -126 -3 -89 -15 -49 148 63 6 13 141 65 14 89 15
4256A5j27J72j19K8j43L30l29J65L8O9k59n3K11j57L49m5j51Q5l15N56j94l15
$$ 15 -112 60 -59 -31 -174 156 -173 -8 30 99 -160 -213 -2 -159 190 145 -6 79 -236 320 126 -189
4278a89K70o9nj39P9l3Q2k4k7J59l46K60J6rJ52l05k8k3L27k64R7j7k03K08O1
$$ -189 81 12 7 -132 -53 -86 -4 -28 -55 104 -242 18 34 25 177 -128 -156 -179 148 -116 -19 -36 -239 -31 30
4303C0K0J16l76L14J16m05M46l73P4j1K44k18M5NJ18k16l4J37j18j1K33Q6j33
$$ 30 50 166 -210 104 220 -185 261 -112 -38 -49 195 -23 22 27 145 -71 -105 32 -86 -97 136 222 89
4326H9j72J37K6j54J34J55j82j42K34nn0k20O6j5R6p7%p4K65J92k05j12J06K8
$$ 89 -83 54 80 -74 60 215 33 -109 125 120 70 -150 -84 -99 -3 -80 -80 -154 111 303 98 -14 92 120
4350A20j90K05k6n0j03J49L6N3l97N1M44l26K40j68p0m6j11J62L06l82rP7KJ23
$$ 120 -70 135 109 59 -44 105 141 194 -203 -152 292 -34 206 38 -32 -78 -189 -27 279 -103 -112 -35 -33 90
4374I0l9Q3j45j52O9N1K26k00k80K45l9j8O5K28j12j5N8j90N8R1o4j8Q3l8J6k32
$$ 90 51 134 -11 -163 -94 -43 183 -17 -297 -52 -91 -109 -44 184 72 57 115 -75 -17 74 10 -8 75 37 53 -179
4400a79K71n3j18K08j74M2k7J10j89L4K58j99n2Q2J17j94O3n6K14m8j03Nj12Q0
$$ -179 92 39 -79 129 -45 -3 -30 80 -109 -75 183 -16 -68 14 131 -63 0 -56 158 110 7 12 -100 -20
4424b0J5j01J88q0Qq3mj5J01O0R5j44J01R9j40p9Jk7K4K11l98LJ25J57l2k7n8
$$ -20 -5 -106 82 2 10 -73 -77 -92 9 69 164 20 121 220 80 1 2 -25 -1 210 -188 -185 -60 97 65 38 -20
4451b0j64R7J9J1K0r2J84n9j06O2q7L7P7J45m0l24L31J6l20M41o9l22J59o8J07
$$ -20 -184 -87 -68 -57 -37 -129 55 -4 -110 -48 -135 -98 -21 124 84 -240 91 107 -213 228 159 -163 -4 -72 35
4476C5o1n3j9L87l04m5n3J77O9J3j6q1P0j54K81l17o2L01n08N31k02Q7r7j59J49
$$ 35 -26 -79 -98 289 -15 -60 -113 64 133 146 130 49 119 -35 246 -71 -133 168 -340 191 -11 76 -21 -180 -31
4501c1q1J38j51J54oj0J92j67j13N4p8J48J11j1l21L71k39J04j68R1RL1j36K29
$$ -31 -112 26 -125 29 23 13 205 38 -75 -21 -99 49 160 149 -172 199 -40 64 -104 -13 -4 27 -109 120
4525A20k08p6Q3K30N3k18j60K97j04j49O2j5L6K6n9J45j76R4k0qJ84j99J75n8
$$ 120 -88 -164 -81 149 202 -16 -176 121 17 -132 -70 -85 -49 -23 -82 63 -113 -19 -39 -47 137 -62 113 55
4549E5q5Q2n0j6r5K08l2k06J89l4k04J45Q9m9L5M6p7l8J11q7N6k7J86k84k7K30
$$ 55 -30 52 2 -14 -109 99 67 -139 50 16 -188 -43 46 -3 32 78 1 -37 74 -13 43 16 202 -82 -109 121
4575A21R3k79J83k03J26k14L21k52J35p4K24j66j27N2k1J14mL9r7N7J88l00P4
$$ 121 214 -65 118 -85 41 -173 148 -104 31 -43 181 15 -112 -60 -81 33 29 68 -29 28 216 -84 -10
4598a0J1K41k24j45K18j24q3j68J56j86L06Q2J0j07j74K30J3n6o5K50k36J54j04
$$ -10 1 242 18 -127 91 -33 -116 -284 -128 -314 -8 74 84 -23 -197 33 46 -10 -75 175 -61 93 -11
4621a1K17j45p3n1J02j19M6r5l4J30j87J33M6O5L9j91L38k34N2Q9L3j21kJ79l61
$$ -11 206 61 -12 -63 39 -80 -34 -129 -163 -33 -220 -87 -41 24 63 -128 210 -24 28 117 150 29 27 206 -155
4646a55j8J74m9j65J31K06K8l48K56L2j23oj0K6k7Q6Q8j41j49K62j52N3J22j54
$$ -155 -173 1 -48 -213 -82 124 152 -196 60 92 -31 -37 -47 -21 -48 38 126 -15 -164 98 -54 -1 121 -33
4670c3J63k23j26J71K21Q8l00j87L72J42j31j53J59l81J66N2l4J30J01ll37J72
$$ -33 130 -93 -219 -48 173 261 -39 -226 146 288 157 4 163 -218 -52 0 -34 96 197 194 -143 29
4692B9K26k42J3j02N2M0j13J16J51k88O4j25J11K52O6j69j95P5N5M8p6o2J00j40
$$ 29 255 13 26 -76 -24 16 -97 19 170 -118 -54 -179 -68 184 250 81 -114 -39 16 64 -12 -74 26 -114
4716a14J78o9j7M5K47l99N1J01l3R6j69N1j06L3l9R8NJ10L8j62r2P1L52k95K58
$$ -114 64 -5 -22 23 270 -129 -78 23 -10 86 -83 -32 -138 -105 -144 -46 -41 69 107 -55 -147 -76 276 -19 239
4741B39m04q8L98J7j7J03l50K5J47k35J10P9J27r3j29K8R3j48q0K41k34J35L9
$$ 239 -165 -253 145 162 145 248 -102 -77 70 -165 -55 24 151 58 -71 -43 50 -98 -178 63 -171 -36 3
4764CR6n3j20J30K6o2q8K2L81l95M8m0o5J72J30j89J46p8j56K33j65n1N9J27j42
$$ 3 99 46 -74 56 82 20 -68 -46 335 -60 -12 -52 -117 55 185 -4 142 64 -92 141 -24 -75 -16 111 -31
4789c1k8p4K22j03J54j79K27p0k99K45pj55L23j53o2j01J15j24K58k59O4N1pN6
$$ -31 -59 -133 89 -14 140 -39 188 118 -181 64 57 -98 225 72 10 -91 24 -100 158 -101 -37 14 7 63
4813F3j14o2q6J90R5j41K5K3J3J36Q8j82J13m3j16j12J88Rj43m4J09Q4k75p1N60
$$ 63 -51 -113 -199 -9 86 -55 -30 -7 6 142 230 48 161 118 2 -110 78 87 -56 -100 9 93 -182 -253 307
4838C07l43O2j3j25j32K45J5J40r7k13J77q1N0j3Q5l4k1p5Q5o4p4K32l73K47o4
$$ 307 -36 26 13 -112 -244 1 16 156 59 -154 23 -58 -8 -21 64 30 9 -66 19 -45 -119 113 -260 -13 -77
4863g7j90K87l7J71M2l13K06J41k25KK9m3k19L04k52L20jk28Q8k5j57J44j2l5
$$ -77 -267 20 -17 154 196 -117 89 230 5 7 36 -7 -226 78 -174 146 145 -83 5 -20 -177 -33 -45 -80
4887h0pJ76J42N7l93J11r4L1j11J52n2L6J96j64M7R0j95j58J85j50J5K49j18J21
$$ -80 -87 89 231 288 -105 6 -88 -57 -168 -16 -68 -32 164 0 47 137 -58 -216 -31 -181 -166 83 -35 86
4911H6j3k76K37m7j44J59O0n5J91j50jRJ37k74K29k22j85K52J7l7Q3k42J89P1
$$ 86 73 -203 34 -13 -157 2 62 7 198 48 47 56 193 -81 148 -74 -259 -7 10 -27 56 -186 3 74
4935G4L6j74l9J43Q1r4j33J81l2j57K62j21k1j76K93j11M6k9p8m9J90p5J19nJ9
$$ 74 110 -64 -103 40 121 27 -106 75 43 -114 148 27 6 -170 123 12 58 29 -49 -98 92 17 136 131 150
4960A50j32j58J40Jn5L1K0l71J81P2jJ43Q8k00o2M17l10J9m1M04n21P3L58j71
$$ 150 18 -140 0 1 -54 -23 -3 -374 -193 -121 -122 21 109 -91 -153 264 -46 -27 -68 336 -185 -112 246 75
4984G5L0p1j52K04J70k55o2k33J55K7K88j37l8j36K07n1J13n8M4o1q0n6o6K38
$$ 75 105 34 -118 86 256 1 -61 -294 -139 -112 176 39 1 -135 72 21 134 76 120 59 -21 -77 -143 95
5008I5j04l3p9M6J03o1Q3J35j34k5L8Q7j52N8K9p4r6J43l5R3j83R5j1N6O5r3j04
$$ 95 -9 -42 -121 -75 28 -33 50 185 51 26 64 151 -1 57 86 12 -84 59 24 117 -66 29 18 74 139 46 -58
5035e8N2k2k0K2J56M3k48j3K12k44K46n2j28K7J14M5l4j06j26K03Qj24m7M5j2
$$ -58 -6 -28 -48 -26 130 173 -75 -88 124 -120 126 74 -54 -27 87 132 98 -8 -134 69 77 -47 -94 -49 -61
5060f1l7j45J01J92J21j2k08J36l4j57M1J4J20l21K36J05j3M5Oj91P1m7Q0k3O0
$$ -61 -98 -243 -142 50 171 159 -49 87 53 -104 -63 -49 71 -250 -14 91 78 123 129 -62 9 -38 42 19 79
5085G9J87m48K19L1o0o1r8pK53l29L98k45P1L5L2K9p9R0j38J29n4q3l2l5K46k62
$$ 79 266 -182 37 68 8 -53 -151 -158 95 -234 164 -81 -10 25 57 86 7 97 -41 88 34 -49 -81 -116 130 -132
5111a32L55l74K81k06J7R9M5k44l7J74k44J97J49j98N2K21j50q9l4J39Q9r9j26
$$ -132 223 -151 130 -76 -59 40 85 -159 -196 -22 -266 -69 80 -118 -66 155 5 -84 -118 21 110 11 -115
5134a15K87j33J99k35j21J78K71l43R4k09L8lr0L35j09j7o8K26l24o3K55p2n7
$$ -115 172 39 238 3 -118 60 331 -12 82 -127 -89 -92 -182 153 44 27 -41 185 -139 -202 53 -19 -76
5157g6oJ89l69K30K47l10J58L5mk66J41j6J68lj31l39K30J39n4j89L34j52M0O2
$$ -76 -82 107 -262 -32 215 -95 63 98 94 -172 -31 -47 121 118 -13 -352 -122 17 -37 -226 108 -44 -4 58
5181E8M1Jj88J72J17k18J57k44K49k73R1J39k0N0j62k4K30o9n0j62J13J29j63
$$ 58 99 100 -88 84 201 -17 140 -104 145 -128 -37 102 82 132 -30 -54 176 107 57 -105 8 137 -26
5204b6p8J04l3J21j5k2j21J04J27l71K58j62N9P9J37j14j59J16P1k24n3r3J99
$$ -26 -104 0 -33 88 73 51 -70 34 161 -210 48 -114 -55 24 161 47 -112 4 75 -149 -202 -295 -96
5227i6O9P8q3J56j88n6J97k25K11j0P9J9k2j00J58k78N7K5Kj64J70q1N7l4M5K08
$$ -96 -27 51 -32 124 -64 -120 77 -148 63 53 132 151 129 29 187 -91 -34 -9 -7 -171 -1 -82 -25 -59 -14 194
5253A94j61q7J33j71J37j31m0l5J30j61J66p1J4j0J39k95P4K80k72L04p2R5k70
$$ 194 33 -54 79 -92 45 -86 -126 -161 -31 -192 -26 -97 -83 -93 46 -249 -175 105 -167 137 65 160 -110
5276a10K67q6K8N4k26Q4K2o7O1L7j47K06j46J55Nn0M5k51J78j4j04Q3J49j5j91
$$ -110 157 71 99 153 -73 11 33 -34 27 64 -83 123 -23 132 137 87 132 -119 59 45 -59 24 173 158 -33
5301c3JK7J4j55M25l03j55J07j50K78k12P0j5K13j11O9J02j49J02k22j60L16J76
$$ -33 -32 -5 9 -146 279 -24 -179 -72 -222 56 -156 -86 -101 112 1 70 172 23 125 -97 -257 59 235
5324B35j79J45j98J53k43K99k31J12P7k15N3p9K09o6j19Q8k0pNo7o9K10j04j55
$$ 235 56 201 3 156 -87 212 -19 93 170 -45 8 -71 138 72 -47 41 21 14 19 -48 -117 93 -11 -166
5348a66J86r1M8J71j79J26N6l93L26J36J2l79J81p2K14k25NJ97k16K8l5J64mj8
$$ -166 20 -71 -23 148 -31 95 151 -242 84 220 232 -147 34 -38 176 -49 -44 153 -63 -35 -70 94 90 72
5372G2q7j93K74J20k63J5K34j38jP4k56R0J4R2K4Q0l66K88j55p6K56o9P9n6L4
$$ 72 -15 -208 66 186 -77 -62 172 34 33 107 -149 -59 -45 47 71 151 -215 73 -82 -158 98 29 108 52 86
5397H6p0Oo2m9O6P5L3j21K8j6P0q5K39J2k74M24k01q7P9j62j14N9p8L17k67J92
$$ 86 16 22 -40 -89 -23 52 85 -36 -8 -24 46 -39 200 212 -62 362 161 74 153 -9 -123 -64 -142 175 -92 100
5423A00j38J47j42j18O4O8j07L19p5l03Q9K08j13n4L07k55J79l97L29m4J04j61
$$ 100 -38 109 -33 -151 -87 -19 -126 193 118 -185 -96 112 -1 -55 252 -3 176 -221 108 64 168 7
5445Gj22M6K2N9N4o2O5j1j07Q4KJ89k18N4j33J60j05j23K04n0J18q3k52K28m3
$$ 7 -115 -69 -47 12 66 4 69 58 -49 35 37 226 8 62 -71 89 -16 -139 65 15 133 50 -202 26 -17
5470a7L0o9N9L8L2pM6j14l38M64k45J42j81K6P9j0k2J29j61L7J48k58J51J25p
$$ -17 13 -56 3 41 73 66 112 -2 -340 124 -121 21 -160 -134 -55 -65 -87 42 -119 -82 66 -192 -41 84 77
5495G7j17J19J46k16K3O0j71N7j76J65ML4Q8k07J20L4o1j75L1J86J35m2k8j34
$$ 77 -40 79 225 9 32 92 -79 -22 -198 -33 -29 5 93 -114 6 40 -21 -196 -165 21 156 114 86 -48
5519d8J08j70Q0N3K1j73o4K38m1J87j95r2j8J83j83L1J57J25l44M17j85k61J26
$$ -48 60 -110 -30 23 44 -129 -193 45 4 191 -4 -96 -114 69 -114 -83 74 199 -145 272 87 -174 -48
5542d8j48L49j34mj17oK59j63P5L2j40p1J00K9j23J60k08J29J85k5k78L47m1l82
$$ -48 -196 153 19 15 -102 -108 151 -12 63 95 -45 -116 -16 13 -110 50 -158 -29 156 131 -147 200 159 -223
5566b23L38j90J1j2j54K79m9j31J58k13O4K04k2k7P6k69P4MJ93m3l3Q6L9o4j93
$$ -223 115 -75 -64 -76 -230 49 0 -131 27 -186 -122 82 60 33 109 -160 -86 -82 111 68 35 121 160 96 -97
5591i7K52k09p5O3K44l38J25K37l03J46r7J40k81J03J56l7j12J2M9n2j42J36L37
$$ -97 155 -54 -129 -66 178 -160 -35 202 -101 45 -52 88 -193 -90 66 29 -83 -71 -22 -74 -216 -80 257
5614B57l04J95j75Q6J8j08j97NL78k48Q0m3L94m69J54j13K53J0l00L32k77K95
$$ 257 -47 148 -27 59 77 -31 -228 -223 155 -93 -13 -56 338 -131 23 -90 163 173 -127 205 -72 223
5636B23k85j6j47K02K96j32J6j70n4p7K00m7L8M5n3l4n3L5J15j86J21r0Q7j25
$$ 223 -62 -78 -225 -23 273 141 157 -13 -67 -144 56 9 47 92 39 5 -48 -13 102 -84 37 -53 34 -91
5660i1K77k23J91Mk81J63K3q9jlKM5R8l99L64r0j25K50mj66l1J99j02J32k6m0
$$ -91 186 -37 154 158 -123 40 63 -26 -27 -30 -28 17 115 -284 80 -10 -135 115 111 -55 -86 113 11 143 117 77
5686G7j75J55J97k82j37K77l00O2L05q9k08J30j50K37k59K28M6k1J29j46j00O2
$$ 77 -98 57 254 -28 -165 112 -188 -126 179 90 -118 12 -138 99 -160 68 114 93 222 76 -24 38
5708C8K9k29J19J05q2k7J3J41R6l34J43l3o6L7P9m5J44q9k1J30j11N5p1J10p4
$$ 38 67 -162 -43 62 -20 -47 -34 107 203 -131 12 -21 -87 -50 29 -16 128 39 18 148 37 92 21 131 57
5733E7l3pj36N1L37m34K57Q2k54K23k23j75K03K30Rl78J77p4K31j55N9j15nJ28
$$ 57 24 17 -119 -68 269 -165 92 174 -80 143 -80 -255 -52 178 187 -191 -14 -88 143 -12 47 -68 -73 55
5757E5j89M1J37j5k20J88rj52J33l3M6j08K61j52Q3k28jK33r5J48q6k80K57J5
$$ 55 -134 -93 44 29 -191 -3 -12 -164 -31 -64 -18 -126 135 -17 66 -162 -163 70 -25 123 37 -243 14 29
5781B9KrlJ48j56N2Q5j86O9j57J86j24J80Q2j47K1k45K96j25r4J3K31k05n4J29
$$ 29 31 22 19 167 11 63 148 -38 31 -126 60 -64 116 198 51 72 -173 123 -2 -96 -83 148 -57 -111 18
5806A8L0k06L63l70R3O9J74k14K17j01m4j06K07k7k52p4R5j14K68J61j8l22J24
$$ 18 48 -158 205 -165 -72 -3 171 -43 174 73 29 -77 130 103 -149 -223 -128 -242 26 187 169 -153 -29
5829b9O6l3Q8k12K24j58R3J80r5j00p6J23j58L43o0j69R0k93L84l85K76K9P0j93
$$ -29 37 4 92 -120 104 -54 39 219 124 24 -52 71 -87 256 196 27 117 -176 208 -177 99 128 198 5
5853EPj68R8J16m3O2K09j96n8j14o3K31o7O0j5j5J02j54lJ95k11K43l24K47J70
$$ 5 12 -156 -58 58 15 77 286 90 32 -82 -145 86 19 79 64 49 151 -3 -6 189 -22 221 -103 144 314
5878C14l85K76j18l8q1r3o9K58j04j49J61K22j71r7k1k23K61j02J47q3pj18J58
$$ 314 -71 205 87 49 -32 -125 -194 64 -40 -189 -28 194 23 -74 -95 -318 -57 -159 -12 -95 -102 -220 -62
5901f2J63l01J25N2k8J39j05M1k5n7J54j21J73j61R9j46K4J39k96J01r6J98P8
$$ -62 101 -200 -75 -23 -51 88 -17 24 -1 -58 96 -25 148 -13 86 -60 -36 103 -193 -92 -188 10 88
5924H8n7m5j08Q1j16M2K81k99n4J67R1K3j86K60j05J61j21j11J47j2j31L0o6K05
$$ 88 31 -14 -122 -41 -157 -115 166 -133 -187 -20 71 94 -92 168 63 224 103 -8 139 127 -4 26 -40 165
5948A65p2j1J85k92K7J05n5j86j3K2J79j51O6J38L4J1k01Q7M5J1o0p6k46J94J78
$$ 165 93 82 267 -25 2 107 52 -134 -147 -125 54 -97 -31 107 141 152 -49 38 83 94 34 -42 -288 -94 84
5973H4K1j32j38J41q4K08j38K02l34J45k8J90k49L8K49j02k8Q9n8j65nO3J18k44
$$ 84 105 -27 -165 -24 -108 100 -38 164 -170 -25 -53 137 -112 -74 175 73 45 134 76 -89 -94 -31 87 -157
5997a57K61m9R6%l30J64L1JM7j31K37j45j45J86n4J50ok98L73k70P1p3J25o2m4
$$ -157 104 55 151 151 -179 -15 16 17 64 -67 170 25 -120 66 12 162 156 -142 231 -39 32 -41 84 22 -22
6022b2J14l8J5j40l6k8R3R7r4k8J3O6Q4r1n2J14j63N9j60J30J02O1j86J93j74
$$ -22 92 54 69 -71 -107 -135 -42 55 -39 -67 -54 12 96 5 -47 67 -96 -37 -197 -67 35 96 -90 103 -71
6047g1Q3o8J04N6o0j40Q8P7j53J03M0j5j32n0K68j94OR2k62L43k14N5r2J53k5
$$ -71 12 -56 48 104 44 -96 -8 69 -84 19 59 44 -88 -138 130 -64 -58 34 -228 115 -99 -44 -136 17 -8
6072hj15K49k31J20k4J70j93oO5M1q3j36K92k61K52j23n9K0L1L32m00J06p4J72
$$ -8 -123 126 -105 15 -9 161 -32 -38 27 68 -15 -151 141 -120 132 9 -50 -30 1 333 -67 39 -35 137
6096A37mk50K35K5j53q4J07J50l8l4q4N6m7k4q3J25k66O3P3J08n8J16j46J94m4
$$ 137 133 -117 118 143 -10 -94 13 163 125 91 7 63 16 -8 -91 34 -232 -169 -96 12 -46 70 -76 118 74
6121G4k19L30j10%j41r4P6R3J09k13n9K39j29j16K9R2J30k72J67O2q2M7r2L8O2
$$ 74 -145 185 75 75 -66 -160 -84 9 118 -95 -154 85 -44 -160 -131 -39 91 -181 -14 48 -34 13 -79 -41 21
6146B1K2j14Q8k8J73j22K6QJ34j78NQl9J10k98K66r7M6j43J09q7J86nr4J02n3
$$ 21 43 -71 17 -11 162 40 66 74 208 30 35 43 4 114 -184 82 -15 31 -112 -3 -90 96 91 -3 99 46
6172D6j64m3J93m8k1R0J04j62O2m9K5L1p9J1o5J74j99nJ06R3n9K08k69M3o1P1
$$ 46 -118 -161 32 -16 -37 53 157 -5 57 8 33 64 -15 -4 -69 105 -94 -99 7 100 41 249 -20 23 -38 33
6198C3P1p4j42J12N4j55k16L96J52k08N3k27P3k4L8L9oJ69j19q8qJ31l2j41J18
$$ 33 104 30 -112 0 54 -101 -317 79 231 23 76 -151 -78 -102 -64 -25 -31 138 19 -69 -77 54 22 -119 -1
6223aj21J87l9P6j23j58J77n6jO4K25j07J5k09N1K52r4qr3p4J45k59L86j53n3
$$ -1 -122 65 26 102 -21 -179 -2 -58 -59 5 230 123 138 -71 -20 232 138 130 37 -37 108 -151 235 82 29
6248B9l8J19p3l1k24L21j99J8Mk54M46j34PJ40j43n6q8L01J31K7k61j10j6OM8
$$ 29 -9 110 37 6 -218 103 -96 -78 -74 -328 118 -16 -9 131 -12 -68 -156 145 276 303 42 -68 -84 -78 -30
6273c0J20j82J41p0K09p0k76L25k06M5n8K9K73m39O5J88l33M60k67L3Q5k07J51
$$ -30 90 -92 49 -21 188 118 -158 167 -39 6 -52 -23 250 -189 -124 64 -269 191 -76 -43 42 -165 -14
6296a4L5K8J51k82K07j02Nj16Q7J37Ok59K11n4j7k63J42J35m7J57Kk69L94j46
$$ -14 21 49 200 -82 125 23 28 -88 -1 136 142 -117 94 40 23 -240 -98 37 -10 147 149 -120 274 128
6320A28N4k36n1J12j47P4K35l54J49J80j40m2K07p3j61M7L3j31J80R5l5k04L02
$$ 128 182 -54 -105 7 -140 -66 169 -185 -36 144 4 -38 169 96 -65 -18 15 -116 64 159 124 -80 222
6343B22k24j54%K27r6l2M1RJ72j42K2r0K27l68Q4J98j43Q6p9Q1pm7k4M3M0k5k14
$$ 222 -2 -156 -156 71 -25 -57 -16 -7 165 23 45 -45 182 -186 -102 96 -47 39 -40 41 34 -13 -37 6 46 21 -193
6370a93O7K70j84R6l05J65m0K22J50l72J5K54k9q7j43J43j7j89J31K2n5q2K50
$$ -193 -126 144 -40 56 -249 -84 -124 98 248 -124 -109 145 116 29 -114 29 12 -177 -46 -24 -79 -161 89
6393H9j01K03j51L1jM3Q5l36J58J05j74K04k25k9K21j46nK49k08J37k06O0j81
$$ 89 -12 191 40 71 70 113 198 -138 20 125 -49 155 -70 -99 122 -24 -29 220 12 149 -57 3 -178
6416a78M5J34N8K5n0q9J18j22K5j09P2%pK46k62Q3J14R1lm59L44n1k4k3R3J04
$$ -178 -133 1 59 84 34 -55 63 -59 -34 -143 -71 -71 -78 168 -94 -11 103 194 191 -268 76 25 1 -22 71 175
6442A75j82J9J09q6j25n1K49R3l07K08j4k0j8%o4q8j21K10o3N1L13l23O7p0K8
$$ 175 -7 12 121 35 -90 -141 108 201 -106 102 88 68 50 50 -14 -102 -223 -13 -76 -25 288 -35 32 -38 -10
6467a0k2j30K36j01r6K73j59J58j09J61k57L6P6R0m32L38LJ70k25J41o8r4k1j21
$$ -10 -32 -162 74 -27 -123 150 -9 149 40 201 -56 -20 56 146 -286 52 55 225 0 141 73 -21 -42 -163
6491a63J72J83j93K3j73l3J92J8M0k60O4J89O3k26J23q4J39k82K86k61L30j74
$$ -163 9 192 -1 22 -151 -184 8 26 66 -194 -130 59 122 -104 19 -65 74 -208 78 -183 147 -27
6513b7k6J38l37J76K02j89O8o0J11N4j22L3K64k78j73J58n8K44j64L4j14O0J27
$$ -27 -53 85 -252 -76 126 -63 5 -55 56 110 -12 21 285 7 -166 -8 -66 178 14 48 -66 -6 121
6536A21j4j22j16J56p3OK18m6j88n7pM1J28m6K2m9j20K54L6l27K12m5P0M4L1j75
$$ 121 107 -15 -131 25 -48 -42 176 130 -58 -115 -122 -81 47 1 23 -26 -146 108 144 -183 29 -16 54 98 129 -46
6562d6J48j14M0j05j04K70M9j71N3n0j42K55J44j57kK7k29J77j26K08k27J64J01
$$ -46 102 -12 28 -77 -181 89 138 -33 20 -30 -172 83 227 70 68 95 -134 43 -83 125 -102 62 163
6585A63k72k77M06J42qj06J02j65P3lp1j35K71j3j25l0j81J87m4M8K11j01j85
$$ 163 -109 -386 20 162 154 48 150 -15 58 55 -16 -151 120 107 -18 -48 -229 -42 -86 -38 173 72 -113
6608a13K06k3l30N07k24Nlj39k7O4K25l38K32o7k2M1K6j23K47j09K03k87J86n6
$$ -113 93 70 -260 247 23 28 25 -114 -141 -77 148 -190 42 -25 -47 -6 20 -103 144 35 238 -49 137 81
6632H1k73K63n6r0K58k67kJ24J50k97J94J98j82P2k08r3R0K63j79r7kJ28J95l11
$$ 81 -192 71 15 -75 183 -84 -86 38 188 -109 85 283 101 173 -35 -128 -38 225 46 -51 -53 75 270 -41
6656d1Q2PK6J0j61J05j6n0P7M2k72K64q7n1J36K13k95p2J12R5m4j32K42k25R2
$$ -41 41 48 74 84 -77 28 12 -38 39 81 -191 73 -14 -65 71 284 -11 -83 29 124 80 -52 190 -35 57
6681E7J51l29Q3M0O8k19K6J23M1p1j05K24j52K4J86k37m2K37j65J35n7M2m6mL8
$$ 57 208 -121 -38 2 70 -149 -123 0 41 -30 -135 89 -63 -39 147 -90 -132 105 -60 75 18 60 14 10 48
6706D8J48j04j14KM5J5qJ03k80K8L1Q4J10k69J5m3J12j66J4J74J1R2j00o5N0Q7
$$ 48 196 92 -22 -20 25 40 32 135 -145 -117 -86 -2 108 -161 -146 -189 -77 -243 -229 -55 -44 48 -52 -117 -67 20
6732B0kp5J22J33j05j39l3J18j17K08j41K1n4j75J85k9J56k05r8K79m3j87M7Q6
$$ 20 18 -57 65 198 93 -46 -79 39 -78 130 -11 10 -44 -219 -34 -63 93 -112 -210 69 26 -161 -114 -28
6756b8p2O1J25q4M8k53J71j97K96o3Q5K02l20j23O3j0J12O4L1q5r6K7o7J29P6
$$ -28 -100 -39 86 2 50 -203 -32 -229 67 4 89 291 -29 -152 -89 -99 13 77 108 23 -73 -46 -113 16 92
6781I2j70J20O6k1l0j19j23L85l55J68J5j15J20l4J17q2rJ40Nk41l2J38p1q5K83
$$ 92 -78 42 108 87 57 -62 -185 200 -155 13 28 -87 33 -1 116 34 25 165 170 -71 -103 35 -36 -121 162
6806A62j80q4K77l78K62K2k56J62m9r4J92j38P3J28N7j17k12J58j35m6L30l30
$$ 162 -18 -102 175 -203 59 81 -175 -13 -62 -156 36 -102 -29 99 156 39 -173 -15 -150 -196 134 -196
6828a96J42QJ02k07L01l8j30J24o6j2K2o2M0o4J19O9l45%J20P6p8Q4j99K34k3
$$ -196 -54 -46 56 -151 150 112 -18 106 40 28 50 -12 28 -36 83 152 -193 -193 -73 3 -75 9 -190 44 21
6853B1j2K86k90j35K07K6q3p8J54k28RL22k25qN0m0l4k7J81j70J36J12j77j6j20
$$ 21 9 295 5 -130 77 103 20 -58 96 -132 -123 199 -26 -34 16 -24 -58 -85 96 -74 62 174 -3 -19 -139
6878a39J15J19K1j50L7J31j09%p5J64j22K2j02J37k6M6k80K38j81j2J13R5L1k33
$$ -139 -24 95 116 -34 3 134 25 25 -50 114 -8 14 -88 49 23 69 -211 27 -154 -166 -53 42 73 -160
6902a60K01m6qM7J01j33j6J2j08J65j40J63j51N7j15L02k74J78k51R2J51Lnj81
$$ -160 41 -5 -13 34 135 2 -14 -2 -110 55 -85 78 -73 -16 -131 171 -103 75 -176 -84 67 70 65 -116
6926a16J98k19o0M58m20K5J71nM8j25L7k9L16k1n48K46L8Q8j45p5J71N0j14K2
$$ -116 82 -137 -197 261 -159 -134 37 32 80 -45 -8 -37 279 258 -290 -44 -6 82 -63 -138 33 83 -31 -9
6950iL2M1j40q4J21J51k58P8Q3J91j55j13K2q8P7l7R8k19n8K04K03j03jR7j21
$$ -9 23 64 -76 -160 -39 112 -146 -68 15 206 51 -62 -40 -128 -51 -88 10 -209 -267 -63 140 37 36 133 12
6975A2n5J6P0J82k4l20R6j35K09j62J33M6p2J68j73j98K73j43K1J07j19J57l61
$$ 12 -43 -27 43 225 201 -119 -23 -158 51 -111 22 68 -4 164 -9 -207 66 -77 -56 51 -68 89 -272
6998b72L63j71J60r0j00J51q1j30k6J90j6j10k23N05j12m6l5O0J14o0rL9q5P6
$$ -272 91 -80 80 -10 -110 41 -40 -170 -196 -6 -22 -132 -355 150 38 -8 -43 17 131 71 62 101 16 92
7022I2Jk50K98m3k47n3N1Q1Q0O4j78J25nJ96k07m0l0Q1j28J10O8M1n5J46k12J4
$$ 92 93 -157 141 98 -149 -202 -151 -70 10 74 -104 21 16 212 5 -35 -65 16 -112 -2 66 107 52 198 -14 0
7048@j23lN5l6K8K60k55Q3j09L6J11k0Ok06K54r9K31n1k26J6k9J24rm6j93K95
$$ 0 -123 -126 -71 -107 -79 181 -74 9 -100 -64 47 27 33 -173 81 -18 213 162 -64 -48 -77 47 38 -8 -201 94
7074I4j82q4J56j94L26j20M0M0j85J22K6j69J52lK1K9J88k94K8j19R7K1j84K77
$$ 94 -88 -172 -16 -210 116 -4 36 76 -109 13 39 -130 22 19 40 69 257 -37 -9 -128 -31 -10 -194 83
7098H3P2j00J36k64K64K7l21J68j42K45r2k42%K72j4m5N9Q4j68Q2j97K21R1k36
$$ 83 155 55 191 -73 191 218 -103 65 -77 168 76 -166 -166 106 92 47 106 190 22 104 -93 128 219 -17
7122a7k8j27L1K85J4m8N8l30K30j16m3J62k82K45k2J97k51j2qJ88j22O4p9J37
$$ -17 -45 -172 -141 144 158 110 168 -162 68 -48 -91 71 -211 34 12 209 -42 -54 -62 126 4 68 -11 126
7146A26l13k6K46j61O3jJ84k26J14r7J10J49j09o9j01n8O9J55p9P7R4j69k3j45
$$ 126 -187 -213 33 -128 -65 -66 118 -108 6 -91 19 168 59 -10 -111 -169 -100 55 -24 53 147 -22 -45 -190
7170a90J47J36m4J54j67J80m10K79k55J53j3J28k16n7J33J4rr3K21k40J98j01
$$ -190 -43 93 49 203 36 216 -194 85 -170 -17 -30 98 -118 -175 -42 -28 -37 -130 91 -149 49 -52
7192e2K07j66m7J34q3O1oo1j57R6K47j02k03L60k46j32K2J78R0k84J33J13j13
$$ -52 155 -11 -58 76 -7 54 48 -13 -170 -74 173 71 -132 228 -18 -150 -128 50 140 -144 -11 102 -11
7215a1L3j97K79l06J21o9Q0L76l08J51Kp1k06K05N0k21L6j2r4K18r1k23K76j30
$$ -11 22 -175 104 -202 -81 -150 -70 306 -2 149 151 80 -126 79 129 -92 -56 -68 -162 56 -35 -258 18 -112
7239a12J94K9n2jp1j52R5J84r4O9o6J6j0r7J37J63j98M2J9p5p4M9K41k00M9j30
$$ -112 82 111 59 58 -13 -165 -70 114 20 89 23 39 29 -68 69 232 34 76 95 20 -54 -5 236 36 85 -45
7265d5j35L06j07j05L9j33J20j1kK6P8j02j11K74M3j99Q2P1j26J74l8m8j31QK25
$$ -45 -180 126 19 -86 -47 -180 -60 -71 -73 -47 31 -71 -182 92 135 -64 18 89 -37 137 99 51 -80 -72 153
7290A53p0k44J66p3l1Q9o6P4J25l96J82O6O3o1Q6mk07J42k58L15O5k04K29prp2
$$ 153 83 -161 5 -68 -99 -10 -76 -2 123 -273 -91 -25 38 -23 63 59 -148 -6 -264 51 116 -88 141 134 125 53
7316E3l8j29O2J41Q7k49J32j75K18j07j45M56j56K1j17j59K23o9r7q2K33j69O5
$$ 53 15 -114 -52 89 176 -73 59 -116 102 -5 -150 306 150 171 54 -105 118 49 -48 -130 103 -66 -1
7339an1R2K5k40K19j60K45j02Pj74J53Q3P9k37QN3n4Q9Qj9N7o7J13j17J2l8j0
$$ -1 -52 40 65 -175 44 -116 129 27 34 -140 13 96 175 -62 -54 -1 -55 34 42 23 80 13 126 9 21 -17 -27
7366b7m0R4K22j48J3j74J45j52J79l22J42k07K66j5j07J70r9J70j98K35O3k24
$$ -27 -67 27 249 101 114 -60 85 -67 112 -210 -68 -275 -9 -24 -131 39 -60 110 -88 147 210 -14
7388a4j23R8m0J5l0P3j47N8k6n2J98Oj62J95m3q5k4M09l06Q9k7n6K71k58j37N4
$$ -14 -137 -39 -79 -64 -94 -21 -168 -110 -136 -188 10 16 -146 49 6 -79 -103 306 0 89 62 6 277 19 -118 -64
7414f4j31J35k9k2K42k27kP7o4L3J58o3K55j97jm0n3n7n9P8J74lj28n2J30q6J38
$$ -64 -195 -60 -89 -111 131 -96 -98 -21 -85 -52 106 43 298 101 100 60 7 -50 -109 -31 143 140 12 -40 90 4 142
7441A42p9j65J18J85ro7k7n0k4j37R4Mk20K68j22J68k42L33l52M82m12J75qk18
$$ 142 63 -102 16 201 192 125 98 48 24 -113 -19 -15 -235 33 -89 79 -163 170 -182 300 -112 63 55 -163
7465a63Q6K20M9m90L79k05r9L48m8l8k8n9J87Pj05j04Q9p3J18m26M20m2k03K81
$$ -163 -77 143 192 -298 81 -124 -223 125 77 39 11 -48 139 146 41 -63 26 -47 71 -355 65 23 -180 101
7489A01l9J40k97K2Kp5L4o0K50J84m30J42nk5N4q3j26J97p9RN0Q4j0j38O3j7M
$$ 101 62 202 -95 -73 -71 -146 -112 -172 78 262 -168 -26 -31 -56 -2 -85 -211 -14 -93 -84 -34 50 40 -98 -35 -52 -48
7516d8K6R5R5j06J0p8j32J57j95N6j3O5r7N6L9K64j65K1Q6j48k08L03J1l16J34
$$ -48 -22 73 168 62 72 -6 -138 19 -176 -120 -133 -68 -165 -109 -70 194 29 50 136 -12 -220 83 94 -222 -88
7541h8R8M2j11J42k42K34m5r9J07j8P3o4KNjj46J53O6L6L5n1j44Q0k88L03j3p0
$$ -88 10 52 -59 83 -159 75 30 -69 38 20 93 29 31 36 35 -111 42 108 144 179 128 -16 64 -224 79 66 -4
7568dL44n39K93r6k05J83pJ59j07P5j31j92K85j78K95j30r5J02j81R9P7n5J70
$$ -4 340 -199 94 -2 -207 -24 -31 128 21 96 -35 -227 58 -120 175 45 -50 52 -129 -30 47 -8 162
7591A62j83j7p2M8Q9Q5r4J2j4j48Q6K0r0R6j01j4R4R9Kk74J56L12j49j7M1q4l36
$$ 162 -21 -38 -110 -62 27 112 18 30 16 -132 -46 -26 -116 -20 -121 -135 -41 58 60 -214 -58 254 105 88 129 45 -291
7618b91J36J37J04L5j08j37J90j37P2p7J49k1k28R3L1k7pK30j31O8r0L9j18q9
$$ -291 -155 -18 86 121 13 -124 66 -71 1 -76 73 52 -176 -83 -52 -79 -86 144 13 81 -9 30 -88 -177
7642a77L07N3k01j91K14K0j33J37k99K46J3M5L6o8k5L7k4Qm7M1L3N2j48p4O1J05
$$ -177 130 183 -18 -209 5 25 -108 29 -270 -24 -11 34 70 2 -23 14 -10 -2 -49 -8 25 77 -71 -145 -84 21
7668B1p2J61r1Mj28j18K28Kj2P2p8m8rJ14j00r9K72q0k01J1K29j37J10k7Q7j12
$$ 21 -51 110 19 23 -105 -223 5 7 -5 67 -11 -59 -68 46 -54 -153 119 39 -162 -151 78 -59 51 24 111 -1
7694aJ98p5O8k4k40R8J30J02m2r0l52K22J23m2j54N0o4r7K56k51K42j85k1J64
$$ -1 197 122 190 166 -74 24 154 256 214 124 -228 -6 117 75 -79 -29 -93 -190 66 -185 57 -128 -149 15
7718A5m8L4KJ01O9k83j1K13k95M08l04K65l8j63R8rm2J19j37J58k66K08k7N2j32
$$ 15 -33 1 3 104 173 -110 -121 92 -203 205 -99 166 128 -35 63 54 12 131 -6 152 -114 94 67 119 -13
7743a3K04p8J69l72K8j34J61j9o7J39j52J41L6J75j64r3K0K38m7j50J22o3k09
$$ -13 191 113 282 -90 -62 -196 -35 -54 -121 18 -134 7 43 218 54 -39 -19 219 172 22 144 81 -128
7766a28Q8o8J66j71Q2J0Q8K0q9k9J25k40R9O0J44j45J14m0l3k10K7j8J71P5M5
$$ -128 -40 -108 58 -113 -31 -21 67 87 -2 -31 94 -146 -47 13 157 12 126 86 53 -157 -130 -148 23 98 143
7791A43m34K83J85r1L8l6r5jql3O5j9R4j4j9n0kL3j19J13n0j39K12J9o1j04N2
$$ 143 -291 -8 177 86 124 88 -7 -8 -16 -49 16 -3 91 77 58 8 6 39 -80 33 -17 -156 56 75 14 -90 -38
7818c8J0J70k55J86kl28Q6K35KQ9j29j01J60j00K9P7k03Q5j63P1J79k92J42%K10
$$ -38 -28 142 -113 73 71 -257 -171 64 66 155 26 -75 85 -15 14 91 -112 -27 -190 -119 60 -232 -90 -90 120
7843A20l96K48l4J04J3K3j00J10j94J73Mj50J10N7j11km8j10K63J35k21J61kj12
$$ 120 -276 -28 -62 42 55 78 -22 88 -106 67 71 -79 31 88 -23 -25 -73 -183 80 215 -6 155 153 41
7867D1Q3K5k8q7%p9J60j23Q4J5q5J11j28o9P8k53J94O6l3P6n7J26j45O4j4M2k03
$$ 41 124 149 121 34 34 -45 115 -8 76 91 6 117 -11 -80 -2 -255 -61 5 -28 48 -9 117 -28 36 22 64 -139
7894a39K42ll8o6K2P2j10P9k2m7qmk29l4L22j41K9J28j47J87j35rK4N9P8l69J08
$$ -139 103 100 62 -4 18 90 -20 59 37 -10 -18 -22 -251 -285 37 -104 -75 53 -94 93 -42 -51 -27 32 110 -259 -151
7921a51J60L8M1n7J26l58K42r6j3n2J40J30j5j13o0J13j81J71qk8o6J0M1l4M3
$$ -151 9 47 88 31 157 -201 41 -55 -68 -120 20 150 135 22 -38 75 -106 65 57 29 -37 -27 14 -20 23
7946B3K2N4p7r6p6K60j50J18l5j68J23J21j99R2j53K52j23j47L25k87K63j22p
$$ 23 45 99 22 -74 -150 110 -40 78 43 -125 -2 119 -80 12 -141 111 -12 -159 166 -121 142 20 13
7969A3r7J58K5Ro3lk19J57J41j51K91p3p1r4J0k26J98K7j56K10j11o6J8K5J39
$$ 13 -84 74 99 108 45 42 -177 -20 121 -30 261 188 117 23 33 -193 5 32 -124 86 -25 -91 -73 -48 91
7994I1k81N47l41lj46j8K22k00L21o7l78K46N7l4j20J7M6j47M3N2ML16k64K07
$$ 91 -190 357 16 13 -133 -151 71 -129 192 125 -253 -7 50 16 -104 -87 -41 -188 -145 -93 -89 227 -37 170
8018A70k62J32J2J94l13o7J25NK35j94M0K19m41J97Oo9r1o3Q8n5J41l6J37K9k14
$$ 170 -92 40 52 246 -67 -134 -9 -4 231 37 77 296 -145 52 58 -11 -102 -165 -77 -132 9 -27 110 139 -75
8043g5J98k25J7l6k00L24o0K4m2J43l7J35k45K81j1r7k42Q2q2J00J83p3j91o5
$$ -75 123 -102 -85 -121 -321 3 -57 -33 -75 68 31 166 -79 202 191 94 -148 -66 -148 -48 135 62 -129 -194
8067a94K14N5k09J74J39m04J24n0J04J41Oq4J24j68R8j91K96k17K1M4K64k96K4
$$ -194 20 75 -134 40 179 -225 -101 -151 -47 94 100 16 140 -28 70 -121 175 -42 -21 23 287 -9 15
8090A5L5k48J68J21kk17K07j37j20L0L88k95j10K16p1P3j33R0n3l0K35j13N4j92
$$ 15 50 -198 -30 91 89 -128 79 -58 -178 -148 240 -55 -165 51 -20 53 -80 10 -43 -73 162 49 103 -89
8114h9j1P8R5j11K86j31r8J29Pk40K73k60J39j99r9K46J00K46m98K02k19J26r
$$ -89 -100 -22 73 -38 248 117 19 148 155 -85 188 -72 67 -132 -231 15 115 361 -137 65 -154 -28 -37
8137c7J80k60J80%k7Q2j40Q3j82R7J7K6j24J36j71J77R1K80m67J49J60l43k03
$$ -37 143 -117 63 63 36 118 -22 61 -121 -24 -7 19 -105 31 -140 37 128 408 -59 90 250 -93 -296
8160b96K76J9J9m4J50N6n4m4k46J53J1K71k63m2K98j19p8n1j4j57L6N3J2P5l6
$$ -296 -20 -1 18 -26 124 180 126 82 -164 -11 0 271 8 -34 264 145 67 16 2 -155 -119 -66 -54 21 -15
8185a5j22J27j40K79l63J94
$$ -15 -137 -10 -150 129 -234 -40
8191d0
$$ Imaginary data points
##PAGE= N=2
##DATA TABLE= (X++(I..I)), XYDATA
0@%%%%%%%%%%%Qj6J6j6K4l2L2m0N5o3P2q8J04j20J44j70J94k24K58k96L37l82
$$ 0 0 0 0 0 0 0 0 0 0 0 0 8 -8 8 -8 16 -16 16 -24 31 -32 40 -48 56 -64 80 -90 104 -120 138 -158 179 -203
33b03M33m89N51o21O97p80Q70r68J076j194J323j464J618j786J970k171K392k636
$$ -203 230 -259 292 -329 368 -412 458 -510 566 -628 695 -769 849 -937 1033 -1138 1254 -1382
51a382K903l200L532l900M316m788N328n951O684p561Q627r963J1687j4010J7328
$$ -1382 1521 -1679 1853 -2047 2269 -2519 2809 -3142 3542 -4019 4608 -5355 6332 -7678 9650
66I650k2481L1630n2651J89313K4065l89909J11743J99295l8925j05199N4927
$$ 9650 -12831 18799 -33852 155461 179526 -210383 -98640 100655 61730 -43469 11458
77A1458j1781k0036O2480J7306j18394n087R4159K4250k8727j5196n5863K0559
$$ 11458 -323 -20359 42121 59427 -58967 -64054 30105 54355 25628 10432 -45431 -24872
89b4872J01759j8062j33690J6545J29299m663r0013K8128K1605q3030J3554J16782
$$ -24872 76887 58825 -74865 -58320 70979 66316 -23697 4431 26036 -56994 -43440 73342
101G3342k9157j00821M2171P2445n9026n2510N6868K2121l9053M1190L6662r1765
$$ 73342 44185 -56636 -14465 57980 -1046 -53556 3312 25433 -13620 27570 64232 -27533
113b7533n0010Q9976N2440n0884m1141J2321K6796J5543k0041m6729N597O2586
$$ -27533 -77543 12433 64873 13989 -27152 -14831 11965 27508 7467 -39262 -33665 28921
125B8921k401n3115K1234K7847m4311N203N7361l7882o6757O6996R0489p3395
$$ 28921 26520 -26595 -5361 22486 -21825 -16622 40739 2857 -63900 3096 93585 20190
137B0190j06331N5418Q3698l8967l9816L1958R920k6519p082R996M7J106J4465
$$ 20190 -86141 -30723 52975 14008 -25808 6150 16070 -10449 -17531 -7535 -7488 -6382 8083
150H083K513j7631q629L997J5827J8667k3481k8287L3608K7348l7414k0699L3598
$$ 8083 10596 -7035 -15664 -11667 4160 22827 -654 -28941 4667 32015 -5399 -26098 7500
163G500R634l7879l250M4191k583l9872P823K0677j6427p045K1247R997j4895
$$ 7500 17134 -20745 -23995 20196 17613 -22259 -14436 6241 -10186 -17231 4016 14013 -882
176h82j0465R970K385j0744J1781J5104j4734j6525P216J5573m595k1771N389
$$ -882 -11347 -1377 1008 -9736 2045 17149 2415 -14110 -6894 8679 4084 -17687 -12298
189a2298K6609n875k5993l551K0669J4221j5359j5471J2390Q757l872N121j390
$$ -12298 14311 8436 -17557 -21108 -439 13782 -1577 -17048 -4658 4099 227 5348 3958
202C958j2901k08J7649Q502k3521j6248K7192J5608k8092j7036J8264J9443o960
$$ 3958 -8943 -9151 8498 17000 -6521 -22769 4423 20031 -8061 -25097 -6833 12610 5650
215E650j8111K643P727m539P874J1044j3027j1779R637J4753m083j7811M111J8561
$$ 5650 -12461 -9818 -2091 -6630 1244 12288 -739 -12518 -2881 11872 7789 -10022 -5911 12650
229A2650o027j4606M15O509M377n374n212O853l78p658N746P392m075o960K786
$$ 12650 6623 -7983 -7568 -1059 3318 -2056 -7268 -415 -793 -8451 -2705 4687 612 -6348 -3562
244c562J3146k584j2152Q759M047j4116M872J5169q122j6228M645J6494n636j8488
$$ -3562 9584 7000 -5152 3607 7654 -6462 -1590 13579 5457 -10771 -6126 10368 4732 -13756
258a3756P010J4000l981l699k378k989P377M680l522j217o34K633M047k560m629
$$ -13756 -6746 7254 3273 -426 -2804 -5793 1584 6264 2742 1525 891 3524 7571 5011 382
273C82l992N617J0210j0738j1859J2525M910j1276k396P000L706m074k338O879
$$ 382 -3610 2007 12217 1479 -10380 2145 7055 -4221 -6617 383 4089 15 -2323 4556
287D556m34o378M880L019k212J194m72p3r46m903L809L673q189q51O115j6l975
$$ 4556 4122 -2256 2624 5643 3431 4625 4153 4080 3134 -1769 2040 5713 -2476 -3327 2788 2772 -1203
304a203m822L643P531m995k962N667N07o95n83j232M000j982l074P051j711q922
$$ -1203 -6025 -2382 5149 154 -2808 2859 3366 2671 2088 856 4856 2874 -200 6851 5140 -3782
320c782K574M688j995n838n90Q283j668q218M858L329m245K212J830L48J525k551
$$ -3782 -1208 3480 1485 -4353 -4943 3340 1672 -6546 -1688 1641 -2604 -392 1438 1786 3311 760
336G60Q63K300l410%J683r45N57l192n87L341n456j397O978j913m059K098K502
$$ 760 1623 3923 513 513 2196 1251 1808 -1384 -1971 1370 -4086 -5483 1495 -418 -4477 -2379 123
353A23J679l262j627O294p43k217L930k170l848K712J536q12m472k010P001m78
$$ 123 1802 -1460 -3087 3207 2464 247 4177 2007 -1841 871 2407 1595 -2877 -4887 2114 1636
369A636o488J254j24M57M824k889k235M159K06k82O83N08M3l506L196O265q722
$$ 1636 -4852 -3598 -3722 -3265 1559 -1330 -3565 594 800 518 1201 1709 1752 -1754 1442 7707 -1015
386a015m970P697p24l488J132k108j442L438L753k160q158J853R918j149j452
$$ -1015 -5985 1712 988 -2500 -1368 -3476 -4918 -1480 2273 113 -8045 -6192 3726 2577 1125
401A125J108n628K708Q858n196q177K198P212K197p582m332N46M90O774J437j2680
$$ 1125 2233 -3395 -687 8171 2975 -5202 -3004 4208 6405 -1177 -5509 -4963 -4473 2301 3738 -8942
417h942j7J2730J088o044m325J591N307K127K310j390r157K092Q985m260p247
$$ -8942 -8959 3771 4859 -1185 -5510 -3919 1388 3515 5825 4435 -4722 -2630 6355 2095 -5152
432e152R26O276N412p171r456K29M333P898L432r614k747O023l23L3K183r38j825
$$ -5152 -4226 2050 7462 291 -9165 -8936 -4603 3295 6727 -2887 -5634 389 66 99 2282 1344 -481
449d81J211O229o18j2048N15R952l680n636K900K341J622k004n788k599K088Q804
$$ -481 730 6959 6341 -5707 -5192 4760 1080 -4556 -1656 685 2307 303 -5485 -8084 -5996 2808
465B808N974n220k427j943p827N575J3967j698r644r10O132k832j1182M402J1958
$$ 2808 8782 3562 1135 -808 -8635 -3060 10907 9209 -435 -1345 4787 1955 -9227 -4825 7133
480G133n344n451M452k236l556K393J895Q43O76J944q83j662Q299k004j8756M859
$$ 7133 1789 -3662 790 -1446 -5002 -2609 -714 129 805 2749 1866 204 8503 6499 -12257 -7398
496g398K1026m365j2038O282J424j5773l867J9695N841j5320L704R258j4450o661
$$ -7398 13628 9263 -2775 3507 4931 -10842 -14709 4986 10827 -4493 -789 8469 -5981 -12642
510a2642J1253K106M506J2120j0153k3321O348K4436n536j8221J2740N904k0632
$$ -12642 -1389 717 5223 17343 7190 -16131 -9783 14653 9117 -9104 3636 9540 -11092
523a1092Q493K0317k1089j9864K1647J5233j4898m320J2867n698j0164J1159m374
$$ -11092 -2599 17718 -3371 -23235 -1588 13645 -1253 -5573 7294 1596 -8568 2591 -1783
536a783j3181K7163K1871l4171k4516J9537R579p480J3378R460l0227j5012L3255
$$ -1783 -14964 12199 34070 -101 -24617 -5080 4499 -2981 10397 19857 -10370 -25382 7873
549G873O490l2317N589K6385p498r063N953j0746p336K5813J2041l4191j0396
$$ 7873 14363 -17954 -12365 14020 6522 -2541 3412 -7334 -14670 11143 23184 -11007 -21403
562b1403L8652M283l1129M047Q533k0409J1360L4217j6875l6691J4441K4821j9709
$$ -21403 17249 21532 -9597 -5550 2983 -17426 -6066 28151 11276 -25415 -10974 13847 -5862
575e862j1436K5397J984j1797J5152q894l4654J7616M1182j2771k6937J2889M939
$$ -5862 -17298 8099 10083 -1714 13438 4544 -30110 -12494 28688 15917 -11020 1869 6808
588F808k3725R557K9745k1870k5116L0455J2786l0916n68K0590r620q502J7443
$$ 6808 -16917 -7360 22385 515 -24601 5854 18640 -12276 -12844 7746 -1874 -10376 7067
601G067O97j7614J3763J8501k8352j9009K8113R412j3838J2774K978l3384o939
$$ 7067 7764 -9850 3913 22414 -5938 -24947 3166 12578 -1260 11514 14492 -18892 -25831
614b5831L4265P850k3877L316J5948j6439j0855J8070j132r420J8800N772k4757
$$ -25831 8434 16284 -7593 -4277 11671 -4768 -15623 2447 1315 -8105 10695 16467 -8290
627h290m548K1707J192j6648M007Q838j1547K544J7200j4019j8865J4614J1458
$$ -8290 -12838 8869 10061 -6587 -2580 6258 -5289 -2745 14455 436 -18429 -3815 7643
640G643j0969j078J1777k810j2065K524M765n919R227J5740j3867j5459R865L659
$$ 7643 -3326 -4404 7373 4563 -7502 -4978 -213 -6132 3095 18835 4968 -10491 -626 3033
654C033r436M436J2185n005j2208K941M346p789L172J2354n800q451N778J845
$$ 3033 -6403 -1967 10218 5213 -6995 -4054 292 -7497 -4325 8029 2229 -6222 -444 1401
668A401k798K401J106l221r78O175L416o313j456P91o048J219P599m24k614m19
$$ 1401 -1397 1004 2110 -1111 -2089 4086 7502 1189 -267 524 -5524 -4305 3294 2870 256 -163
684a63k930k521n58N758P959k684n698j825p53K976M284L11j285l475K12M819
$$ -163 -3093 -5614 -6172 -414 7545 4861 -837 -2662 -3415 -439 3845 4156 2871 -604 -392 4427
700D427m196n179N167J967l887n24Q76M55l26J144N2m609K398R396k259o505J606
$$ 4427 231 -4948 219 2186 -1701 -2225 -1349 -894 -1220 -76 -24 -4633 -2235 7161 4902 -1603 3
717Cn87n97M643O36m038n84L176j247p487K335P446m462k327N392l896m635O467
$$ 3 -584 -1181 3462 4098 60 -524 2652 1405 -6082 -3747 3699 -763 -3090 2302 -1594 -6229 238
734B38M259l907k413M308J480n807K119N082n841k859O625j405l711J602R1k015
$$ 238 4497 590 -1823 2485 3965 -1842 277 5359 -482 -3341 3284 1879 -1832 -230 -139 -2154
750b154rJ568n63k387M596L077p784o06P897j460k676L576r2m137J79M242j151
$$ -2154 -2163 -595 -1158 -3545 1051 4128 -3656 -4262 3635 2175 -501 3075 2983 -1154 -975 3267 2116
767B116o138L726M420o974j111N490l030j878M327q85l221J880M418j592m154
$$ 2116 -4022 -296 4124 -2850 -3961 1529 -1501 -3379 948 63 -3158 -1278 3140 1548 -2606
782b606L582L016m713J629L197n173j69L998k708k623J931J352k115j744L401
$$ -2606 976 3992 -721 908 4105 -1068 -1237 2761 53 -2570 -639 713 -1402 -3146 255
797B55p9m307L717L289m664L23L632q08m95N64j42lj262J667j38l302J285J083
$$ 255 176 -4131 -414 2875 -1789 -1466 2166 1358 863 1427 1285 1282 20 1687 1549 -1753 -468 615
815F15k725J366M00k341J274J346l40m46q68K560J113k583J387J313j826J217
$$ 615 -2110 -744 -344 -2685 -1411 -65 -405 -851 -1719 841 1954 -629 758 2071 245 1462
831A462M20j951M56N9P9p94j979J701Q94l179J530J673k043R71J111p91Q93q2
$$ 1462 1882 -69 387 446 525 -269 -2248 -547 347 -2832 -1302 371 -1672 -701 410 -381 512 430
849D30O77j04q74K164l86k948K128K56k665J327L35k167L22R23M40j176j513K937
$$ 430 1107 1003 129 2293 1907 -1041 1087 1343 -1322 5 340 -1827 -1505 -582 -142 -1318 -2831 106
867A06M86j572K230o04j847L102K56k047P06o8M67j27j374J43o91q73K317j358
$$ 106 592 -980 1250 646 -1201 1901 2157 110 816 748 1215 1088 -286 -143 -834 -1707 610 -748
885g48k096K050J48k79J513j276l47J127J228J734k702k242L641J098k714l06
$$ -748 -2844 -794 -646 -925 588 -688 -1035 92 1320 3054 352 -1890 1751 2849 135 -171
901a71J81M88J49j789Mp12n77L519Lk869J98j10J636L005j824k703J839K545L75
$$ -171 10 498 647 -1142 -1138 -1850 -2427 1092 1095 -1774 -1576 -1686 -50 2955 1131 -1572 267 2812 3187
920C187l670j508L715j11k110J263j153j438J563m29o93m46n8K647J401k134j179
$$ 3187 -483 -1991 1724 1613 -497 766 -387 -1825 -262 -691 -1384 -1830 -1888 759 2160 26 -1153
937a153r12J848M009j195k600L39L39N66j402j993K924Q98k316M45o73k337J216
$$ -1153 -2065 -217 3792 2597 -3 336 675 1241 -161 -2154 770 1668 -648 -203 -876 -3213 -1997
954a997J889J309j130j766K094J216q84O43k460r07O031O5m782M72K196k629l546
$$ -1997 -108 1201 71 -1695 399 1615 731 1374 -1086 -1993 4038 4103 -679 -207 1989 -640 -4186
971d186K850N052l509k860M474k903n832M851N309r49q47n44k281j105L249K881
$$ -4186 -1336 3716 207 -2653 1821 -1082 -6914 -2063 3246 2297 1450 906 -1375 -2480 769 3650
987C650l290N4M002n464l500P156l90p210K144N285k019l658L934K255p483r74
$$ 3650 360 414 4416 -1048 -4548 2608 2218 -4992 -2848 2437 418 -3240 694 2949 -4534 -5508
1003e508Q768q29l081N881j071q386j18N546O86o77L849j044j0875J41R726k729
$$ -5508 3260 2431 -650 5231 4160 -4226 -4344 1202 1888 1211 5060 4016 -6859 -6718 3008 279
1019B79m505P426N54q020J290N014l625k330Q061K410r553R78Q437o423m159P885
$$ 279 -4226 3200 3754 -4266 -2976 2038 -1587 -3917 4144 6554 -2999 -2021 6416 -7 -4166 3719
1035C719k855p542Q794P495j1097q178Q738L197q656N597J0683r060p094P667
$$ 3719 864 -6678 2116 9611 -1486 -9664 -926 2271 -6385 -788 9895 835 -6259 1408
1049A408j638p290R069R407o359p297K153j850m031J0317N425j3090k298J1214
$$ 1408 -230 -7520 1549 10956 4597 -2700 -547 -2397 -6428 3889 9314 -3776 -6074 5140
1063E140m873q311Q581M563j0105p45J2207j411j1142O520O385j2214j193J3431
$$ 5140 267 -8044 537 5100 -5005 -5750 6457 5046 -6096 424 6809 -5405 -6598 6833
1077F833j23o907K857k056j0114K991J3707q15r801M112R63j0825L680J2064m791
$$ 6833 6710 -197 2660 604 -9510 -6519 7188 6373 -3428 684 1647 -9178 -5498 6566 1775
1092A775n419Q328K01j0694J163J0374k816o353P187J096j0941M954Q870j0379
$$ 1775 -3644 4684 4885 -5809 -4646 5728 2912 -3441 3746 4842 -6099 -1145 7725 -2654
1106b654o549J0769K917p656K069O715p216p480R544L951p527N242O982r463n927
$$ -2654 -9203 1566 4483 -3173 -1104 5611 -1605 -9085 459 4410 -3117 2125 9107 -356 -6283
1121f283N321J461j236N954J936j0124m349P664k39n161P526L480j0131r39P766
$$ -6283 -962 499 -737 5217 7153 -2971 -7320 344 105 -5056 2470 5950 -4181 -5120 2646
1136B646j753m368M350L481o039j999Q478J36p316J387K018m313K715O065k673
$$ 2646 893 -3475 875 4356 -1683 -3682 4796 4932 -2384 -997 1021 -3292 -577 5488 2815
1151B815n009r45O90r91K179N699j557m729J505r41k462M807M089l198k599Q51
$$ 2815 -2194 -3139 -2449 -3440 -1261 4438 2881 -1848 -343 -1284 -3746 1061 5150 1952 -647 204
1167B04K03j636P15L228k027l260L210P23l199N20Q95o71j41O06K025M21j448
$$ 204 407 -1229 -514 2714 687 -2573 637 1360 -1839 -1319 -424 -1095 -1236 -630 1395 1816 368
1184C68K29r18j356K103J511N12n1l226j467J345k30J185J875j179j461j348k02
$$ 368 597 -321 -1677 426 1937 2449 2398 -828 -2295 -950 -1180 5 1880 701 -760 -2108 -2310
1201b310J146R06J285J075k372m84J270n95J516Q92l185j43K237n53j179L83Q58
$$ -2310 -1164 -258 1027 2102 -270 -754 516 -79 1437 2329 -856 -999 1238 685 -494 -111 747
1218G47k259j954M488J360m593J141K874l931p27M281J369k399p8J287k054j505
$$ 747 -1512 -3466 1022 2382 -2211 -1070 1804 -2127 -2854 1427 2796 397 319 1606 -448 -1953
1234a953M071L19l881J556Q67l420R83K859k002j225K109Q50k871L06L289j027
$$ -1953 2118 2437 -1444 112 979 -2441 -1458 1401 -601 -1826 283 1133 -1738 -1432 1857 830
1250H30l206L311J414l633J595K534k541j961J921J526k500r47L059j187l224
$$ 830 -2376 935 2349 -1284 311 2845 304 -1657 264 1790 -710 -1657 1402 215 -3009
1265c009K730J125k758J429J874j742r01J739L46j046K02K104j720j791L510n59
$$ -3009 -279 846 -1912 -483 1391 -351 -1252 487 833 -213 -11 2093 373 -1418 2092 1533
1281A533l258J874J478k807n71J882L78k338M77K929j912j740L647R8k677J176
$$ 1533 -1725 149 1627 -1180 -1751 131 509 -1829 -1352 1577 -335 -2075 1572 1670 -1007 169
1297A69J300j209l89J256K52j518l01J516j162j166K309j518j459K110k83j726
$$ 169 1469 260 -129 1127 1379 -139 -440 1076 -86 -1252 1057 -461 -1920 190 -93 -1819
1313a819J004J620n49j307J063J670j754n03K587j376j566J539L73j483J73M64
$$ -1819 -815 805 256 -1051 12 1682 -72 -575 2012 636 -930 609 982 -501 -328 136
1329A36j46q43j50J210p52p73J698o34p58J636l81k34N16o8L58n16n7J020j477
$$ 136 -10 -853 -1003 207 -545 -1318 380 -254 -1012 624 243 9 525 457 815 299 242 1262 -215
1348b15l32J378j082j138J591k26p34LO59K52j149O21J501j530j05K020p78j322
$$ -215 -547 831 -251 -1389 202 -24 -758 -755 -96 156 -993 -372 1129 -401 -506 1514 736 -586
1366e86J340J13q26O9K3P6o65K80L27j249M51J332j601k31J565o27m65J083L27
$$ -586 754 867 41 110 133 209 -456 -176 151 -1098 -647 685 -916 -1147 418 -209 -674 409 736
1385G36m94m31J141N01j719K63J411j356m59J079r53o70L97M74j88n50O35K79
$$ 736 242 -189 952 1453 -266 -3 1408 52 -407 672 -281 -951 -554 -80 -268 -818 -183 96
1403I6n53K89N30q52O27J167p98j92K34J2l28j71K35K0j205O72O81j702J09J074
$$ 96 -457 -168 362 -490 137 1304 506 314 548 560 232 61 296 316 -889 -217 464 -1238 -1129 -55
1423e5r8k62J02K11J81l08M42P13j249O92R12j277K94O1p15o7M79J11j60n75M26
$$ -55 -153 -415 -313 -102 79 -229 213 926 -323 369 1281 4 298 359 -356 -423 56 167 7 -568 -142
1444a42K49j700N37J628j60l07J37k95l54L37N06R93j072N0L23j129J70N60n85
$$ -142 107 -1593 -1056 572 412 105 242 -53 -407 -70 436 1429 357 407 730 -399 -229 331 -254
1463b54j27M38j28m27k26Q71j58j398Q76K053j216k33R66o64j445P18J673k44
$$ -254 -381 57 -71 -498 -724 147 -11 -1409 -533 1520 304 71 1037 373 -1072 -354 1319 1075
1481A075p71N96m55k488J185J765j582P2K172j626k150J245J905j371l25K555
$$ 1075 304 900 445 -2043 -858 907 -675 -603 1569 -57 -2207 -962 943 -428 -753 1802
1497A802j98l101J661J721k710L1K559j574j301K150K48k875p16L150j338j899
$$ 1802 1604 -1497 164 1885 -825 -794 1765 191 -1110 1040 1288 -1587 -2303 847 -491 -2390
1513b390M250J108n319J31L308j424j061L755J065l748j755K637o25j659L883
$$ -2390 1860 2968 -2351 -2220 1088 -336 -1397 2358 3423 -325 -2080 557 -68 -1727 2156
1528B156O04m345k5K485k005o45K905j86l368J372L742k604k571L845K19m201
$$ 2156 2760 -1585 -1610 875 -1130 -1775 1130 944 -2424 -1052 2690 86 -2485 1360 1579 -2622
1544b622K636M035l314k138K294p28l515K864M288k944l116K979j150l961M016
$$ -2622 14 4049 735 -1403 891 163 -3352 -488 3800 856 -2260 719 -431 -4392 -376
1559c76L765l211j258K726r80l737K505L728k876j276L378j648l823L287J803
$$ -376 3389 178 -1080 1646 666 -3071 -566 3162 286 -990 2388 740 -3083 204 2007
1574B007l677Q6L281j610k416L008J353m859l92N444j078k762L954O48n294n00
$$ 2007 -1670 -1584 1697 87 -2329 679 2032 -2827 -3219 2225 1147 -1615 2339 2987 -2307 -2807
1590b807L858K13j219K385J95m842j224L875l04p48K608q05l946J316K695j375
$$ -2807 1051 1264 45 2430 2625 -2217 -3441 434 130 -618 1990 1185 -2761 -1445 1250 -125
1606a25r53K426M41l524J269L448k439k558K437J28k093K032K244k435k738J194
$$ -125 -1078 1348 1789 -1735 -466 2982 543 -2015 422 550 -1543 489 2733 298 -2440 -1246
1622a246J034j165J738K717k960k300J869o2q39K132J865j998j640N45K98j282
$$ -1246 -212 -1377 361 3078 118 -2182 -313 -375 -1214 918 2783 785 -855 -310 -12 -1294
1638a294J346J824k102p75J550q89j435J930M22j670J75J875J72j817O90J115
$$ -1294 52 1876 -226 -1001 549 -340 -1775 155 577 -1093 -918 957 1129 -688 2 1117
1654A117k059k03K324N10j201K6q43j053M15J245J102p58m80p30j278P79J708
$$ 1117 -942 -1145 1179 1689 488 514 -329 -1382 -967 278 1380 622 142 -588 -1866 -1087 621
1671F21m36N13Q9j182n78J049P21q5n34J52k47l54N01M58r00o79M9M91O91K54
$$ 621 185 698 787 -395 -973 76 797 712 178 330 83 -271 230 688 -212 -891 -842 -351 340 594
1691E94q37q3l27k51J143N44M09p43o38K2j87J92J246J56j326l77J55j93P3K55
$$ 594 -243 -326 -653 -904 239 783 1192 449 -189 -167 -354 -162 1084 1240 -86 -463 -308 -501 -428 -173
1711a73L32l10m00N95k97l61Q69M9n91N75J85m63K39K47n36o39O34N61l44m00
$$ -173 159 -151 -551 44 -253 -614 255 304 -287 288 473 10 249 496 -40 -679 -45 516 172 -228
1731b28Q89j004j285J569N09o94J0R12p18r42R13J128o91m14J056r75r68J268
$$ -228 661 -343 -1628 -59 450 -244 -234 678 -40 -982 -69 1059 368 -46 1010 35 -933 335
1749C35K11n15Q5J50q36P5M61M77j257J26J222r36l43J369k2j147M31P56k54n97
$$ 335 546 31 116 266 -570 -495 -34 443 -814 -688 534 -402 -745 624 602 -545 -114 642 388 -209
1769b09Q72L21j468O7R64p53k89Q18j28j094O88L48m08j48L73J88n50K51Q09o99
$$ -209 663 984 -484 -417 547 -206 -495 323 195 -899 -211 137 -271 -419 -46 142 -408 -157 652 -47
1789d7j13J003n61n06M00J39m14l19M81J29o94J17R34j006k10R50j92o13K25N95
$$ -47 -160 843 282 -224 176 315 -99 -418 63 192 -502 -385 549 -457 -667 283 91 -522 -297 298
1809B98j21k14M29J77n66K93L81p34j70O30n52k37J96K01l93k17N84J78o35M68
$$ 298 177 -37 392 569 3 296 677 -57 -227 403 -149 -386 -190 11 -382 -599 -15 163 -472 -4
1829dM48p63O0Q49k69j97P6J59l67M3%L48o55L6L63n01J3K70O9j38j50L28M8o0
$$ -4 444 -319 -259 590 321 124 200 359 -8 35 35 383 -272 -236 127 -374 -361 -91 -22 -160 -310 18 66 6
1853Fn3M93o35L54J66l65J02N23l89l32M43m17J51q24O54J88p83L91L27k87M66
$$ 6 -47 446 -189 165 331 -34 68 591 202 -130 313 -104 47 -777 -123 65 -718 -327 0 -287 179
1874A79J84k42j22K24P1j76k62M62j33m60J55O74r79K52M39n45k70M28J42l00
$$ 179 363 121 -1 223 294 118 -144 318 185 -275 -120 554 -425 -173 266 -279 -549 -121 21 -279
1894b79K85K90j79l37M69J16m22M8M36n05o7J59o0J26l00K37R9n40L77j1l56L17
$$ -279 6 296 117 -220 249 365 -57 -9 427 -78 -145 14 -46 80 -220 17 116 -424 -47 -58 -414 -97
1916i7N2j87L10N9j32j54K98J29j07j85L80j48p37L68R2%k9J56j63r6L5O8O1j98
$$ -97 -45 -232 78 137 5 -149 149 278 171 -14 366 218 -519 -151 -59 -59 -88 68 -95 -191 -156 -88 -27 -225
1940b25N27j18k14J85l5k01R2K34j40L21o36K29j82l59N34J73k58m1J96m04k7
$$ -225 302 184 -30 155 120 -81 11 245 105 426 -210 19 -163 -522 12 185 -73 -114 82 -322 -349
1961c49J22L97k10J50M03k35p38O87K92n53j00L96p1m09J62K02m29l60O58p0l58
$$ -349 -227 170 -40 110 513 278 -460 227 519 -34 -134 262 191 -218 -56 146 -283 -643 15 -55 -413
1982d13P35n1p45J02N60m11L41M64L51j049m69Q46k83l73Q32L29j381L06M55k80
$$ -413 322 271 -474 -372 188 -223 118 582 933 -116 -585 261 -22 -395 437 766 -615 -309 146 -134
2002a34o59P04O02q29l31J334n06j021J118J81q55N63O53p02p77P86K88j160L57
$$ -134 -793 -89 513 -316 -647 687 181 -840 278 459 -396 167 820 118 -659 127 415 -745 -388
2021c88J378q95r98J148k19j214J158J032r80l49O60K9j615R25J457j068p38J696
$$ -388 990 95 -903 245 26 -1188 -30 1002 22 -327 333 362 -1253 -328 1129 61 -677 1019
2039A019q04j507J374Q73j109p05J494m15r90P09Q85j483l07J650q9j086J313
$$ 1019 215 -1292 82 955 -154 -859 635 220 -770 -61 824 -659 -966 684 595 -491 822
2056H22p0j655r3J900j07j025J014O0k039k97K190m35r07J265o9j835J63J867
$$ 822 752 -903 -996 904 797 -228 786 846 -1193 -1490 700 265 -642 623 554 -1281 -1118 749
2074G49l77j023J110L32j339J06J652j267p89J221L47j422P31J006j331j115J202
$$ 749 372 -651 459 791 -548 -442 1210 -57 -846 375 722 -700 31 1037 -294 -1409 -207
2091b07Q48j392R71J181j774o78J236K97j242J333Q72j358r48J019O8j231J301
$$ -207 641 -751 220 1401 -373 -1051 185 482 -760 573 1445 87 -861 158 226 -1005 296
2108B96Q87j416m42R89m39p58J000M95r44l72J010j53p09Q30K93j325N07J209
$$ 296 1183 -233 -675 314 -125 -883 117 612 -332 -704 306 153 -556 274 567 -758 -251 958
2126I58m82p78K93Q2r60M70J158j46p82K35l97q81O50J387m12k45R2l21o77N04
$$ 958 476 -302 -9 73 -887 -417 741 595 -187 48 -349 -1230 -580 807 395 150 242 -79 -756 -252
2146b52P45j71m99K26J49n85M56M07o02n25P27j77KL14o7o25j89O08J62r8M50
$$ -252 493 322 -177 49 198 -387 69 476 -126 -651 76 -101 -99 215 148 -477 -666 -58 104 6 456
2167D56j33p06R4M36m4k2L47j47o10j38K18k5K22L10j50m26nK35k70N71K02n09
$$ 456 323 -383 -289 147 103 81 428 281 -329 -467 -249 -274 -52 258 108 -318 -323 -88 -358 213 415 -94
2189i4J85j8K29k6l8l13r6l29N92J22k57l2k05k03L31J16N5J80j9j65n08L14N20
$$ -94 91 73 302 276 238 -75 -171 -500 92 214 -43 -75 -280 -483 -152 -36 19 199 180 15 -493 -179 341
2212C41qj44J08m26l18N94L2j50k6J55n66J47n3O90p29ML52l39M25K06o2m02L27
$$ 341 333 189 297 -129 -447 147 179 29 3 158 -408 -261 -314 376 -353 -349 3 -336 89 295 233 -169 158
2235A58R6k83k4K69J71p13J85N1j88P0M51l26l20K67J38j35J00J82J57n29K97
$$ 158 254 -29 -53 216 387 -326 -141 -90 -278 -208 243 -83 -403 -136 2 -133 -33 149 306 -223 74
2256G4K10k39j73N37k86l31J70K36R3n60K57q9k51K36M29m41K3K45l36m0K45J60
$$ 74 284 45 -128 409 123 -208 -38 198 291 -269 -12 -101 -352 -116 313 -128 -105 140 -196 -236 9 169
2278A69L2k92K99j77o5j4L11l32K52L9m40r2K32J00k04K09Q0r4l96O06Pl46K81
$$ 169 201 -91 208 31 -34 -48 263 -69 183 222 -218 -310 -78 22 -182 27 107 13 -383 223 230 -116 165
2301A65M2o8k56M12j33p7q7J20k35K5rJ63k44n4M14k24j00J56J44l14J61P9L8
$$ 165 207 139 -117 295 162 85 -2 118 -117 -92 -101 62 -182 -236 178 -46 -146 10 154 -160 1 80 118
2324A18l10J29j1p2J39Q9j66k9O9J93j04k34K58r1k34J30J57Lq9P5J89j28j37
$$ 118 -192 -63 -74 -146 -7 82 -84 -113 -44 149 45 -189 69 -22 -256 -126 31 34 -55 20 209 81 -56
2347e6M4J97j73P2J0j57J98k50J56n7q8J64n8j28J07O5j42lK81k76J06J11o6l8
$$ -56 -12 185 12 84 94 -63 135 -115 41 -16 -104 60 2 -126 -19 46 -96 -99 182 -94 12 123 57 19
2371A9J35m5q9n8q3J27k65Q3N5p3J05J2n5J37M0J87p1j48J8J3k4K39r2k64N9P2
$$ 19 154 109 20 -38 -121 6 -259 -176 -121 -194 -89 -77 -132 5 45 232 161 13 31 44 20 259 167 -97 -38 34
2397C4m1p3m4j3p0N6l9J94j85J53J36k39K24J41l05MRM7J21L6j51N0k1K0j00r1
$$ 34 -7 -80 -124 -137 -207 -151 -190 4 -181 -28 108 -131 93 234 -71 -67 -58 -11 110 146 -5 45 24 44 -56 -147
2423a47N2Nj67L32q2k81K00RK57J13q8j57j85K45j18O0KO7J06k36P2k08P7J73
$$ -147 -95 -90 -257 75 -7 -288 -88 -79 178 291 203 46 -139 106 -12 48 50 117 223 -13 59 -149 -72 101
2447A01m9q4J02j21j2J35j19M2J56p6O9j19J23l24l7K54o4J36J7k76K4O8J47m7
$$ 101 52 -32 70 -51 -63 72 -47 -5 151 75 144 25 148 -176 -213 41 -23 113 130 -146 -122 -54 93 46
2471D6j97M5L64k12j69J19J00k40K54K30m90K35O2nj96j54J27j16NK76K0l52J78
$$ 46 -151 -106 258 46 -123 -4 96 -144 110 340 -150 85 147 142 -54 -208 -81 -197 -192 84 104 -248 -70
2494g0O1l80K64K66m4j26N3K41l07mK08m6r6q2J61j38J59L4j90k08P5K74j14j10
$$ -70 -9 -389 -125 141 97 -29 24 265 -42 -46 162 116 20 -62 99 -39 120 154 -36 -244 -169 105 -9 -119
2518a19K97k39j86N05k64j08L9L34l68j6J33M21n09k8M37m32k04M97j93k65K07
$$ -119 178 -61 -247 258 -6 -114 -75 259 -109 -125 8 429 -80 -108 329 -103 -307 190 -3 -268 -61
2539f1K37m44J19K27K7m31M42J59n61J01N66j84l33j23N23l91j5L70j14m50J96
$$ -61 176 -268 -149 78 105 -326 116 275 -286 -185 381 197 -136 -259 264 -127 -142 228 114 -336 -140
2560a40O42n94K8L85j66o20L63K95l16J89L72k05p34M98J89n54O80K20o01m40
$$ -140 502 -92 -64 321 155 -465 -102 193 -123 66 438 233 -501 -3 186 -368 312 532 -69 -509
2580e09M03J56j98j34M66k33l09N92l6p55M11M07m08J8L58J87m09k56J70l34p7
$$ -509 -106 50 -148 -282 184 -49 -358 234 198 -557 -146 261 -147 -129 229 416 7 -249 -79 -413 -490
2601d90R52j08o26K59J34m13P4O85k12n15J80j7k78K3Q49l11m05J31K92l50MK54
$$ -490 462 354 -272 -13 121 -292 -218 467 255 -260 -80 -97 -375 -352 497 186 -219 -88 204 -146 -142 112
2623A12l36j96N00J22k45k8K30k54q1M12J06k64L0J55l67q5K20J52j00K09k35
$$ 112 -224 -420 80 202 -43 -71 159 -95 -176 236 342 78 108 263 -104 -189 31 183 83 292 57
2644E7l51k1K86J76l51L35J12m08j68L63j70K5J96R2l35R3J95j41k0Q1qj53J98
$$ 57 -294 -315 -29 147 -204 131 243 -165 -333 30 -140 -115 81 173 -162 -69 126 -15 -35 46 38 -115 83
2667H3n1j17j15p9L18j43L22K2l39j99L40j69P1J08L91l85j89j4k7L5K40J38l3
$$ 83 32 -85 -200 -279 39 -104 218 240 -99 -298 42 -127 -56 52 443 58 -131 -145 -172 -137 103 241 208
2690B08l04p2l9J92K04l8n7j63K05l38K57n7J2j61K47j73J90p2K66l16j85K47
$$ 208 -96 -168 -207 -15 189 151 94 -69 136 -202 55 -2 10 -151 96 -77 113 41 307 -9 -194 53
2712E3l0M8j70J40j14M6J33j67N0Q4j45K3J17O9l8O5j57M1k51K50M7k01M4L4M2
$$ 53 23 71 -99 41 -73 -27 106 -61 -11 73 -72 -49 68 137 99 164 7 48 -203 47 94 -107 -63 -29 13
2737A3j51K67J39l62J44qn6L6J42k6L2k6k38J80j40j07L63j19j77j10L4J23L7
$$ 13 -138 129 268 -94 50 42 -14 22 164 138 170 144 -94 86 -54 -161 202 83 -94 -204 -170 -47 -10
2760a0J04j29j24K13nj68L66J1j94m3K7J06j54n7J59J11l65L38j43r4nP3j15L
$$ -10 94 -35 -159 54 49 -119 247 258 64 21 48 154 0 -57 102 213 -152 186 43 -51 -56 17 -98 -95
2784i5J75j19n0J45J38l28J58K01k08j0R4j13r7l3k9K33j48J26J94k43k34J82
$$ -95 80 -39 -89 56 194 -134 24 225 17 7 101 -12 -109 -142 -171 62 -86 40 234 -9 -243 -61
2806f1L0j99K22O3j79L1P0P8n4j18J70N2j73n5Q7m9M7R3n2K10l36L9K04j55K52
$$ -61 -31 -230 -8 55 -124 -93 -23 55 1 -117 53 105 -68 -123 -36 -85 -38 55 3 213 -123 -84 120 -35 217
2831B17j10j10k5l9J76j47R0J06N4l41K37p5K6k74J21n8N2J00j33K79q4k03L61
$$ 217 107 -3 -28 -67 109 -38 52 158 212 -129 108 33 59 -215 -94 -152 -100 0 -133 146 62 -141 220
2854B20j45J13j33j4p7K41j5r2p8j44k2K41j32N7J68k03L0l64M45q9j93M7J31
$$ 220 75 188 55 41 -36 205 190 98 20 -124 -146 95 -37 20 188 -15 15 -349 96 7 -186 -139 -8
2877hP5o2j82L75r6j37R0q8lO1j06j92J42J61j69O5J11j15J86j79k2K58l02R8
$$ -8 67 5 -177 198 102 -35 55 -33 -36 25 -81 -273 -131 30 -139 -74 37 -78 108 -71 -93 165 -137 -39
2901c9J16j6r0n0P1Qk08L77k70N7O8j00r6K04k60K09J43k99J72j2J87m06M24m05
$$ -39 77 61 -29 -79 -8 0 -208 169 -101 -44 24 -76 -172 32 -228 -19 124 -175 -3 -15 172 -234 190 -215
2925b15J37M9K40j99R4j64J50o0j03M7J58j47P8l7p3J01k71Q1j40K05L5J0J5K29
$$ -215 -78 -29 211 12 106 -58 92 32 -71 -24 134 -13 65 28 -45 56 -215 -134 -274 -69 -34 -24 -9 220
2949B20j63K2p5j38J45J78k35Oj54K7O0R1P9n2kj68J80j1Q3p6K0J3r8j33K61r2
$$ 220 57 79 4 -134 11 189 -46 -40 -194 -167 -107 -16 63 11 9 -159 21 10 93 17 37 50 -48 -181 80 -12
2975a2J14l14K65j29j52J64Q0j00J74J2k35O0K5r0M8K42k22J81k5o4Rj9Pjkj57
$$ -12 102 -212 53 -76 -228 -64 16 -84 90 102 -133 -73 -48 -138 -90 152 -70 111 86 22 31 12 19 18 16 -141
3001a41k9K03k92K43L37k73l8K2J69j16j85M73l45J28o0j58L7M8O3k14O8R2R6
$$ -141 -170 33 -259 -16 321 48 10 32 201 85 -100 373 28 156 96 -62 -25 23 86 -128 -60 32 128
3024A28k54J62K82n21J01Q7J20k32J45r6J99o3j69J29Q0j66M3k09R1P5J90k55
$$ 128 -126 36 318 -203 -102 -15 105 -127 18 -78 121 58 -111 18 98 -68 -25 -234 -143 -68 122 -133
3046a33J29M12m76N8K85j72l99K49J87j81l7J91j2M2q3o8J23K3J11j99k02M8K55
$$ -133 -4 408 -68 -10 275 103 -296 -47 140 -41 -78 113 101 143 60 -8 115 138 249 50 -152 -104 151
3069A51k15r9L07j20j0j18J66k95K28K34j30k65R5J36l98L38K96m29nJ73J25k52
$$ 151 -64 -163 144 24 14 -104 62 -233 -5 229 99 -166 -71 65 -333 5 301 -128 -133 40 165 -87
3091h7N6Q5k97L29P6L6o14N45jj85J75J26j89j62K13n9j35J33J31j14L7J32N3
$$ -87 -31 54 -243 86 162 198 -416 129 128 -57 118 244 55 -107 106 47 -88 45 176 62 99 231 284
3114B84m08k6K8M6K11P7k11n8J32m1P0j09L22l24J70l97L36K3j32J10j37K3PK19
$$ 284 -124 -150 -122 -76 135 212 1 -57 75 34 104 -5 317 -7 163 -234 102 125 -7 103 -34 -11 -4 215
3138B15k58k9L8J64j43K21j33j00j91J66Q4R3j96K34k26O6L5J1j18m8J22rj36
$$ 215 -43 -72 -34 130 -13 208 75 -25 -216 -50 34 127 -69 165 -61 5 40 51 -67 -115 7 -2 -138
3161a38J94k6j61K05J29j39J13k93J16o8L01k58k30M96l77J36L8r5J32k03J66
$$ -138 56 30 -131 74 203 64 177 -116 0 -68 233 -25 -255 241 -136 0 38 -57 75 -128 38
3182C8p4j1J01P8k74n9K43Jr3P0L3r0j52J82J17K3j00Lj03K15l43L0J33M7L9n0
$$ 38 -36 -47 54 132 -142 -201 42 43 -50 20 53 -37 -189 -7 110 133 33 36 -67 148 -195 -165 -32 15 54 4
3208DQ2J25k02L4j20N8J08j19OJ37j04K7k12L2Q2J37l44J67L63k93Jq4N6L5P9
$$ 4 86 211 9 43 -77 -19 89 -30 -24 113 9 36 -176 -144 -62 75 -269 -102 261 -32 -31 -115 -59 -24 55
3233E5j10J03m7K23n8m18J61J52m4L0K86l58l9kJ29L6m0k22K28l44K45M36k33
$$ 55 -55 48 1 224 166 -252 -91 61 17 47 333 -25 -64 -66 63 99 59 -163 65 -279 -34 402 169
3256A69m90M53j26r8J16J8k00J74l5k03J73O5m4p8n9K62j79p1L50k51q3N1K23
$$ 169 -321 132 6 -92 24 42 -158 16 -19 -222 -49 16 -28 -106 -165 97 -82 -153 197 -54 -137 -86 137
3279A37j99R2K2M5j85R0J54j61%Q4k29r4M58l51M7N1N6k19K01r5K41k14M9J2k2
$$ 137 -62 30 52 97 -88 2 156 -5 -5 79 -150 -244 214 -137 -90 -39 17 -202 -1 -96 145 -69 -20 -8 -30
3304c0j38M13k2l46K24j11j63Q0J50j57N5k25M17m4k25NJ26r4L52k66k11L34j12
$$ -30 -168 245 223 -123 101 -10 -173 -93 57 -100 -45 -270 147 103 -122 -117 9 -85 267 1 -210 124 12
3327A2j33r5L69j58p3j24L02q2j59J29kL1k67K75o3Q6Pj15n8J98j67l7K64k44
$$ 12 -121 -216 153 -5 -78 -202 100 18 -141 -12 -14 17 -250 25 -38 48 55 -60 -118 80 -87 -124 140 -104
3351a04P6J43j22lo8l9J78j37O9j64K18k02M2L09j71K3J48l18J47Nk4P8k66K30
$$ -104 -28 115 -7 -10 -78 -117 61 -76 -7 -171 47 -155 -113 196 25 48 196 -122 25 30 6 84 -182 48
3375D8L6Q5j20L3j9j50n8L3J13O8J4j55O9j2O4j51J35J08k13J72q7o1J92n1p9
$$ 48 84 169 49 82 63 -87 -145 -112 1 69 83 -72 -3 -15 49 -102 33 141 -72 100 13 -48 144 93 14
3400A4J22k64J68L5j20K9l7J30k35k4K82O4j48J70j61j6k02K02L9j10Q4j37K80
$$ 14 136 -128 40 75 -45 -16 -53 77 -158 -182 100 164 16 186 25 9 -193 9 48 -62 22 -115 165
3423A65j42J55jj58K24l84k9L15k77R4M5j78M19j73O8j18J40p8j46J09j49J55
$$ 165 23 178 177 19 243 -141 -170 145 -132 -38 7 -171 248 75 143 25 165 87 -59 50 -99 56
3445E6k5J2K1L4j14Ol6K68l48L1O2O1j05K51l87J64P8k7k04J61K9j10P3P0R3q
$$ 56 31 43 64 98 -16 -10 -46 222 -126 -95 -33 28 -77 174 -213 -49 29 2 -202 -41 -12 -122 -49 21 114 106
3471A06j39K7JK7m5L0n8O4j07K14k53J04o6J59K5k37J27l7J62j20j20J57J26l63
$$ 106 -33 -6 -5 22 -23 7 -51 13 -94 120 -133 -29 -95 64 89 -148 -21 -58 104 -16 -136 21 147 -216
$$ [...]
8191A27
##END NTUPLES=NMR FID
##END=
