##TITLE=1H_Pr C62-eth2
 200.13Hz, CDCl3.
 8 sc
 24.8.2026
##JCAMPDX= 6.0         $$ Bruker NMR JCAMP-DX V2.0
##DATA TYPE= NMR FID
##DATA CLASS= NTUPLES
##ORIGIN= UXNMR, Bruker Analytische Messtechnik GmbH
##OWNER= pz
$$ XWIN-NMR		Version 3.5
$$ Mon Aug 24 14:59:24 2026 Russian Standard Time (UT+4h)  she@DPX200
##.OBSERVE FREQUENCY= 200.1313
##.OBSERVE NUCLEUS= ^1H
##.DELAY= (6, 6)
##.ACQUISITION MODE= SIMULTANEOUS
##.ACQUISITION SCHEME= undefined
##.AVERAGES= 8
##.DIGITISER RES= 18
##SPECTROMETER/DATA SYSTEM= spect
##.PULSE SEQUENCE= zg30
##.SOLVENT NAME= DMSO
##.SHIFT REFERENCE= (INTERNAL, DMSO, 0, 14.3821)
##AUDIT TRAIL= $$ (NUMBER, WHEN, WHO, WHERE, WHAT)
$$ ##TITLE= Audit trail, XWIN-NMR		Version 3.5
$$ ##JCAMPDX= 5.01
$$ ##ORIGIN= Bruker BioSpin GmbH
$$ ##OWNER= she
$$ F:/spectra/data/she/nmr/H-C/1/audita.txt
$$ ##AUDIT TRAIL=  $$ (NUMBER, WHEN, WHO, WHERE, WHAT)
(   1,<2026-08-24 14:57:44.51 +0400>,<she>,<DPX200>,
      <created by zg, POWCHK disabled, PULCHK disabled
       configuration hash MD5:
       00 E9 B6 7A A2 85 ED C7 34 08 36 98 17 FE 4E 26
       data hash MD5: 16K
       10 49 05 D7 57 8E 66 B2 6A B3 13 25 C7 DD AB 29>)
$$ ##END=
$$ 
$$ hash MD5
$$ 80 98 B0 B6 0A 14 B5 7C EB 83 9E A3 14 BD 43 6E
##$RELAX= 
##$RELAX= 
##$RELAX= 
##$RELAX= 
##$RELAX= 
##$RELAX= 
$$ Bruker specific parameters
$$ --------------------------
##$DU= <F:/spectra>
##$EXPNO= 1
##$NAME= <H-C>
##$PROCNO= 1
##$TYPE= <nmr>
##$USER= <she>
##$AMP= (0..31)
100 100 100 100 100 100 100 100 100 100 100 100 100 100 100 100 100 100 
100 100 100 100 100 100 100 100 100 100 100 100 100 100 
##$AQSEQ= 0
##$AQ_mod= 1
##$AUNM= <au_zg>
##$AUTOPOS= <>
##$BF1= 200.13
##$BF2= 200.13
##$BF3= 200.13
##$BF4= 200.13
##$BF5= 200.13
##$BF6= 200.13
##$BF7= 200.13
##$BF8= 200.13
##$BYTORDA= 1
##$CFDGTYP= 0
##$CFRGTYP= 5
##$CHEMSTR= <none>
##$CNST= (0..31)
1 1 145 1 1 1 1 1 1 1 1 1 1 1 1 1 1 1 1 1 1 1 1 1 1 1 1 1 1 1 1 1 
##$CPDPRG= <>
##$CPDPRG1= <>
##$CPDPRG2= <>
##$CPDPRG3= <>
##$CPDPRG4= <mlev>
##$CPDPRG5= <mlev>
##$CPDPRG6= <mlev>
##$CPDPRG7= <mlev>
##$CPDPRG8= <mlev>
##$CPDPRGB= <>
##$CPDPRGT= <>
##$D= (0..31)
0 0.7 0 0 0 0 0 0 0 0 0 0.03 0 0 0 0 0 0 0 0 0 0 0 0 0 0 0 0 0 0 0 0 
##$DATE= 1787569063
##$DBL= (0..7)
120 120 120 120 120 120 120 120 
##$DBP= (0..7)
150 150 150 150 150 150 150 150 
##$DBP07= 0
##$DBPNAM0= <>
##$DBPNAM1= <>
##$DBPNAM2= <>
##$DBPNAM3= <>
##$DBPNAM4= <>
##$DBPNAM5= <>
##$DBPNAM6= <>
##$DBPNAM7= <>
##$DBPOAL= (0..7)
0.5 0.5 0.5 0.5 0.5 0.5 0.5 0.5 
##$DBPOFFS= (0..7)
0 0 0 0 0 0 0 0 
##$DE= 6
##$DECBNUC= <off>
##$DECIM= 32
##$DECNUC= <off>
##$DECSTAT= 4
##$DIGMOD= 1
##$DIGTYP= 9
##$DL= (0..7)
0 120 120 120 120 120 120 120 
##$DP= (0..7)
150 150 150 150 150 150 150 150 
##$DP07= 0
##$DPNAME0= <>
##$DPNAME1= <>
##$DPNAME2= <>
##$DPNAME3= <>
##$DPNAME4= <>
##$DPNAME5= <>
##$DPNAME6= <>
##$DPNAME7= <>
##$DPOAL= (0..7)
0.5 0.5 0.5 0.5 0.5 0.5 0.5 0.5 
##$DPOFFS= (0..7)
0 0 0 0 0 0 0 0 
##$DQDMODE= 0
##$DR= 18
##$DS= 0
##$DSLIST= <SSSSSSSSSSSSSSS>
$$ [...]
##$SUBNAM0= <"">
##$SUBNAM1= <"">
##$SUBNAM2= <"">
##$SUBNAM3= <"">
##$SUBNAM4= <"">
##$SUBNAM5= <"">
##$SUBNAM6= <"">
##$SUBNAM7= <"">
##$SUBNAM8= <"">
##$SUBNAM9= <"">
##$SW= 18.0517328524113
##$SWIBOX= (0..15)
0 0 2 0 0 0 0 0 0 0 0 0 0 0 0 0 
##$SW_h= 3612.71676300578
##$TD= 16384
##$TD0= 1
##$TE= 0
##$TE2= 300
##$TE3= 300
##$TEG= 300
##$TL= (0..7)
0 120 120 120 120 120 120 120 
##$TP= (0..7)
150 150 150 150 150 150 150 150 
##$TP07= 0
##$TPNAME0= <>
##$TPNAME1= <>
##$TPNAME2= <>
##$TPNAME3= <>
##$TPNAME4= <>
##$TPNAME5= <>
##$TPNAME6= <>
##$TPNAME7= <>
##$TPOAL= (0..7)
0.5 0.5 0.5 0.5 0.5 0.5 0.5 0.5 
##$TPOFFS= (0..7)
0 0 0 0 0 0 0 0 
##$TUNHIN= 0
##$TUNHOUT= 0
##$TUNXOUT= 0
##$USERA1= <user>
##$USERA2= <user>
##$USERA3= <user>
##$USERA4= <user>
##$USERA5= <user>
##$V9= 5
##$VALIST= <valist>
##$VCLIST= <CCCCCCCCCCCCCCC>
##$VD= 0
##$VDLIST= <DDDDDDDDDDDDDDD>
##$VPLIST= <PPPPPPPPPPPPPPP>
##$VTLIST= <TTTTTTTTTTTTTTT>
##$WBST= 1024
##$WBSW= 4
##$XGAIN= (0..3)
0 0 0 0 
##$XL= 0
##$YL= 0
##$YMAX_a= 157709
##$YMIN_a= -138337
##$ZGOPTNS= <>
##$ZL1= 120
##$ZL2= 120
##$ZL3= 120
##$ZL4= 120
##$ABSF1= 10
##$ABSF2= 0
##$ABSG= 5
##$ABSL= 3
##$ALPHA= 0
##$AQORDER= 0
##$ASSFAC= 0
##$ASSFACI= 0
##$ASSFACX= 0
##$ASSWID= 0
##$AUNMP= <proc_1d>
##$AZFE= 0.1
##$AZFW= 0.1
##$BCFW= 1
##$BC_mod= 2
##$BYTORDP= 1
##$COROFFS= 0
##$CY= -3
##$DATMOD= 1
##$DC= 2
##$DFILT= <>
##$DTYPP= 0
##$F1P= 0
##$F2P= 0
##$FCOR= 0.5
##$FTSIZE= 0
##$FT_mod= 4
##$GAMMA= 1
##$GB= 0.15
##$INTBC= 1
##$INTSCL= 1
##$ISEN= 128
##$LB= 0.25
##$LEV0= 0
##$LPBIN= 0
##$MAXI= 10000
##$MC2= 0
##$MEAN= 0
##$ME_mod= 0
##$MI= 1.114404
##$NCOEF= 0
##$NC_proc= 0
##$NLEV= 6
##$NOISF1= 3.799351
##$NOISF2= 2.8
##$NSP= 1
##$NTH_PI= 0
##$NZP= 0
##$OFFSET= 14.38212
##$PC= 1
##$PHC0= -4581.412
##$PHC1= 11.9923
##$PH_mod= 1
##$PKNL= yes
##$PPARMOD= 0
##$PSCAL= 0
##$PSIGN= 0
##$REVERSE= no
##$SF= 200.129724274929
##$SI= 16384
##$SIGF1= 3
##$SIGF2= 2
##$SINO= 400
##$SIOLD= 16384
##$SREGLST= <1H.CDCl3>
##$SSB= 0
##$STSI= 0
##$STSR= 0
##$SW_p= 3205.1282051282
##$SYMM= 0
##$S_DEV= 0
##$TDeff= 0
##$TDoff= 0
##$TI= <>
##$TILT= no
##$TM1= 0
##$TM2= 0
##$TOPLEV= 0
##$USERP1= <user>
##$USERP2= <user>
##$USERP3= <user>
##$USERP4= <user>
##$USERP5= <user>
##$WDW= 1
##$XDIM= 8192
##$YMAX_p= 0
##$YMIN_p= 0
$$ End of Bruker specific parameters
$$ ---------------------------------
##NTUPLES= NMR FID
##VAR_NAME=  TIME,          FID/REAL,        FID/IMAG
##SYMBOL=    X,             R,               I
##VAR_TYPE=  INDEPENDENT,   DEPENDENT,       DEPENDENT
##VAR_FORM=  AFFN,          ASDF,            ASDF
##VAR_DIM=   8192,          8192,            8192
##UNITS=     SECONDS,       ARBITRARY UNITS, ARBITRARY UNITS
##FACTOR=    0.0002768,     1,               1
##FIRST=     0,             0,               0
##LAST=      2.2672688,     0,               0
##MIN=       0,             -138337,         0
##MAX=       2.2672688,     157709,          0
$$ Real data points
##PAGE= N=1
##DATA TABLE= (X++(R..R)), XYDATA
0@%%%%%%%%%%%%%%%%%mJ2j6J6j6J6k1K9l2L4m2M8n6O4p2Q5r5J08j24J40j56J75
39I3j95K18k44K71l02L34l68M08m52M98n48O04o66P33q08Q92r84J087j203J336
59G04j492J672j882K137k452K848l363M054n006O217o862J61134n4705k10445
73a07441L8916J06047j2063m0242J9634j7479j9326N0992L4831n8988l7229K4675
85a7673M0216K9045k4050o3010J5529O7832j1906p4925l262O0584N163l1920J9938
98A1561j189n2307K0019P1706j8153o0496K0137N1539k3817l9596K4407Q346l2583
111b0426L0077M4285m9245n4085L5505M9068j8076m1771P230L3481M982k0546
123D79k4715J834L4430N640k1605J2059P445k7843N584L6542j5879n0680K1388
$$ y = [0, 0, 0, 0, 0, 0, 0, 0, 0, 0, 0, 0, 0, 0, 0, 0, 0, 0, -4, 8, -8, 8, -8, 8, -13, 16, -16, 18, -24, 24, -32, 32, -40, 45, -50, 58, -66, 74, -82, 93, -102, 116, -128, 143, -159, 175, -193, 215, -237, 261, -287, 317, -349, 384, -424, 468, -516, 571, -632, 704, -788, 884, -998, 1139, -1313, 1535, -1828, 2226, -2780, 3437, -3425, 157709, 103004, -107441, -68525, 37522, 25459, -14783, 4851, -12628, -31954, 19038, 53869, -5119, -42348, -17673, 22543, 51588, 27538, -35472, -19943, 47889, 35983, -38942, -42204, 18380, 23543, -8377, 11561, 10372, -41935, -21916, 49790, 31637, -28859, -8722, 42817, 19000, -20596, 3811, 12157, -20426, 9651, 53936, 4691, -49394, -13889, 35179, 17103, -24668, -17438, 16043, 21025, 479, -24236, -22402, 12028, 17668, -3937, 8122, 15567, -12276, -6692, 29850, 13971, -36709, -15321]
136a5321O5950k7959p7803K2461N8509k1009l0126K2261J6641j6245m954J4993
148G398q895j7179K2072J9177j8564j3465L116N156O903p839r280J4350R999j6701
162c752j4705J3233J2801k3110r360L7044P217l5407o96K6788j321j5634O505
175c97J6007j0664j1282J6618m690k7824J0534K6586r177k0733K806J6343r28
188C199j4138K378J1145L670J237r289o094J4148J216j1640N122N717m064J718
202D325K594q870j1388J1840J9579j9409k2547K3192J6195k1036j0845J4127J1810
215I567m304m274P641l114r501R821P030j0469o334K232P761P59j4941l876J3287
230A285M265n607n710L093Q338o010m603J0084m15p144N365M837k069n839M8Q004
$$ y = [-15321, 50629, 22670, -55133, -32672, 25837, 4828, -25298, -3037, 13604, -2641, -7595, 7398, -1497, -18676, 3396, 22573, 4009, -9456, -6340, -1184, 5719, -2120, -11400, 2950, 12949, -3752, -18457, -5224, 7577, -15533, -24893, 12151, 19368, -16039, -16735, 10053, 8732, -6902, -397, 15610, 4946, -6336, 10282, 5592, -22232, -11698, 14888, 5711, -15022, -12216, 4127, 3199, -10939, -8561, 2584, 6254, 7491, -1798, -7892, 6256, 7472, -4168, 954, 6671, 2607, 4325, 6919, -1951, -13339, -1499, 18080, -1329, -23876, -684, 15511, -5525, -16370, -2243, 9567, 5263, 989, 8630, 5516, -3985, 5836, 12866, 2397, -3937, -1705, 6056, 6815, -8126, -12002, 1285, 5550, -57, -5767, -2674, 5664, -346, -4949, 5135, 4720, -2424, 2941, 7778, 5709, -130, -82, 7922]
246G922m298o991Q602k237j2177M273P707l557q523N58J2651Q73j0770L424O585
261D042p98K120k314k266L072k198j2J494o490k028N125K295l866q673L753J2731
277E987p514j0022R267N664m339k772K356N934k078m613N963P95m622J475p15
292G66j683N50l145P37q1m903M683K785n511J260M517J399O31l908K940N930m531
309B436j842K355j089J65j813j503L677n101k783Q208k419p144K651M910J173
324A881n290j758Q850J53n647M736J718j418J703k497N54J814m993m30J975k849
340a498p18j536K36L368l382L38N442l260L60M989k161n82P92N69K090l067j863
357A17M061l611k430L882k287k522M8N49K891l636m105O387J630k486J968q20
$$ y = [7922, 3624, -3367, 5235, 2998, -9179, -4906, 2801, -756, -9279, -8721, 3930, 4803, -5967, -2543, 4042, 3244, 5364, 3050, 784, 3856, 1658, 1646, 3140, -3350, -5378, -253, 2042, -1824, -10497, -6744, 5987, -1527, -11549, -2282, 3382, -957, -3729, -1373, 4561, 2483, -2130, 3833, 4628, 6, 1481, 766, -917, -367, -3512, -2775, -2856, -7759, -3076, -291, -5802, -4542, -25, 1374, 2005, -1903, 1037, 6967, 2436, 594, 2949, 1860, 2025, 212, -1291, 2386, -2715, -5498, 2710, 291, -6853, -4202, 708, 1881, -3409, -5167, 3683, 3836, -1811, 2925, 4643, 3225, 4928, 2431, 2985, 4799, -194, -624, 1351, -1498, -2216, -3752, -3516, -148, -3530, -3192, 2250, -1010, -650, 4339, 2178, 1596, 2388, 2957, 5047, 1980, 117, 4178, 567, -1863, 2019, -268, -2790, -2742, -2193, 698, -2938, -7043, -656, 974, -1512, 456, -364]
373c64K014L445l414P4K485k033n91q06R29L69q034j02Q714m318n345L871J194
390a912N90J144q40l14k01M573M228p434j689N959k508o34L281n064k570M722
406A331J270m433o428K599P552k867k094N61k906N350O231o828k752O524M314
421G424k343n523J055K253n058K473M798p928l827O352R12m162l368L054O262
436B374o75j005o63m736N412P164o958j747P090j582m378L89J354l641l807Q165
452B756L699j2588k116Q695l072j702M143r51Q26M709J027n966m996R238M501
467H203p808L407M030j1163k679R031j636p624J755Q948o87j0622Q61N094k877
482c767M692N129n983P05M506m471l531M081N019m127m293Q649m84j5955J460
$$ y = [-364, 1650, 5095, 1681, 1755, 4240, 2207, 1616, 810, 1739, 2108, -5926, -6028, 2686, -1632, -6977, -3106, -1912, -1322, -178, -1018, -1332, -1533, 3040, 7268, -166, -1855, 4104, 1596, 962, 4243, -821, -3391, 1331, 2601, -1832, -8260, -5661, 1891, -976, -3070, -2509, -5415, -65, 6166, -662, -3414, 3110, 7424, 5081, -442, 613, 2866, -2192, 281, 5079, -2849, -6676, -324, 588, -3574, -6942, -3888, 2374, 1699, 694, 31, -4705, 707, 7871, 913, -834, 6256, 4674, 296, 685, 2039, -1602, -5409, 2756, 6455, -6133, -8249, 446, -2626, -4328, -185, -1136, -310, 4399, 5426, -540, -5536, 3702, 8203, 395, 3802, 7832, -3331, -6010, 3021, 1385, -6239, -4484, 4464, 3777, -6845, -5984, -890, -3767, 925, 6054, 71, 776, 5282, 811, -2720, 1361, 6380, 2253, -2040, 6609, 6125, -9830, -8370]
497h370J1262m799l578P413J709q482l828Q924K836p067N887P318n979K25k27
512C244j0806K394J4351k9j2313k078Q722n132r844J0743M038j2841P524J4528
526A2501j1780j3631O868J0067J20p63K507n332k987J1202m530j8298R177J7025
540A2146p416p939K570m824q118R293J5400r358j4236J4159J0567j4443o031O093
554b137K981P414N673j0226j3599N264J3674p507j2401J1639N748j0315M407K635
568C250j6870j698K2593Q303j8162p041J5575J177j1982M061K593l221J2560M013
582A5151k0353q353J3583M567r545K573R626j0187q255J5511r61j8272R517J9405
596A4007n358j1211J720K438l868L292O484q344l021J4443l804j7785M152P754
$$ y = [-8370, 2892, -1907, -5485, 1928, 3637, -4845, -8673, 251, 3087, -3980, 1907, 9225, 3246, 3471, 3244, -7562, -5168, 9183, 9154, -3159, -5237, 3485, -1647, -11491, -748, 3290, -9551, -2027, 12501, 721, -12910, -6042, 4025, 4145, 3382, 5889, 557, -2430, 8772, 4242, -14056, -4879, 12146, 4730, -3209, -639, -5463, -13581, -4288, 11112, 1754, -12482, 1677, 12244, -2199, -8230, -2137, 844, 8258, 13931, 3705, -9894, -4630, 9044, 1537, -10864, 775, 6523, -3792, 615, 3250, -13620, -15318, 7275, 15578, -2584, -9625, 5950, 7127, -4855, -794, 1799, -1422, 11138, 15151, -5202, -13555, 28, 4595, -4950, -2377, 7249, -2938, -11193, 4318, 3357, -14915, -5398, 14007, 8649, -2562, -842, 1596, -2272, 1020, 7504, -840, -3861, 10582, 6778, -11007, -6855, 899]
610H99n860K634J0733n389j5487M697J6028p590j0539J4267P369r778n85L84p444
625e661K355J0912l20j1104O51Q659q181p595J0589K19q052R374O865j2138o346
640i773J0432N630q114R54J0820n337p492O616l416q679R613P311r632m310P308
655A931j153j0869L161J2323n045n533J0117k276r649O026O879m463j419N823
669E853K34q255L29N537p227k626J0783j628q545L895J897m866j58O103R94n285
685b965L739O705q343n123J0033J456n311L011J382o278k061N284O59q354J365
700d801R909m369p133M584O14j913N031J131m197J80N457M46p355P65P420m003
716A766k895N617m294n878M341L152m588k274M765K496n303L56M898m235L48P604
$$ y = [899, -4961, -2327, 8406, 3017, -12470, -7773, 8255, 665, -9874, 4393, 11762, 1984, 1399, 1783, -5661, -3306, 7606, 7286, -3818, -3167, 5492, -2689, -10284, 305, 524, -7528, 1846, 8711, -3427, -9773, 659, 6289, -1825, -871, 9949, 4612, -2880, 3736, 320, -8359, 1254, 8565, -1067, -5377, 1931, 778, -10091, -6930, 5393, 348, -5185, 4932, 2656, -6993, -967, 5912, 1449, 30, 5853, 6087, -2168, -1839, 3698, -3529, -6155, 4628, 3000, -5545, -1650, 247, -4619, -4777, 1326, 2320, -2965, 774, 7479, -864, -5987, 4046, 5502, 191, 3202, 4584, -1694, -3755, 1529, 2188, -6166, -4801, 5108, 739, -6394, -1810, -1196, -3109, 1922, 3053, -1144, -964, 4493, 4939, -2416, -1651, 5769, 1766, -1129, 4488, 194, -5684, -1343, 1809, -2779, -5053, -288, 2208, -3095, -2739, 2159, -2076, -1728, 5876]
732E876k716n021L555K264k759k139K481J797m705j96L709m681j886L895j355
747a881o24K988j454j108J699K833o24l938L167N415m948k646L818j449j958J727
763A017l05j621k014J538J989m159l83M004j334m3K887k652R5L611J41j887r38
780e4K335J904m362m49K654l150k3J887l165l76K294j175o74N27J955L74k827
797b325L122K853l903N30L433j955l14q6r39N52q11j022K57j430R74N45k813J999
815a333J440k588J547J957q30M77k88J441J285k555J78J567j290L6l47k372J642
832c3j45j944N71m97M85J344k315J544J969j849J240J473o82Q07n60n33J522j778
850F19m70R38j920P43J09k659J162J253k433O33J262L30m0r30J800K226k593O83
$$ y = [5876, 3160, -1861, 1694, 3958, 1199, -940, 1541, 3338, -1367, -1563, 2146, -2535, -4421, -526, -1881, -2505, 483, -971, -2079, -380, 2453, 1829, -2109, 1058, 6473, 1525, -1121, 2697, 1248, -710, 1017, 712, -909, -2923, -1385, 604, -3555, -3938, 66, -1268, -1311, 1576, -1076, -981, 2630, 2771, 884, -54, 2281, 4185, -177, -626, 2028, -1122, -1145, 742, -2423, -2799, -505, -1680, -2354, -1827, 128, 502, -2325, 797, 3650, -253, 277, 3710, 1755, 1441, 1355, 416, 968, 157, -865, -608, -2038, -1064, -519, -3332, -1333, 107, -2481, -934, 1023, 193, 670, 382, 1823, 3108, 553, 731, 2298, 1008, 1044, 697, -1675, -33, -178, -2122, -1551, -2048, -1563, -219, -2534, -990, 979, -870, 370, 1843, 1161, 1968, 1408, 875, 2397, 619, 149, 1087, -833, -90, 19, -2640, -1478, -225, -2658, -2025, -763, -433, -473, -1403, 397, 2623, 30, 713]
868G13J557j425J289l10k251J304j47j393p4j338J253K13k265J818J299k667R85
885a439K025k7N89j196R32K075j696o3K66j741J891O23l704p2J320o00m34j465
903b716J493P37j781K353J213l648J851K843o47L20p14j289J577O68j083k495
919a318p78M850q40n835J712K556k689M98J721j35q00N3K686R8l103J988J563
936B227m74J770k122l823K541K169k243k239O58K761j376l731K444P51k441L237
952A09K360k059o12J89R21N64m46J160j187p05L610k675o098L526L793l731j301
969b582K465J045l303j537M272K2k400L956J330l171J117l91k110K512K461j687
985A999k748J063J984n207k664P195L1n649K900L283m263j412K571K600j331L09
$$ y = [713, 2270, 845, 2134, 1824, -427, 877, 730, -663, -737, -2075, -822, -609, -2874, -1056, 243, -2424, -1439, 586, 559, 1148, -48, 884, 2959, 1263, 1200, 1466, -275, 1616, 2239, -1465, -1537, -217, -817, -1251, -2716, -1223, -486, -2267, 86, 1299, -2349, -498, 2345, 1698, 2018, 1304, 15, 1592, 2260, 1177, -1318, -2096, 2754, 1914, -3921, -2209, 347, -2342, -1844, -123, -258, -1058, -1005, 1681, 1779, -1324, 664, 2227, 1753, 3523, 1401, -2422, 119, 2288, 45, -2194, -1536, 1225, -151, -3882, -1438, -687, -3128, 109, 2469, 410, -202, -13, 908, 1472, 1026, 2186, 999, 294, 3904, 1229, -4869, -1343, 2450, -1281, -2582, -117, 928, -2375, -3912, 360, 382, -2018, 1938, 3268, 97, 1214, 823, -1287, 1225, 3686, 1999, -749, 314, 2298, -2909, -5573, 1622, 1653, -3996, -1096, 2187, -2076, -3488, -917, 1683, 352, 661]
1001F61L665k475l377L087o07k889L499J700l545m24O86j803k543J529N490k109
1017E45l349M560j309m505L381K966j870N91L081o44n433o91N035k027k563N461
1033C229j439n684K596K069m625r42N546L195m788q74M217l386k702O349R10m010
1049c39K670J894m024l687J766K024p98J778K023o484k302O777j754m903N239
1064a20M879l553k838K966O35n351K346P384l445n122M279J33m948J28J630k8
1080a025J158K407j824n504J072N377k933j041P122j039n453K427J899l795j729
1095b881N394L458o055j599L010m004j607N783r45l808L676K472m797l045M606
1110c42K909l817J826N453m898m107N065n11l775K155L029j655k215L59j254l121
$$ y = [661, 4326, 1851, -1526, 1561, 954, -1935, 1564, 3264, -281, -705, -19, -1822, -4365, -2836, 2654, 545, -2804, 1756, 447, -4058, -677, 2289, 419, 1010, 4091, 3447, -1986, -2677, 2358, 331, -2232, 3229, 1790, -3894, -1298, 771, -3854, -4796, 750, 3945, -843, -1717, 2500, -886, -3588, 2761, 3671, -339, 2331, 4225, 201, -3486, -1720, 304, -494, 1284, 3307, -3177, -5479, 1298, -456, -5359, -120, 4759, 1206, -1632, 1334, 1969, -3382, -1036, 6348, 2903, -2219, 2060, 2193, -2755, -2627, -997, -1025, 133, 2540, 716, -4788, -3716, 1661, -1272, -2313, 4809, 3770, -1683, 744, 2643, -1152, -2881, 2513, 5971, -84, -1683, 1327, -2677, -4284, 1499, 554, -3254, 422, 2894, -1903, -4948, -342, 2567, -1250, 576, 6029, 1131, -2976, 2089, 1578, -2197, -42, 2987, 1332, -883, -524, -1778, -4899]
1126d899L343M973m718p84N236k675m761L511L785j945j219L549K65n533qM640
1142B760k858k013L941o45l065Q06K28j909n25L839K196l949O00L126l535j567
1158b570M387L65j586J470N41k716k082J925J391k895J227L031m260k031L973
1173A70q87k238K479L181j131k913J708K020l214L83L406j879j324K346j657k265
1189a815N18J117m16j043J649O46l497Q16K974k083k29L477%j470n04N53m2j061
1207d10J732R13l280L89K322k976j166K236K55j129l19J819J13k463J184K823
1223B043k079k09K474j061r43N85n43l77K30R18p63k043J149J228k968M80K905
1240A026j821r66K080N09j315m10K109N32j907J056J190k466L65J871k356r27
$$ y = [-4899, -1556, 3417, -1301, -2085, 3151, 476, -4285, -774, 3011, 1066, -153, 3396, 3661, -1872, -1880, 2760, -98, -2111, 1830, 1185, -1880, -1074, -846, -2755, -3280, 559, 2755, -1194, -594, 2532, -1003, -2570, 1817, 2182, 596, 2066, 2607, -109, -2191, -266, 1125, -1770, -543, 2488, -1772, -3803, 170, -717, -2955, -476, 2705, 1574, -1339, 369, 2389, -825, -442, 2964, 1085, -239, 2107, 450, -1815, -1297, -180, -596, -1639, 10, 656, -2841, -2025, 949, -1134, -1363, 2114, 2114, 644, 140, 693, 651, -410, 1322, 2235, -1045, -656, 1666, -1310, -2476, -240, 15, -1114, -1433, 386, 499, -1964, -780, 2043, -36, -245, 2229, 1168, 225, 810, 267, -110, 120, 1038, 275, -1768, -619, 609, -2359, -1879, 1026, -795, -1761, 319, 828, -487, -897, 1212, 1744, -163, 893, 2083, -383, -18, 1853, -503, -1430]
1256a430J802p2j257p52J280O42k170J156J782j510R7J519r09j9J065j75k08j25
1274G16N04p61j634J316Q40k841M62J917j377q63O56Q83j06p29J159J009j793
1291f42J029J287j569N73J015j393k05N88k86n39j149J096K38j868J042J144j578
1308a217M50J186j089P56N04o7l36k0J016j78j395J456K49k345N64J036j098m46
1326i74R3K86J71o62M43P77n95P76P7p50J300L91j147J96N14n7k61j097R46rj680
1347a262P19N29j482O28N42q85R08K67J58K35j74J044k63j299J578J50j644L81
1365A30N48n78l77l91K57Ro79P05o8o57J513l58j419J681Q06j244M63P56j51o50
1385B96k27J048p27j218J122K9j257N58p8o88N03N36l04o0J19J235o13p33J683
$$ y = [-1430, 372, 300, -957, -1709, -429, 213, -1957, -801, 981, -529, -432, 1087, 178, 159, 1224, 1049, 841, 716, 1220, 459, -1175, 141, 981, -1860, -1398, 519, -858, -1721, -1065, -182, -288, -1017, 142, 1151, -642, 387, 1674, 105, 678, 1693, 300, 95, 683, 397, -142, -1291, -195, 43, -1825, -783, 361, -1217, -767, 419, -670, 86, 590, 523, 187, 167, 1183, 1005, -390, 1066, 1315, -1030, -466, 570, -528, -974, -881, -595, -424, -1086, -643, 134, -461, 315, 392, -358, 942, 1333, 186, 382, 896, 839, 578, -519, 427, 418, -1262, -543, -14, -1496, -868, -326, -1211, -303, -36, 122, 357, 183, 1227, 964, -335, 1243, 1393, -251, 130, 678, 100, -277, -668, -411, -402, -1081, -376, -444, -1101, 412, 54, -1365, 316, 1122, -122, 341, 1097, 946, 296, 69, 1117, 390, -828, 294, 323, -934, -376, -454, -1142, -639, -103, -407, -467, -348, 887, 274, -459, 1224]
1404A224P6j071K75M45p86l2j81J81k90k54P7m60n62J456n73j266J725Q52r37
1423a01l31P80P67p57k71J362n80j064Q58l71j117P74L5p24M43L50o79p98N85
1442h39J551j237n69K154P4j367M20O74m00k57M52L04p28n29N27r25n43J555o48
1461c31j103J690j64j386P4J280Q21j207K89J705q45j347J041O8o38N29K08p03
1479a9k85m2k83q15N49J654j302o36J858l62j986J106J719Lr19N19O01j410n82
1498f32J549q56n57J641r18j616Q03M77j107m10K215M45j878L03K074j881j223
1515a571K666N08j391M69O75j177j131N10R50j014K46J493k014j169J610O3j028
1532a305J603R31p54r31O91L26j517P14K314j230j189J622j043j794P81J154m81
$$ y = [1224, 1300, 229, 504, 949, 163, 131, -50, 131, -159, -413, -336, -796, -1358, 98, -475, -1741, -16, 836, -101, -432, 348, 1115, 358, 87, 1449, 869, -195, 663, 292, -825, -51, -16, -740, -297, 53, -626, -1424, -839, 712, -525, -1094, 1060, 1134, -233, 187, 861, 461, 204, 656, 960, 232, -297, 230, -695, -1238, 317, -331, -1434, 256, 92, -1294, -1220, 60, 881, -326, -37, 1668, 823, -524, 517, 585, -53, 476, 684, -19, -304, -346, -629, -1444, -895, 759, -543, -1179, 679, 317, -1669, -563, 1156, 1159, 240, 759, 1360, -50, -632, 917, 61, -496, 1145, 227, -1389, -586, -109, -1216, -1626, 589, 1034, -844, -541, 1533, -348, -1571, 1095, 1603, 212, 681, 1356, 179, -952, -442, 508, -506, -260, 1233, -781, -1950, -340, -277, -1305, 298, 1229, 475, -456, 235, 561, -956, -242, 2072, 842, -347, 1275, 232, -1562, -781, 373, -108]
1549a08p79R49P48k451j86K040m14m60K107R8j909K83O88p39n40J818Q71k443
1567d27R2R23j845r82K744J50j376L99Q29j185j024J644J156j712J033K226k430
1584B15j583K244j81j958J293J632r02j753N57M62j915N26K232m72o87Q33o22
1601g9j114J113P16k07k06J450k24k681M89K051j783l68K049l09k034j05J332
1618I0p54j061J799J183j585n4J365j375o55K148K32j106O06N93j331j180N34
1635e51J113j321N82J219j510p56P46k01j93R59J028r82n38J105k41j645J392
1652B06J568j520p12J389m82j212k26P63L53r06Q24N41j554K87M94p1K74P07o6
1671F57n00J53J27m70l44J068N72j291j20K29r57Q2O06J20m45J53L19m8p88P42
$$ y = [-108, -887, 62, 810, -1641, -1827, 213, -201, -661, 1446, 1544, -365, -82, 606, -133, -673, 1145, 2016, -427, -335, 588, -1257, -2239, 505, 655, -721, -322, 507, -678, -1702, -58, 1098, -614, 419, 2645, 215, -1368, 876, 695, -1263, 30, 1662, 760, -993, -436, 26, -1889, -1363, 869, 397, -290, 543, -79, -1193, -80, 636, 429, 223, 1673, 1449, -1232, -743, 1308, -475, -843, 1206, 897, -1137, -1242, 90, -664, -1725, 74, 1257, -328, -382, 983, -392, -1047, 1101, 1333, 227, 833, 1426, 95, -1085, -551, 562, -759, -177, 1042, -468, -1224, -478, -679, -872, 87, 1115, 133, -405, 700, 459, -1186, 206, 1774, 254, -458, 931, 449, -763, -989, -226, 127, -779, 45, 586, -968, -681, -187, -258, 16, 723, 657, 157, 310, 437, -33, -377, 691, 1263, -28, -148, 81, -876, -794, -188, -68, -513, -360, -41, -89, -877, -135]
1691a35Q54p16N4J178q03p30M84K42k09o10O06M35j149l1K63p78O22O49m57K17
1711a4L09k40k80l2R12q0m57M43N79j142j96N60l29m00M8M23l03m38J00L06m82
1732g13M49Q40o90j53P03O2m54n6M85K55p84J59K70n24j12K21l43J81Q2k65J33
1753b54J6J20j04j61Q39M60j192L61O97p83j93N69k2k90m00M28k7p02L57L25n36
1774d92K61K56m98K38M51p6o2j94N44J97o39K88L82p03J86J70o22K72j59p5j20
1795c95R4R3K6n19N45M89p06L18P20m44k01K62J25J72o86J23M37o94J74K8m21
1816d60L20J24o31J06L15J60jk46P28N2m50K96M37n61l6L05l56j16J85o3k6l96
1838c14N70m60n06N76K37p58L69N97l83J39q7M08J15k91R2K06l92L47k34o33K41
$$ y = [-135, 719, 3, 57, 1235, 432, -298, 186, 428, 219, -391, 215, 650, -499, -530, -267, -1045, -423, 226, -231, -14, 295, 55, -225, -257, 655, 575, 118, 561, 1140, -2, -198, 362, 33, -367, -319, 104, -199, -637, -537, -231, -713, -264, 576, -114, -267, 436, 498, 44, -12, 473, 728, -56, 103, 373, -151, -263, -42, -385, -204, -122, -387, -254, -238, -118, -222, -383, 456, 916, -276, 85, 782, -1, -194, 375, 353, 63, -337, 91, 64, -638, -281, 44, -492, -231, 25, -473, -235, 216, 140, 78, -116, 428, 625, -14, 274, 656, -47, 139, 309, -313, -41, -200, -275, -395, -301, -208, -182, -701, -156, 333, -373, -55, 665, 221, 20, 282, 407, 579, -107, 16, 453, -241, -67, -39, -460, -140, -16, -647, -541, -226, -66, -67, -313, 415, 467, 17, 313, 750, 189, 153, 458, 102, -14, 171, 108, 82, -314, 256, -204, -710, -134, 103, -655, -286, 311, -72, 67, -20, 388, 503, 212, 304, 510, 118, 465, 231, -402, -161]
1859a61L23n98O1O3K01j53k7O87p7n56K47M28l63K23Oj85M57l07k65P5m68N20
1881A31k3q71O36N3n41M96J78j59k19J66K84L5j49M43j67k58N67l04l98M8L76
1902C24l48m53M73j23j26j83M10n4n66P81p9k37M40Q7l12L03J97r9l39j62N12
1923D46m21p82J007k78n29L18J82j31K5j31K48M9k21L99j58m8M74M6n95L18N7
1944B75l74J29L4N8l48l61N07j71j88K92K02n20N23J72m05NN77m6l92K55N07p25
1966Fn63Q12j7p21N53K56n44l12K34K64k27J52O13m56j90P07n30l57Q30Q3n03
1987I0NL53k49p45l5R25m63n08Q95k17o51K56L58m74M60L73L8n42J24N62m95m92
2009d32J318n71o03L88R3o12k26L89J95k49K49N86q91m00R98r5m82O29M83m72
$$ y = [-161, 162, -436, -375, -312, -111, -264, -291, 396, 319, -237, 10, 438, 75, 298, 304, 119, 576, 269, 4, 79, -389, 131, 108, -763, -127, -74, -615, -119, 59, -100, -319, -153, 131, 166, 17, 460, 293, 35, 602, 298, -100, -52, 324, -24, -477, -4, -127, -253, -436, -26, -80, -646, 135, 56, -181, 259, 346, 34, 337, 534, 435, 96, -66, 446, 25, -757, 250, -28, -557, -239, -57, -188, -163, -294, -46, 3, -218, 181, 23, -25, 449, 495, -100, 218, 275, -99, 30, 64, 122, -226, -587, -80, -251, -439, -147, 55, -465, 58, 230, -175, -170, 407, 361, -31, 224, 731, 6, -557, 255, 238, -483, 70, 326, -218, -530, -296, -32, -259, -107, 506, 50, -140, 567, 37, -320, 510, 593, 90, 95, 448, 199, -546, -581, 344, -119, -627, 268, 51, -600, -344, 14, -460, 0, 373, 411, -131, -7, 555, 60, -432, 886, 315, -288, 100, 193, -419, -645, -256, -61, -310, -61, 525, -366, -766, 232, 137, -345, 284, 767, 295]
2029B95l74L90m4p01M44J082r80n59O96l96r83Q37L87j08l26N41k49o63N81Q49
2049G19n00k25Q04k80q75K13M92o01j15O35K53r86J19N90j076k33J510o4p32O87
2069C35K11r38l4O11J34j06K0N77q43p95Q21k01l35Q91N4o02m59O37j32p08P61
2090a01Q18p49j40O42m9j016O13O60n42j49J94J7p81N7O78p17J63J020o59n66
2110f07M88J26m36L09N99K29q95Q0N30o47j44Q26k00m00L11L7p20m1P18M2q66
2131f61O42O24j069q5R60l56l06M19K71K5n68L44Po89N55L70o36k34P48o10n18
2152g67N82Q1J77k52M22K08o89J0O26l42MO89l71n02K33N3l18j83Q10J0q96K69
2174a46M49r86K33N30J25k26P3J20j18l07M22L50m33K73P0n19j46L16k55j39K62
$$ y = [295, -79, 311, 267, -434, 10, 1092, 112, -447, 249, -147, -1130, -293, 94, -14, -340, 201, -48, -711, -130, 719, 219, -6, 798, 518, -357, -144, 348, -253, -368, 267, 520, -466, -347, 243, -833, -1066, 444, 380, -352, 335, 546, -392, -426, 185, 319, 213, 233, 810, -33, -828, -7, -208, -543, 348, 402, -200, -659, -22, -154, -862, -101, 717, -32, -172, 470, 421, -595, 18, 678, 136, -13, 181, 198, -583, -526, 152, -565, -402, 618, -41, -607, -119, 7, -429, -120, 479, 708, -187, -107, 423, -224, -368, 458, 258, -142, 169, 206, -514, -555, 163, 205, -661, -19, 605, -464, -549, 411, 55, -251, 168, 439, 464, -104, 240, 247, -442, 113, 483, -153, -387, 361, -249, -767, -185, -104, 73, -179, 243, 451, -238, -228, 398, 56, 60, 749, 378, -124, 109, 162, -156, -339, 471, 481, -415, -146, 303, -683, -450, 80, 205, -21, 52, 172, 54, -253, 169, 519, 86, 359, 429, -90, -236, 80, -175, -314, -52]
2195e2J91k12l49M34L0m10K27O05k95j15M16m46j29L3J34J35j83K38J9m14l44
2216d87L75k23K61K2J35p8m68M15n1J5J71N48o02J32K67o00K15K25j70j09q3O8
2238b2n4l99J74K58l10J40K94k00J39m9m7J61R0k26K90l52J67J85n81M76Q3m81
2260b64J53j83lL81n45K34K77k34J56J61l22K24J30k85L68K36m48J41k73O2o6
2281a00j80o0O31m04J1L3j36P8pJ97K19j31q4K63k54K28Mj47K8r8q0N5j04l2R
2306f1j94J2J17j40j0J23K1J65j28k3M36l92L98j21k87J9L00j49l15K00j7j13
2328a59k26M69k1n52K33K78o4j04J41j58L43M3j19M7j18J80q1m7R9J20n93j4K32
2351g1q3r5J98J9r0k34K87J80J9r7J41r9K7J20k85O5N1J8j36j45J15J48k99J14
$$ y = [-52, 139, -73, -422, 12, 42, -368, -141, 464, 169, 54, 470, 24, -105, -72, 62, 197, 14, 252, 271, -143, -487, -112, -335, -74, -52, 83, 5, -463, -48, -99, -84, 87, 635, 33, 165, 432, -168, 47, 272, 102, -7, -90, -22, -76, -475, -301, -43, -353, -213, 81, -119, 20, -29, -76, 85, 175, -51, 239, -113, 54, 239, -342, 134, 217, -264, -111, -294, -297, 84, -461, -227, 50, -184, -28, 133, -189, 35, 165, -120, 248, 484, 36, 177, -96, -34, -100, -280, -340, 291, -113, -102, -69, -205, -127, -134, 63, 282, 151, 67, 330, 76, 304, 308, 161, 189, 91, 11, 66, -38, -70, -61, -255, -243, -126, -266, -276, -153, -132, 33, -95, -118, 318, -74, 324, 203, -84, -65, 235, 86, -229, -29, -46, -159, -385, 84, 63, -489, -256, 22, -42, -146, -5, -163, 180, 223, 104, 151, 33, 213, 132, 85, 184, 304, -289, -303, -71, -154, -249, -51, -32, -122, -356, -69, 111, 130, 33, 174, 75, 102, 222, -63, 2, 53, 71, -65, -210, -95, 53, -246, -132]
2375a32qp1O6J90k12K99m1j7L2O4r9J50l18J75K65l74m5K41l49K35N8n71M07j92
2399b47p4J45J68RJ7p5L52n7l78K30J71j24o9j0j73J62k32M05k62k24L62mn34
2422d42K92R9M8m0j2K71k82o6K56pl4r1m5j59L15k96K3J30m4j24j04m7L25j18
2446a52J4K69Q9k71Q1L05j88k1L5j94K51j0pl45l15N44p8m43L75N7k32RK10L13
2470B96k10j72K39k9M3M5k10j52J94P7k26j1O7o7l02J64M04l82k7L84j76j95M9
2493a97N40j92M8j3m4k59J67R2j63J59J4l6l45J87J17m77N8K50K82l31J66L25
2515C48o23k6M06J66k31L32m35j04q3J60m1Po2M85l59m39M97k2l81M21L69j47
2537B38m73L69K06n05J10M38l20M1K62k64o01L56K12k40p7N60l59k52p2L41q1
$$ y = [-132, -140, -211, -145, 45, -167, 132, 91, 74, 106, 170, 71, 221, -97, 78, 343, -31, -76, 165, -184, 51, 109, -462, -55, -247, -321, -176, -8, 1, 18, -57, 295, 238, -140, 90, 261, 137, 68, 58, -115, 47, -185, 220, -42, -266, 96, 92, -442, -150, -51, -3, -43, -55, 216, -66, -132, 124, 117, 83, -8, -53, -212, 103, -193, -170, -40, -84, -208, -312, -359, -34, -152, -138, 131, 220, -51, 30, 335, 147, 126, 161, -33, 218, 208, 201, -144, -459, 85, 7, -436, -61, -4, -236, -227, -17, 296, 86, -86, 153, 124, 167, 212, 2, -150, 44, 121, -105, -116, -49, -116, -418, -254, 150, -232, -259, 125, -51, -246, -197, 343, 151, 199, 186, 142, -117, 50, 142, -21, 138, 152, 116, -229, -42, 75, -402, -344, -94, 188, -143, 23, 348, -275, -301, 105, 271, 40, 372, -63, -167, -250, -90, -131, -124, -186, 299, -60, -499, -2, -24, -405, 16, 385, 238, -235, 134, 340, -165, -55, 383, 63, 104, 366, 102, -499, -143, 69, -171, -248, 312, -47, -299, -371, -30, -111]
2558a11o4P50l45l46L27P5o39K28K59P5k13K29K17p66j60O87l75j35M75kk24j48
2580b06M2K08k68M13L64m44j05K35k22l56M22J19l61K6J89Qo19K67M59m70K73
2601b6J74j83k08L60n8k66L57L11n9n52J78K71o84J50M65j48k67J49k63p5j33
2622e07N74O5l28L10K53o58K7K91L2j53L46J32o04J90k1j56O5P7K69m02n7L03
2644D8k57j31K85l9J4R3N76m23m05K77K09j73j59N04l90m76L25M8l11M41J29k26
2666d1j56o1L98l99K74J47N4k6q2K96m60j04J05K43m60K58K50m20j65L13k3r4
2688a53kJ93l30R4L16j20O5k5L89m69J95J42l96j16J84K1K20k25j4o0j89J51R0
2711c9j38K98L8K5l67K56Q0J80j89j71M07l33rr6k40K33j6p3j65K59j14K14j45
$$ y = [-111, -175, 575, 230, -116, 211, 286, -353, -125, 134, 209, -4, 225, 442, -324, -484, 203, -172, -307, 168, 166, -58, -206, -164, 44, -224, 189, 553, 109, 4, 239, 17, -339, 83, 202, -159, -133, 56, 64, -555, -288, 171, -299, -26, 148, -35, -243, 117, 59, -207, 150, 461, 402, -150, 28, 299, -385, -235, 230, 82, -185, -36, -299, -374, -507, 67, 132, -196, 114, 367, -291, -264, 27, 59, -94, 252, 384, -220, -30, -51, -207, -142, -65, 204, -198, -255, 48, -209, -340, -55, -94, -80, 13, 589, 166, -239, 38, 247, 74, -85, 419, 29, -447, -122, -74, -385, 56, 185, -41, -197, -258, 140, -259, 15, 162, 216, 190, 108, 404, -56, -160, -55, 188, -272, -14, 236, -184, -349, -36, -59, -153, -155, 38, -292, -198, 118, -2, 63, 38, 427, -42, 153, 295, -101, -217, -33, -12, 208, -17, -31, -91, -280, -129, -39, -177, 121, 159, 184, -183, 73, 153, 333, 144, -27, 380, 47, 38, -58, -298, -65, -81, -154, -319, -60, -174, 40, -105]
2734a05j1m3P3L17N7m23J31R3J10j86K04l48J73lk56M13k88mJ11j55L9k04J74
2757a31N1J77Mo5m5K27j41M2j96K93j30RJ06m64K80k05Pj0q8J93K09j05M8o4j73
2782a71R5J83q1K70j76n9l7J25j40k8j82Q1K07j43O1p0j05L2K78k69J0qn6K24
2806D1Q6j36o8J52J75l67m1J76j33K07j71J4O5j74k3J75J49j98P2R6j70K21q1
2829F7j18L58k52K59k11o0Qj50J54j31M6k3Q7j98N4L87k35R6j60K6j34P3J96k6
2853A13M6k53J86p1l4n0P1J2K6l12K17J22j36K4j57J26J98k76J23K04k42J60p3
2876B4J43k4N8k34K03m2j86J50k78J41Q3j40k11L53l4m4J6J23J25j60p5K5j27
2899a11J48o8J42j18l5M7N7j29p1P0k34J85J18L0J6o7j30J39j15J18Mm7R1K0j16
$$ y = [-105, -116, -159, -86, 231, 288, -135, -4, 89, 199, 13, 217, -131, 42, 39, -217, 196, -92, -96, 15, -140, -101, -305, -131, -80, 97, 101, 36, -9, 218, 77, 119, -77, 216, 86, 95, 201, -263, 17, -188, -181, -191, -279, -86, 123, 18, 66, 2, -171, -76, 107, 26, 296, 120, 61, 24, 149, 9, -19, -201, -120, 87, -56, 5, -65, -170, -138, 140, -129, -119, -127, -183, 41, 127, -9, -77, 75, 250, -117, -158, 18, -115, 92, -79, -65, 0, -174, -197, -22, 127, -71, 1, 97, -73, 148, 67, -51, 307, 55, 314, 103, 43, 51, -99, 55, -76, -30, -53, 34, -164, -110, 277, 42, 138, -22, 4, -130, -57, 139, 113, 159, -94, 92, 21, -13, -63, 8, 20, 46, -266, -49, 73, -63, -39, -196, -70, 128, -148, -25, 179, -63, 97, 24, 167, 143, 201, -33, 170, 128, -58, 92, -186, -45, 38, -102, -313, 40, 6, -38, -22, 101, 226, 66, -9, 16, -111, 37, -31, 111, -7, -42, 5, 62, -67, -138, -68, -302, -117, 1, 31, 47, -20, -150, -11, -126, -8, -4, -51, 40, 60, -56]
2924e6R9j20N9J5q9q6j6r1K15o5P3j33J29N5QJ45j09L51k66j13l6j9m7O3K36m8
2950A54k72M7k50L64k38J41K10l44J89Q8j91K49n9N8j16K63k65j68J9J45j30J46
2972D0l0K50l70j11K76k03Q8j00J93j6j54L30Q2l77J86j83K33j83Q9k0j61k3K
2995a62Q0k17J96m4J16M5j34jK01l0j58J94q6L3J69k73MK87j79j36jJ97l29K7
3019b01Q7m7J36J27n6l6p2J36r0j1J80k42M2J58j10J02k96L51m1p0j33j4q1J28
3043e3J62l75J69J44M3j55M8L6o8q4K02K48m56P5R2o8MP8j10n5j06K01M5l0Lj16
3069a26nK79J33k37k65K30Q4l3P5K12k72j96K60l6k06P2K45l53J80j09k16K86
3091Bj24K75k51L8L04m1l41J74J21j34k16K80k03K9j71J10m4J45K12j21l78M79
$$ y = [-56, 43, -77, -18, -3, -92, -178, -194, -285, -70, -135, -62, -195, -66, -11, -3, 142, 33, 384, 118, 5, -31, -50, -97, -34, 202, 154, -118, -71, -321, 43, -195, -54, 156, -188, 1, 89, -102, 147, 88, 146, 30, 293, 28, -140, -121, 24, -106, 40, 10, 260, -110, -221, 55, -148, -60, -160, 33, 17, -137, 193, 275, -102, 84, -99, 134, -49, 40, 20, -141, -164, -162, -82, -299, -103, -147, -31, 14, -120, -121, 80, 50, -108, 86, 0, 33, 202, -71, -67, 220, 41, -95, -96, 101, -228, -201, -114, -161, -25, 102, 46, 10, -62, 74, -16, -27, 153, -89, -47, 111, 1, 103, -193, 158, 117, 47, -86, -100, -181, -53, 109, -266, -97, 47, 90, -65, -17, 19, -49, -133, 69, 317, -139, -64, 28, -40, -36, 42, -68, -123, -229, -28, 17, -13, -10, -126, -131, 148, 281, 44, -221, 9, 93, 60, 135, 347, 75, -121, 139, 103, -103, -31, 214, -139, 41, -68, -284, 2, -122, 153, -98, -60, 244, 203, -138, 36, 157, 23, -193, 87, -116, -87, -258, -148, -192, -47, 165, 44, -334, 145]
3113A45J74n97J52K85K39l32O4J36r9j64R1J81k54m5O7q2Nk06K77j23O5J70l04
3136a55j81N39l08J19N4m1N6o0qJ24l16Q0R7J62m83O38m45K1NJ72j60j01J61Q2
3160E2Mj16J79j13q7J63j69m2J22O7j77N9L0l3r6J66J98j38k78J32K47l12J49
3183GM5J30j95P6J27r3j93L22j85n2J6J00l51J64N3n9l0J64r0r1l2oK60j5J84
3208B56j52J29Qk89J17o2J9J00k25j4L84n65l7N54k00q9K46k89l8J45M9P6R2o2
3232A53J18l11N7O4L9k07J38k4J47k35k0J22l0k19K87Nk88J89O1J03n8k1k2n3
3256eQ2k9j30K6M6j12J32r4RJ9M5R4k13K97k08J08j04j2J46q2J1J13m4o8j73J69
3282B3kj46J76q8K02j02j85K1J95Ko0N6O3q7J17k09j48J53l7J16J09k39J67k04
$$ y = [145, 319, -278, -126, 159, 398, 66, 130, 266, 167, 3, 94, 275, 21, -24, 43, -39, -34, -240, 37, -86, -21, 149, -155, -336, 203, -105, 14, 68, 27, 83, 23, 15, 139, -177, -97, 0, 162, -321, 317, -128, -107, -102, 70, -90, -191, -30, 52, 56, -60, 119, 6, -81, 82, -87, -129, -7, 60, -117, -58, -28, -61, -157, 9, 207, 69, -209, -77, 170, -142, 7, 52, 182, -13, 63, 190, 97, -96, 226, 41, -11, 5, 105, -246, -82, -29, -88, -118, 46, -44, -135, -167, -173, 87, 72, 256, 104, 233, 241, -48, 69, 7, 26, 126, -99, -113, 271, -294, -331, 223, 23, -66, 180, -109, -147, -2, 47, 123, 215, 153, 271, -40, 17, 81, 120, -87, 51, 27, 174, -61, -81, 41, 11, -208, 79, 84, -204, -15, 46, 149, 91, 70, 48, -5, 77, 48, -82, -56, -10, -122, 10, -84, -75, -56, -11, 83, -130, 167, -41, 67, -37, -49, 97, 15, 26, 139, 95, 27, -146, 23, 21, -125, 51, -37, 165, 63, -122, -101, 94, 96, 36, 92, 155, 68, 185, -24, -172, -19, -56, 60, 169, -70, 97, -107]
3306a07q7J28R7j37n7J19p5J94O4m2j8j07K51Q4l08R1J17j00K7j06L4J11l64K20
3330B9pp6q5q5J34j6J59j57K6M8O0M0N4R1N4k78j44J39Nj68K54k12K42n5o8K9
3356A3J0R7j65K9Q8P7k66P1P1j03o8M2L33j70j20oJ12k24J60mq0l5lO2L8J92j62
3383a1pn6p6K47q7j11J74P4j27J4k49k0J70K11m22K32Q5ol09K10P2k48L30j49
3407e9J65Q7j59L9M0k03O5R8j43Q0j55J67j3l6j76J32O7k97J44J41M6k2l9J20
3431H9j31q0K97j51M1N7j87j05r2O4M28m62K10k06J57Q9j98J25J52N0Rj18J09
3454A47n2J1M0k71L82n6q5j26j92M8J08j71K19J1k01K72R8p8o4k17J57k26L62
3477A16j33q3K35l7r4l08K08M8m6K9qN4m5m3M00k58j17L7J4OM4K40k13J21J9k41
$$ y = [-107, -194, -66, 31, -106, -163, -44, -119, 75, 139, 97, 79, -28, 223, 307, -1, 90, 207, 107, 134, 28, 62, 173, -191, 29, 22, -54, -139, -224, -90, -106, 53, -104, -78, -30, 30, 70, 124, 215, 269, -9, -153, -14, -9, -177, 77, -135, 107, 52, -16, 13, 23, 120, -45, -16, 72, 149, -117, -46, 25, -78, -146, -104, 229, 59, -61, -67, 45, -179, -19, -23, -103, -138, -141, -79, -41, 151, -11, -18, -74, -150, 97, 10, -101, 73, 147, 20, 34, -215, -235, -65, 146, -276, -44, 41, 35, -274, -64, 8, -240, 90, -59, 106, 193, 34, 73, 113, -90, -25, 73, -70, 10, -145, 22, 9, -27, -203, -71, -4, -301, -157, -16, 30, 8, -31, 89, -42, -122, 175, 24, 65, 122, -65, -170, -262, -198, 230, -232, -22, -228, -71, 18, -180, -55, 97, 147, 156, 38, 147, 95, 106, 146, -125, 257, 201, 116, -10, -202, -154, -46, -217, 2, 13, -188, 84, 182, 104, 40, -177, -20, -246, 116, -17, -100, 135, 98, 4, -304, -96, -48, -94, -65, -73, -19, -64, -107, 293, 35, -82, -45, -31, -25, 19, 259, 46, 167, 186, -55]
3503e5N5N6N9l86J05J24n8l3r8MK04K2J52rk70J48N6l34K30R8J14l26n8J15q1
3528a66J90J09j51r2N4K8j09N6J20Q2j37q8K87o7j19R4n3M9J40L4k92k19L94l85
3552b41J32j76J67K81l28J51m3K04j4k40J54M1J85j4j39k25J48p3J87j43J93j87
3574B0k91K85kj40K1Np8K25j05J59r6K88j28j95Q4N4n8l80L96J04k39j31K72r2
3598b2q4j55K18r3O3K25k06q9K04nj01O2J31j18j63K15j8k73M9K03kj31K70j77
3622CJ2j60K24j4j05J73Q5j91K9J94l31k8L14k04Oj07m2L7k9q1J87J23J05j65
3646C5m3k35K34j86J49J16j6J1j39J55j7j10o6L18j84o1K49l42k0P7r1J38JN2
3670B5J29l24K32n1q5J04k6J43k95L11k49N7m2O6j6M4o5J64l93K70p4qj17l13
$$ y = [-55, 0, 56, 115, -271, -166, -42, -100, -133, -231, -227, -23, -1, 151, 142, -128, 20, 76, -258, -28, 70, 184, -142, -200, -85, -166, 24, 133, -18, -110, -56, -28, -137, -81, 39, 121, -16, -104, 183, 116, -3, 91, 38, 87, 227, 261, -31, -250, 144, -241, -109, -285, -118, 163, -165, -14, -57, 147, 133, -107, 47, 88, 273, 259, 120, -105, 43, -30, 157, 14, 207, 20, -271, 14, 12, -128, -107, -102, -180, 45, -60, 99, 3, 291, 163, -32, 52, 106, 48, -332, 64, 168, -71, -202, 70, -22, -106, -261, -43, -136, -73, 152, -54, -143, 61, 56, -45, 17, 148, 30, -133, 82, 64, -209, -160, 43, 41, -90, 180, 3, 15, -145, 79, 65, -40, 133, 218, 27, 56, 250, -81, -109, 205, 1, 7, -100, -142, -105, -134, -215, -28, 95, 200, 35, -8, -243, -9, -195, -46, 70, 54, 65, -74, 81, 64, -46, -112, 206, 22, -39, 210, -132, -152, -75, -166, -28, -27, 25, 154, -170, 62, 11, -74, 30, 4, 147, -148, 163, -86, -29, -71, -5, -21, 23, -42, 122, -271, -1, -75, -83, -200, -513]
3694e13N62J5j47n5L81j83J10k1l41N8J04n0L7K01k44N9j48J91k04L8oK69P6k28
3718c9M7L6K12k81K40r6j29J0K34m51R8J84R2j49K6m9Kk25O6K50q4L3l6O2j00
3743d7l6K00K25k58M8m0P1k60p2kJ46J7k87J94K56j64j00J08J54m5Q8k54J18l7
3767B3Q7o9j94J60M6r7R2o0j20j27L06m2n7M0K7J49l15q7J58N0L14j97j07P7j14
3792e7J86j85R6rk67J44k5j0k4N5j34K28K04j99m6K31k43l7k5L56j59O2j13q2
3816e3K44k04K81m96K25Qk01J81J91l88K42N9k07M52l54L7J47J56l03j8k2J70
3838A47l30K72J58j51j90j64m2K55r5m2j3J41M8j56K79l58K28J69q1l34K99n2
3860a2R7p1j30J33q0j4j07J21o3r3J39J37k46J22J05j65R9K76p3j11NQ6r3q4n6
$$ y = [-513, 49, 64, -83, -138, 243, 60, 170, 149, -192, -134, -30, -80, -43, 158, -86, -27, -175, 16, -188, -150, -156, 113, 189, -39, 8, 44, 256, -25, 215, 119, -10, 0, 234, -217, -119, 65, 157, 8, 34, -15, -13, -238, -172, 78, -6, 27, -9, 53, -47, -83, 117, 342, 84, 132, 92, 163, -97, -169, -171, -25, -8, -295, -101, 155, -9, -109, -1, 153, 108, 196, -58, 60, 23, 110, 41, -153, 7, 53, -44, 48, -12, -132, -259, 47, 5, -52, -12, 15, 164, -151, -238, -80, -30, 284, 87, -20, 57, -57, 129, -56, 40, 31, -236, -92, -117, -127, -151, -96, -230, -2, 202, 3, -43, 188, -55, -92, -117, 239, 80, 142, 29, -53, 191, -13, 268, -228, -3, 5, -196, -15, 176, -212, 30, 89, -118, 334, -20, 17, 164, 320, 17, -1, -23, 147, -183, 89, 247, 96, -94, -258, -300, -45, -140, -182, -195, -54, -6, -162, 117, -241, -13, 156, 75, -259, 40, -12, 85, 14, -116, 17, -63, -77, -184, -63, -126, -219, -80, 57, -189, -67, 38, -127, -28, 248, 175, 64, 69, 155, 62, -22, -78]
3885g8PL9J35k8l61K94J12j63K04l25L18k5m9j5j99K62j34nP3j29Q1k05K26K49
3909B84k73P3p8k44J49o2K72p3j81J41N4j16K22j08j9J3j4M2m8o2J32j43j31J30
3933d0k14O2P2J28kj25J76l4k23J18l4J58P3R3L6j6k6l26P1P4j12l0J85k3l05
3958b64K55J41l03O7q0JJ05J5J55K8j40J50j69J22k23K2J10M6j59J84k56J93L1
3981C1k1J14j00o0o2L06k33K42l4q1j62N7k46p7K71J1j60P3J86l21K07J13j9m08
4005c73M29j43M6n9J24k70K6J00M1J40oj00K29k29P4k46L1J65%k50K73O5l08J08
4029a33p2J64NR2l5J03o0J2R6j29j27M0J28j27j97L57l39Q1J35mP1Nk8q5K36k27
4055c8J9L4p5K17n7j89r7R2J6J55k02K02j09j35K97j71M1J29p0KJ60j14K6j34
$$ y = [-78, -71, -32, 103, 75, -286, 8, 120, -43, 161, -164, 154, 129, 80, 65, -134, 128, -6, -11, 62, -67, 14, -191, 35, 284, 11, 84, 6, -238, -89, -151, 121, 48, -133, 8, 62, -54, 168, 60, 41, 54, 40, 82, 34, -28, 104, -39, -170, -40, -254, -192, -120, 8, 6, -119, 57, 23, -200, -82, -116, 42, 115, 208, 244, 228, 202, -124, -53, 21, -91, -121, 64, 41, -264, -9, 132, -171, -104, -184, -183, -78, -63, 92, 120, -20, 130, -39, 83, -140, -118, -8, 38, -121, 63, -193, 0, 31, 10, 124, 24, -36, -98, 208, -25, 217, 183, 102, -60, -3, -249, -326, -55, -44, -204, -131, 55, -266, -59, 54, 35, -373, 56, -87, -41, -100, 24, -246, -220, -120, -79, 61, 55, -45, 184, -45, 29, -217, -186, -21, -21, -271, 2, 67, -241, -133, -205, -41, -36, 56, 21, 124, 64, 76, 172, 43, -84, -44, 84, -43, -240, 117, -222, -141, -6, -10, 61, 66, 38, -47, 189, -38, -19, 15, -60, 157, 100, -89, -186, -94, -78, 77, -125, 77, -32, -167, 130, -41, 0, 129, 59, 61, 221, 107, 133, -1]
4079aK85l54NK00j00K9j03J75k89N5J07J86k21m8J21j90N1J64Q3m0J09l03M0Q3
4103D4k1J72l21K44l51K98k11P0o6m8M1K78j06o5J00j86P9r1K74r2N6M9P8j67
4127E8J28j86K4l1K6k29MNJ83J12j74m4J72k45J51Q0k53L14k7K28l76j29M57l65
4151a17J33nK0n8m8K17j44K44l68J64J1J64l51K06k04K58r8j15J72R7k42q7L27
4174A76o2k86n5K46J08k28J88k55j00J53K37q6J66k13J44k14J74k4n3k79L60k43
4196a46j24N05j50j72K10j14J15p3q4q9K17j08K85k62n4P0O2j3l3J42n1Q0j51
4219F2n8R7q3j26K18k05K00N9O9k09R5j27J6M3J29j5j41r1O0k6J88j02K5j79Q6
4244a5j5j27J0j26K47j43L19J56m25P3J2q1K87j5o0j39j3J39m4J87o7O6j45j94
$$ y = [-1, 284, -70, -65, 135, 35, 64, -39, 136, -153, -98, 9, 195, -26, -74, 47, -143, -92, 72, 155, 115, 224, -79, -39, 44, 23, 195, -126, 118, -233, 65, -146, -76, -142, -190, -149, 129, 23, -42, 58, -128, -49, -140, 134, 42, 98, 147, 225, 58, 186, 0, 24, -7, 19, -210, -206, -201, -18, 94, -80, -124, 48, -197, -46, 34, -219, 95, 68, 296, -80, -209, 248, -117, 16, 11, 31, -27, -75, 142, -2, 242, -126, 38, 49, 213, -138, 68, -136, 122, 24, -91, 81, 178, -64, -151, 176, 114, -172, -227, 19, 127, -101, 87, -168, -268, -115, 122, 36, 202, -11, 133, -81, 93, 69, 16, -263, 97, -146, -270, 235, 85, -87, 123, 9, 124, 51, -33, -122, 95, -13, 272, 10, -44, 26, 88, 75, 42, 184, 133, 213, 62, 4, 101, 18, -108, 110, -95, 105, 164, 233, 24, 119, -8, 8, 51, 180, 165, 24, -67, -7, -33, 155, 53, 78, -101, -15, -30, -157, -147, -273, -26, -169, 150, 306, -119, -46, -34, -115, 172, 157, 97, -42, -55, 84, 40, 227, 160, 226, 81, -113]
4268a13j4j01J14RQ4m5Q1q9J31j08O2O1j68J17j39K93m3j99J43j29n5K72k04O2
4292B2Pl2r1L21l33N7j03O2J79p5k10K90j2j41J6R1m9Rm9J89j92k13L91j78J01
4317E7j9J4j78j1J35K09j47p4L40k25j49K71j90PJ0j71P4J71l08J59k8K28k54
4340g9J72J06k78J48j37m5j85K89P0Q5m4r2k2K0L43m51J66o5j94J76K44l21P8
4363a6K05m4O3j15r3j26R0J11N8q1j77J3L86k75M9J70m4j08l4j86J82p2J38j50
4387e6P5j26K93j55r5o5Q0N7k64K71J6o8L7J31k34M3Q4Q4k71J76J11q0j54N5J42
4412H7j38J90k2j4k9j36J79k49k1J3K21j28N9K02k86l4l9rNK18k54K10M2j00M2
4437IJ84K4j68j86J19p3J28k69K83L3j17P4k63J29N6m3J47j73K62j65M6r3j11
$$ y = [-113, -127, -228, -114, -105, -21, -66, 15, -74, 57, -51, 11, 72, -96, 21, -118, 175, 132, -67, 76, -53, -108, 164, -40, 22, 29, -3, -94, 227, -106, -49, -152, -90, 89, 14, -196, 94, 82, -59, -43, 48, -1, 8, -41, 148, -44, -257, 134, -44, 57, 38, 52, -126, -137, -2, 207, 60, -14, 326, 101, -48, 223, 33, 40, 50, -121, -47, 124, -184, -25, -53, 175, -79, 93, 199, -79, 69, -68, -113, -298, -9, 61, 146, 102, 10, -12, 8, 351, -100, 66, 1, -193, -17, 227, -94, -16, 189, 145, 208, 93, 0, -126, -36, 75, 133, 52, -125, -112, 274, -1, 48, 218, 174, 66, 32, -154, 28, -44, 94, -56, 19, -107, 186, 31, -64, -129, -49, 8, -256, 15, 31, -37, 0, 131, -103, -60, 24, 108, -163, 13, 124, 44, -110, -55, 87, -51, 139, 117, 103, 74, -62, 117, -132, -153, -140, 81, -47, 12, 214, -72, -106, -145, -154, -149, 69, -185, 25, 67, -33, 9, 193, 217, 49, -137, -18, -91, 37, -232, 51, 84, -33, 41, -222, -93, -37, -80, 67, -106, 156, -9, 37, -56, -167]
4460a67J41N6J1q7o9J08j58J58K8k71K37j47K10j93R2J15Lj07n5L52k99R5q2l7
4484f6RJ18l1j47J72q1n1N7k52K92j57L10r9q4j18J04K8K36q2k02M1J8Kj15Q3
4509a5RK2l8j11M7j55J61J08n2J08n5j19J96J11j81l5N6k40M35k53N7r4j47L3
4533a52m6J38m0R7K3J14l08J14O0J6J55k37J55Kj98J80jj06J61r4n8j10K65q7
4557D3j28M9m2j48j2R9J74j10j81K11np2K34j90J84j14K9j9j89K26j24k71M35
4580G9p3j10J05R9P1k03n3K44j68l8J05M3j23r1l9P6L02k76K66k59J23j61J54
4603G3j35j6J73j36J9K9j26j2L30k95j28K45J4l9Q7j64K48k54J38n5k49l2M57
4626A72k65J4J35j29J79n2j04J56k07P9J05j01N1K0k31J22j73L33N6j16K4k63
$$ y = [-167, -26, 30, 41, -46, -115, -7, -165, -7, 21, -250, -13, -160, 50, -143, -51, 64, 67, -40, -95, 257, -42, 53, -29, -66, -57, 61, 30, -117, 55, -26, -77, -20, -272, 20, -137, 173, 74, -10, -128, -24, 4, 240, 158, -44, -3, 15, 17, -98, -15, -6, 16, -22, -133, -86, -241, -80, 28, -24, 84, 29, -90, 106, 217, 36, 1, 57, -183, 252, -1, 56, -38, -185, -152, -198, -60, -100, -3, 20, 134, -174, -60, 0, 16, 171, -66, 89, 91, -107, 73, 72, -34, 127, 33, -25, -135, 130, 43, -85, -36, -78, -226, -238, -139, 35, -75, -256, -45, -50, -122, 112, -78, 106, -8, 21, 2, -187, 39, -85, -356, 79, 6, -104, 1, 100, 171, -32, -85, 159, -9, -47, 58, 101, -22, -113, -152, -76, 226, -50, 216, -43, 80, -81, 73, -62, -78, 95, -41, -22, 7, -119, -131, 199, -96, -224, 21, 35, -4, 83, -81, 167, -87, 51, -4, -253, -285, 172, -93, -79, 56, -73, 106, 54, -50, 106, -101, -22, 83, -18, 33, 53, -178, -56, -229, 104, 160, 44, 68, -195]
4648a95j23M99j48k78K28j3N6j04L3R6j0p6l5RJ4J65j67j90K94K7k17K1J13J19
4672A18l94J13l8L27q7j8J84p4j48O2PJ22k49J63n8J73k63o1np0K41j96N4j15
4696b12K09r4P7K43k17J14j70J7k8K82j98j58K67J7n8Nj19J20l83J10J32r3J85
4719D8j2j02R5J5j17m0K79k00J05j78N5k6J00j8p8J43L0j85N0P0J39l08l6L31
4743A60k29J75k34n4l4Q1K91k9Jmk66K62j28j24K03l5k4K3p1J36J50k10j16J06
4767C0L5R4n8j68J53L4k39J49j00J45J00j86J70Q2l37k2j80K37O2m6j14O4O8R9
4791G2k21j30K85r1J94r3R2k41M22k90PJ78j37N6l4J3j17O9m4j1J04j02M5J00
4815A26k16K95j99lK9n3J83q5R6j02j28J5R6o2M0j51q8K42M3K4O2j79J8m2J82
$$ y = [-195, -318, 181, 33, -245, -17, -30, 26, -78, -45, 51, 41, -35, -70, -61, -47, 118, -49, -239, 55, 82, -135, -114, -1, 118, -276, -163, -201, 126, 39, 21, 205, 131, -17, 45, 52, 174, -75, 88, 30, 203, -60, -121, -126, -196, 45, -151, -97, -212, -3, -97, -20, 223, 6, 120, -50, -33, -61, 221, 23, -135, 132, 149, 91, 96, -23, 97, -286, -176, -44, -137, 48, 36, -66, 29, 44, -73, -113, 166, -34, 71, -107, -52, -78, 22, 4, -74, 69, 99, -86, -36, 34, 173, -135, -171, 160, -69, 106, -128, -182, -216, -135, 156, 127, 128, 124, -142, 120, -8, -132, 71, 36, 12, 35, -36, 100, 250, 40, -76, 30, 65, 159, 101, -67, 86, 120, -119, 30, -70, 75, 175, -11, 159, 241, -96, -118, -298, -61, 1, -45, -159, -95, -27, 72, -149, -279, 6, -85, 109, 16, 108, -133, 289, -1, 6, 184, 47, 103, 69, 82, -35, 34, -10, -21, 83, -19, 26, 126, -90, 205, 6, 3, 32, -21, 162, 77, 173, 71, -57, -42, 54, -8, 32, -119, -207, 35, 78, 102, 164, -15, 3, -39, 143]
4840A43p9j48J98j32J22j91o0K0J5R6o5K10k15j57L65k06J35k52K88m7Q5j57j1
4863d3J7J17LK5n7j28l2mQ7N7l6M5J06k16J77j04Q5j52J24M5np7M2k55J24j26
4889a81J00l1j89L16o9p7K27o4p5J44r2o8K25k45R9Q2m6j6r6J58l8j67j5J39j2
4914IM0k19K94j79j66K58o8N2oQ5LQ0j31k1p9j85K90J22k45J04P5p6q1p9K08q4
4940Aj73Q7N0l5p4rj45J80K31j11m1J18j20J30j21K49k08m1J21j07N8op2J22k3
4965F1l0j22Q6m9K74j22j27R3K9M9K7m1j22N8O6k85O8M5l9K8j04L30k40J73j82
4990g6L3J45j91o4J79K10k69J0K0M7N0K0j32JP0R7l44J36l2J48q1k16K03N0L3
5015D7J18j50L3j03r5R1J47l00L52k17K3j5o7o5K10Rj20L4j10J79j08N8J67Q1
$$ y = [143, 64, -84, 114, -18, 104, -87, -147, -127, -112, -16, -81, 129, -86, -243, 122, -84, 51, -201, 87, 40, 125, -32, -43, -26, 91, 94, 119, 62, -66, -98, -102, -15, 42, 6, 51, 157, -59, 118, 14, 99, -53, 71, 116, 111, 34, 76, -179, -55, -181, -81, -112, -301, 15, -54, -131, 96, 32, -43, 101, 9, -59, 166, -79, 20, 102, 56, 40, -56, 102, 64, -103, -118, 21, 9, 49, -170, 124, -55, -221, 37, -31, 21, 15, 100, 103, 183, 52, 31, -48, -233, 57, 179, -66, 38, 113, 37, -44, -123, 85, 1, -172, -85, -35, -70, -144, -153, -298, -118, 113, 2, -39, 79, -41, 89, -32, 217, 9, -32, 89, -18, 40, 34, -38, 84, 61, 31, -91, -5, -54, 220, 98, -29, 64, 93, 142, 169, 128, 6, 64, 130, -155, -87, -42, -81, -53, -157, 173, -67, 106, -76, -43, 102, -89, -153, 26, 236, -33, -23, -3, 44, 94, 114, -18, -17, 53, 150, -194, -58, -90, 58, -23, -239, -36, 14, 47, 165, 15, 48, -55, -150, -59, 88, -212, 140, -77, -54, -69, -136, -201, 9, 18, -102, -68, -178, 1, -107, -49, 118, 199]
5039A99k07M2j02K70k5r8Q9qn2k45K33L5k94R8r1J0L08j72M1j63J30j08j96N23
5063B17j43J47p2j36n6K29%j42q5K30q7j97J23R4j33o0K9p0K63j85o6K51q2J12
5087A81l32p1K02R3q5N9J1p9J47l01K42j51N2n7n6P7j38J32K40l2M6q5j48q3L50
5112B14r1p6j50J07K0l3j35k4J69P3r8lJ61l04K33K1N0r2J4r7J90k17J46J5K9
5137A22m36R5K50M6j58j35K09L5k1N2j3r5N9J4q6R0K13j64j39J74m4j49J6J59
5161I4k45M8K67l35o4L07j6M1j59QJ04j48OK5R2j42J73rq1NL6k4q2J68j4j98J81
5188C8l6j46R9Q8K1Q1m06J39K30J71n68L64m9J60jk91J24k48J29LM5J30j08J53
5212A22j55Oj68J27K39k35j22K97j66J48j46J53M3n0k0p4J45k74K01j69N5N8p4
$$ y = [199, -8, 34, -68, 202, 177, 79, 168, 160, 108, -137, 96, 131, -163, -65, -156, -146, 162, -10, 31, -132, -2, -110, -306, 217, 74, 221, 149, 13, -43, 186, 186, 44, -41, 189, 102, -95, 28, 122, -11, -71, -42, -112, 151, -34, -100, 151, 69, 181, -151, -222, -20, 73, -12, 47, 58, -21, 126, -175, 67, -84, -32, -89, -145, -68, -206, -74, 166, 134, 180, 95, -53, -136, 214, 123, 47, -103, 4, 24, -9, -144, -168, 1, 74, -24, -27, 134, -170, 63, 84, 134, 42, 56, -41, 149, -68, 78, 93, 122, -314, -219, 31, 77, -81, -216, -7, 28, 7, 59, 46, -49, 10, 24, -62, 28, 241, 77, -62, 112, 68, -81, -65, 94, -151, -103, 164, -171, -235, 72, 56, 97, -62, -54, 50, -98, -92, -67, 25, -117, 56, 47, -34, -29, 7, -17, -99, 69, 55, -143, 38, 2, -144, -45, 43, 64, 145, -261, -122, 108, 279, -289, 75, 26, 186, 185, -106, 18, -230, -101, -98, -53, 77, -31, 122, -33, -27, -195, -68, 171, -64, -186, 111, -55, 93, -53, 100, 143, 93, 73, -1, 144, -130, 71, -98, -43, 15, -59]
5235e9r0M77k23J01k08O2J01j06l02M56k3k07q0L73l11l7P2q2r2J87m4j03J95
5258E7N7l10K52k4j23J07k21K85j5j85J72j25R8j72J15M0j0K36l26K0J48j35R9
5281D0r3J10j37p8K75N0P0k17k10K26L9Rj88j02J94k3R0k55J59J14l05K19J3J41
5305A41l2N3k02J0RnJ81k94K07j46m5J70p3k6P9j7J22j05nP8k20K00j29P1o8K01
5331A55j98O4j74J63l3K04j60j67K89j86Rj45O2j06NJ22K24j10j76JK17j15J41
5354H6k22K49Q7k15J05q2k2M9Q7j02m2j6J22j72j35L22l28J82l3j7R2n2j16K04
5378C1nk04L99l59M4J46M1l16K17RJ47j36Q0j0J8j24J18j21o9K44j93n5k4J56
5402C4K07k56k9J90q0r1ln3r1K69j93j7J24J4K0J02j99J02j2L1m2j20J91k00O8
$$ y = [-59, -149, 328, 105, 206, -2, 60, 161, 55, -247, 209, 186, -21, -101, 272, -39, -76, -4, -86, -178, 9, -35, -138, 57, 114, -196, 56, 32, -91, 16, -205, 80, 65, -120, 52, -73, 25, -147, -32, 8, -2, 234, -92, -72, 76, -59, 40, -53, 57, -80, -158, 117, 167, 237, 20, -190, 36, 75, 84, -104, -206, -12, -35, 55, -200, -41, 73, -232, -13, 0, 141, 109, 162, -40, -30, -21, -26, 155, -139, 68, -78, -123, 47, -26, -52, 27, 10, 132, 27, 22, 100, -120, 80, -49, 22, -46, 155, -43, 21, -153, 10, -23, 181, 21, -146, 143, -43, -34, -179, -117, -223, -218, -96, 128, 18, -158, -157, 60, -55, 86, -136, 113, 200, -15, 90, 8, -14, 35, 122, 20, -22, -38, 84, -88, -223, 99, -229, -47, -80, -97, -5, -57, -173, 31, 26, -178, 221, -138, -94, 52, 93, -223, -6, 3, 150, 14, 94, 84, 102, -22, 96, -25, -94, 150, -43, -98, -122, 34, 241, -15, -44, 146, 66, -25, -28, -81, -172, 97, -96, -113, 11, 25, 45, 147, -52, 50, 38, 69, 27, -93, 98, -102, -34]
5427c4J62o1k5J7o7J4o1J51LPq9N9J3J66j79j29K3N6p1j21j6J00J34o6J13j8O0
5454A41j98K55j95J36k00r0K64k06m4K38j63M5J66j37q0J56k15J8J46l00J05Q6
5476g2j84J89K23j92M9j05N8Q2j42J62J91j82L3OR6l60K51l34J93R0r6J38n2j40
5500i8L0k05K67j5j11M0J61j03KK04l09L8K66o1r5M7j64J66r9O2j20J8M6L0rJ67
5526A55j57p9J29j83MJ10k2Q7k7Oj67R4J97o1j11mJ66p3o3P4j85J0L0J94p7k77
5552b30K73k13J75k17L89j73n6Q4J44j45m6J20o4l2K0J4n1J15j93K49j81P6J69
5575B27j57k41L18k2P2j27j21P2j94L21k03J84n3k56M8j21M12k02J85k41P2J93
5597A66j2n4j92K38jq5q5K3M4j1r4p9O2N3P3N8j82J8p6J90o7j66J92p5M3m9K24
$$ y = [-34, 128, 67, 42, 59, -8, 6, -55, 96, 99, 106, 17, 76, 89, 255, 76, -53, -30, 26, -45, -166, -182, -82, 52, -14, 99, 81, 141, -57, 198, 3, 139, -61, -151, 113, -93, -137, 101, -62, -17, 149, 12, -68, 88, -127, -109, 37, -263, -158, -72, -256, -67, 156, -36, 13, -92, -34, 48, -94, 68, 259, 77, 110, 116, 212, -148, 103, -231, -38, 52, -44, 94, 42, -98, -68, -273, -6, -21, -132, -92, 69, -34, -32, 172, -137, -99, 167, 106, 11, 58, -106, 60, -39, 23, -97, -79, -33, -3, -12, 155, -2, -81, 48, -135, -131, -21, -43, 44, 17, 23, -144, -50, 147, 86, -25, -29, 137, 64, 1, 75, -110, -100, -70, 124, 47, -230, 43, -170, 5, -212, 177, 4, -52, 32, 176, 31, -15, 105, 41, 9, 29, 43, -8, 107, -86, 163, -18, 58, 227, 70, -171, 147, 125, 197, 70, -51, 21, -173, 148, -55, 129, 76, -180, -132, -253, 159, -43, 142, -99, -27, 166, 154, 100, -92, 146, 145, 60, -25, -2, 42, 31, -63, -142, -80, -27, 46, 104, -78, -60, -136, 54, -13, -179, 13, -62, -19, -68, 156]
5624A56k24J07L08k49k46J01j0J37j30L4k23R2K6J6k9K94n5k87L7J76J16k10N8
5647eJ04r8j5j2P4j94K60J52j09qk02l0k7K0N0k3q2J28R7J25r4j41L7N0qm9q6
5674h6J34Q7k31m3K13j6n3N6n2k21L36j32j74P7l3J48o4j50K54R4j25o7Q8l7j2
5699iJ07o3Mk6o8jp1K67j85N4k11M08k66N8j3Qj76n0K49O1p6O8l3K0J3j41J75
5726A03P6j67l3P1J11J66l30l66P64n83K22j0M8j97K39r6oJ73l75Q5J39p5K07
5749A66k53J31r2J49j09J66K7o0k05K76k17M1j53o6N4L18j16o7N7O0k8l2m0l5
5773b8q3J39N4r5J40l05j11M14m0J19k86L7k1J33j33J16j58J25j35J04J25r8O0
5796G3j09J14j26J13j17R0J1j14k3J09MJ95n20K90J81k2k23N7o6J42n2k31P6J38
$$ y = [156, -68, 39, 347, 98, -148, -47, -57, 80, -50, -16, -239, -147, -121, -105, -134, 160, 105, -182, -145, 31, 147, -63, -5, 99, 1, -14, -26, 48, -146, 114, 266, 157, 149, -53, -83, -110, -90, -40, -63, -145, -17, 80, 205, 111, -30, 7, 57, 49, 0, -86, 48, 135, -96, -139, 74, 58, 5, 61, 9, -212, 124, -8, -182, -105, -138, 10, -54, -204, 50, 144, 19, -48, 40, 3, -9, 98, 35, 39, 13, -55, -56, -127, 140, -45, 9, -202, 206, -60, -2, -15, -7, -183, -233, 16, 77, 1, 69, 36, 56, 69, -72, 103, 179, 12, -21, 50, 161, 327, -3, -369, 395, -188, 34, 24, 72, -125, 114, 18, 12, 185, -190, -105, 34, -41, 166, -87, 44, -48, 101, -8, 158, 185, 125, -80, 196, -21, 20, -133, -199, -145, 173, 57, -10, 47, 107, 79, 47, 7, -28, -111, 28, 82, -13, 127, -178, -289, 125, 85, 204, -82, -45, -66, 67, -66, 50, -108, 17, -118, -14, 111, 13, 73, -36, 78, -48, 65, -52, 38, 49, -65, -88, 21, 25, 220, -300, -10, 171, 149, -74, -17, -83, 59, 7, -224, -148, -10]
5820a0L3j43J93m7J69j05j10m1Q8o1P7j35J53q9l1R5O0q8p8J53q1Q7k78J70J81
5845A62J13k01p3L7l5J20j00m7m0J86j29M6R6R8m23J69J40m3j36K53k12N3m5Q3
5869G2N1Qk3K0j11N5J32j23p1k86K56j8N7j11J62OJ07j38O3j92O9J08j77K18k36
5894a02J11j00J08k34J03L01j08r0p3kJ73k4Mk71K82j20lJ33k12m1K45R4j29j27
5918h2o4K32j07J11q0J1k23j68K37J93n3n7q6K1R1n0O4m6R9J39q8QLL2J1q6q9
5945b7o7P1o2k6K0P1q0K1L37p9j11k18K79j10l3K7j41K15j44n8M32k26k2J18n
5970A82q5l09Q0K92j68J6J56j79j9o6J55j56pl8J50J44k67J40l7M7j39P0K1j63
5994a80M38l65J84j17kj12J35k0J20J04l0j82p0n5J09R6o3j08J08j48L3K7K1O0
$$ y = [-10, 23, -120, 73, 26, 195, 90, -20, -61, 27, -34, 43, -92, 61, -28, -59, 36, 96, 8, -70, 83, 2, 89, -189, -19, 162, 275, 74, 1, 38, 3, 123, 23, -24, -64, 122, -7, 39, 135, 233, -190, -21, 119, 76, -60, 193, -19, 34, -11, 72, 123, 131, 108, 128, 17, 72, 204, 81, 10, -276, -20, -38, 19, -92, 70, 76, 183, 45, 108, -84, -15, 93, -84, 134, -102, 9, -91, 17, -217, -114, 187, 79, -11, -84, -86, 87, 63, 67, -204, 78, -42, -45, 88, -124, -165, 80, 174, 45, -82, -146, 86, -21, 90, 10, 21, -202, -370, -133, 60, 7, -50, -136, -115, -24, -74, -10, -56, 43, 182, 94, 102, 105, 137, 148, 62, -27, -94, -23, -85, -111, -91, -20, -100, -79, 258, 179, 68, -150, 129, 19, -14, 13, -128, 87, -57, -115, 317, 91, 69, 187, 182, 97, -212, -132, 160, -8, 8, 164, -15, -34, -100, 55, -101, -108, -146, 4, 148, -119, 21, -16, 31, -108, -38, -17, -180, 258, -107, 77, -40, -42, -154, -19, -39, 81, 185, 155, -27, -97, -152, -43, 53, -10, -118, -10, -158, -125, -98, -77, -17]
6018a7K00j99j41K98q5L3p9R3j22J95o9M8q6r5J11p8P2p5J1J09r3k0j27Q9j1J11
6044G3J5n6l1J11j20J07k01K46k78J86l4k70K52JJ79k99J70o3Rm3P6q1j10L09
6068A48k00J33J35j50l5K5R3k29m6J36o3M5j34J52j79J33m7O9J77k21Q1o4R2M4
6092I5j21K2qJ11n4Q0j72O4n7o4pM5mJ36j45n1L4L2L34l52R4l9P8j59m3MK43q1
6120A5M5l6O1j90J15J90k87K15j20J19p6P4lk41J20oj97K61j8NJ83k10j31J2L34
6145B34l19N7J68j59j26J09P8j00J78p4pj02j58J87j6n8Q1L51k97L1n32L76J52
6168E4L8k28J39j0r3L7RQ2j77o5K85K1P5Kl55L36m6m5M6r4j12LkJ04j10J12J42
6195A48j44j51J26K8m6J39k18Q3pQ3J9Lk80K19j19L9K18j63j29K39l65M27n5K5
$$ y = [-17, 183, -16, -157, 141, 56, 89, 10, 103, -19, 176, 107, 155, 69, -26, 85, 7, 79, 4, 15, 124, 31, 11, -116, -27, -38, 73, 88, 32, 1, 112, -8, 99, -102, 144, -134, 52, 18, -252, 0, 1, 180, -119, 51, -12, -3, -46, 30, -51, -161, 148, -52, 81, 216, 66, 31, 56, 149, -80, -126, 10, -53, -8, -142, 10, -169, -36, -83, -14, 163, -58, 23, -41, 51, 95, -26, -4, -12, 99, 45, 125, -47, 17, -40, -104, -111, -66, -70, 66, -79, -130, -96, -64, 270, -82, 12, -27, 51, -108, -151, -147, 96, 15, 60, 24, 85, -105, 10, 200, -87, 128, 8, 127, 51, 125, 122, -119, 1, -5, -202, 59, 41, 46, 229, 19, -112, -100, 234, -85, -28, 140, -19, -145, -36, 42, -58, 120, 46, 39, -63, -221, -34, -50, -108, -27, 324, 27, 58, -474, -98, 54, 92, -136, 3, -7, -100, -63, -54, 28, -149, -214, 71, 92, 167, 169, -186, 150, 104, 59, 105, 11, -101, -98, -100, 4, -106, 6, 148, 4, -147, -21, 7, -39, 100, -118, -35, -42, 41, 60, 63, -217, 2, -117, -78, 140, -23, -152, 87, -278, 149, 94, 119]
6219A19j69m1R5j23J36k89J66J51j42J54j0kQ7r2q2K44j88j20J54N3l6r3P2l5
6243Io4J43Nj09J97l29J80j71K23j88L01j37j83n7L42j55P9j91J9o3J37K14j17
6266H5l15J82K4J0P6m5j30J74k5j47N7L45j93j07q3m2R3k7J67j21P4M5j1j59P9
6291FL60k77j0j86K05j01L5Ok6r4J90o4k15J77r5M09l31K5j24L7Q4oN9n3l1m4
6317f4J86k81J84J15J04k66J49j95o8j23K44j19O9J03J7J50l45J88k51j37N77
6338B37k70k4J00j56K39J7j12Q5J2j84K11k02p4N3j5K61l24J45n9j65l9J89L83
6361C08l89j37J83M2R5On8m7j18K46k42J74l03N66r5j55r6K2J53j74r3Q0j16J92
6385D4j7j85J89k9K05l10K4j33M19j15j24L2n2P8O4q5J43k42L26l81QK81l2j89
$$ y = [119, -50, -91, 4, -119, 17, -272, -106, 45, -97, 57, 47, 45, 132, 40, -42, 202, 14, -106, 48, 101, 65, -28, 44, 9, -55, 88, 93, -16, 181, -148, 32, -139, 84, -104, 197, 60, -123, -180, 162, 7, 86, -105, -86, -149, -12, 202, 85, -230, -48, -24, -14, 62, 17, -113, 61, 36, -111, -54, 291, 98, -9, -92, -134, -41, -68, 99, -22, 52, 97, 86, -73, 6, 366, 89, 79, -107, 98, -3, 32, 38, 12, -82, 108, 44, -171, 6, -89, 320, -11, 14, -110, -73, 11, 5, 64, 11, -20, -64, 122, -159, 25, 140, 244, -22, 127, -68, -136, -259, -15, -134, -65, 38, 55, 205, -140, 48, -203, -340, 237, -33, -57, 43, -113, 126, 143, 31, 116, 128, -56, 155, -47, -121, -68, -83, 178, -146, -1, -60, -225, -264, -75, 308, -81, -218, -35, 7, 102, 108, 50, 3, -115, 131, -111, 63, -240, 326, 231, 76, -20, 2, 155, -19, -112, -32, -148, 44, 27, -158, 31, 2, 207, -103, -79, -212, 207, 92, -32, 0, -52, 26, 90, 5, 148, -94, 232, -149, -141, 140, 108, -81]
6409h1J34L5j89P2L04l19Q7j20L2J6m1J97o6L0M3j01k05Q8k0J65j70J41j98J45
6433b1L1r9p0MK91l3k93qK7J20L4j66K61kj93J02n0M6J15k92J81J51k5R7l82J46
6459b8N5J11j95O2K6op4M5n4R4k03J83L6J19k0m6Nn0Q7j49K40j11k31N2J15j82
6485a19k4J85L0m4l2m8lJ71k32J31l9j10Q9O7q2L3q9P5J90J1j74J40k09J79l7
6510E9q3m6Q5P1M6J09l61J62p2m3K78k92L06k83K66k65J90p2j00P7j33K35j71
6533c7J61j30j25J18n7k2J14L9k58K74J65k40m6RJ29q4k1o9K00k39RJ00R6J30
6557B16k01pL4r1L5j13n1P3J70k25J5L71k27P4J2k05J34J39l28r2K63j47RK34
6581I2m4o1n3K07k05j7J7J15K29l26J92j62Q0j7J24l32L17k05l4M6Q9q9J55k14
$$ y = [-81, 53, 88, -101, -29, 275, -44, 43, -77, -45, -29, -70, 127, 61, 91, 134, 33, -172, -84, -104, 61, -109, 32, -166, -21, 10, -89, -159, -155, 136, 103, -190, -198, -171, -51, -17, -183, 78, 76, -117, -15, -65, -19, 96, -196, -15, 136, 111, 208, -174, -28, 27, 138, -57, 5, 31, 25, -49, -4, -58, 36, -167, 16, 52, 171, 151, 105, 110, 60, 147, -2, 238, 127, -104, -52, 63, -119, -143, 42, 72, 28, -4, -52, -55, 116, -116, 15, -24, -134, -45, 22, -60, -27, -116, -41, 149, 160, -14, 126, -83, 96, 59, -24, -70, 15, 86, 132, 241, -120, 42, -30, -73, 205, -87, 219, -64, 202, -63, 127, 55, -45, 32, -101, 134, -37, 124, -6, -131, -13, -70, -92, 22, 61, -197, 77, 242, 2, -44, -35, 94, 10, -11, -80, 120, -119, -110, -10, 86, 216, 15, 8, 42, -49, -14, -127, -178, -105, 65, -160, -145, 226, -1, 73, 85, -120, 14, 153, -175, -267, -4, -151, -142, 92, 48, -13, -66, 141, -64, -81, -64, 51, 280, -46, 146, -16, 64, 47, 171, -161, 156, -49, -83, -37, 52, -37, 118, -96]
6605i6J42l04M83l49R0K4r0J53J48j82j96J76Qo4M6O1p6O2j41K13pl9j3k9L3j81
6631a28J7K21J28j18k25P9J78j48R4j57J72j87J90l4q6R6QN7j30J1n7K01l7mj
6656A40j10L8p1J7P8J39j12j36J61m71K84M4k13L66j25j87J26j5J88k39J75L3
6678A10p3l5j01K55j50J1k51K18K49k66j06J8K38j84J38n0p3O6j4J64m4j12o5
6701e7JL6J5P9j17J81j65q7k3J51m0J10p6N9j82K01j44M9k22Q5K76m6j49K35k4
6726A46q8P7k9j33R2j98j3M9M5J9r9J12K32k49p9P9L00m03K98k61R5R4J73k84
6750b5J13l13K11jj40K09k22K7L5k41M23m8j31Q0O2j51N0P8j89L12k8j85j35P7
6774a32K1R7R7k79J78Q3P5K6q1m1q0l8M2O8P3o2j08J42No0p8j05K74j60J02K20
$$ y = [-96, 46, -258, 225, -124, -34, -10, -100, 53, 201, 19, -177, -1, 7, -57, -11, 50, -26, 36, -105, 108, 101, 62, 49, 20, 53, -128, -111, 110, 238, 120, -105, -26, 152, 4, 98, -59, 113, -74, 116, 82, -4, 92, 100, 157, 27, 38, -19, 182, 145, 141, 140, 30, 68, -3, 14, 92, 231, 119, -17, 144, -327, -43, 1, -212, 154, 29, -158, -32, -47, 141, -98, 77, 110, 37, 2, -99, 156, 6, 17, -234, -16, 233, -33, -139, -121, 117, -67, 71, 21, -52, 14, 0, 164, 120, 8, -57, -56, -20, -5, 74, -43, 138, -27, -114, -137, 14, -26, 84, 8, 67, -115, 86, -58, -9, -231, -146, 130, 84, -65, 170, 146, 58, 135, 106, -27, 65, -133, -146, -97, -52, -33, -132, -20, 212, -37, -116, -37, 263, -140, 158, -103, -8, 86, 259, -25, 88, -225, -14, -15, -155, 54, -168, -141, -106, -347, 76, 28, -103, -23, 39, -112, -62, 16, -173, 139, 111, -74, -209, -132, -111, -14, 83, -196, -18, 65, 140, 166, 85, 44, -36, -74, -32, 36, 109, 47, -61, 81, 86, 26, -52, -157, 117, -43, 59, 279]
6800B79l89J48o3j13J89m6K7j36L25l22J71j97K60k80J28J65p2k9j50J67k19J00
6822e7J36P2k65q0K33P6j02l9K23j99j16j9K49k05K6J70j25p6J87L9k38J09N0
6845D9m3q9P5Rm9O1%P9k13L31k40J23J01k34J57k8Q9N1j10j05M8k21L29l23P5
6870g8n2J25m7O1Jj06K04J13l41K07K8k21J81J40L6k56R4r8o8J51k62J46R7N5
6894A10r1j45m4O2K89k04oJ48j97j02K52r0J38m7p4K70k95J4j11L8O4O3R0r6j05
6919f9J32j61J67m7J48l22J24K18j87j06%K24nj70r1J59J28N4j26n0j83L73k64
6942e4j59J30J2Q8j11J32K1J6K6k80L6L6J19p5J42q6L1j64J31R3o3J89l29K71
6966A52j8k57M12p1p3j19M2L6j12Q6K3j45K0R0o5P3N2l7q0j58M4L1M0N9J14k13
$$ y = [279, -110, 38, -25, -138, 51, 5, 32, -104, 221, -101, 70, -127, 133, -147, -19, 146, 74, 45, -105, 62, -157, -57, 79, 151, -114, -194, 39, 115, 13, -26, 197, -2, -118, -137, 112, -93, -67, 103, -22, -98, 89, 128, -110, -1, 49, 6, -83, -8, 1, -48, 13, 13, 92, -121, 210, -30, 93, 194, -40, 117, 89, 178, 229, 119, 14, 62, -159, 170, -153, -78, -130, -5, -52, 9, 10, -96, 108, 221, -120, 87, 115, -106, 75, 215, 251, -5, 89, -9, -77, 74, -188, -42, 55, 110, 19, -126, -170, -108, 181, -23, -29, 119, -78, -180, 72, -18, 120, 73, -1, 269, -26, -12, -123, -85, -21, 42, 132, 36, -69, 63, -98, 69, 22, 170, -152, -28, 190, 3, -103, -103, 121, 116, -54, -145, 14, 142, 196, 70, 20, -163, 210, -54, -213, -83, -71, 17, -94, 38, 59, 75, 101, -179, -143, -107, 12, -63, 79, -7, 24, -140, -9, 84, 21, 210, -119, 152, 134, -123, 289, 218, 145, 26, 68, 104, -8, 78, 101, -44, -24, 66, 1, 74, 126, 89, 9, -149, -105, -74, -34, 25, 139, -74]
6992g4j69L27j63k6K75K8j72j7O7Oo5P2j27J27k32J53J17J2j56J51r2k4r3K38
7016A63O6j87J11k26J78k24M2N3o3j13J46j40M8K23r1K4j01J16j68J59p8K4K96
7039B58j13j0l03L47l29J86l0o3J06j57J1J72r5l41L31N0j76J98p0R9Ol8q2K12
7063A69k94P4N2j54J98J96k90J9J35k55J06q3J28L81n52J43o4J62l8k0o5J32r9
7086a9K52n55K97P7j61l3K12j59jJ95O2j96pO9j56o4J66J68j01n1p3J04k2J29
7110A33r8p5p9L52k97l7J36KJ31j96J23j27r6J94Lm6p2M1n3Q4j1k1l7J06P8J12
7136B50j60KK9m11L25K0o4Mj4Q6%j50j13J65P8K29m68J7R1K40j70K15k73J84j52
7161d0N7j6m6q1rk8K07R7j42K04k99O1O7J20j70R5l8ko0j32L57j1k54O6Q4M9q3
$$ y = [-74, -243, 84, -79, -105, 170, 198, 26, 9, 76, 82, 17, 89, -38, 89, -143, 10, 127, 139, -17, 134, 42, 18, -75, 163, 229, 42, 153, -73, 105, -119, -77, -24, -87, -200, -54, -194, -146, 77, -14, 10, -91, 25, -143, 16, -62, -38, 258, 145, 135, -168, 179, -150, 36, 6, -57, 49, -108, -97, 75, -20, -361, -30, 20, -156, 42, -28, 71, 77, 39, -43, 169, -125, -51, 1, -153, 45, 241, -49, -30, 105, -150, -44, -127, 1, 382, -170, -27, -91, 71, 33, 13, -52, 80, -19, 233, -322, -25, 52, -109, -142, 70, -89, -90, 105, 167, -29, -36, 33, -123, -187, -21, 147, 46, -5, -78, 26, 4, 133, 35, -40, -119, 233, -64, -101, 35, 37, 168, -28, 95, -32, -128, 66, 69, 23, -49, -8, -61, 23, 12, -9, -46, 60, 138, 250, 90, 92, 121, -290, 35, 55, -9, -5, -19, 67, 67, -83, -196, -31, 47, 276, -192, -175, -84, 156, -14, 201, -72, 112, -40, 17, 1, -45, -126, -135, -163, 44, 141, -1, 203, -96, -35, 32, 152, -18, 77, 39, 37, -23, -155, 202, 191, -63, 3, 87, 136, 53]
7188E3p1M2q9J73M7q7m0k16M06k21J42o2J28j77q6p6k0J53p1M6r9J40J00k69J30
7213b4J03J89k76Nl5K63k90K71q9j90K03k74K19k17J05K64j50O8j76j33M21k06
7235E1R5l09K31q8l8J53k5K3J26q0j83l5J00k3l4L5r9J90m65L52J2Q1r2MKO5q1
7262c2K90j83l4J52l32K06jk56L33o5j07J09k74J19Q1M9j00J9l2J46j38o2L07
7285A95j71K09k61P6k3j02J19j98L01j65o1J80J3k63j5K72k65K64k49QK52j41
7307b5l2J9K11k65M5m1K35j62l3O8R4k63L36j56m7Pk52K49o2J21l8ok5N6j55O7
7333e4J45r0j66J05l6J09M9P9k65K6R6J36j11K11k99Q5k2N4q9J95k40K10j24j13
7357a09j8J96k21NJ35j42j32O4Q6M4j17p6K63r6Kn6J32J56p3p8J10M1j34nn7J11
$$ y = [53, -18, 24, -65, 108, 155, 68, 28, -188, 218, -3, 139, 77, 205, 28, -58, -134, -154, -1, -72, -26, -125, 15, 115, -154, -24, 79, 268, -8, -3, -38, 225, -65, 206, 117, -73, 130, -144, 75, -142, -37, 227, 77, 145, -31, -164, 257, 51, 146, -163, 68, -20, -58, 95, 70, 93, 219, 139, -44, -79, 21, -2, -36, -1, -100, 90, -375, -23, -11, 70, -22, -18, -16, 49, -32, 258, 75, 41, 193, -139, 67, 66, -190, 143, 78, -29, 80, -194, -75, 6, 55, -45, -26, -58, 88, -50, -112, 195, 24, 233, -28, 48, 25, -77, 42, -156, 145, -20, -81, 99, 112, -151, -166, 106, -159, 105, -144, -136, 116, -25, -57, -38, 173, -92, -47, -88, 147, -15, -48, 20, 114, -149, 187, 31, -16, -9, -261, -12, -74, 47, 9, 3, -22, 34, -121, -54, 91, 1, -165, -60, -96, 13, 62, 141, -124, -98, -2, 134, 23, 234, -65, 20, -2, 52, -37, 158, -82, 128, 4, -109, -127, 69, -152, -147, -12, -154, -286, -222, -136, -92, -209, -285, -22, -118, -116, -172, -40, 116, 43, -35, 75, 116, -18, -23, -80, 31]
7383C1q0P5l9k4K03j1j47j08K38k47M8J01Q5pk58K15k3J57J97l63O6j51J22j5
7407F5k90J76l3J61l9J37L5p1j04j17J89l4J52k59J84j22K2k0j43JJ52q3P5n4
7431b0n4KL2J63j11j6k35L36k43J03J33o4q2K46K8l73J08l1J55Pj25N1J67k34
7455e7K28j74j41L2J18k6L6j24kN8L4m3J03k6K13j47j00M6J5O4q4l4K4J18j79
7480d8K42l49j00L09k51J11J28O6k12J71N%j16K5p7q7J91j08J08n3L1M0K00j56
7504G0p9O2l14J67J57J51j70o8Nk3J07n8kp1J3J72J79m47K25k86L16r5j46QJ03
7529b4j58Q5Q4J50Rj75j61L87k29m6J34l8J2l3k31j0Q9J94QL0j28K82r7j87P9
7554B6n7K38L8j39Q0k09J29n5n3j43P1J78n2K1m8j18l5l0K74k4n6j25j2j18L19
$$ y = [31, -49, 26, -13, -37, 166, 155, 8, -100, 138, -109, -61, 40, 125, 118, -140, 75, 52, 209, 406, 43, 109, -42, 80, 65, -225, -49, -82, 79, 40, 177, 212, 141, 37, -80, 109, 75, 227, -32, 152, 30, 52, 32, -111, -110, 42, -41, 34, -20, -74, -72, -40, 123, 12, -4, -239, 97, -146, -43, 90, 26, -56, 190, 218, -155, -47, -78, 77, 84, -41, 10, 177, -57, 171, -3, -144, -112, 6, -20, 16, -108, -110, -52, -18, -61, 42, 16, 229, 82, -18, 28, 43, 107, 23, -11, 13, 131, -48, 194, -155, -255, 54, -197, -86, 42, 108, -104, 67, 72, 72, -44, -19, -96, -183, 8, -100, 8, -45, -14, 26, 226, 70, -9, 53, -261, -94, 63, 214, 44, -24, -19, -42, 65, 7, 5, -66, -53, 119, 298, -149, 76, -210, 106, 11, -135, -127, -24, -182, -97, -13, 137, 146, -29, -190, 197, -32, -78, 56, 18, 30, -3, -234, -244, -155, 39, 47, 77, -51, 231, 134, -53, 26, -31, 207, 245, 106, 186, -23, 106, 51, -2, -145, -74, 104, 52, 73, 25, -93, -128, -158, 116, 92, 36, -89, -101, -219, 100]
7579A00k65NJ04R4rk2o5J15k46J12K5m0J93P9j00q6K76k99J07m4p8n2L5L6j55
7604a80Q3O6j73K38R5Qj29J8j5j48Q8r7K12j30m2N3P3J75Qo3P2r9l21K15j8KK
7631gK6j7P6k08K31k60J40J89l17M7J51j0l4PJ08k65J91j54j1Q1J01j9q6K31m21
7656b30K09L8r2K24j99O0j08P5J10L5l8j52K1J37o1J33j87P3j20o0K9J52r5J24
7680G8k38J41rJ59J1j13N6k81K73M7o8j01J67J4q8m6P7j75J28Q7j65J04l44J65
7704a21J02kQ3j56J12O8j87L17j92n3J66k96J23J98j38M4j45J0J37n5N3j2k88
7727b32M99o6j16p5m3J81Lj22o8j3r2M19k55Rj38j5M5N6J1k6K29j77j02j48K66
7752C0RO7q5q0j1K83r7k3k18K67o8j75J98p6mm6KKJ20k94N9K02k1K6JNK1j71j18
$$ y = [100, -165, -160, -56, 38, 29, 7, -58, 57, -189, -77, -52, -92, 101, 180, 80, -6, 270, -29, 78, 34, -44, -96, -61, -25, -180, -97, -31, -204, 34, 129, 137, 8, 26, 11, -137, -49, -146, 66, -64, -106, -53, 20, 195, 203, 140, 212, 113, -208, 7, -11, -9, -7, 19, 2, 78, -130, 101, -159, -19, 170, -147, -100, 51, 41, 7, 14, 122, -143, 48, -106, -117, -36, 65, 46, -40, 191, -230, -21, 17, -75, 149, -50, 10, -98, -23, 87, 122, 84, -68, -47, 90, 29, 162, -25, 48, -72, -132, -103, 49, -46, 78, -160, -19, -28, 131, 142, 29, 85, -196, 77, 124, 56, -45, 122, 136, 48, 2, 79, -96, 32, 119, -46, 58, -286, -121, -19, -21, 62, -94, 18, 86, -101, 216, 24, -29, 137, -159, -36, 162, 24, 68, -77, -67, 70, 15, 68, 56, -232, 267, 201, 85, 10, -33, 148, 151, 29, -39, -52, -144, 275, 20, 29, -109, -124, -79, -23, -12, -38, 191, 14, -88, -236, 30, 39, 106, 21, -59, -70, 213, 116, 93, -125, 142, 74, -101, 97, 21, 17, -29, -27, -25, 95, -199, -140, 62, 41, 67, 68, 73, 94, -77, -195]
7781a95L03L4l07R2K35r0k06J92m6J74q2nj48L3pk01L07j05J23j86N2J77j97Q1
7805B8o8k7O9q7J94m8j74P1j83L51j59K1r3J37J21j63Q5M9k89P5O2o4O5N3m9m2
7831f5P0R5j4j21K04j55N0q5%N1k4N5P5K7j24p5J8r3L68l04L09j47r9K3q7o4J22
7858A0j21%J73j47K14j32j1j58J37j16J13J40j77j4MK01p6k7P8j26k4J43j67q8
7882a71J27o8M23m53L36k18K6R0J6J23k96L31l06o7J15l00L08o5o1J35J16j85
7904d4L7M4j83O0p6J36K42k75p2J49l1R9L7j33K04l07L43j21j99P0Q3r0%J92j28
7929C7L3p8n5P9o2l4Q8l4j28R6K86o5k81L52m03K16j5p6N7j73K60K05l81J07j50
7954a19K7K59l7n9j51nP0P2n7M1j20K75j86R6j4O1l06J04n4J99j25L3%J7K08j81
$$ y = [-195, 108, 142, -165, -73, 162, 72, -134, 58, 12, 186, 104, 99, -49, -16, -23, -224, 83, -22, 101, -85, -33, 144, -53, 28, -40, -67, 2, -85, 109, 61, -113, -42, -225, 126, -33, -12, -105, 32, 153, -10, 75, 124, -165, -90, -28, -92, -27, 26, -23, -65, 5, 100, 86, -35, 169, 14, 64, -21, -21, 30, 6, 61, 136, 163, 39, -36, -18, -111, 257, -47, 262, 115, 16, 39, -48, -112, 10, -111, -111, 62, -85, 129, -3, -14, -172, -35, -151, -38, 102, -75, -89, -85, 116, 40, 13, 91, -35, -59, 84, -83, -171, -44, -112, 311, -142, 194, -24, 2, 92, 108, 231, -65, 266, -40, -107, 8, -292, 16, -49, -110, 25, 141, -44, -7, 37, -146, -86, -162, -26, 216, -59, -131, 18, -13, 86, 123, -10, 194, -113, 230, 109, -90, -20, 63, -27, -27, 165, 37, 70, -8, -63, 16, -46, -80, 8, -26, -154, -58, 228, 163, -118, 234, -169, 47, 32, -44, 13, -160, 100, 305, -76, 31, -119, -92, 167, 130, 71, -80, -85, -15, 57, 0, 41, -79, 196, 10, 106, 92, 153, -153, -49, -103, 96, -29, 4, 4, 21, 229, 48]
7980D8l24P7K04lL6k57J67N3J5j66rJ39j57K61k24J92P3k26K58m3m8j23K93j47
8004H9m8N7k51K64l15K01N0n7j43K36j95J32ol65M37j45j6J40L0j02o4M6K3q9
8028i1J05K13k25k95K74K37j62J9M2j09J26j29j18K79m41K55o2N2j2K59k97J07
8050B7p0R7J01j34k2r6K03n9J55k92J24j98K62K4j17K2j18J74j10j0r4K10J90
8073B69j39j50J45k18J55j5k01J68K9k78J15O9J16k33J88K1j13K75j56k11K74
8094A10j37j34M6O5n7J77K9k79N1K14j85J23l0o3K20L4m13K21j14rL72j61l3j53
8118a06Q8n0J52P1j59o2j68L17k18J93J30k06J60j16j10K14k13R8J42j32k20J97
8140BN9Lo6J13p1q5j16J58j05P5J82l21J39j06J73J40J07k52k7K01j50k5j9k0
$$ y = [48, -276, -199, 5, 2, 38, -219, -52, 1, 16, -150, -159, -20, -177, 84, -140, 52, 125, -101, 157, 114, 66, -57, 236, 89, 41, 98, -153, 111, -204, -3, 47, -10, -153, 83, -112, 20, 14, -351, 86, -59, -75, 65, 95, -7, -71, -25, -2, -91, 14, 227, 2, -293, -19, 218, 56, 75, 117, 8, 134, 5, -113, 166, -275, -20, -82, -30, -42, 217, -80, 27, -43, 54, 155, 21, -1, -97, 106, 47, 202, -90, 34, -164, 98, 122, 5, 27, -91, 83, -27, -37, -131, 79, 269, 130, -20, 125, -93, 62, 47, -154, 14, 43, -235, -120, -51, 65, -168, 20, 41, -72, 203, 47, -164, 110, -27, -161, -115, -50, -107, 70, 99, -180, -129, 85, -100, 23, -7, -70, 150, 184, -229, -8, -122, -131, 241, 80, 47, -106, -18, -68, 84, 155, -4, -66, -234, 83, -135, 58, 188, -18, 142, 26, -84, 130, -83, 15, 157, 25, -195, 2, 61, 64, -2, 111, 40, -45, -161, -3, -108, -33, 149, -172, -33, -139, 34, 174, 281, 29, 2, 203, 53, 28, 9, -11]
8164a1K51k29K03l30J72K2j98K50r5l8j5J78j19J2n5J8K72j34k36J64k75m7J90
8187e0P3p1J6L8
$$ y = [-11, 240, 11, 214, -116, 56, 78, -120, 130, 35, -3, -18, 160, 41, 53, -2, 16, 288, 154, -82, 82, -193, -240, -50, 23, -48, -32, 6]
8191F
$$ Imaginary data points
##PAGE= N=2
##DATA TABLE= (X++(I..I)), XYDATA
0@%%%%%%%%%%%%qJ6j6J6j6K4l2M0m8N6o4P2q8J04j20J36j60J84k08K40k72L08
34A64l50L96m45M97n56O23o93P70q56R48j048J159j280J410j555J715j890K081
52A090k291K529k793L089l427L811m258M784n410O172p125Q356j0014J2383j6056
67i160K2576l7579J35739K1612k71525O6535J37983j2204q2091K2075J022j3017
79a8034L0847L2028o3377l1200M4758M5321J064k9138n1149K0968O4975j2656
91C4407p3583N773O8206P013n0694L704J1916l7534J1616O5676k1893o8100J7331
104b6162N5614k1235m5406K5310K8698k5903J3464L8822m3173n0928M4986N2164
116D6251k7728m7013R922L5846m161k9492j5322J0708L2101N370k8984K420J5381
$$ y = [0, 0, 0, 0, 0, 0, 0, 0, 0, 0, 0, 0, 0, -8, 8, -8, 8, -8, 16, -16, 24, -24, 32, -32, 40, -48, 56, -64, 72, -88, 96, -112, 128, -144, 164, -186, 210, -235, 262, -294, 329, -364, 406, -450, 498, -550, 609, -671, 739, -816, 899, -991, 1090, -1201, 1328, -1465, 1624, -1803, 2008, -2250, 2534, -2876, 3296, -3829, 4527, -5487, 6896, -9160, 13416, -24163, 111576, 133188, -138337, -71802, 66181, 53977, -28114, -6039, -5017, -18034, 12813, 44841, -18536, -49736, -4978, 40343, 41407, 12269, -38880, -17912, 47063, 34407, -39176, -33403, 34803, 41816, -8878, -5174, 6742, -30792, -19176, 46500, 24607, -43493, -26162, 29452, 8217, -37189, -11879, 16819, -9084, 4380, 43202, 29, -50899, -5913, 46251, 18523, -28490, -18568, 17278, 13117, -16375, -31697, -20989, 11112, 16482, -12502, -10082, 5299]
129E299j9620R26L4196r924m2063J9383N8177k5568p4923K5278P0268k1766m4709
142b5046K0417K0278k0824j2114J4095j355j5224J7432K0385k1219j5333J3237
154e271J0584M548m182q573J1376Q818j7790j3391J2845J2812j7802j2194K9857
167A1637P722l8431l859L2332O46j9221M626J6610p178j3626J3624M767k2130
180a2481R179K8548j1022k4373N076J6380k619j6232M55J2392q00n521o587m888
194a2493J3328O025j2290M283J0207l711j137L123n340o390R444J5239j6578k3626
208a9916K0468J8659k4110j3946J7720J1146q279q808N895J283q094Q346R648
221A0012j0128n317P513O841l24j1700l030J4455K925j0745o324J839O099n190
$$ y = [5299, -14321, -13395, 20801, 10877, -31186, -11803, 46374, 20806, -54117, -28839, 41429, 19663, -25046, -4629, 15649, -5175, -17289, -3194, -4549, -19773, -2341, 18044, -3175, -18508, -5271, 5313, 9861, 5679, -2894, 8482, 17300, -490, -13881, -1036, 11776, -6026, -18220, 11637, 19359, -19072, -22931, 9401, 10047, -9174, -4548, 12062, 4884, -8742, 4882, 9649, -12481, -3302, 25246, 14224, -10149, -5073, 11307, 8688, -7544, -7089, 5303, 4503, -1018, -7605, -12493, 835, 6860, -5430, -1147, 9060, 5349, 4212, 7335, 1995, -4395, 5049, 20288, 3710, -19916, 552, 19211, -4899, -18845, -1125, 10021, 1742, -7066, -1171, 112, -7982, 364, 10012, -116, -5433, 2080, 8921, 8597, -3103, -6133, 8322, 11247, 502, -5822, -3983, 2116, -3074]
235c074p839Q396K263q391M698O587k792l752K005Q007l76p926O397K073j1524
250e248K855R199n432q408Q03R775j14j3301J158R333k317j313J53k395M278J410
266D36j043L567k849j160O851J243m781n889J623J0419p043j3436Q262P248p715
281d267l650L128N149n45m651N580M001m973J954K498j781J314j377n50J456l954
297f68J420L352o599j439N041j197j859k868Q73O253l320k884N079P48P96Q98
313C626j168L538j461m284O589p69r458J908M620k152n339k443P039J238p691
328f207L756M181k720J602O29l09L393k406j153L986k039j530M95p24J662l162
344e46k870M201k830l361M394j445k794K825P82J856n35j460N271k96k912M199
$$ y = [-3074, -10913, -2517, -254, -8645, -3947, 2640, -152, -3904, -1899, 6108, 5732, -2194, 4203, 6276, -5248, -2393, 6806, 1374, -7034, -6231, 3544, 3430, -9871, -8713, 620, -1697, -3010, -2857, -5252, -974, 436, -607, 2960, 111, -1049, 5802, 7045, 2264, -3625, -2002, 8417, 1374, -12062, -3800, 3448, -4267, -7917, -4789, 360, -185, -4836, 744, 4745, -228, 1726, 4224, 2443, 3757, 2380, 1830, 3286, -668, 752, 4104, -2495, -3934, 1107, -90, -1949, -4817, -3944, 2309, -1011, -3895, 1184, 1932, 2728, 3626, 2458, 5996, 4535, 251, 6840, 6071, -3387, -1479, 3141, 989, -4350, -6793, 246, 1484, -6207, -2451, 1730, -990, 612, 1241, 932, 4325, 1919, 766, 4752, 2713, 1183, 1678, 954, 2616, -546, -3416, 785, -2045, -5406, -1012, -2457, -5251, -2426, -1644, 212, -323, -1783, 3488, 3192, 280, 4479]
360D479n07l921J373Q3N18k842n147M245K584n657L89J240Q6L067k138r25M280
377A207n52q32K207N33J093m200n78Q495l077q438L891K052l077l41j794j040
393d451N81K145L294n632k802Q755N65k465M193k201k277N428J379n198m144K179
409f51O684l526o527J245j208J522N234o419m101P967L658l327m055J676N714
424C886k467K56O686o275n009P244R91o151k347K551M058k513n096j49k038L111
440c262P544n827l666Q558J33m689J710K828q14j904N405L576j2253m193J0428
455C574j603n952L701m86k091K668n04n105k123Q464O392p639m89P200p740k785
471d518J1110J45p942J531O957k246j1574n56P858k399l54M447o250k253N416
$$ y = [4479, 3972, 51, 1424, 1507, 2025, -817, -5964, -1719, 865, -4792, -4403, -3163, -3077, -10, -2148, -3073, 1207, 655, -177, 2030, 2563, 3656, -544, -1122, 7373, 4296, -4142, -251, 1801, -1276, -1617, -3411, -4451, -3870, -1725, 1569, -4063, -6865, 1890, 2455, -10, 4183, 1982, -295, 5133, 6512, 1314, -2830, -651, 6033, 2507, -4020, -2775, -3983, -2461, 2773, -3646, -7747, 220, 3878, 551, -3504, -1828, 3886, 1419, 1675, 8361, 2086, -2923, 4321, 5312, -839, -3186, -635, 3423, 910, -4186, -4335, -6373, -3262, 4282, -1545, -5211, 3347, 3480, -1209, 501, 3329, 2515, 611, 6016, 9592, -2661, -6854, 3574, 1971, -3981, -280, -766, -2857, -189, -693, -5798, -7921, 543, 6935, -704, -1193, 6007, -1733, -4518, 6592, 6737, -1205, 326, 7283, 5037, -6537, -7093, 765, -1634, -1988, 2459, -3791, -6044, -628]
486f28k258k567O119N021k764m252N925K362j3231R88J4485l831q014N332N97
501C284r155l610Q422M385q283J886P894o441l660L706m479L234J4547j043j3467
516b780j562R890j409r957P434P182j3111J191J2289j1576j4640J0003J2809k205
530C558m833Q99j494l025R023P15j4173Q282J8815r223j3716L808L67m889O930
545A044J1418r540j6645J0678J2315j5509p813J2016N474K125J894r329r766Q615
559c023J4921n022j3343R770R091j2923k186N712j1853j612K0375M239k1114q997
573a5965J6326N011j3705L197R247l251N767M088j7849n910J8110P165j1034j798
587f01Q479p556j0700J2430L334j7664N966J9380q490j6093L602O958j091J713
$$ y = [-628, -2886, -5453, 666, 5687, 2923, -1329, 4596, 6958, -6273, -5285, 9200, 5369, -2645, 2687, 3284, -5871, -9481, -1059, 3326, -4957, -3071, 4823, -1618, -5278, -1572, -6051, -2817, 11730, 10687, -2780, -4342, 5548, 4139, -5818, 1616, 8798, -4313, -3122, 9167, -2409, -17049, -7046, 5763, 3558, -1275, -376, -1870, -4895, 4128, 4843, -9330, -1048, 17767, 8544, -5172, -1364, -997, -5886, 1044, 12462, 2922, -13723, -3045, 9270, -6239, -14052, -2036, 3438, 5563, 7457, -1872, -11638, -3023, 11898, 6876, -6467, 3303, 12394, -529, -2715, 2997, -8856, -10468, 9907, 14146, -6968, -15965, 361, 5372, -8333, -5136, 4111, 860, 6627, 10715, -7134, -13044, 5066, 12231, 1197, -601, 7878, 322, -10378, 2052, 5386, -12278, -6312, 13068, 4578, -11515, -7913, -955, -2046, -333]
601c33O848m450n331J1568m69j7214M214J3403n409k321P193n887j4958M409J6399
616G662n637j3543J1658R026j2597l620N602k778L037J0703q05j0956n79R631
630F804m849r034R717M047j0533M121O477j2684o707J1416O613q152k052R740
644D924k415r635O960L181p317P893Q809j0211o459P347Q67r528J716J1665m941
659B856j0207P057J378j0718N057R367m690l208N722Q72o576K09P655l069l999
674b294R669kj0940K035M489n482j272N255Nn492N17O030n858n609J0914M075
690F040p335J690L268m716r56O023J349o619k99R131l781j0379M325L098l637
705b798K389R28m513j02M975N32n671R13Q718j829n171N293q23n967M775L997
$$ y = [-333, 6515, 2065, -3266, 8302, 7833, -9381, -5167, 8236, 2827, 506, 7699, 1812, -13146, -8737, 7662, 2025, -11518, 140, 9166, -3431, -7051, -1449, -4227, -1190, 9513, 8708, -2248, -2827, 6804, 1955, -7079, 2638, 6685, -3848, 273, 6750, -5934, -12641, -1225, 5388, -2764, -4816, 4924, 2509, -7126, -166, 3015, -4302, 3591, 12400, 2189, -4270, 3077, 3944, -5584, -3868, 7797, 2856, -7351, -294, 1084, -9634, -4577, 4790, 100, -3108, 2614, 3486, -3090, -2881, 4774, 1705, -2294, 7375, 7373, -3567, -1532, 2957, -2525, -3797, 1458, 1463, -4029, -3512, 2518, -3340, -8949, 1965, 6040, -1295, 395, 3663, -1053, -2009, 4014, 5363, -1256, -1555, 7576, 3795, -6584, -2259, 839, -2798, -409, 519, -3994, -4096, 879, 1411, -4260, -3347, 5371, 3542, -1629, 3664, 2841, -3126, 1649, 5646]
721E646m809l023L763J733n826k431N237k322k675O801j587o168M215M148k711
736ij152K979K469l127j341M316k813l385M380o17k939J689j225k786J572J520
752d69p67l221K176N770l537l993N628R16k527K225J018j619j087P40J769l746
768g24j949L905j283k719K454j825j539L316N55k277J39K627K062k879r18M506
784C451j191j918K797j815j704K307j378j817J16O18j24k443Q32L317l568p36
800c256M666j193j085J839j10J088M23j172M93l54l30Q79k725R6J671l024k39
817b333K231j802l18M28O70J535j542r8L021n75n79J260j049R76R81k475L70J04
835H05q90N65k181k61K084k364n97K382r53k9J006j03J715l84l39J622p48J04
$$ y = [5646, 837, -2186, 1577, 3310, -2516, -4947, 290, -2032, -4707, 2094, 507, -5661, -1446, 2702, -9, -1161, 1818, 4287, 1160, -181, 4135, 1322, -2063, 2317, 1700, -1239, 450, -775, -3561, -1989, -469, -1236, -4457, -2281, 3489, -48, -4041, 1587, 2503, -24, 2201, 3219, 1600, 513, 1253, 3022, -724, -2673, 1232, -51, -2770, -316, -2141, -3680, -364, 191, -2086, -1947, 680, 2742, -137, -1055, 3451, 2260, 342, 3139, 1324, -380, 1927, 549, -1268, -1152, -534, -658, -3101, -2269, 1048, -2520, -3256, 1410, 217, -868, 971, 861, 1949, 2372, 1200, 1693, 1339, 1009, 1888, -837, -741, 930, -2094, -2333, -102, -1904, -2222, -1794, -1124, 411, -1131, -1229, 1792, 1217, 638, 1898, 849, 1825, 2806, 331, 701, 805, -85, 480, -1701, -1962, 122, -2242, -2839, -457, -1410, -1439, -433, -536, 1179, 795, 456, 2078, 1330, 1434]
853A434J415k625M46J486k926k50J194p73n95j283M53K287k301m54K920q11M46
870F3J284j451J482J193j557J53O1r9O13k288J03J416k865k33J902r96m65j28
888a812J86K054r33o34K108p52J430J798l202j66K632j118q41q00L54O61k428
905a463L12J213l220R9L759j384n97N16m26J673J353r18j120M51L718j01n758
922a893Q79M055k813j592K303j372j754L8J529M76l224J410L198j033N93r5k963
939b258K969L486k598j895J174K284j406m112J313K279l165J237K223l494j404
954c367J552N36J234l62O70N17q45K745p15m972L458N154l857l147K591K50l011
971a569j708L211Q62l448K091J741l886J27J987j166K429K935k014k168J118K526
$$ y = [1434, 2849, 224, 670, 2156, -770, -1020, 174, -599, -1194, -2477, -2024, 263, -2038, -2492, 428, -383, 63, 1347, -104, 1378, 2571, 1014, 1167, 1228, 1129, 1742, -546, -443, 973, -1892, -2125, -223, -1219, -1684, -1812, -1626, 428, -505, -1139, 969, 217, 1647, 3445, 243, 77, 2709, 1591, 750, -50, 304, 965, -1463, -1151, 62, -3158, -3059, 700, -684, -1281, -765, -1191, 482, 1835, 917, -203, 248, 3966, 3865, -1893, -1014, 3041, 228, -1364, 939, -433, -2187, -2149, -620, -144, -3368, -1958, 1240, 207, 800, 705, -2258, 711, 4197, 1599, -296, 878, 3162, 1756, -2356, -1043, 1236, -1929, -692, 1531, -1963, -3367, -1815, -1279, -45, -407, 263, 780, -65, 2680, 1965, -3007, 451, 5605, 1748, -1399, 1192, 1442, -1569, -3277, -66, 796, -2652, -561, 1180, -2706, -2579, -592, -1758, 671, 3606, 1592, -576, 542, 3068]
987C068l071k477O238J033p168J036L849m614k443L406K056j715j315K846j077
1002c48l658L674K166k595K702K737l719j371J487m98j957J514M002k291n428
1017c583K555Q65m683K540M231k097r56K203n4l758k08O198J24l677L598K76o254
1034b680J865L339l945j163M741J465n579k754M110q51l204N733K515n351J482
1049b77L250l795k234L442L274q07o01R71m882l074O444K16o108L702M748n199
1065i30l878L033J889l212J135P242k494o328M114K698m789P58L148m8n11O68
1081B495k120m783P67N683j847l340N348l54o650J700M338k610p93N282K781n855
1097D2k871M541j031k667N334M15n676J858K531m877l117M539L513l849m69M544
$$ y = [3068, -3, -2480, 3758, 4791, -2377, -1341, 2508, -2106, -4549, -1143, 913, -802, -2117, 729, -348, -4006, -332, 1834, -761, 1941, 4678, 959, -412, 1075, 577, -1380, 134, 4136, 1845, -3583, -1028, -163, -4846, -2306, 1925, -172, -1128, 1075, 1021, -2737, -2945, 3253, 3377, -300, 3298, 3574, -2680, -815, 2524, -1421, -2584, 2157, 3622, -1957, -4711, -601, -1452, -4656, 1077, 3592, -1759, -277, 2973, -822, -3056, 386, 3660, 2853, 2252, 3223, -1659, -4733, 1711, 1927, -4181, -479, 4269, -930, -4808, -1775, 114, -3098, -1963, 5279, 2785, -3543, 571, 3269, -1520, -762, 2386, 2338, 1827, 2495, 375, -4408, -3641, 2042, 195, -3145, 2203, 1849, -4801, -3101, 1237, -1373, -2166, 3116, 5897, 42, -2829, 1712, 681, -1986, 3348, 3763, -1913, -55, 2476, -2401, -5518, -979, 2534, -1315, -1784, 2760]
1113B760l120m896N341K425l944K383L397k247k702M24L82j709K063M243m690
1128A10l588M432j207n553L582M594k112k176K757J104m716K87O097j263l330
1143i82L938k29l821N38J294j640m53K675J104m274j356L578k207j989M729J000
1159A905k443J226O41j701j402K489K491k515l37K909l694k799M147J57l450J593
1175g83K646k055l247J038L334k277n52M198q85k109K209j71k226J054J712m41
1191A445j361O04M34l098l73L236j368j840L162k16k347L7J264L79k76J318J369
1208B369k273n0K615k043j948K700L00j970p59J136k72k045L6L418j737j477K631
1225F31m83j508J200L89k19J007P42l81j563O32J869k884p13L203j709k275J629
$$ y = [2760, -360, -5256, 85, 2510, -1434, 949, 4346, 2099, -603, -179, 203, -1506, 557, 4800, 110, -3478, 954, -253, -5806, -2224, 2370, 258, -1918, 839, 1943, -2773, -2486, 3611, 2348, -982, 2956, 2727, -1094, -556, 738, -902, -1355, 1320, 2424, -1850, -3206, 372, -1835, -3824, 905, 1905, -538, 688, 1329, -372, -1774, 715, 3206, 691, 354, 3263, -431, -3230, 917, 1074, -2376, -783, 1863, -192, -3439, -2401, 933, -1344, -1896, 2302, 1417, -692, 1517, 1346, -880, 174, 1886, 1445, 84, 688, 1122, -1976, -2349, 887, -481, -2321, 841, 625, -1722, -1685, -421, -42, -318, 1000, 2369, 96, 46, 2661, 618, -1330, 1370, 1670, -300, -1059, 77, -195, -2240, -2204, 1214, -523, -2000, 631, 148, -1360, -160, 229, 10, 1017, 1759, 1378, -185, 447, 2316, -568, -1281, 1922, 213, -2062, -433]
1242d33N18j577m24J689R51j688K77J967j638k60K591j341j051K004K98j749l49
1259b15P97L54j982m1J853j823r02J866q56n01J379j02KK19N46L64j176Q50J721
1278B353k432l19K317j269j819J159M25p74q98R9J353j425n6J891j178j73J901
1295A155q41m78J223Rm08m57Q80J93j788L10J407j970m21J451j313k05J144l24
1313d33n76M83P61L06j100J045J568j854k3J830j337p81O32r1j45j010L0P68j105
1332a032M2N65j226J115R22j391O59R76j41k9r5L69Q46j372N5R30j531j5P51r43
1352e45m9K19m40L9q4N00L84j261J146J132j443M00J447o77k84n2L63K5q52J59
1372A27K97r96M44Mj528J283N38j359L22R63j37l40L1J437o2j446J060P09j330
$$ y = [-433, 85, -1492, -1916, -227, 724, -964, -687, 1280, -358, -618, 1973, 632, -419, 1585, 1883, 134, -215, 582, 936, -1046, -1087, 766, -1057, -1959, -93, -949, -1450, -71, -173, -171, 48, 594, 958, -218, 632, 2353, -79, -398, 1919, 650, -1169, -10, 415, -359, -1257, -1158, 195, -1230, -1286, 605, -573, -746, 1155, 314, -164, 1059, 1068, 660, 203, 1083, 1276, -512, -202, 1205, -765, -1186, 265, -1048, -1253, -109, -433, -1009, -526, 235, 541, -559, 486, 2054, 200, 177, 2007, 670, -111, 521, 430, 285, -725, -695, 73, -1032, -990, -425, -1651, -536, 386, -1005, -346, 630, 489, 460, 365, 734, 1580, 208, 263, 1193, -338, -353, 398, -545, -594, -375, -815, -776, -860, -360, 24, -1237, -91, 1041, -402, -2, 1445, 768, 484, 432, 795, 820, -32, 127, 424, -572, -128, -124, -1652, -369, 169, -1190, -868, 95, -42, -382, -351, 1086, 1024, -422, 638, 1347, 17]
1391A7K51N73j004Q7L80p45k21k54O64q5j061J325O21j449Q12Q93r40N31J69K87
1411H51P5m45K46j72p76N42%j687R52Q54j300n01N68P87l60n50J424K89j295J130
1431F32N81j434P15N73r37L96K42p93o31J45R82p98j276J622N62k227O26J085
1449F5j95J58L28P15o04m65P58k05o27J516l08j811J094L38j946l7J193L22j236
1468i47k10J270j26j344J210Q10q07P35O61p24n13M72J0p07M52J254j093j961
1486a558J602J57k223R17J827n73q70L01P43q22m83J764L90r50J261l75k300J298
1504A06M94p17m58J199L53k146n87K051r87j723K628J408k186J50J090p13n27
1521e65Q82J202p43m03J090j442j740J919K01j219O90R28j435j034P72Q81q83
$$ y = [17, 268, 841, -163, -76, 304, -441, -662, -916, -252, -337, -1398, -73, 548, -901, -89, 804, -136, 395, 564, 851, 926, 481, 727, 555, -221, 321, 321, -1366, -414, 440, -860, -1361, -793, -6, -366, -916, 508, 797, -498, 632, 1213, -221, 494, 1067, 130, 526, 768, -25, -656, -511, 471, -327, -1603, 19, 581, -1646, -1020, 65, -130, 28, 356, 1071, 467, 2, 760, 555, -72, 1444, 1136, -675, 419, 757, -1189, -1226, -33, 289, -947, -1157, 113, -13, -1357, -147, 663, -144, 591, 1252, 528, 15, 487, 497, -210, 242, 1496, 403, -1558, 44, 201, -2022, -1105, 722, 149, -721, -420, 323, -499, -982, 782, 1172, 222, 1483, 1108, -1192, 106, 600, -117, -575, 624, 977, -1169, -1756, 295, -692, -2415, 213, 1621, -565, -415, 675, -38, -565, 317, 1519, 776, 373, 1463, 21, -1719, 200, 401, -818, -128, 800, -635, -1669, -897, -16, -899]
1538h99L18K511j104j831J632J61j760J025J702p29j111Q60J75k030p42K287n0
1555D15j493J391K69j978R0J182J50o66J625P51j661r00J663q65j299K813K08
1572A695k271J24O85p63j439J486J328j589J26J802j711j765K530O73j222N67
1588B56J819j071j566K79J077j378q2K250p40j918P48m31q23Q54J022l71k54R12
1606E83r7j821K89K758j151j015J878N2k238J10J335m37j136R60J098j755p37
1623a324J338o89p90K003K98j315N06N77p08q70J115J495j127k36J062j198j420
1640a283J145J32m78O70L11r43o94P26L85p17L82J986j195j318J343L93j304J86
1658b73J319r5o90k56N42j326l83J171l26j42Q62n06m95J4M65J36j09P06P70j476
$$ y = [-899, -581, 1930, 826, -1005, 627, 788, -972, 53, 1755, 1026, -85, 775, 950, -1080, -1822, 465, 415, -1078, 313, 582, -1396, -1306, -124, 26, -640, 985, 1736, 75, -825, 838, -27, -1326, 1487, 1695, -576, -452, 233, -530, -1969, -483, 845, -744, -618, 1184, -527, -2292, 238, 911, -311, 256, 2075, 1004, -562, -283, 794, -584, -666, 1584, 844, -1074, -326, -757, -1580, -726, 296, -75, -329, 583, 486, -1335, -1046, 1712, 561, -454, 1424, 1476, -762, -652, 683, 246, -890, 70, 1168, -587, -1324, 14, -675, -1465, 538, 836, -479, 27, 604, -104, -974, 141, 1636, 509, 273, 1335, 137, -1283, -138, -6, -484, 186, 497, -446, -1140, -414, -29, -746, -364, 1622, 427, -891, 452, 845, -459, -273, 1046, 951, 261, 5, 547, -779, -1162, 9, -317, -459, 403, -103, -598, -584, -119, 17, -92, 614, 1384, -92]
1678i2k5Q72p40n03J040l8k83q8j53m8r85M77J139j001l01J409p40p74O64O84
1698E14q4l25M99M04r31m21O64m18k08Q62q17j23K60m95k94L13N40M86q69L56
1718h7O39p18q6J083m66r5J33j02J44n61m6K18m66k1O05n48l04M50l0m91M03L04
1740d2N12m47q0O27k28l23O99n45O5k0l06k61K21j13j68k2L69J67r77K49J101
1761D78n31n61Q02N62n99k05M88J85m93J02K74n56k58M38l48l28N02l68P8j98
1781e36L64L05l89m6M83k36K01M59k19k43J93K2k10N1j10q6m80L89J06n60M9O32
1803A39m16m3L00J30q6j57J26P04o06j47N26m16k6K94l93K6m5K05m90j38J56J93
1825a64o05M15O51o23J69M34J09n23M71l68L38k17K36P3p58K83L14o07k8M69k18
$$ y = [-92, -117, 755, 15, -488, 552, 514, 231, 143, -10, -58, -1043, -566, 573, -428, -729, 680, -60, -834, -170, 514, 430, 105, 604, 1008, 77, -344, 320, -98, -306, 556, -261, -384, -124, -619, -913, -600, -60, 426, -443, -87, 552, -166, -252, 831, 365, 270, 403, 301, 445, -116, -162, 56, -410, -431, 174, -374, -678, -228, -258, -749, -346, -42, 470, 23, -57, 570, 342, 19, 718, 173, 238, 218, -88, -349, -128, -241, -409, -431, -62, 105, -872, -623, 478, -53, -614, 188, 750, 151, -54, 434, 619, 126, 228, 502, -54, -312, 126, -222, -550, -48, -416, -338, -536, -172, 133, -256, -302, 181, -55, 146, 605, 386, 143, 336, 358, 148, 199, 89, 3, -477, -88, 18, -542, -493, 139, -277, -320, -20, 110, 24, -133, -7, 697, 91, -56, 470, 54, 28, 322, -71, -45, -90, 115, -375, -513, -357, -164, -769, -354, 297, -326, -157, 277, 386, -137, 334, -34, 304, 87, 323, 396, -362, -79, 235, -372, -400, 69, -149]
1846a49k45J82J52J67l20MM99r5j45L60l25O9N13m89j50M52m40J8l70K34J79p03
1868f02J60N44l36k7K77k13K25m1L37k26n0K69n4n94N33M50q87r9O37p15K03R4
1890a15q0N1k32L11Q0n07Q25l0n34M67K41n75K34K17n1j60l95M04j32m31J22L44
1912E4o23K97L64l33j9M29n0r2L8M74k33m30N10l4m09K73K35n09m5k84J05J69
1934a13k86J73J55k31J11K80n36O14L50m89l1O28j04l18m33M97k6o78N56P6m75
1955b80qPj22M1J61R8P8j02L77k40k61O83K69p55K58L64p12l3J42Rj24j7M08m50
1979b09n65O98j6p46J011J17m67K61J82L11p83p3Q89j04o26M75L7q36K75K65k98
2000b02o9K31j03k60j0M59j77l70P72M32r61L75J63m36J03L34K05m44k67M15n18
$$ y = [-149, -394, -212, -60, 107, -213, -209, 290, 195, 50, 410, 85, 154, 667, 178, 28, 480, 40, 58, -312, -78, 101, -602, -442, 102, -234, -261, 16, -197, 28, -13, 324, 98, 48, 317, 263, -331, 202, 652, -235, -334, 303, -412, -209, -115, -195, -144, -376, -65, 15, -492, 333, 303, -231, 236, 477, -98, 136, 353, 302, 142, -253, 151, 19, -412, -290, 54, -569, -272, 92, -241, -260, 169, 119, 27, 65, 539, 306, -124, 386, 352, -57, 216, 451, -58, -103, -387, -282, -113, -399, -226, -71, -302, -191, 89, -447, 167, 517, 28, -3, 625, 521, 203, -230, 267, 241, -437, 119, 195, -280, -288, -281, -403, -362, -201, -103, -25, -127, 250, 10, -251, 432, 701, -54, 204, 568, -144, -177, -35, -26, -150, -167, 241, -209, -774, -76, -92, -838, 173, 290, -177, 84, 266, 577, -206, -279, 610, 506, -120, 355, 392, -444, -169, 96, -202, -271, -40, -143, -403, -413, 46, -131, -501, 271, 703, -258, 117, 280, -156, -53, 281, 486, 42, -225, 190, -328]
2021c28k57O40L5o87N57L45n65m45P47J38l79K50P25l36o57N61j47o80Q01N21
2041H39r34k55L92j78n26L2J319p41p29J315l79p52N49N68l96nO14k4q40k67P24
2062C26m54l10Q99m5j036K51M92p72jP92J31k67M5N68o52p29J315j79n65O99K70
2083G78p95m22N41K49q75M05N93p47r58J471k79r96J086L52K4k75J92p8p44K46
2103b32J020n74m34J024p22j043M50O67m40n9O24J67p63m83R65n84K35P49L9p37
2123a31M47N4m90j31O81o7n73K46N64r81n96O99K90n43N37K49l79k26J23M39k88
2144g6Q8P85o48l46M57l06l36N87L38m34k76j21L62n72j38R74k87l39O75k00l86
2165a99J49M77m00N0M49O0q52l3P33p16r8O76j11m42J46l4k18j70N10J42KJ05
$$ y = [-328, -585, 55, 90, -597, -40, 305, -260, -705, 42, 180, -199, 51, 776, 440, -217, 344, 197, -483, 318, 839, -95, -350, 42, -136, -662, -630, 689, -52, -781, 534, 155, -597, -48, 520, 124, 119, 733, 709, -131, -398, 326, -128, -438, 461, 416, -620, -369, 123, -649, -650, 142, 273, 6, 51, 619, -33, -762, 553, 374, -191, 508, 778, -17, -439, 102, 351, -524, -119, 474, -273, -1231, 240, -39, -1035, 51, 403, 427, 152, 344, 266, -478, -232, 788, 214, -220, 804, 82, -961, -511, 156, -284, -343, 281, 448, -315, -798, 167, -417, -182, 567, 606, -131, 316, 370, -120, -251, 430, 363, -210, 36, 600, -381, -977, -278, 12, -531, 6, 255, -124, -350, -227, 212, -76, 12, 797, 149, -197, 260, -46, -382, 205, 543, 109, -167, -288, 74, -498, -636, 338, 51, -288, 387, 187, -199, -50, 427, 27, 77, 526, 586, -266, -299, 434, -282, -380, 296, 185, -257, -111, -145, -363, -533, -23, 119, 121, 226]
2187B26J54m03p9M33j7l20K97n5k26j06k13N02m02o4O28m87l22M00j70K27KJ26
2209A31K44k27Q4K35m96R0L84l66l8J86k87M1k33KP5N8j00K54j17j25M22m44k6
2232b53N94k02K50n9j30j10k47Q9L12o0k07j01R5k69J21k80J32J87m4L76l91K01
2254DJ77L9n6J79j41q4j03n7Q2j28j03J5M1J86j55p4J38q5m9L04J11l44L97j67
2278A27P3K53m85m6N23k56k17K5j22n7J77j70K91k91j00J08K03K8J23k61j9K29
2300A36j73J4N2J67J3k19l39M88j13l25J43k4j28J35j37J78Q4J00l4QJ02M14l86
2323A56r4L39k33j39j48K32K9l45k2L10j80j49L43l8j98j4J1K48k02K67N0k00
2345B3r0J98k88R8O37l98k09J0M8K49l84J76p9k62O1L9J5P1N16l22j69L14j06
$$ y = [226, 380, -23, -102, 331, 314, -6, 291, 236, 10, -96, -309, 193, -209, -273, 355, -132, -454, -54, -224, 3, 5, 131, 375, 148, 232, 467, -29, 61, 445, 79, 41, 227, -60, -19, -252, -250, -175, -117, -217, 37, -80, -205, 217, -227, -253, 341, 139, 389, 330, 200, 90, -157, -68, 244, 184, -23, -124, -29, -298, -177, -457, -325, -138, -182, 194, -197, 4, 181, 220, 164, 343, 202, 118, 15, -42, 40, -88, -191, -176, -135, 51, -104, -178, -40, -125, -174, 130, 241, -103, 294, 127, 200, 453, -32, -78, 445, 189, -28, -3, -125, -182, -5, -175, 116, -175, -275, -167, 36, 64, 187, -74, -93, 136, -37, -23, 29, 196, 209, -10, -349, 139, 26, -299, -156, -180, -308, -173, -310, -132, -48, 52, 18, 26, 128, 542, 156, 62, 401, 168, 29, -119, 113, 142, -203, -225, 85, -95, -244, 99, 61, -137, -151, -140, 108, -94, 173, 223, 23, -67, 131, -157, -59, 578, 180, -29, -19, 29, 278, -106, 70, -9, -271, -210, -171, -156, -85, 431, 109, -60, 254, 148]
2368A48k6j72K33J07m53L24L6k15k4P9k05J14j34J08k51L72J03n0m05L01M40l75
2390E5q6K40O6m44M47j13j32j29j24J97k89m7K47%j8M56n64J07R0%J80J6O2J79
2414C96j95J46L2l52N7l1k37r0L52m33L05j64L46k39l32M49K89l09M7K40j56j11
2436A0O3k20N8K50r1j25P9jr8l19M20n3l0j64K21J67j31o9O8K60j82L1J9k56m0
2461a33N01m74Q6J9q4j81J03P7R8j61J55R9j89R9J07j82K16J10m8j19L4J6k99
2484a50K70J39l00l23L00p6k27q6N54k29K16P8k8l24p6K85K1k17O18q3m00Q3L0
2507G5O4k77R9K73l71k88K58P8m60N50K35m40L11n6j92J82R6P5m4l6O8k79k09
2530b88N34k17m20M87o2j76P3J45j53j76P3L95k30l18P95m76k84K24L10j04k34
$$ y = [148, 122, -50, 183, 290, -163, 161, 197, -18, -42, 37, -168, -54, -188, -80, -331, 41, 144, 94, -311, -10, 430, 55, -31, 209, 275, -169, 278, 165, 33, -96, -220, -23, -312, -359, -112, -112, -130, 326, -238, -131, -41, -41, 139, 155, 217, 396, 201, 347, 379, 27, 84, 53, -184, -274, 78, -355, -50, -214, 132, -107, -439, 10, 299, -10, 37, 277, 121, 10, 73, -147, -89, 161, 70, -55, 24, 23, -75, -394, 26, -27, -57, -221, 0, 167, 36, -33, 35, 295, 113, 144, 163, -93, -133, 368, -106, -20, -1, -85, -266, -163, -86, 12, -149, 6, 105, -84, 15, 122, -60, 156, 266, 218, 99, 133, 149, -150, 120, 259, -41, -364, -64, -140, -367, -453, 101, -128, 88, 166, 138, -186, -262, 23, 44, -173, 445, 362, -38, 45, 75, 139, -138, -39, 234, -137, -425, -167, -89, -549, 1, 236, -204, 107, 51, -141, 41, 137, 212, 168, 132, 200, -79, -288, 246, 29, -391, 96, 34, -142, -69, 76, -77, -253, -180, 215, -15, -333, 462, -14, -298, -74, 236, 132, -102]
2551a02L67j09l84j61M64k03rL74k34n20L79J75k16K5L37K04m62K23N1l49j60
2572c10O84j01n17M06r5j02k75q7L17j75K14J70k41j27L63p1m97Q77J25o11lJ40
2594H4M9l23J21L28p5l23N73m60l47K87M6j71q2O10k54l90oP09m25k01P83q3n95
2617a45m9K07j21J65J68j46l07M5K89l35p9L28Q5k32K79J45l22j57M76j4l86K13
2639A07J87k90l56N34m10j48O55k75k34j25L97j55j62O8L19k67K44J14j32l79
2659c08M52n5Q1k48N6Q8k01j61M97l13k35O03k00l01J41K21k10N2K68M4j75k06
2681a10K63j69l46N33l7k11M5M4k18J18q3QJ4q4M53k76k95M22J28l39L04K72m74
2704c8J12L5j78lQ0J21k20o9K76l14q0K56n1Nq2J18K86k81K3J50j02J21J7j22
$$ y = [-102, 265, 156, -228, -389, 75, -128, -137, 237, 3, -517, -138, 37, -179, -154, 183, 387, -75, 148, 199, -150, -310, 374, 273, -244, 162, 67, -35, -310, -397, -80, -255, -41, 129, -112, -239, 124, 53, -444, 433, 558, -53, -56, 84, 133, -190, -69, 259, 184, -139, 434, -26, -373, -86, -40, -211, -293, 317, 63, -327, -333, 376, -49, -250, 533, 450, -145, -194, 13, -108, 57, 225, 79, -228, -183, 106, -229, -308, 20, 105, -127, 152, 297, -25, -182, 294, 280, -106, 107, 294, 4, -352, 182, -228, -376, 279, 4, -230, -355, 42, -113, -275, -207, 112, -155, 89, 203, 71, -308, 144, 89, 170, -78, -22, 66, -135, -296, 201, -112, -347, 256, 56, -245, -104, 117, -93, -41, 227, 271, 96, -110, 153, -16, -362, 171, 134, -77, -32, 12, -206, -88, -171, -163, -149, -233, 220, -56, -351, 71, 199, -140, 164, 436, -38, 74, 109, -69, -72, 8, 129, -91, -160, 116, -198, -278, -22, -73, -68, -150, -32, 254, -27, -4, 146, 44, 165, 182, 60]
2728F0r3J44k88K58k5n1q3j14J23J24n3j54J11o4l4J80q7J54k0Q3L3j46Q0J6k95
2753a41j2K41l08K52m3j8M4l12K80K03l80J68J41j22J33J9O8j41K0l8j20K41m
2776A71K3l52K05l8j31M7J8j05J18p3L4P2J26k45J48R6j20K20j39K63k62o3l7
2799b4RO0J58j59k66L05Kj10K00J4j87K24l20J03Lo0J01K1K8Q5q7j10n6J5j09
2824a60J00p7J60k28Q8K07M7k57J60J06k3J92k93J77j75k7J24l07l8L50j79j27
2846a80p2R3k6LJ51J96j80r2K08j78k7K52oj37J32j22L62j70o8p9l20J87j48p0
2870b91J00K8J22k7K11j73J5m3J12J35K1j93L02n8k05J32j42l85J19L6Q9M5nJ73
2894A18rk48p2J12K38J4j03J26j56J89j64j73K09R1k09r6L08j28o5Q4n6k00K35
$$ y = [60, -33, 111, -177, 81, 56, 5, -78, -192, -69, 55, 2, -152, -41, -105, -139, 41, -46, 108, 88, 171, 204, 58, 138, 154, -141, -153, 88, -220, 32, -11, -29, 15, -297, -17, 186, -194, -26, 115, -7, 126, 145, 213, 72, 92, 54, -66, 175, 171, 194, -158, 47, 9, -122, -75, -57, -162, -44, -117, -83, -11, 115, -130, 18, 114, -6, 214, 75, 338, 76, 13, -24, -15, 45, 203, 44, -222, 83, 85, -25, 175, 189, 2, 226, -94, 9, 12, -48, 53, 74, 102, 187, 100, -10, -66, -51, -160, -60, -137, 23, -205, -117, 90, 137, -120, 40, 146, 123, 315, 22, 199, 24, -3, 121, -186, -224, 126, -53, -180, -252, -159, -185, -182, -31, 165, -15, -107, 101, -77, -104, 148, 142, 5, 137, 15, 377, 207, 139, 60, -260, -73, -221, -291, -191, -163, -41, -68, 143, -30, -15, -58, 54, 189, 210, 17, 319, 261, 56, 188, 46, -339, -220, -184, -95, -50, -55, 118, 109, -139, -211, -99, 139, 153, 50, 176, 20, 209, 45, -128, 81, 172, -37, -133, 175, 47, -18, 66, 10, -190, 45]
2917D5o3P2k35J60p4L15m30K91j99Q0K4J43o8ml8k44K24j48N2l1Q7j36J57r2R8
2942a4mPK50k39R3O2o5J58l94K12P0j41o1J61j68k1J35k87L94r9o8J47r9J49j49
2967B9R2j4J41p3r3O9k25K56k03k2oO6j8P2Q1j10k91M63j92J60l61OK19MK6J5
2993I1o4J14k66K98rk38J49j00j01L9K72k99n2K07j8l9j35J15K39r2O5M1k69k4
3017g6M4N0R5p6j10O4j15J07N4l75J83L66l31M9R0O1kj42L35j17j93L5M4l53L01
3042a2O5j3j7R7j19k5q4J12J27j78J71o8Kj84K10k9N4j19M24m25J56j62k07k9
3066b53K78K02j79P7p3l40P5J39K03m5j80K09M9j32JP3l84K40K63l62O7j78J25
3089a25k02K02M74k41k90J33Q8m25L70p2Q8K44j57k5n3M1P6j52n5K26l8k81L5
$$ y = [45, -18, 54, -181, -21, -95, 220, -210, 81, -118, -38, -14, 129, 61, 57, 19, -225, -1, -149, -97, -128, -41, -177, -20, -112, -14, -18, -11, 239, 0, 93, 155, 90, 248, -146, 66, 136, -5, -66, 95, -73, -94, 41, -246, 148, 49, -19, 128, 29, 178, 29, 121, 107, 248, 175, 82, 151, -74, 182, -21, -43, -49, 17, -1, 71, 152, 42, -249, 214, 22, 182, -179, -173, 46, 50, 76, 91, 27, 141, -125, 173, 164, -74, 75, -25, -126, -87, 185, -114, -166, 41, 23, -16, -151, -36, 203, 111, 176, 217, -52, -76, -32, 18, 113, 37, -73, -9, -124, -17, 37, -338, -155, 211, -120, -71, 19, 80, 78, -64, 271, 154, -39, -4, 40, -313, -12, 53, 40, 23, 120, 1, -24, -108, 4, 131, -47, 124, 56, 58, -126, 84, 55, 109, -10, 414, -11, 145, -17, -224, -253, 25, 227, 48, 125, 52, -288, -213, -74, 129, 84, -96, 113, 162, 30, 31, 104, -280, -40, 223, -139, -72, -250, -125, -327, -125, 349, 108, -182, -49, 39, -386, -16, -88, 0, 244, 87, 62, 9, 50, 126, -26, -81, 145, 107, -174, -139]
3112a39K82l76J8M46o7j20k18K87j84k73L69K21k53K12q7o0k28J66K05n05L26
3133B2J22j27j97L70m0l89L21j05M8lP8J05k90k7J64p7N5J36j13j38J52o1j47
3156a41m2M18m3l41J70%L6m7J94J06m60L51L7l59k9K90P4k68P6K2j54K6K37j93
3180d0J4J49j03j48P8M5mO7j43L51j79j18J49j20J42O2j62R2k79J69K3k81J80
3203e6kj3n6N6K2j65Q1J29R7J70j06jo1j10O3k03J46J45j4k67R6M7l05L77m14
3228c44L45J21k52K23q6J44k29N3M8o2J11j86jo3J52Q1j49J59j52jL2L3k4N4k1
3253a4J29k1n3K07l11J6L44j61q0K06j21p7j62j41J38K68k54qJ14j31J88Rl74
3276b89M03O9k48J30J50l0o0j65K%J80p3o9j54M8n0l4L14k57J04j53O7L90k39
$$ y = [-139, 143, -233, -215, 231, 164, 44, -174, 113, -71, -344, 25, 246, -7, 205, 118, 58, -170, -4, 201, -304, 22, 144, 17, -180, 190, 150, -239, 82, -23, 25, 22, 100, 205, -85, -112, 52, -25, 30, 166, 53, -85, 67, 6, -141, -183, 235, 192, -149, 21, 21, 57, 10, 204, 310, -150, 201, 238, -121, -150, 140, 214, -54, 22, 44, -110, -84, 153, -40, -26, 123, 20, -128, -50, -5, -9, 58, -85, 266, 87, -31, 118, -2, 140, 202, 40, 132, -147, 22, 45, -236, -56, -58, -71, -127, -71, -49, -214, -133, -4, 93, 263, 157, 156, 95, -15, 48, -155, -9, 136, 122, -145, -49, -2, -307, 70, -344, 1, 122, -130, 93, 7, 151, -78, -25, 23, -39, 72, -114, -115, -178, -26, 55, -94, 65, -87, -88, -56, -23, -47, 7, -14, 115, 94, 41, 248, -63, -47, 297, 136, 56, 262, 141, 64, -98, -239, -101, 167, -87, -95, 19, -112, 76, 85, -289, 114, 183, -65, 65, 215, 185, 125, -40, -38, -38, 142, 69, 0, -154, -106, -156, -190, 124, -133, -29, -182, -115, 275, 36]
3300C6L9R3k64k01N65q7J9j01n2m6n1k06K45J14l21K35Q1j31J5Pp0J55Rj7O6k26
3326i4R5Mn6Q5j91J76o1p8L0J14QQ8j63j8J31r6r2J71J45j47n4J04R7j26j53K36
3352A55k09R3j92n5K75k37K5J23L3j29M8o8L00q7q4K47l69L33n8o4P4N1p3k27
3376i5J17K4k21j07J77L7J27j06r8K66l62K09N4J0K03l32L67m30K87k32K96l02
3398a11P9J63j45l9k4j55K58j46P3J66K6l26L44q6j62K69j64J14n0P1j22N2l77
3421b92M38l24J62o2K9k04J87L3n7K47j27k%J2K2l7O5rMj40K42k97J4R9j24p7
3447a98O3j16K12k4o8J75l6L7N2j27O8K51l53Q2j61K83j08O8L6j27j02r7J35k31
3471b86J55J11p2M9J13l04M69j46j1n7n5K59j9n44M32K2J6Mj64J19j23L3k06Q0
$$ y = [36, 75, 168, -96, -297, 268, 181, 200, 99, 47, 1, -50, -256, -11, 103, -218, 17, 98, -33, -18, -11, -81, 74, 83, 66, 132, -94, 1, 5, -51, 34, -157, 19, -42, -120, -90, 24, 32, 120, -43, -61, 70, -26, -118, 53, 198, 51, -3, 101, 198, 72, -81, 155, -54, 39, -153, -208, 67, -170, -145, -22, 11, -118, -70, -138, 162, 75, -9, 238, -131, 202, 144, 80, 154, 205, 132, -95, 22, 46, -175, -282, -105, -68, 59, -47, -145, 121, -241, -32, 22, 32, 235, -97, 270, -160, 127, -105, 191, -111, -32, 131, -14, -53, -77, -232, 26, -120, -47, 119, 145, -181, 163, 77, -85, 184, 20, 134, 84, 155, 33, 85, -292, 146, -178, -16, -78, -49, -253, -66, -33, -90, 157, 30, 28, 28, 40, 62, 25, 90, 81, 85, -55, 187, -110, -96, 3, -121, -198, -135, -251, -39, -63, -131, 44, 8, 45, 97, -30, 38, 289, -64, 18, -143, 140, 32, 100, 136, 9, -93, -190, -55, -286, -131, -20, -92, -43, 70, -234, 235, 89, 78, 21, -34, 225, 206, -338, 94, 116, 132, 136, -28, 91, -32, 1, -205, -125]
3495a25Q5M2J97j62Q8mOl16Q7K93k21q4J40k0j10j03J57O0o1q7J27j84R2P1P3
3520D1j58K87n4k08j3m1Q5L98k18K4o4j08J34r6j39R6r5J6K99k11j78N5Q1J82
3544A15O2Q3m6j60J7o3Nn3J69m6j68O6O2o9j87O1J72R3k89J56j67J19J67O0q1
3569G8Q6K0j66Kk73J58R8J8j8m5M6r8R2k33K16j17J96lj18N13n98j27L21K06L6
3594B90l44J95M8l33J0K70j21n9m9K58n23M04j45l25L95J35Qj20o3K89l23M5J98
$$ y = [-125, -40, 2, 199, 37, 125, 121, 127, -189, -102, 191, -30, -114, 26, 6, -104, -207, -50, 10, -51, -138, -11, -195, -103, -32, 41, -117, 170, 116, -92, -105, -146, -61, 337, 119, 143, 79, -29, 105, 9, -130, -34, -129, -113, 186, -25, -203, -148, -67, 115, 177, 260, 214, 54, 71, 8, 13, -40, 129, 83, -85, -19, 43, -26, -213, -152, 20, 113, -176, -20, -187, -68, 99, 159, 78, 164, 184, 18, 20, -253, -95, 3, 21, 3, -42, 4, -94, -2, -235, -19, -136, 60, 57, -61, 452, -146, -273, 48, 254, 290, -54, 141, 189, -144, -134, 136, 15, -44, -93, 165, -358, 46, -99, -424, -29, 106, 114, -6, -69, 220, -103, -58, 140]
$$ [...]
8191A44
##END NTUPLES=NMR FID
##END=
