##TITLE=1H_Pr C2-dep`
 200.13Hz, CDCl3.
 8 sc
 18.8.2026
##JCAMPDX= 6.0         $$ Bruker NMR JCAMP-DX V2.0
##DATA TYPE= NMR FID
##DATA CLASS= NTUPLES
##ORIGIN= UXNMR, Bruker Analytische Messtechnik GmbH
##OWNER= pz
$$ XWIN-NMR		Version 3.5
$$ Tue Aug 18 13:21:43 2026 Russian Standard Time (UT+4h)  she@DPX200
##.OBSERVE FREQUENCY= 200.1313
##.OBSERVE NUCLEUS= ^1H
##.DELAY= (6, 6)
##.ACQUISITION MODE= SIMULTANEOUS
##.ACQUISITION SCHEME= undefined
##.AVERAGES= 8
##.DIGITISER RES= 18
##SPECTROMETER/DATA SYSTEM= spect
##.PULSE SEQUENCE= zg30
##.SOLVENT NAME= CDCl3
##.SHIFT REFERENCE= (INTERNAL, CDCl3, 0, 14.3821)
##AUDIT TRAIL= $$ (NUMBER, WHEN, WHO, WHERE, WHAT)
$$ ##TITLE= Audit trail, XWIN-NMR		Version 3.5
$$ ##JCAMPDX= 5.01
$$ ##ORIGIN= Bruker BioSpin GmbH
$$ ##OWNER= she
$$ F:/spectra/data/she/nmr/H-C/1/audita.txt
$$ ##AUDIT TRAIL=  $$ (NUMBER, WHEN, WHO, WHERE, WHAT)
(   1,<2026-08-18 13:20:27.71 +0400>,<she>,<DPX200>,
      <created by zg, POWCHK disabled, PULCHK disabled
       configuration hash MD5:
       00 E9 B6 7A A2 85 ED C7 34 08 36 98 17 FE 4E 26
       data hash MD5: 16K
       03 19 CB D0 23 E9 36 45 91 70 54 4E 42 C2 1D E5>)
$$ ##END=
$$ 
$$ hash MD5
$$ A5 F5 12 10 7D D9 A1 C9 E9 5E 9C 2D 7A C8 61 29
##$RELAX= 
##$RELAX= 
##$RELAX= 
##$RELAX= 
##$RELAX= 
##$RELAX= 
$$ Bruker specific parameters
$$ --------------------------
##$DU= <F:/spectra>
##$EXPNO= 1
##$NAME= <H-C>
##$PROCNO= 1
##$TYPE= <nmr>
##$USER= <she>
##$AMP= (0..31)
100 100 100 100 100 100 100 100 100 100 100 100 100 100 100 100 100 100 
100 100 100 100 100 100 100 100 100 100 100 100 100 100 
##$AQSEQ= 0
##$AQ_mod= 1
##$AUNM= <au_zg>
##$AUTOPOS= <>
##$BF1= 200.13
##$BF2= 200.13
##$BF3= 200.13
##$BF4= 200.13
##$BF5= 200.13
##$BF6= 200.13
##$BF7= 200.13
##$BF8= 200.13
##$BYTORDA= 1
##$CFDGTYP= 0
##$CFRGTYP= 5
##$CHEMSTR= <none>
##$CNST= (0..31)
1 1 145 1 1 1 1 1 1 1 1 1 1 1 1 1 1 1 1 1 1 1 1 1 1 1 1 1 1 1 1 1 
##$CPDPRG= <>
##$CPDPRG1= <>
##$CPDPRG2= <>
##$CPDPRG3= <>
##$CPDPRG4= <mlev>
##$CPDPRG5= <mlev>
##$CPDPRG6= <mlev>
##$CPDPRG7= <mlev>
##$CPDPRG8= <mlev>
##$CPDPRGB= <>
##$CPDPRGT= <>
##$D= (0..31)
0 0.7 0 0 0 0 0 0 0 0 0 0.03 0 0 0 0 0 0 0 0 0 0 0 0 0 0 0 0 0 0 0 0 
##$DATE= 1787044827
##$DBL= (0..7)
120 120 120 120 120 120 120 120 
##$DBP= (0..7)
150 150 150 150 150 150 150 150 
##$DBP07= 0
##$DBPNAM0= <>
##$DBPNAM1= <>
##$DBPNAM2= <>
##$DBPNAM3= <>
##$DBPNAM4= <>
##$DBPNAM5= <>
##$DBPNAM6= <>
##$DBPNAM7= <>
##$DBPOAL= (0..7)
0.5 0.5 0.5 0.5 0.5 0.5 0.5 0.5 
##$DBPOFFS= (0..7)
0 0 0 0 0 0 0 0 
##$DE= 6
##$DECBNUC= <off>
##$DECIM= 32
##$DECNUC= <off>
##$DECSTAT= 4
##$DIGMOD= 1
##$DIGTYP= 9
##$DL= (0..7)
0 120 120 120 120 120 120 120 
##$DP= (0..7)
150 150 150 150 150 150 150 150 
##$DP07= 0
##$DPNAME0= <>
##$DPNAME1= <>
##$DPNAME2= <>
##$DPNAME3= <>
##$DPNAME4= <>
##$DPNAME5= <>
##$DPNAME6= <>
##$DPNAME7= <>
##$DPOAL= (0..7)
0.5 0.5 0.5 0.5 0.5 0.5 0.5 0.5 
##$DPOFFS= (0..7)
0 0 0 0 0 0 0 0 
##$DQDMODE= 0
##$DR= 18
##$DS= 0
##$DSLIST= <SSSSSSSSSSSSSSS>
$$ [...]
##$SUBNAM0= <"">
##$SUBNAM1= <"">
##$SUBNAM2= <"">
##$SUBNAM3= <"">
##$SUBNAM4= <"">
##$SUBNAM5= <"">
##$SUBNAM6= <"">
##$SUBNAM7= <"">
##$SUBNAM8= <"">
##$SUBNAM9= <"">
##$SW= 18.0517328524113
##$SWIBOX= (0..15)
0 0 2 0 0 0 0 0 0 0 0 0 0 0 0 0 
##$SW_h= 3612.71676300578
##$TD= 16384
##$TD0= 1
##$TE= 0
##$TE2= 300
##$TE3= 300
##$TEG= 300
##$TL= (0..7)
0 120 120 120 120 120 120 120 
##$TP= (0..7)
150 150 150 150 150 150 150 150 
##$TP07= 0
##$TPNAME0= <>
##$TPNAME1= <>
##$TPNAME2= <>
##$TPNAME3= <>
##$TPNAME4= <>
##$TPNAME5= <>
##$TPNAME6= <>
##$TPNAME7= <>
##$TPOAL= (0..7)
0.5 0.5 0.5 0.5 0.5 0.5 0.5 0.5 
##$TPOFFS= (0..7)
0 0 0 0 0 0 0 0 
##$TUNHIN= 0
##$TUNHOUT= 0
##$TUNXOUT= 0
##$USERA1= <user>
##$USERA2= <user>
##$USERA3= <user>
##$USERA4= <user>
##$USERA5= <user>
##$V9= 5
##$VALIST= <valist>
##$VCLIST= <CCCCCCCCCCCCCCC>
##$VD= 0
##$VDLIST= <DDDDDDDDDDDDDDD>
##$VPLIST= <PPPPPPPPPPPPPPP>
##$VTLIST= <TTTTTTTTTTTTTTT>
##$WBST= 1024
##$WBSW= 4
##$XGAIN= (0..3)
0 0 0 0 
##$XL= 0
##$YL= 0
##$YMAX_a= 351149
##$YMIN_a= -324458
##$ZGOPTNS= <>
##$ZL1= 120
##$ZL2= 120
##$ZL3= 120
##$ZL4= 120
##$ABSF1= 10
##$ABSF2= 0
##$ABSG= 5
##$ABSL= 3
##$ALPHA= 0
##$AQORDER= 0
##$ASSFAC= 0
##$ASSFACI= 0
##$ASSFACX= 0
##$ASSWID= 0
##$AUNMP= <proc_1d>
##$AZFE= 0.1
##$AZFW= 0.1
##$BCFW= 1
##$BC_mod= 2
##$BYTORDP= 1
##$COROFFS= 0
##$CY= -3
##$DATMOD= 1
##$DC= 2
##$DFILT= <>
##$DTYPP= 0
##$F1P= 0
##$F2P= 0
##$FCOR= 0.5
##$FTSIZE= 0
##$FT_mod= 4
##$GAMMA= 1
##$GB= 0.15
##$INTBC= 1
##$INTSCL= 1
##$ISEN= 128
##$LB= 0.25
##$LEV0= 0
##$LPBIN= 0
##$MAXI= 10000
##$MC2= 0
##$MEAN= 0
##$ME_mod= 0
##$MI= 1.114404
##$NCOEF= 0
##$NC_proc= 0
##$NLEV= 6
##$NOISF1= 3.799351
##$NOISF2= 2.8
##$NSP= 1
##$NTH_PI= 0
##$NZP= 0
##$OFFSET= 14.38212
##$PC= 1
##$PHC0= -4577.493
##$PHC1= 8.3923
##$PH_mod= 1
##$PKNL= yes
##$PPARMOD= 0
##$PSCAL= 0
##$PSIGN= 0
##$REVERSE= no
##$SF= 200.129724274929
##$SI= 16384
##$SIGF1= 3
##$SIGF2= 2
##$SINO= 400
##$SIOLD= 16384
##$SREGLST= <1H.CDCl3>
##$SSB= 0
##$STSI= 0
##$STSR= 0
##$SW_p= 3205.1282051282
##$SYMM= 0
##$S_DEV= 0
##$TDeff= 0
##$TDoff= 0
##$TI= <>
##$TILT= no
##$TM1= 0
##$TM2= 0
##$TOPLEV= 0
##$USERP1= <user>
##$USERP2= <user>
##$USERP3= <user>
##$USERP4= <user>
##$USERP5= <user>
##$WDW= 1
##$XDIM= 8192
##$YMAX_p= 0
##$YMIN_p= 0
$$ End of Bruker specific parameters
$$ ---------------------------------
##NTUPLES= NMR FID
##VAR_NAME=  TIME,          FID/REAL,        FID/IMAG
##SYMBOL=    X,             R,               I
##VAR_TYPE=  INDEPENDENT,   DEPENDENT,       DEPENDENT
##VAR_FORM=  AFFN,          ASDF,            ASDF
##VAR_DIM=   8192,          8192,            8192
##UNITS=     SECONDS,       ARBITRARY UNITS, ARBITRARY UNITS
##FACTOR=    0.0002768,     1,               1
##FIRST=     0,             0,               0
##LAST=      2.2672688,     0,               0
##MIN=       0,             -324458,         0
##MAX=       2.2672688,     351149,          0
$$ Real data points
##PAGE= N=1
##DATA TABLE= (X++(R..R)), XYDATA
$$ [...]
1665h61P52N90r72M89J423j285q90J011J64o30N59Q02r16j103L32N88p20K90R28
$$ -861 -109 481 -491 -2 1421 136 -754 257 421 -209 350 1152 236 -867 -535 53 -667 -377 551
1684E51r65n12J147m81n23O25O95l99l05J034J29j546L71Q87p64q3J121p48j169
$$ 551 -414 -926 221 -260 -783 -158 537 138 -167 867 996 -550 -179 708 -56 -139 982 234 -935
1703i35K12P43m57l85J033K74j279M92Q73p52k98J122j21l23J18L79m45p01M68
$$ -935 -723 20 -437 -822 211 485 -794 -302 571 -181 -479 643 522 199 317 696 251 -450 18
1722A8J65l63N21K8j061PQ42m70l46R03K23n56k02P95j28n92N98L37p45R4N12
$$ 18 183 -180 341 369 -692 -685 157 -313 -659 244 467 -89 -291 504 376 -216 382 719 -26 68 580
1743E80o50k71M27l0j38l00K58j67m59N26M6l0J77K30r6J94j96K73n2p8J43j93
$$ 580 -70 -341 86 56 -82 -382 -124 -291 -750 -224 -178 -208 -31 199 103 297 101 374 322 244 387 194
1765A94j83L45k77m00K17J81k36jk07J70q2j58L35N34l16J48J71k89K64j87nN8
$$ 194 11 356 79 -321 -104 77 -159 -160 -367 -197 -279 -437 -102 432 116 264 435 146 410 223 218 276
1787B76k70P4J02m99J2K95l79JK94q1Q5q8J58J1k96K16N63k48q9L73j12k85O1
$$ 276 6 80 182 -317 -305 -10 -389 -388 -94 -175 -90 -178 -20 -9 -305 -89 474 226 137 510 398 113 174
1810A74Ll5l57L20j48m61J84K67l14KM15l95J21K14K98l8l06L95J48l38J9K93
$$ 174 177 142 -215 105 -43 -504 -320 -53 -367 -365 50 -345 -224 -10 288 250 -56 339 487 149 168 461
1832D61m99J30kk94K26l12J57m19J54O76m55k55L98L39n58L99L73m52P9R9Lj75
$$ 461 -38 92 90 -204 22 -290 -133 -552 -398 278 -177 -432 -34 305 -253 146 519 67 146 245 248 73
1854G3J34Qk24l69M04j12n32N12j94n8r3N90j17j73J46L45k24p1K24K12l42L42
$$ 73 207 215 -9 -378 26 -86 -618 -106 -300 -358 -451 139 22 -151 -5 340 116 45 269 481 139 481
1876D81l49j98J05O9l22j0J4J03l59J8M94q9k21L81n2l4Q9J98J1l22K67L8k67
$$ 481 132 -66 39 108 -214 -224 -210 -107 -466 -448 46 -43 -264 117 65 31 120 318 329 7 274 312 45
1899D5k23M19m54j07L87j51l24J51J42k90J05K19n3K8K72L71n95K59L16k32n20
$$ 45 -178 241 -213 -320 67 -84 -408 -257 -115 -405 -300 -81 -134 -106 166 537 -58 201 517 285 -235
1920b35P50j49o82K18K7m9k42Q2L14m88k2M82m03K30M10j70j23K11J36k88j25
$$ -235 515 366 -316 -98 -71 -120 -362 -280 34 -454 -476 6 -397 -167 243 73 -50 161 297 9 -116
1941a16M93K66p03P5K58l85l59O13j71n36N63k18N3p6K09l8m3L17K41l66K25M07
$$ -116 377 643 -60 15 273 -112 -471 142 -29 -565 -2 -220 -167 -243 -34 -72 -115 202 443 77 302 709
1963G09o32J78jM2j46k45J81Mr35N13M99m26J02J55o4m30M38L87j12q9N81l6p64
$$ 709 77 255 254 296 150 -95 86 90 -845 -332 167 -259 -157 -2 -66 -496 -58 329 217 128 709 673 -91
1986i1M17J4o97L20L37k70l05L27l01m27K56N99l2n01N24j51o03L55O59J6l13
$$ -91 326 340 -357 -37 300 30 -275 52 -249 -676 -420 179 147 -354 170 19 -584 -229 430 446 133
2007A33J32L44n71l20N66n41j21N22L41j047K62L20n84j55P34P99p49l62O11k48
$$ 133 265 609 38 -282 284 -257 -378 144 485 -562 -300 20 -564 -719 15 814 65 -297 314 66
2027F6m80Q24M91p55j27N31m67n66N23J63o27N2J198p30r52O41L36q21L38J258
$$ 66 -414 410 901 146 19 550 83 -483 40 203 -424 -372 826 96 -856 -215 121 -700 -362 896
2047H96l85p46K22K93q23L07J438o62j079O06L64j287M54O93p73O7P58J55j390
$$ 896 511 -235 -13 280 -543 -236 1202 540 -539 67 431 -856 -402 291 -482 -415 343 498 -892
2066h92J92J182n65m67J461p5j398M42M46o48J25R58m3j075J28O79j119l24J366
$$ -892 -700 482 -83 -550 911 836 -562 -120 326 -322 -197 761 718 -357 -229 450 -669 -993 373
2085C73j53q01M30J053j189l31O74L88o42P68P87j371m77R24m17o12J210J42j312
$$ 373 220 -581 -151 902 -287 -618 56 444 -198 570 1357 -14 -491 433 16 -596 614 756 -556
2104e56n3Q54p04p80J138M95r75J18J278o58r30Q18M82l98M2P37o58r62M43N46
$$ -556 -609 245 -459 -1239 -101 394 -581 -463 815 157 -773 45 527 129 171 908 250 -712 -269 277
2124B77n78J75J060r75q82Q75q5m89M64O34n67q1L53K08q50L37O33m84J83O64
$$ 277 -301 -126 934 -41 -923 -48 -133 -622 -158 476 -91 -172 181 389 -461 -124 509 25 208 872
2144H72o72q24J83L74L0j78N31j93p21l7O33l02l5P63k00j88K20J23k60l30L99
$$ 872 200 -624 -441 -67 -37 -215 316 123 -598 -635 -2 -304 -339 424 224 36 256 379 119 -211 188
2165A88M49l12N0o1n56l79N30O3p4l3j82L5j95L61K70k12J40J24k81K05J56k76
$$ 188 637 325 375 314 -242 -621 -91 -28 -102 -135 -317 -282 -477 -116 154 -58 82 206 -75 130 286 10
2187A0j3J05J42l5l6n8k85l22J18L79J48o7m4l49O7NK70K76k51N2K04l37J41P1
$$ 10 -3 102 244 209 173 115 -170 -492 -374 5 153 86 42 -307 -240 -235 35 311 60 112 316 -21 120 191
2211A91k29o8K30M7j33l31P4K04l30J96L79l12o9M64l05k28L21L84k61l81L03
$$ 191 -38 -106 124 171 38 -293 -219 -15 -345 -149 230 -82 -151 313 8 -220 101 485 224 -157 146
2232A46J6l12K68J35m30o5N03l21k64r9K41J22q9R8J08l76L70L0j03Q6K28j89
$$ 146 162 -150 118 253 -177 -242 261 -60 -324 -423 -182 -60 -149 -51 57 -319 51 81 -22 64 292 103
2254A03j51K17K5k79j45J16J18j45K36N9n75L93p0j85N07r9K8J99m41J51K18j13
$$ 103 -48 169 194 -85 -230 -114 4 -141 95 154 -421 -28 -98 -283 224 125 153 352 -89 62 280 167
2276A67q7K21l94J81j55j64K34l8m35L2K10J39o3j36L16J69m98N55q4j19J26j40
$$ 167 80 301 -93 88 -67 -231 3 -35 -470 -438 -228 -89 -152 -288 28 197 -301 254 170 51 177 37
2298C7K51l5k13L6k69J39K6j80j50M32k98J29K44k95J44P8j21K39J46l10K78j42
$$ 37 288 253 40 76 -193 -54 -28 -208 -358 74 -224 -95 149 -146 -2 76 -45 194 340 30 308 166
2320A66J43j52j89J77k7k12J04M6N7j52o1L3L1j0q7J1P0k6J20n6K85K0k72r8L27
$$ 166 309 157 -32 145 118 -94 10 56 113 -39 -100 -67 -36 -46 -133 -122 -52 -78 42 -14 271 291 19 -79 248
2345B48l9j04k58M05k30j06Q1Q0k89l9J62kJ59j33oK06J47l45K33k65M93j24n25
$$ 248 209 105 -153 252 22 -84 -3 77 -212 -251 -89 -91 68 -65 -71 135 282 -63 170 -95 398 274 -251
2368b51P6J97j89O6K34k79J70k43K18j68m4L07k43J49N2K35j12j34N9J24J26k09
$$ -251 -175 22 -167 -101 133 -146 24 -219 -1 -169 -213 94 -149 0 52 287 175 41 100 224 350 141
2390A41J84k22k20pJ09j83J27j3j88K49N9j33q8K61mj75J14J49L7j39K21k03j37
$$ 141 325 103 -117 -124 -15 -198 -71 -84 -272 -23 36 -97 -185 76 72 -103 11 160 197 58 279 76 -61
2413f1nM37p62M20k02J11n0j73L76l43K06O9q5L9K58j33j04K18j94k3K26j11j48
$$ -61 -66 371 -391 29 -173 -62 -112 -285 91 -252 -46 23 -62 -23 235 102 -2 216 22 -1 225 114 -34
2436c4P7k30K84j24k01K92l15k5K15K57k87k8J26KJ43jj12Q2j61K38l98K41J06
$$ -34 43 -187 97 -27 -228 64 -251 -276 -61 196 -91 -119 7 9 152 151 39 121 -40 198 -200 41 147
2459A47m64K37J20j59j19L1K96p2k51J24l%K63J70l19J31R3k65j93L41N5k15j23
$$ 147 -317 -80 40 -119 -238 -207 89 17 -234 -110 -113 -113 150 320 1 132 225 -40 -233 108 163 -52 -175
2482a75K07J77l28qkM5J47Kk8l69M70j53k6J16L06L5n62K16J11k19j81N22m1l68
$$ -175 32 209 -119 -127 -129 -84 63 65 37 -332 138 -15 -41 75 381 416 -146 70 181 -38 -219 303 262 -106
2506a06P9o9j2k76M23J33k43J82Qk83J34N2J6j0J64N9l34M7K55j94k85J40J85
$$ -106 -27 -96 -108 -384 39 172 -71 111 119 -164 -30 22 38 28 192 251 -83 -36 219 25 -260 -120 65
2529F5o6j1j28j17q4J43K70m2j5L03l11l61K77L05k66J75J82p2l67l5M13j45j17
$$ 65 -1 -12 -140 -257 -341 -198 72 30 15 318 7 -354 -77 228 -38 137 319 247 -120 -155 258 113 -4
2552dj27K3m6l8K77k96R1L08p1j94L13j46j02j40L60jk39k7J96j56n06N41O4k73
$$ -4 -131 -108 -154 -192 85 -211 -120 188 117 -77 236 90 -12 -152 208 207 -32 -59 137 -19 -525 16 80 -193
2576a93J03J38k26J6J05J11n52N72L67m29L4P0jj96j19O21l46j93M6lk86P8K50
$$ -193 -90 48 -178 -162 -57 54 -498 74 441 12 46 116 115 -81 -200 421 75 -118 -72 -75 -361 -283 -33
2599c3n6K01M3K44q40M41J64j29k09N47n7l58K37o3l10j28M64j1k01j64J70n83
$$ -33 -89 112 155 399 -441 0 164 35 -174 373 316 -42 195 132 -178 -306 158 147 -54 -218 -48 -631
2621f31L97O75n61j24M30m9k33l23Q35j38m30J16N79n23j90M91n01n7M30k7j94
$$ -631 -234 441 -120 -244 186 137 -96 -419 416 278 -152 -36 543 20 -170 321 -180 -237 193 166 -28
2642b8j62M29l45k63L82L14k88j24L79l09o4J40P8l61K11M38m23k81J21Q6j68
$$ -28 -190 239 -106 -369 13 327 39 -85 294 -15 -79 61 139 -222 -11 427 4 -277 -156 -70 -238
2663b38K83K69m18q3K02k4k32K24K84k72j90N23j64m04L50K18k96J0J29k23m4
$$ -238 45 314 -104 -187 15 -9 -241 -17 267 -5 -195 328 164 -240 110 328 32 42 171 -52 -96
2684i6L3pNl10M92l0k87J02K07j68q1N01m94j1L03J99l20L8J48l6k47m1K10k61
$$ -96 -63 -70 -65 -375 117 87 -200 -98 109 -59 -140 361 -133 -144 159 358 38 76 224 188 -59 -100 110 -151
2708a51N7P1J35Q1R5k65K5r7M6j8L6K93Q6m49O8J7j68J24m0J23l7j1R2l23J85
$$ -151 -94 -23 112 193 288 23 48 -49 -3 -21 15 308 394 -55 13 30 -138 -14 -54 69 32 21 113 -210 -25
2733b5j26K24k18L19N2k29Q1l9J26j80J99K0rj92M4Q1j41j02LL1j40J26MJ8m7
$$ -25 -151 73 -145 174 226 -3 78 39 165 -15 184 204 195 3 47 128 -13 -115 -112 -81 -221 -95 -91 -73 -120
2758a20J76n7m1j82L45K8k45L83k47o9J09j2j69N4M7J66k82m3O3kM4J02j54r4
$$ -120 56 -1 -42 -224 121 149 -96 287 40 -29 80 68 -101 -47 0 166 -116 -159 -96 -98 -54 48 -106 -200
2782b00K00J31k27p0K66J20l09K18L0j51K7j6k7q9J7J65J69l22l6J82l7M3k68
$$ -200 0 131 -96 -166 100 220 -89 129 159 8 35 19 -8 -97 -80 85 254 -68 -104 78 41 84 -184
2805a84K30K6kJ0j98J97P0j26j20L34j84j62n5J62j05j4K06m16L46N1k48K23n
$$ -184 46 72 70 80 -118 79 149 23 -97 237 53 -109 -164 -2 -107 -121 85 -331 15 66 -182 41 36
2828C6k03K99r3PjQ1p8R1k10M9p7K4j70K00J61j61J64j44J81l28J70o5o4L60j3
$$ 36 -167 132 39 46 45 126 48 139 -71 -22 -99 -75 -245 -45 116 -45 119 -25 156 -172 -2 -67 -131 229 216
2853B16k19j68K85n6J89k55J4j29K33j22o8M9P6j30K8P4j71K63j41J37o2j2J22
$$ 216 -3 -171 114 58 247 -8 6 -123 110 -12 -80 -31 45 -85 -57 17 -154 109 -32 105 43 31 153
2876A53j87J19j21K6r4L21j67o5j07J51L1n5j74J58K2j79k7J41J01m2M6K46j98
$$ 153 -34 85 -36 -10 -104 217 50 -15 -122 29 60 5 -169 -11 11 -168 -195 -54 47 5 51 297 99
2899I9k6j76N3K8J94j53J9k29M29k55j43J7K18J0m37M18rR9p4P6j00k7J27k61
$$ 99 73 -103 -50 -22 172 19 38 -191 238 -17 -160 -143 75 85 -352 66 57 156 82 158 58 31 158 -103
2923a03K01LJ18j32j44J9l8K07r5j6j80K18M2j65l3K15j57n6J75K48m60M6K44
$$ -103 98 101 219 87 -57 -38 -76 131 36 20 -160 58 100 -65 -98 117 -40 -96 79 327 -133 -87 157
2946A57j56j00K42r0j09RjJ02K2l24M0PJ81j6J36q5k7r2J24R1l8p9j95J05PJ76
$$ 157 1 -99 143 53 -56 -47 -48 54 76 -248 -208 -201 -20 -36 100 15 -12 -104 20 111 73 -6 -201 -96 -89 87
2972H7j02j38K44o0q6J70j62J15r9r4J93k47l7L33j6o6k03L13l09j06L93j35k23
$$ 87 -15 -153 91 31 -55 115 -47 68 -31 -125 68 -179 -216 117 101 35 -168 145 -164 -270 123 -12 -235
2995b35K98L0n07L70J37k02pJ77j36k3JK51P1l04K25m6k07K6K98j01l16R3K75
$$ -235 63 93 -414 -44 93 -109 -116 61 -75 -98 -97 154 225 -79 146 100 -107 -81 217 116 -200 -107 168
3018A68m13l3K28j78K16p7L33l11L0M43l08J60j88j66J45l9J90n9j58m9L1J12
$$ 168 -245 -278 -50 -228 -12 -89 244 -67 -37 406 98 258 70 -96 49 10 200 141 -17 -66 -35 77
3040G7j67J09Q8p0N3J3l19j57L85J11k55K21J21m56K22Q5K7k61o0L30k41L4K00
$$ 77 -90 19 107 37 90 103 -216 -373 12 123 -132 89 210 -246 -24 61 88 -173 -233 97 -144 -110 90
3063I0k70PK02j13k4J27J80k72J1N9O2j27N6K16r5k64J10Q1j74L06l17J76K7k06
$$ 90 -180 -173 29 -84 -108 19 199 -73 -62 -3 59 -68 -12 204 109 -155 -45 36 -138 168 -149 27 54 -152
3087a52K47j39J45l3J35l69K95n2k83L20J14l71K59k0p6R3j77K25J7k42K48o9
$$ -152 95 -44 101 68 203 -166 129 77 -206 114 228 -143 116 96 20 113 -64 161 178 -64 184 115
3109A15l37Q1j5P2K02oj0M4k05R8m3j45J59K75o3j62J49j04k95Q9r7J24l3J29
$$ 115 -222 -141 -156 -84 118 112 102 146 -59 39 -4 -149 10 285 222 60 209 105 -190 -101 -198 -74 -107 22
3133B2kj19M5O8J20m4q0J84k64o0N00l33J3J26p2r8J05J4k41K01j32q8P3O7Q1
$$ 22 20 -99 -54 14 134 90 10 194 -70 -130 370 37 50 176 104 6 111 125 -116 85 -47 -135 -62 5 86
3158H6k88O0K05J62k82N8K10j14k23K60j46K0K7J04k82Q9P8lj96L55L3m19K64
$$ 86 -202 -142 63 225 -57 1 211 97 -126 134 -12 8 35 139 -143 -54 24 21 -175 180 213 -206 58
3181E8l3j84M8L39K2l21jK27j51J7J39O8m57K95j7q6q6K91j58q0J86j15o5M28
$$ 58 25 -159 -111 228 250 -71 -72 155 4 21 160 228 -229 66 49 -37 -123 168 10 -70 116 1 -64 364
3205C64l48K3q6j3J52J31k00P6K4j97n7J86j41N5NM2q5r4j86L16r1J57J23j59
$$ 364 16 39 -47 -60 92 223 23 99 123 -74 -131 55 -86 -31 -26 16 -69 -163 -349 -33 -124 33 156 -3
3229cR9n9J8J23K6k80K0P5m5m7P1j63J47j4p5M4j42J36j47Q4R8O1j68K88q8R3
$$ -3 96 37 55 178 204 -76 -56 19 -26 -73 -2 -165 -18 -32 -107 -63 -205 -69 -216 -132 -34 27 -141 147 59 152
3255A52O7k49mlj03L56p5r3j35M3J6o5N1rJ52L1r2Jk19K44J38m5j16k44K35j7
$$ 152 219 -30 -34 -37 -140 216 141 48 -87 -44 -28 -93 -42 -51 101 132 40 41 -178 66 204 159 43 -201 34 17
3281A7j24k39N44k95K64k94K17mK0j04k47K23J3r3L6Q0j41J55j8kK7J08l79K21
$$ 17 -107 -346 198 -97 167 -127 90 86 106 2 -245 -22 -9 -102 -66 14 -127 28 10 8 35 143 -236 -15
3305a5l4J1P2j92K16n0o1Q1J38P7k28m1J54N5k83j4N4K0Kl6N4k04J52k0J47j71
$$ -15 -49 -38 34 -158 58 8 -53 28 166 243 15 -26 128 183 -100 -114 -60 -40 -38 -74 -20 -224 -72 -92 55 -116
3331a16R4J16j95J39K4q2N5K34k20k6M0K7K8j53K6J96j90R3j04j71J37L4oK4J52
$$ -116 -22 94 -101 38 62 -20 35 269 49 23 63 90 118 -35 -9 187 -3 90 -14 -185 -48 -14 -20 4 156
3356A56n3l40J37R2j55L31k54K55p0j63J05Q0p8j43po0K17r5K18j29k46L7J00
$$ 156 103 -237 -100 -8 -163 168 -86 169 99 -64 41 121 43 -100 -107 -167 50 -45 173 44 -202 -165 -65
3379f5n5L31j77o7J11k26L42l47K11j64p6jJ20L19j27p7j89P0m0L0J26l8J87j39
$$ -65 -120 211 34 -33 78 -148 194 -153 58 -106 -182 -183 -63 256 129 52 -137 -67 -107 -77 49 11 198 59
3403E9J05j90n0Pm7K3P9K15r6q0j7N9Q9l62J50J2M3KQ9k35J15J20j20k1j73K57
$$ 59 164 -26 -76 -69 -116 -93 -14 201 105 25 8 67 156 -206 -56 -44 -1 1 90 -145 -30 90 -30 -51 -224 33
3429C3j30K44k23L31j21l40J84K44l38J16m8R1R0k42J14j87R0N9N4m3N6R9o1n9
$$ 33 -97 147 -76 255 134 -206 -22 222 -116 0 -48 43 133 -109 5 -182 -92 -33 21 -22 34 133 72 13
3453A3J92k05oj1M1L4O4p0j55J61l7r8o0L12k7j75k8J98lr8q8m0J96p1r3r6J36
$$ 13 205 0 -6 -17 24 58 122 52 -103 58 21 -77 -137 175 148 -27 -55 143 140 42 -46 -86 110 39 -54 -150 -14
3480a4R0N2j11J4K2M8j5j1r2jl6n6K6J62m1k9j9r6J49j95K96j81L20k68n1N7O8
$$ -14 76 128 17 31 53 101 86 75 -17 -18 -54 -110 -84 78 37 8 -11 -107 42 -153 143 -38 282 14 -37 20 88
3507H8J04r3r0j55J84M6l2j30P0J69j40k11pJ90Q7n2k3P6j15J51J50l50n1J6M7
$$ 88 192 99 9 -146 38 84 52 -78 -8 161 21 -190 -197 -7 80 28 5 81 -34 117 267 -83 -134 -118 -71
3532g1K28k89K12O6o6k65K86j81J42M3j37J89j14J73j84m5J22k60J77L7m2j01
$$ -71 157 -132 80 146 80 -185 101 -80 62 105 -32 157 43 216 32 -13 109 -151 26 63 21 -80
3554h0n6J98n9J40L6O9l55n2R5M1K96j38j17k85K31l7p0m2K43k69K11J64Q8l49
$$ -80 -136 62 3 143 179 248 -107 -159 -64 -23 273 135 18 -267 -36 -73 -143 -185 58 -211 0 164 252 -97
3578i7p1J71J21j16K36q5k68l3j23P1K06m3j53M9j51M34j65n8j89J93K03n0j9
$$ -97 -168 3 124 8 244 159 -109 -142 -265 -194 12 -31 -184 -135 -286 148 -17 -75 -264 -71 132 82 63
3601F3j18n2O4K72j23n4j57j19J61J20k17J59K05k29m9l1J02R6M4M4n6k00k5o8
$$ 63 -55 -107 -43 229 106 52 -105 -224 -63 57 -160 -1 204 -25 -74 -105 -3 93 137 181 125 -75 -100 -168
3625a68n5L18j17J05K03j72j01J43m27L27j11J26j94K33j60j29J73Nq8j12K66
$$ -168 -223 95 -22 83 286 114 13 156 -271 56 -55 71 -123 110 -50 -179 -6 -1 -89 -201 65
3646F5j89J16n6J35j29J6o6J16PJ10k15J39J0j80m4m9K70l3n5j0J61r8R7q8k29
$$ 65 -124 -8 -64 71 -58 -42 -108 8 15 125 -90 49 59 -121 -165 -214 56 23 -32 -42 119 21 118 30 -199
3671a99K88j2j55j52L49j2k5k15J24l9J4r6Q2rlJ9p5K03j53J33k74R5K13j89O3
$$ -199 89 77 -78 -230 119 107 82 -133 -9 -48 -34 -130 -48 -57 -60 -41 -116 87 -66 67 -207 -112 101 -88 -25
3696b5J8j17J72Q2J81k49r5M3n8qLl8j39K57j75m8J40l3J81p6m6J26R3l60K55
$$ -25 -7 -124 48 130 311 62 -33 10 -48 -56 -53 -91 -230 27 -148 -196 -56 -89 92 16 -30 96 189 -171 84
3721H4k1M8j6p3j93L33k02J10l08Q5K00Ll3J0n3j24J02O4M3j06nj3j43L33j81
$$ 84 63 111 95 22 -171 162 -40 70 -238 -153 47 50 17 27 -26 -150 -48 16 59 -47 -52 -65 -208 125 -56
3746e6p4%O0J35l20N09k73n2J95k64K17J5n9j24J21k8j00K35j38J87qk9p1J09
$$ -56 -130 -130 -70 65 -255 254 -19 -71 124 -140 77 92 33 -91 30 2 -98 137 -1 186 178 149 78 187
3770A87l54L26o3k24K58K6q6j71J15J00o5o1R5j52O6N2j39Q7J90m06L95k55Q0
$$ 187 -167 159 96 -128 130 156 70 -101 14 114 49 -12 83 -69 -3 49 -90 -3 187 -219 176 -79 1
3793Aj01n5K38K25l31j11J80L4q8Qk00J58J29R3j44j66K57k56M5rL56j00r3J3
$$ 1 -100 -155 83 308 -23 -134 46 80 -8 0 -200 -42 87 180 36 -130 127 -129 -84 -93 263 163 70 83
3817H3rl9j0k10O0N8J2K59k11k4J8M6Q9j99O3j81J39J4J09j08J75j53K43k71n7
$$ 83 74 35 25 -185 -125 -67 -55 204 -7 -31 -13 33 122 -77 -14 -195 -56 -42 67 -41 134 -19 224 -47 -104
3842a04K8o8r8K67k05J9J52q1O5J4J32n5QJ6k20O5J31l6j66J71K03r6j31q7j53
$$ -104 -76 -144 -242 25 -180 -161 -9 -90 -25 -11 121 66 74 90 -130 -65 66 30 -136 35 238 142 11 -76 -229
3867b29R8L50l57R2j03K27O1j01O1j97K37P4j7k02J33k09P4N7j3n9j26L20j44
$$ -229 -131 219 -138 -46 -149 78 139 38 99 -98 139 213 196 -6 127 -82 -8 49 36 -23 -149 171 27
3890B7P0k71O3J2J33qj8P4k34L33p1k24o2K07r7J24k95O3j28L74j63j6K34j81
$$ 27 97 -174 -111 -99 34 26 8 82 -152 181 110 -114 -176 31 -66 58 -237 -174 -302 72 -91 -107 127 -54
3914e4P2j10K4J95r9p9j45K99Q2l57K04m5Q8j4j1m5N9j62l0J52K2j48j02J93j8
$$ -54 18 -92 -68 127 28 -51 -196 103 185 -172 32 -13 75 61 50 5 64 -98 -128 24 46 -102 -204 -11 -29
3939b9J28J79l49JR7k1j44L1ll4J78j80J74J01l02K42k71O2J81j48J5K68q6J2
$$ -29 99 278 -71 -70 27 6 -138 -107 -110 -144 34 -146 28 129 -173 69 -202 -140 41 -107 -92 176 90 102
3963A02j68R3n9J76M4k77J02j54K15j30J08j36L69k36n2P0r8J91k14O7q4m7M6
$$ 102 -66 27 -32 144 188 -89 13 -141 74 -56 52 -84 285 49 -3 67 -31 160 -54 13 -71 -118 -72
3986g2L13k23L6n6j95K07P2P8j83J60N2l11N9j9J04q1qL4j18J48J23j82nK46j63
$$ -72 241 18 54 -2 -197 10 82 160 -23 137 189 -122 -63 -82 22 -59 -67 -33 -151 -3 120 -62 -67 179 16
4011A6J53j75J55q5j12j56K29O2L9l8l22K52m0K31k96L4j50L07j62J93K4k5p4
$$ 16 169 -6 149 64 -48 -204 25 87 126 88 -234 18 -22 209 -87 -53 -203 104 -58 135 159 134 60
4034F0j80O0J53Jk11J14j31J73N4k26K06k82J97k37J90K22j20J54r0k30Q6J25
$$ 60 -120 -60 93 94 -117 -3 -134 39 93 -133 73 -209 -12 -249 -59 163 43 197 107 -123 -37 88
4056H8j56k3k3P0m9J22j5k6j08K94r2k50P5K47j33M4m7J1j45J15j35K43j08po4
$$ 88 -68 -91 -114 -44 -93 29 14 -12 -120 174 82 -168 -93 154 21 65 18 29 -116 -1 -136 107 -1 -8 -72
4081g2K11l06L37m36J22K31l3j33O5P8m2N6pq5k28M05j04j52k04M54k07m2L72
$$ -72 139 -167 170 -266 -144 87 54 -79 -14 64 22 78 71 -14 -242 163 59 -93 -297 157 -50 -92 280
4104B80k77pM9J24j07j32q7Q9l9K62j0j41l8J13J47j53j41oK62l73J06J78o0j30
$$ 280 3 -4 45 169 62 -70 -157 -68 -107 155 145 4 -34 79 226 73 -68 -74 188 -185 -79 99 39 -91
4128i1N6j03R4J12k69K81O9k56K81j23r0J69k86K21M0r2l6Kp4J24n1o7J9K16r0
$$ -91 -35 -138 -44 68 -201 80 149 -107 174 51 -39 130 -156 65 105 13 -23 -21 -95 29 -22 -89 -70 146 56
4153E6o0l7K4q0j5j8J63J56l43K71k66K82k04R5j86L5K33k48K24k18L01k73o3
$$ 56 -4 -41 -17 -97 -112 -130 33 189 -154 117 -149 133 -71 24 -162 -127 106 -142 82 -136 165 -108 -171
4176a71N3k49M52l05M70k89m0K05j51KJ17k09J30kJ21j84J40l4K59n30J82J38
$$ -171 -118 -367 85 -220 250 -39 -79 126 -25 -23 94 -115 15 13 134 -50 90 56 315 -215 -33 105
4198A05K2l00J92j28N6K88j93Kj99J69j54J93j32L07j77Mp9j67k4K91k29J07J7
$$ 105 127 -173 19 -109 -53 235 42 44 -155 14 -140 53 -79 228 51 55 -24 -191 -215 76 -153 -46 -29
4221b9j9o7K63j59k0K1K8P8k66J61N0J4j70L53l3O4k53k6K1P9N8j08K9j41J89
$$ -29 -48 -115 148 -11 -31 -10 18 96 -170 -9 41 55 -115 238 205 269 16 -10 11 90 148 40 69 -72 117
4246A17k19K13j01k69K88J91l09K20k20K29p2P4pk51J34N4J87k28O9j07L2RQ6
$$ 117 -102 111 10 -259 29 220 -89 131 -89 140 68 142 135 -116 18 72 259 31 100 -7 25 34 120
4269A20k50J48l9J14l6o3Q2j48O4J85j82J22l8k08J24K7q7o5%J07R4j02J0J53
$$ 120 -130 18 -21 93 57 -6 76 -72 -8 177 -5 117 79 -129 -5 22 -65 -130 -130 -23 71 -31 -21 132
4293A32k19p5L19K2l6j28J06p0j69J96o1Kp5R1k4k88N51o4o1j45N9p6J17j11j51
$$ 132 -87 -162 157 179 143 15 121 51 -118 78 17 19 -56 35 11 -277 274 210 149 4 63 -13 104 -7 -158
4318a58L02k33K48m11L32j3R4j00J07l30K05rr9Q6j16MJ12k49j20N33l35K20J9
$$ -158 144 -89 159 -252 80 67 161 61 168 -162 43 34 -65 21 -95 -91 21 -228 -348 185 -150 70 89
4341H9k20J42rO4j39kM0n1Q2l8J24l5j09J65j67k2J00J64m3k80P9J14o9j28l9
$$ 89 -131 11 2 66 -73 -75 -35 -86 -4 -42 82 47 -62 103 -64 -86 14 178 135 -145 -66 48 -21 -149 -188
4366a88J62m8P0O2qk58K0J00J63J5j78KR0j70RJ55kQ2j8p8N0J38k12Q4m1P9j00
$$ -188 -26 -74 -4 58 50 -208 -188 -88 75 90 -88 -86 4 -166 -157 -2 -4 78 60 -18 32 170 -42 42 1 80 -20
4393b0ro2R3j69K44l47K76j54L33l20J04R4k06J38r1J39j2P0Lr6m9Lq2L5Q2J0
$$ -20 -29 -91 2 -167 77 -270 6 -148 185 -135 -31 63 -143 -5 -96 43 31 101 104 8 -41 -38 -120 -85 -3 7
4419GN6k0j64R2JL5mj6O3j8on0nL14j64j50J61k32P2K30k00K9N5J2m8j29J34J83
$$ 7 63 43 -121 -29 -28 7 3 -13 50 32 26 -24 -29 285 121 -29 132 -100 -28 202 2 31 86 98 50 -79 55 238
4447B38k28r4l2M6P3J41k50K80N9k26o4k37L99Q9np5j93K34l45L04o9L8Po6j93
$$ 238 10 -84 -116 -70 3 144 -106 174 233 7 -57 -294 105 194 189 114 -79 155 -190 114 45 83 90 24 -169
4472a69K59l17J86k9J54Jk99K6oJ14L3L4l9J35j65J77n6M1k6j78J42K3M7J06k07
$$ -169 90 -227 -41 -70 84 85 -214 -188 -194 -80 -47 -13 -52 83 -82 95 39 80 54 -124 18 41 88 194 -13
4497a3j85L95j77m5O2J21pq1O6l84L45P1j66j62L3J23j62J08J65q7J1m9Q8L7j76
$$ -13 -198 197 20 -25 37 158 151 70 136 -248 97 168 2 -160 -127 -4 -166 -58 107 20 31 -18 70 107 -69
4522f9K73r0q1j38J06j68N1K22K15l85Q0Mj6j67K82m08K22P4k9j26J78j04J05
$$ -69 204 114 33 -105 1 -167 -116 106 321 -64 16 20 4 -163 119 -289 -67 7 -22 -148 30 -74 31
4545C1K39k62J05n6J05J38n80LK72j62L33n76M38K02k76L66k98k83K24K63m02
$$ 31 270 8 113 57 162 300 -280 -277 -5 -167 166 -410 28 230 -46 320 22 -261 -37 226 -176
4566a76L04j81o7K20q6k41j5N2O3K40j32j24lk4J40j42K85p8MJ70k04J83j85K45
$$ -176 128 -53 -120 100 14 -227 -242 -190 -127 113 -19 -143 -146 -170 -30 -172 113 35 39 209 5 188 3 248
4590B48k08j1n0J28j28N9N7k09J29m4PJ84q4j00n7O3J37Jk62M2m7J59N5j47K62
$$ 248 40 29 -21 107 -21 38 95 -114 15 -29 -22 162 78 -22 -79 -16 121 122 -140 -98 -145 14 69 -78 184
4615A84l25K26nk22K64j52p0j26K35k0K23j66L%r7p4K7J15oj21K69j7J50k96J24
$$ 184 -141 85 80 -142 122 -30 -100 -226 9 -11 212 46 49 49 -48 -122 -95 20 14 -107 162 145 295 -1 123
4640A23Mj42n7q0K86k04J44l8j2LK4l6L2j40J19J1j26kK73k76J75j38o4L31m21
$$ 123 127 -15 -72 -152 134 -70 74 36 24 27 51 15 47 -93 26 37 -89 -91 182 -94 81 -57 -121 210 -211
4665b11J60Q5p5J9j44K6J27m2j90K34J6KN2P6o9j76J98j80J35r3n2KR9j07q1J03
$$ -211 -51 34 -41 -22 -166 -140 -13 -55 -245 -11 5 7 59 135 66 -110 88 -92 43 -50 -102 -100 -1 -108 -189 -86
4691h6Kj03K39j00o4K60k97J48k1j6Q0m0K2O6j05J78j88j54J26p9P4Q8j40J65
$$ -86 -84 -187 52 -48 -112 148 -149 -1 -22 -38 42 2 24 90 -15 163 -25 -179 -53 -132 -58 30 -110 55
4715E5j48Q2K27j89j22o1L16j91M7O6L9j73Q8L4j88J87j24M0Rp4K98j24j8j19
$$ 55 -93 -11 216 27 -95 -156 160 -31 16 82 121 -52 36 70 -118 69 -55 -15 -6 -80 218 94 76 -43
4739d3j2J2j29M3R6M5J40j6l95J87o7L59k69J81r6K7j41J36j02m8P3J92J26l19
$$ -43 -55 -43 -172 -129 -33 12 152 136 -259 -72 -139 220 -49 132 36 63 -78 58 -44 -92 -19 173 299 -20
4763b0J05K3m2j8J43j86n4j21K70q3J24o3r4j31K16N1j23k2K54kk99K1J78k44
$$ -20 85 108 66 48 191 5 -49 -170 100 17 141 78 -16 -147 69 120 -3 -25 229 227 -72 -51 127 -117
4787a17LJ59J8m3j23K2k7J68j34JRk8R1jr9kJ42j57K29l65K95j9k35M07j92J09
$$ -117 -114 45 63 20 -103 -81 -108 60 -74 -73 -64 -92 -1 -2 -101 -103 39 -118 111 -254 41 22 -213 194 2 111
4813A11r7j96K02L0j73OR2p3J83k34J7J67M0k38J45L8m7krj16qK55k18R6J71k61
$$ 111 14 -182 20 50 -123 -117 -25 -98 85 -149 -132 35 75 -163 -18 20 -27 -29 -38 -154 -162 93 -125 -29 142 -119
4839a19L31m36K31K57j04j41J38mr1q8L3qk0J18j30R5j21N2j21K4J25j15Q8J45
$$ -119 212 -224 7 264 160 19 157 153 62 -26 7 -1 -21 97 -33 62 -59 -7 -128 -104 21 -94 -6 139
4863A39m2r2P4J12l51J16J60j76n0J04k07J14l6j80R2L39k9j81J21L9m7J64j03
$$ 139 97 5 79 191 -160 -44 116 -60 -110 -6 -213 -99 -135 -315 -223 116 87 -94 27 66 19 183 80
4886H0j50K80l9j02l4j5P9l1J5j2j03QR7q4M9p5L21k46j47R4j9J64n2N7k43K73
$$ 80 -70 210 171 69 35 20 99 68 83 71 -32 -24 73 -11 38 -37 284 38 -109 -15 -34 130 78 135 -108 165
4912A65j82K25k07n3L22l14N3J39k08j7J03r8j19K79l3j17J35O9p1R8l77J38P9
$$ 165 -17 208 1 -52 270 -44 9 148 -60 -77 26 -72 -191 88 55 -62 73 142 71 169 -208 -70 9
4935Ik8K2j53J4R7N2jK6J41k20j10K25k38O9R1j88L65j32O0k19QQ5R1pj11J36
$$ 9 -19 3 -150 -136 -39 13 12 38 179 -41 -151 74 -164 -95 -4 -192 173 41 101 -118 -110 -25 66 59 -52 84
4961H4o7P2k03q6L56n7j45Pk5PR6q6k4J55m9o8k47L98k05K95m17K00o5O7J74k24
$$ 84 17 89 -114 -200 156 99 -46 -39 -64 -57 39 -47 -71 84 35 -33 -280 118 -87 208 -209 -9 -74 -7 167 -57
4987e7k31J27J40M8J1j48R6O3J76k63m0J22N8j91P4o0O3m2R4K5R0k92M1J73j32
$$ -57 -288 -161 -21 27 38 -110 -14 49 225 -38 -78 44 102 -89 -15 -75 -12 -54 40 65 155 -137 -96 77 -55
5012e5N7pj49J84m4O3J20n8J13j25%k36O3J19J28k02J38l41K63k02M51k55j24
$$ -55 2 -5 -154 30 -14 49 169 111 224 99 99 -137 -74 45 173 -29 109 -232 31 -171 280 25 -99
5035i9M4K40j58M7j34K01n4k06J32m2O9j58J03J21p8N3nj52MK1L8J91j58J15k53
$$ -99 -55 185 27 74 -60 141 87 -119 13 -29 40 -118 -15 106 28 81 76 -76 -72 -51 -13 178 20 135 -118
5060a18q7J07p5K89q8J36j69J40j96K03j76J53k79O9j17J02M4J5q2JK70k69K62
$$ -118 -205 -98 -173 116 28 164 -5 135 -61 142 -34 119 -160 -91 -208 -106 -62 -47 -129 -128 142 -127 135
5083A35j9j43N4n5m4L9n9P1L9l3L8n8K07j36J11j10l9o6Q3m9P9m4p5l0O6J24k2
$$ 135 116 -27 27 -28 -72 -33 -92 -21 18 -15 23 -35 172 36 147 37 -2 -68 15 -34 45 1 -74 -104 -38 86 64
5110F4p8l9L1k18K81k76J19R5m3oOJ48j62J27j17K34j71J99l58K09P4K1O1k67
$$ 64 -14 -53 -22 -240 41 -235 -116 -21 -64 -70 -64 84 -78 49 -68 166 -5 194 -164 45 119 140 201 -66
5134f6o9J52k68K99J5k38K36K48m51p3L52j79p2L28k16O7n3M9r7Q1k2J06jJ07
$$ -66 -135 17 -251 48 63 -175 61 309 -142 -215 137 -42 -114 214 -2 65 12 61 -36 45 23 129 128 235
5158B35j48k00L33k35P6l8L1j05R9j04Oj2J18j36P3m6K7lK71j89o8L3R5j69Pj27
$$ 235 87 -113 220 -15 61 23 54 -51 48 -56 -50 -62 56 -80 -7 -53 -26 -29 242 53 -15 18 113 -56 -49 -176
5184a76K14p3J0K9M6K09j24m1k01J34N5k30oM22k01j70J67j42J24K3J15k62J25
$$ -176 38 -35 -25 4 50 259 135 94 -107 27 82 -148 -154 268 67 -103 64 -78 46 69 184 -78 47
5207D7r0O6J6j80L24l22J68j4N3l17L52k44r6L10j0j5k27M2J07m5J98l7j84K03
$$ 47 -43 23 39 -141 183 -139 29 15 68 -249 103 -141 -237 73 63 48 -179 -137 -30 -75 123 86 -98 105
5231A05j4On8n7p0J65p5n5J8N5K6j11P0nm6j3J6J33j08J02Nj59M2r9M4K41r9o8
$$ 105 91 97 39 -18 -88 77 2 -53 -35 20 46 -65 5 0 -46 -59 -43 90 -18 84 89 -70 -28 -127 -83 158 59 -9
5259iK25l61J15RJ4P8q3n5N1l7N3J26k14J84j80p7K62j67J07k29P4o7J31KJ13
$$ -9 216 -145 -30 -21 -7 71 -12 -67 -16 -53 0 126 -88 96 -84 -161 101 -66 41 -188 -114 -181 -50 -48 65
5284F5k3J22k2l61J81K08j14Rk06J82j4J23k91N8RK05k02J47m7J19j55j44M4J37
$$ 65 42 164 142 -219 -38 170 56 65 -141 41 27 150 -141 -83 -74 131 -71 76 29 148 -7 -151 -107 30
5308C0k3j03K25o4j1k3q5JQ9k93K34k3O4m5J4j32J47J5R6k10J92J11m84K77J69
$$ 30 7 -96 129 65 54 31 -54 -53 36 -257 -23 -46 18 -27 -13 -145 2 17 113 -97 95 206 -278 -1 168
5333A68k92O4n8J95J4j37O8j29j23K70j52Q1l2j0K3K21k98J57mj16J20j54N5Q4
$$ 168 -124 -60 -118 77 91 -46 22 -107 -230 40 -112 -31 -63 -73 -50 171 -127 30 26 -90 30 -124 -69 15
5357A5R4j26j6M3r0J28j97K27q1j72J21K6J52n6j62rK49l23K26n8J09l09J38K6
$$ 15 109 -17 -33 10 -80 48 -149 78 -3 -175 -54 -28 124 68 -94 -103 146 -177 49 -9 100 -209 -71 -45
5381d5J22Q3j73N8j4j12mL0j27K19m2k24L28j21j0n1J87j38K42k08J13n8o4P4
$$ -45 77 160 -13 45 31 -81 -85 -55 -182 37 -5 -229 99 -22 -32 -83 104 -34 208 0 113 55 -9 65
5405F5j7j73k4L13k11K46j87r7J09L1Nj03LR4j11l3Q8N6j35K30l52L6K26j35j2
$$ 65 48 -125 -149 164 -47 199 12 -85 24 55 60 -43 -40 54 -57 -90 -2 54 -81 149 -203 -167 59 -76 -88
5430h8J48P1l01K33q1m5j0J41Mj19q4p0Q0K05j20J95k10k62L59M9j99J31k6j04
$$ -88 60 131 -170 63 -18 -63 -73 68 72 -47 -131 -201 -121 84 -36 159 -51 -313 46 95 -104 27 1 -103
5454a03L4J63j83p0L51k85K07j64j67J18N7m7K23q7P9r7J51j82M4j52M4J2Nk2
$$ -103 -69 94 -89 -159 192 -93 114 -50 -217 -99 -42 -89 134 47 126 29 180 -2 42 -110 -66 -54 -49 -71
5478g1r3K00nOJ3j55K94j54j05J42m7K2p8M7J9K3r8j5J1k9o9K0J95K4P1K6j27
$$ -71 -164 36 31 37 50 -105 189 35 -70 72 25 47 -31 16 35 58 -40 -55 -44 -73 -142 -122 73 97 168 194 67
5505F7j3j52L63l41L9J6K0J5K2P1j16J11j20K0j06L3j38J52J30k10K14j1m1m9
$$ 67 54 -98 265 -76 -37 -21 -1 14 36 107 -9 102 -18 2 -104 -71 -209 -57 73 -137 77 66 25 -24
5529b4J78l86J34K89l32Q7m8L90l13k8K72j59j62J63l0n8M9Or6K47k38J38j57
$$ -24 154 -232 -98 191 -141 -54 -102 288 -25 -53 219 60 -102 61 31 -27 22 28 -68 179 -59 79 -78
5552g8L2J2O2j73M34j16j60L2l11M09l98K00K13j70l8J36p1J6q3j08J86k8l0K42
$$ -78 -46 -34 28 -145 289 173 13 45 -266 143 -255 -55 158 -12 -50 86 15 31 -52 -160 26 -2 -32 210
5576B10j65m7J7r9N9L9l5M1r0j2j0L8j51K11l9r9N6OJ83j99Q3PN5Q0l0P7l86L65
$$ 210 45 -2 15 -84 -25 14 -21 20 -70 -82 -92 -54 -205 6 -33 -132 -76 -70 113 -86 -3 4 59 139 109 186 -200 165
5604A65k81J46j4j94r7L50l5m7Q1q7Q6J32j26J42k93J68L2j69K25l67J27j84L70
$$ 165 -116 30 16 -178 -275 75 40 -7 74 -13 73 205 79 221 -72 96 128 -41 184 -183 -56 -240 130
5627A30P6o3m36L87j56R1j79J06J47j22J17N4q9O3k18jK47l13KO0J33P0r3k5k8
$$ 130 206 143 -293 94 -62 29 -150 -44 103 -19 98 152 63 126 -92 -93 154 -159 -157 -97 36 106 13 -12 -40
5652d0L03j44j99M6j0R7J14q0j36J55m1p8K84k61N2n8L8L0jR2j74J88j73K85k77
$$ -40 263 119 -80 -34 -44 53 167 87 -49 106 65 -13 271 10 62 4 42 72 71 163 -11 177 4 289 12
5677A2j4n8l8J87j99J94k22J55m4l02K36L0j13n3L52k06J33o8M8M4j19J35N0j13
$$ 12 -2 -60 -98 89 -110 84 -138 17 -27 -329 -93 -63 -176 -229 123 -83 50 -18 30 74 -45 90 140 27
5701B7O0j57K42j78j77J69oQ1Q1j14M8j6J8k37L56j69j01K50k75Q8K15k79K51
$$ 27 87 -70 172 -6 -183 -14 -20 61 142 28 76 60 78 -159 197 28 -73 177 -98 -10 205 -74 177
5724A77q0q7P4k47K8M0O6Ml3J20J11m24K80l8L1q9M6j90M1N9J8M2m8L01n4k0j29
$$ 177 97 10 84 -163 -135 -95 -29 -25 -58 62 173 -251 29 -9 22 -67 -21 -211 -170 -111 -93 -51 -99 202 148 128 -1
5751aj37J03J04j24o2J83j10L8l9J2p8J90O3j83m4M8K57j57K8Pj44j08J59n3K3
$$ -1 -138 -35 69 -55 -117 66 -44 -6 -45 -33 -111 79 142 -41 -85 -37 220 63 91 98 -46 -154 5 -48 -25
5776b5R2qj79J3J01L69n17R9Q2r7K7q9L63m39J17K1J52J1k76M8Q2J15J19r5k62
$$ -25 67 59 -120 -107 -6 363 -154 -55 27 -70 -43 -132 231 -208 -91 -70 82 93 -183 -135 -53 62 181 86 -176
5801a76Q8O6J3J01k96K03J0J83k06n0J11J58l81j7K33j39L5j52J83R0k9J04q6
$$ -176 -88 -22 -9 92 -204 -1 9 192 -14 -64 47 205 -176 -193 40 -99 -64 -216 -33 57 28 132 46
5824D6m9K3j67M3J18j72K93K7k54j3J14k36K80n2K37j66J28k93K39Pj58N8o6J52
$$ 46 -3 20 -147 -104 14 -158 135 162 -92 -105 9 -227 53 1 238 72 200 -93 146 153 -5 53 -13 139
5848A39m2k25M7N4R7k8J65j55P5q8q8j47L30m8k05Q1L00q0k66L6Q5J61o0q5k44
$$ 139 97 -128 -81 -27 70 42 207 52 127 39 -49 -196 134 86 -119 -38 262 182 -84 -48 37 198 138 53 -191
5873a91K00J26j03J30k49j4O8j2J13l06K30Rp8J18J6J80k60J63j18Q2k5j1n2L2
$$ -191 9 135 32 162 -87 -101 -33 -45 68 -238 -8 1 -77 41 57 237 -23 140 22 104 79 68 16 48
5897D8M0r7l8K43L0m96M28j97M6j47J96j56K73k57m1N9o5K41Q0j49k1P5j52K76
$$ 48 88 -9 -47 196 226 -270 158 -39 7 -140 56 -100 173 -84 -125 -66 -131 110 190 41 20 95 -57 219
5921B19k36k5n6K35o7j7j63K05k9k67K10L3j26k9J76n5O8j7p0O5j82K08kr7J67
$$ 219 -17 -42 -98 137 70 53 -110 95 66 -201 9 42 -84 -113 63 8 76 59 -11 54 -128 80 78 -19 148
5946A48q4n5l1l4J16Qr8N1r2P8k3J43o7N5j43j33J84pJ1j97K6J06J73j43Nj26
$$ 148 64 9 -22 -56 60 68 -30 21 -71 7 -16 127 60 115 -28 -161 23 16 27 -170 -144 -38 135 -8 -3 -129
5972a29K39J09m27K28m4l3n6j0j55N8J44q3J89J94k12p6O2q1J39k2P3k65K79k02
$$ -129 110 219 -208 20 -24 -57 -113 -123 -278 -220 -76 -159 30 224 12 -64 -2 -83 56 34 107 -158 121 -81
5996h1q7J33O8Jr8K06l05L06j31K0O8k03nQQ9P4O4j65Pm2J51l9J75m67K12j11
$$ -81 -168 -35 33 34 -64 142 -163 143 12 32 100 -103 -108 -100 -11 63 127 -38 -31 -73 78 39 214 -253 -41 -152
6022a52J04M6l8J13j35N6P8J36k20M3r4J31j44K77l16p8N2K12j40J99k96J13K01
$$ -152 -48 -2 -40 73 -62 -6 72 208 -12 31 -63 68 -76 201 -115 -193 -141 71 -69 130 -166 -53 148
6045A48k40J43o0P0j90K18K4l40j24M83n4p9K29k03nlL15k71j19r4K23j65K57
$$ 148 -92 51 -9 61 -129 89 113 -227 -351 132 78 -1 228 25 20 17 332 61 -58 -152 71 -94 163
6068A63k24r9J34N9J93j44k26N1R8N0j06J02j14m5J48j18J34K34k03j45kR9J2
$$ 163 -61 -160 -26 33 226 82 -144 -93 5 55 -51 51 -63 -108 40 -78 56 290 87 -58 -60 39 51
6091E1J48k56J60j23N5l0p6j18L03k23K45j19LM1r4o7J59p4J5j18O2j14L85k60
$$ 51 199 -57 103 -20 35 5 -71 -189 114 -109 136 17 20 61 -33 -100 59 -15 0 -118 -56 -170 215 -45
6115d5j47Q5J82L8lq2K25j96ON5q8K0j43OL6L5j16O8PK94k52k8q5rM2P3K30m15
$$ -45 -192 -107 75 113 110 28 253 57 63 118 30 50 -93 -87 -51 -16 -132 -64 -57 237 -15 -43 -128 -137 -95 -22 208 -207
6143b07K09o5j5l7K73J73o10L29j48n8K96j42l5J4J96Kl00J20L9J4M8k1m3o6J19
$$ -207 2 -63 -78 -115 158 331 -279 50 -98 -156 140 -2 -37 -23 173 175 -125 -5 34 48 96 75 32 -34 85
6168H5q6k36K39L0J28o47N43j29L2j39kJ30p7R0l0r2n2K43J66k37J07J1k43J3
$$ 85 -1 -237 2 32 160 -487 56 -73 -41 -180 -182 -52 -129 -39 -69 -161 -213 30 196 -41 66 77 -166 -153
6192a53K00j8Q5j89J35l02L74k92R3K0R5J5N2k52M3K8K14j14N4pj67K9M1j54P0
$$ -153 47 29 114 -75 60 -242 132 -160 -67 -47 48 63 115 -137 -94 -66 148 34 88 81 -86 -57 -16 -170 -100
6217a00P3J22n1P2M3j4j35Q0J15j48J54l03N4M0R3L4P2j23j55p3J56l5J30o9J38
$$ -100 -27 95 44 116 159 145 10 90 205 57 211 -92 -38 2 95 129 201 78 -77 -150 6 -29 101 32 170
6242A70o9O5j45j67J21J27k12K56k52M8J1K43j5k43J2J99l25K20l8n2O6r4Q9k86
$$ 170 101 166 21 -146 -25 102 -110 146 -106 -58 -47 196 181 -62 -50 149 -176 44 6 -46 20 -74 15 -271
6266b71P5j55M30j85K6J49l3r8J62j22K18n6l10L59j90Pj12P9N9q9j57R7J66j1
$$ -271 -196 -351 79 -106 -80 69 36 -62 100 -22 196 140 -170 189 -1 6 -106 -27 32 -57 -214 -117 49 38
6290C8q4j47J95m1Q6j15j07O9L52l16K34j99K80l56O6J3j09J70L5j9qk5j16J69
$$ 38 -46 -193 2 -39 47 -68 -175 -106 246 -70 164 -35 245 -111 -45 -32 -141 29 64 45 37 12 -104 65
6314F5j60l1P3J62r7mR2k9k7O4K8j46J38q9j33l6J22J52j95M4P0m6o0M1K5p8j22
$$ 65 -95 -126 -53 109 12 8 100 71 44 108 136 -10 128 39 -94 -130 -8 144 -51 -7 63 17 -43 -2 23 -55 -177
6341a77J22K27k58L7J93j66K1m3o6l7J98j04J41N5k16J47n4q2J63q6k07K28j31
$$ -177 -55 172 -86 -49 144 -22 -1 -44 -110 -147 51 -53 88 143 -73 74 20 -62 101 15 -192 36 -95
6364i5J52n6K8j3M4j23k0M4J19M9j47J28j16J6j09j89L19k8L8n8l9k5J13Q3j9
$$ -95 57 1 29 16 60 -63 -83 -39 80 129 -18 110 -6 10 -99 -288 31 3 41 -17 -56 -81 32 115 96
6389I6m02L61q7J03j37p7K27j07J1O3j87Q5J0m7O2o0M0K71l38oJ45j67J38M3j92
$$ 96 -306 55 -32 71 -66 -143 84 -23 -12 51 -136 -51 -41 -88 -26 -86 -46 225 -113 -119 26 -141 -3 40 -152
6414a52l0K04J19j47o4n9k7L77k70K41j46N3q6P9j02j02J64q0k26M12k36MQ5N6
$$ -152 -182 22 141 -6 -70 -129 -156 221 -49 192 46 99 13 92 -10 -112 52 -28 -254 158 -78 -74 11 67
6438F7Qj0o0K0J08j00j16L20l5k10P6k24K57j59J54Q8j43j6J29k25J38r9J94k43
$$ 67 75 65 5 25 133 33 -83 237 202 -8 68 -156 101 -58 96 184 41 25 154 -71 67 -32 162 -81
6462h1J76L4j08n8P5j37J58j72j60M44k58L11p7o9j50LJ15M8N6Q6o3k32L1j07
$$ -81 95 129 21 -37 38 -99 59 -113 -273 171 -87 224 147 78 -72 -69 46 94 150 236 173 -59 -28 -135
6486a35J63QJ10k16L04l11J04j48K8M5N0K07k75k7K72m39K22K24l60K58j47j98
$$ -135 28 36 146 -70 234 -77 27 -121 -93 -48 2 209 -66 -93 179 -260 -38 186 -174 84 -63 -261
6508b61K68J49j06l4J29j02l8j01J60p3q7o0O7J29k0N5m4k5L5j51M6R4r4N9J08
$$ -261 7 156 50 16 145 43 5 -96 64 -9 -96 -156 -89 40 20 75 31 6 41 -110 -64 30 -64 -5 103
6533A03j22P4M3j66J06r1R0J19k39J82j06N5J8k58L52q3k9n0p9J80q4q6n3J91
$$ 103 -19 55 98 -68 38 -53 37 156 -83 99 -7 48 66 -192 160 77 48 -2 -81 99 15 -71 -124 67
6557F7k64J85J42m14L08k06K5J28MN6K03r3k70L20k90J06J29n3j17J46q2o7P5
$$ 67 -197 -12 130 -284 24 -182 -157 -29 -25 31 234 141 -129 191 -99 7 136 83 -34 112 30 -37 38
6580C8R1o8p7j74K01k12K43l3k3m7L0L4qN5j52J30P6j23J77k89M8M1L3K2J4mm05
$$ 38 129 61 -16 -190 11 -201 42 9 -14 -61 -31 3 -5 50 -102 28 104 -19 158 -131 -83 -42 -9 13 27 23 -382
6607c82L90L36n19K48R2j02J13q0k8p1K17k14J8k69K45N1p0Q5k35Q6J80k11J97
$$ -382 8 344 -175 73 165 63 176 96 68 -3 214 0 18 -251 -6 45 -25 60 -175 -89 91 -120 77
6630G7mK9k79O6K26j13p5k0J68k07J78p9J38j42O7p2R3j5o6RM1k9M28m52j6P0
$$ 77 73 102 -177 -111 115 2 -73 -93 75 -132 46 -33 105 -37 30 -42 51 36 -30 -21 20 -9 419 -33 -49 21
6656B1j14J38j57J21K8J58j74M1j56q3K50Q6j74M0j5P2j82J0K54r5l8p2P9J8j31
$$ 21 -93 45 -112 9 37 195 21 62 -94 -177 73 159 -15 25 10 82 -100 -90 164 69 31 -41 38 56 -75
6681g5Q9Nj8K61j50j76n0J70m2J03j59j50R1J05L1O8j11K9p8P8J65l53J52j70
$$ -75 14 19 1 262 112 -64 -114 56 14 117 -42 -192 -101 4 35 103 -8 21 -57 21 186 -167 -15 -185
6705a85O4J85j05j09J92k15K95q8j44K37K2j1O4J0O9m04K08p7j7m4j0r4L01M8
$$ -185 -121 64 -41 -150 42 -173 122 34 -110 127 149 138 202 212 281 -123 85 8 -9 -53 -63 -157 144 192
6729A92j75J78m4r5n7o7J78j23K9k32K10n2J70j53m0K31q8j11K41k17K01j24j5
$$ 192 17 195 151 56 -1 -68 110 -13 16 -216 -6 -58 112 -41 -81 150 62 -49 192 -25 176 52 37
6752C7j25Q7j1QM4j92K2j01L62k67K06k23K84k05J18Rj59J84M8j39m5K15r9l7
$$ 37 -88 -1 -12 -4 40 -152 -130 -231 131 -136 70 -153 131 -74 44 53 -106 78 126 -13 -58 157 58 21
6776B1q3M3Q7R4k1j31N2r1J90k34J43k10L73j23k03J76j08J40l6k52R9N1J51p7
$$ 21 -62 -19 68 162 141 10 62 -29 161 -73 70 -140 233 110 -93 83 -25 115 79 -173 -74 -23 128 51
6800E1J7j84j0J62q9J22j47M1J19N0q4j1K25l19J18n1l0J8KK57k21j22J10Jk07
$$ 51 68 -116 -126 36 -53 69 -78 -37 82 132 48 37 262 -57 61 10 -20 -2 0 257 36 -86 24 25 -182
6825a82K74O4N1l9k87J43J24j55k1L7K49j58k0j08l1j06R6q4J73L2J5p3N5k32
$$ -182 92 156 207 168 -119 24 148 -7 -28 9 258 100 80 -28 -59 -165 -69 -153 20 52 67 -6 49 -183
6849a83J63R2k80R1N0Q0r6j32J49J2J2O1j35J77J58k00J4O8K16l69K0l2L6j62
$$ -183 -20 72 -208 -117 -67 13 -83 -215 -66 -54 -42 19 -116 61 219 19 33 101 317 -52 -32 -64 -28 -190
6873a90L44L1j82J69k30pj1J39k47K08N6k9j30J16J05L9l06K55L2k33J5J04K9
$$ -190 154 185 3 172 -58 -65 -76 63 -184 24 80 51 -79 37 142 181 -125 130 162 -71 -56 48 77
6896G7j15L50k74Lr2j60J93J78l03J16k8K5K6J97l16Q1q5M5J03j21j46J64oJ29
$$ 77 -38 312 38 41 -51 -211 -18 160 -143 -27 -55 -30 -4 193 -123 -42 -127 -82 21 -100 -246 -82 -88 41
6920D1j96J03J37k35K81j72J2J0J23l90K61M9O3l9J40q7j40O5r4NK8O8l40M03
$$ 41 -155 -52 85 -150 131 -41 -29 -19 104 -286 -25 24 87 48 188 101 -39 26 -68 -63 -35 33 -307 96
6944I6J02k89K68l75L60j77j24K51n2j33R2j04j16J56KM7j97M36k19j66m6J53
$$ 96 198 -91 177 -198 162 -15 -139 112 60 -73 19 -85 -201 -45 -43 4 -193 243 24 -142 -188 -35
6966c5K8k40J17J57J41l87J31J03M3j6r9K29l3N6k81L14j51k25J79n5j2m0K18
$$ -35 -7 -247 -130 27 168 -219 -88 15 58 42 -57 172 139 195 -86 228 77 -148 31 -24 -36 -76 142
6989A42k29L5M1J8j8j08K51k89M59n04r8M30j34j25J09JJ70j68N9k1J01L8j88
$$ 142 -87 -52 -11 7 -11 -119 132 -157 302 -202 -300 130 -4 -129 -20 -19 151 -17 42 21 122 160 -28
7012b8N9J06O0j61j51K59j92K97k36J04J19k62J48k11N9J5MR6Jj46K16p1j35J85
$$ -28 31 137 197 36 -115 144 -48 249 13 117 236 -26 122 -89 -30 -15 -11 85 86 -60 156 85 -50 135
7036A35j14q4MN5L3K3M2l2m7n7J11r4j27L62j54j33M3K62j34l5j67J12N0j18o5
$$ 135 21 -63 -59 -4 29 52 94 62 15 -42 69 -25 -152 210 56 -77 -34 228 94 59 -108 4 54 -64 -129
7061a29J14q3l8J15P9l2r0N0q0J34j28L33l79P2Q1R7k49K44N3j49K50l21l8l1
$$ -129 -15 -98 -136 -21 58 26 -64 -14 -94 40 -88 245 -134 -62 19 116 -133 111 164 15 265 -56 -94 -125
7085a25J01n3L00l89O2Q2J2M1M4R6k00j76Q9J35M9k7J03k76J94k32K44L3k61J4
$$ -125 -24 -77 223 -166 -104 -22 -10 31 75 171 -29 -205 -116 19 68 41 144 -132 62 -170 74 107 -154 -140
7109a40J12q7K63k48K25k05J00J34l37J2K44p4K68j56j30j59J51j4j05m7L33j97
$$ -140 -28 -115 148 -100 125 -80 20 154 -183 -171 73 -1 267 111 -19 -178 -27 -41 -146 -193 140 -57
7131e7L4j14K51j98j04J78k5j08O4O7p5J82j40R1lm7O1J38q1k0k76J48P8K9oL3
$$ -57 -23 -137 114 -84 -188 -10 -35 -143 -79 -12 -87 95 -45 46 43 -4 57 195 114 94 -182 -34 44 73 67 100
7157A00j49oPm3L3pJ40O6k98J47J7R9j29J05j16J63N3j72R0q5P4l67K36rK06j64
$$ 100 -49 -55 -48 -91 -58 -65 75 141 -157 -10 7 106 -23 82 -34 129 182 10 100 15 89 -278 -42 -51 155 -9
7183ip0J85k59L46k41mN3Pj6j1K06j11j88J48l2k5qnk70L48k44K26j3q9j9P0J6
$$ -9 -79 106 -153 193 -48 -52 1 8 -8 -19 187 76 -112 36 4 -21 -29 -34 -304 44 -200 26 13 -76 -95 -25 -9
7210iQ9j37J91o4q4J9j25K89j91r3O3J3J3J82q7o4M7R0k40N0J18r6q6J9K02l7
$$ -9 80 -57 134 70 -14 5 -120 169 -22 -115 -52 -39 -26 156 69 5 52 142 -98 -48 70 -26 -112 -93 109 72
7236G2L1r3mJ6J0J40k29K28q9k19K20j10ql9P6j75j2J14K92k06k5p1J00M5j45
$$ 72 103 10 6 22 32 172 -57 171 82 -137 83 -27 -35 -74 2 -173 -185 -71 221 15 -10 -81 19 64 -81
7261h1m8J12Q0J08k0o8k9p9K0nJ00r0m7J32j17J6K9n3J02j59J19j09k3p8K61J19
$$ -81 -129 -17 63 171 151 83 54 -25 -5 -10 90 0 -47 85 -32 -16 13 -40 62 -97 22 -87 -110 -188 73 192
7287A92k67J06k6rp4J46r5K48k88J75n0j05J1L2J90j15O0j80O4jq8Q3K9J7J60
$$ 192 -75 31 5 -4 -78 68 -27 221 -67 108 58 -47 -36 -4 186 71 131 -49 15 14 -74 9 38 55 215
7312B15l03J98j21R5J1J77k00q0j17L03j99P9Jj95K07m4J0K01k81nl3J41rJ42
$$ 215 -88 110 -11 84 95 272 72 -8 -125 178 -21 58 59 -136 71 27 37 238 -43 -48 -81 60 51 193
7336A93l60r7J14J55J4j84Q4J56j2J9Pj75K33p8o0j15K94r1j21J42J6%m6j53N
$$ 193 -167 -264 -150 5 19 -165 -81 75 63 82 89 -86 147 69 9 -106 188 97 -24 118 134 134 88 -65 -60
7361f0J12P1k66J56n0K6J2n7PP1j38J78L1k40J73j11J97j53L5O4n3J24j42J25
$$ -60 52 123 -143 13 -37 -11 1 -56 -49 22 -116 62 93 -147 26 -85 112 -41 -6 58 5 129 -13 112
7385A12j75J27k14n7J38j15J66J64j5K5r8j37J41R8p9mN4k79O2P2LL9j11K06J6
$$ 112 -63 64 -150 -207 -69 -184 -18 146 131 156 58 -79 62 160 81 77 131 -148 -86 -14 -11 28 -83 123 139
7410A39j46J33j96K75k28j76K87k6J21l48L23k50O0J21N9o6j88Q9J63j77J57q
$$ 139 -7 126 -70 205 -23 -199 88 62 183 -165 158 -92 -32 89 148 82 -106 -17 146 -31 126 118
7432A18j28k0j35L05o5P1J1k0p4k22R7K2J32J65l00M7K99l78k9K8n0J21k18O9
$$ 118 -10 -30 -165 140 75 146 157 137 63 -159 -62 -40 92 257 -43 4 303 -75 -104 -76 -126 -5 -223 -154
7456a54J31rP7k58R4K23r1p1J23j22J05o4Ql17M58k8M9l06K59j26l4J35k37O4
$$ -154 -23 -32 45 -213 -119 104 13 -58 65 -57 48 -16 -8 -325 133 105 154 -152 107 -19 -53 82 -155 -91
7480i1P0j50J65K03k70JNK03k37n8L22j49j8Jq7R7j61Q8j15L33o6m3j20J67M5
$$ -91 -21 -171 -6 197 -73 -72 -67 136 -101 -159 163 14 -4 -3 -90 7 -154 -66 -181 152 86 43 -77 90 135
7505A35j05k2O6m93L82J4J01k22P8q0rL59j59l66J99J9J48l81L11j13J45L2k28
$$ 135 30 8 74 -419 -37 -23 78 -144 -66 -146 -155 204 45 -321 -122 -103 45 -336 -25 -138 7 39 -189
7528a89K81R3n5k14K05j01n5O7j7k03K04j36K37k16J65k7R7j12N6q4j69Q0J27
$$ -189 92 185 130 -84 121 20 -35 32 15 -188 16 -120 117 -99 66 39 136 24 80 -4 -173 -93 34
7551C4K10k19K00j00j98R4ON3j08M3p8J06k35K04L6j5j26K4m3Q5j48N2R9Q3k8
$$ 34 244 25 225 125 -73 21 27 80 -28 15 -63 43 -192 12 48 33 -93 -69 -112 -27 -175 -123 -24 59 31
7576C1k5J19l09KL7J79J4j00j4J52L6q2m6K08l25q7K69r3P8k34P1K53j16J6J15
$$ 31 6 125 -184 -182 -145 34 48 -52 -66 86 122 40 -6 202 -123 -210 59 -34 44 -190 -119 134 18 34 149
7601A49l26J73O9L1j36kJ40R6k62R3L7m5j15J87RO0L5o7k28k2J13J41j23J12p8
$$ 149 -177 -4 65 96 -40 -42 98 194 -68 25 62 17 -98 89 98 158 193 126 -102 -124 -11 130 7 119 41
7626D1j16j22K3J15K19j05j2k58K07J21j11j65Q4J3K87m18J32J48N2r1j68J53
$$ 41 -75 -197 -174 -59 160 55 43 -215 -8 113 2 -163 -79 -66 221 -197 -65 83 135 44 -124 29
7648B9j86K38j69O9p0K41j66j70P3O8J16j39Nj02J76j56N2pp2K76k13K12k09K25
$$ 29 -157 81 -88 -19 -89 152 -14 -184 -111 -43 73 -66 -61 -163 13 -143 -91 -98 -170 106 -107 105 -104 121
7672A21mm13L06n4L2J0K7p8q5J00J63k70J52p5J44j13j35J59P3M8r3J52j80J21
$$ 121 117 -296 10 -44 -12 -2 25 -53 -138 -38 125 -145 7 -68 76 -37 -172 -13 60 108 15 167 -13 108
7696A08o9p8J23j72K03rk12J90k18K96k74R1j9J46j98L5j0Q4J07N8k96J7J57P9
$$ 108 39 -39 84 -88 115 106 -106 84 -134 162 -112 -21 -40 106 -92 -57 -67 17 124 182 -114 -97 60 139
7720A39o6J50l06J3o1J83p1m2O6L3j31j12K33o6R8J41k82j2J13J72p5q9P1j84
$$ 139 73 223 -83 -70 -131 52 -19 -61 5 38 -93 -205 28 -38 60 201 -81 -93 20 192 117 28 99 -85
7744h5J92M0l26J50J17j70r3J13J21RM9l29K36J02k32J45j07nj50J51J67p7r1
$$ -85 107 147 -179 -29 88 -82 -175 -62 59 68 117 -212 24 126 -106 39 -68 -73 -223 -72 95 18 -73
7767g3J26j07L4j00N1J08K0n3NrQ7J54l79J41k11K49j99L43k17J59Q3j38r6j72
$$ -73 53 -54 -20 -120 -69 39 59 6 11 2 89 243 -136 5 -206 43 -156 187 -30 129 212 74 -22 -194
7791a94K19J44k17J13J0j05q8K6J89j50Q4m0m4m3K26k72N3J43j24o6K10J03k03
$$ -194 25 169 -48 65 75 -30 -118 -92 97 -53 31 -9 -53 -96 130 -142 -89 54 -70 -136 74 177 -26
7814b6J02j18R6r6Q7n4jR3k1r0R9K8J67j17k21L1Q1jo1K5j92L15k39J78j30N0
$$ -26 76 -42 54 -42 45 -9 -10 83 62 -28 71 99 266 149 -72 -41 40 39 -22 3 -189 126 -113 65 -65 -15
7840a5QK51k76k41J11J40Q7p4L0m0N5j24J47L1N2j24mm8o0J87J11O9l50J98r7
$$ -15 -7 244 -32 -273 -162 -22 65 -9 21 -19 36 -88 59 90 142 18 14 -34 -94 93 204 273 -77 121 24
7865B4P9j98j24K37P3j90J39o7J69k60L8p7J61JJo0J9K4k25J94J77l80K04K93
$$ 24 103 -95 -219 18 91 -99 40 -27 142 -118 -80 -157 4 5 6 -54 -35 -11 -236 -42 135 -245 -41 252
7889B52l41R1k8j75J81L2P1p4j36M5K34k30j01J38j6J25K8p7K33l70m3J63m8P8
$$ 252 -89 2 -26 -201 -20 12 83 9 -127 -82 152 -78 -179 -41 -57 68 96 19 252 -118 -161 2 -46 32
7913C2j0R2k87J92n7M9L8M6k32o8J58j5J6K87k70j14J93J72l42O2n5K87l41M34
$$ 32 22 114 -173 19 -38 11 49 95 -137 -205 -47 -62 -46 241 -29 -143 50 222 -120 -58 -113 174 -167 267
7937B67j96j05K42n4l12J31J47j11K5j44P1J92N3j96j0Q2K7p3R3L9l10K71l49
$$ 267 71 -34 208 154 -158 -27 120 9 34 -110 -39 153 206 10 0 82 109 36 129 168 -142 129 -220
7960b20K68j96n4K10N9L0j02M0p6J97k40R4M01l22j90Q0Nn1K12n1n1k2j74L4L63
$$ -220 48 -148 -202 8 67 97 -5 35 -41 156 -84 10 411 89 -101 -21 -16 -67 145 94 43 21 -153 -119 244
7985B44k43m3J9q3K36n3j77J15J06j2k19K6K24k50J29J80j46j86P2L4j8l5k20
$$ 244 1 -42 -23 -106 130 77 -100 15 121 109 -110 -84 140 -110 19 199 53 -133 -61 -27 -45 -80 -300
8008c00K80m0j6J05j17K40k52j34M64k35P1r7MK4j37K66k3n0JN7q9O7j02n6K6
$$ -300 -20 -60 -76 29 -88 152 -100 -234 230 -5 66 -31 -27 -3 -140 126 103 53 54 111 22 89 -13 -69 -43
8033d3J01n7r3J77L1j00Rnj39L03j67N0j02N6M4m88M10k9j03J24ml5k6J16k23
$$ -43 58 1 -92 85 116 16 25 20 -119 184 17 67 -35 21 65 -423 -13 -42 -145 -21 -25 -60 -86 30 -193
8058a93K40K00k91o3J11k3l6N9o7O3j46J00M3NJ19j5j69J43Jj53J68J1o3j75j7
$$ -193 47 247 -44 -107 4 -19 -55 4 -63 0 -146 -46 -3 2 121 106 -63 80 81 -72 96 107 44 -131 -148
8083a48L88m75L85j66%k00K80No6K21j97J86j67j83m5L16j45OJ7J8k6l5NJ56k0
$$ -148 240 -235 150 -16 -16 -216 64 69 3 224 27 213 46 -137 -182 134 -11 -5 12 30 4 -31 -26 130 110
8108A10j2L7j15l39K00k9O8J54Q6j97j8J27k30J39J02LJ51k86r5J72m30M84l5
$$ 110 98 135 20 -319 -119 -148 -80 74 160 -37 -55 72 -158 -19 83 86 237 -49 -144 28 -402 82 47
8131D7l23K16J40j56K31j27k68K59K42l21K99j67j71J13J98r4j94J14J0j22j3
$$ 47 -276 -60 80 -76 155 28 -240 19 261 -60 239 72 -99 14 212 118 -76 38 48 -74 -87
8152h7J36N0m1n6l8J75k29j1N0K23j21l7n8J9k5J03j00J47n6j62J37Q4M0j71L9
$$ -87 49 99 58 2 -36 139 -90 -101 -51 172 51 14 -44 -25 -50 53 -47 100 44 -118 19 103 143 -28 11
8177A1j51J00J29J42k26j92m0K37K63l00O1kJ17j24
$$ 11 -140 -40 89 231 5 -187 -227 10 273 -27 34 32 149 25
8191B5
$$ Imaginary data points
##PAGE= N=2
##DATA TABLE= (X++(I..I)), XYDATA
0@%%%%%%%%%%qJ6j6K4l2L3m1N6p2Q8j04J20j39J63j92K24k64L07l50M03m64N30
$$ 0 0 0 0 0 0 0 0 0 0 0 -8 8 -8 16 -16 17 -24 32 -40 48 -56 64 -75 88 -104 120 -144 163 -187 216 -248 282
32B82o03O84p73Q69r75J094j224J368j524J692j878K082k305K548k810L098l416
$$ 282 -321 363 -410 459 -516 578 -646 722 -802 890 -988 1094 -1211 1337 -1473 1625 -1791
49a791L765m146M567n035N554o136O789p528Q378r361J0514j1892J3570j5669
$$ -1791 1974 -2172 2395 -2640 2914 -3222 3567 -3961 4417 -4944 5570 -6322 7248 -8421
63h421J8382k2038K7257l5371M9803q3058K97395O4736o33143J16473L50458J4736
$$ -8421 9961 -12077 15180 -20191 29612 -53446 243949 308685 -324458 -207985 142473 157209
75A57209k12918R388J9252J6303O9436M0103j42011p4485R3626J25161k2787j16623
$$ 157209 -55709 -46321 -27069 -10766 58670 98773 -43238 -117723 -24097 101064 78277 -38346
87c8346o3097J23455J06584j00463j40496P3374J25577k9977q5432J5481R508
$$ -38346 -101443 22012 128596 28133 -112363 -38989 86588 56611 -28821 -13340 -3832
98c832k6961N0244N6727q8012p5960Q5974P6993p4847n9341N9322L5818l2740
$$ -3832 -30793 19451 76178 -11834 -87794 -1820 75173 326 -59015 307 36125 3385
110C385J9592J5816p8892k6440J02795L8759q7449l8569O9919L7560n2211m8310
$$ 3385 22977 38793 -40099 -66539 36256 75015 -12434 -51003 18916 56476 4265 -44045
122d4045Q115L4370K9733n766k9806m921P620R62J8824K118m4684m576P5242K6046
$$ -44045 -35930 -1560 28173 22407 -7399 -12320 -4700 -3738 15086 17204 -27480 -32056 43186 69232
136F9232r0523m8522Q5292N0448p2489l9542N2033K3883l2279j3660J0574j712
$$ 69232 -21291 -69813 15479 65927 -6562 -46104 5929 29812 -2467 -16127 -5553 -7265
148g265M168K3006r658l7490N702L8575N077k2307r772J4092J8647j0987k8957
$$ -7265 -3097 19909 10251 -27239 -21537 17038 22115 -192 -9964 4128 22775 11788 -17169
161a7169j779K6804R359k0369n326K2335m746l0398L277K1486m749o030J5547
$$ -17169 -18948 7856 17215 -3154 -8480 13855 9109 -21289 -18012 3474 -1275 -7305 8242
174H242O361k0507o328K1034k269k0806J6250K0883k0095j4626J8692N509k2222
$$ 8242 14603 -5904 -12232 8802 6533 -14273 1977 22860 2765 -11861 6831 12340 -9882
187i882o046K0519M148j5001j716M751k8M502k040m983Q548K289r479L559R457
$$ -9882 -15928 4591 8739 -6262 -7978 -3227 -3255 1247 -793 -5776 2772 5061 -4418 -859 8598
202H598p639o209J6529O845k8003j0224K9752M191k9788J371K4844j527j7175
$$ 8598 959 -5250 11279 18124 -9879 -20103 9649 13840 -15948 -14577 10267 8740 -8435
215h435R6Q708p567l108J6936M032j5029R67J2564j359j1699k988J1403N134j0091
$$ -8435 -8339 369 -7198 -10306 6630 10662 -4367 -3400 9164 7805 -3894 -6882 4521 9655 -436
230d36l861O669L38p343n433O860P353r535n575J2730M922r657k425P263K650
$$ -436 -4297 2372 2710 -4633 -10066 -3206 4147 -5388 -10963 1767 6689 -2968 -5393 1870 4520
245D520m584K700M315j0944j721J9080j342k3069r06J8858J739j7867m507J4568
$$ 4520 -64 2636 6951 -3993 -5714 13366 12024 -11045 -11951 6907 8646 -9221 -13728 840
259H40L726p838N40j05j755M534K656k61k056j531O005N426q212q059M283Q364
$$ 840 4566 -3272 -2732 -2837 -4592 -58 2598 2337 281 -1250 4755 10181 1969 -6090 -1807 6557
275F557k914j1079L374R100p235n445O670l06m571K042N758R36o055J522P936
$$ 6557 3643 -7436 -4062 5038 -2197 -7642 -972 -1278 -5849 -3807 1951 2887 -3168 -1646 6290
290F290k638n464L416K947k316k973J280M217n355o118N910K639o639k014L922
$$ 6290 3652 -1812 1604 4551 2235 -738 542 4759 -596 -6714 -804 1835 -4804 -6818 -2896
305b896L972j393m204L733L438l350R98L226r07j522N60L782o71q560P99Q260
$$ -2896 1076 -317 -4521 -788 2650 -700 298 3524 2617 1095 1655 5437 4766 -3794 -2995 5265
321E265m445p092K203M791l92n238L60M568j930p25L872q42k17K278N44L24j780
$$ 5265 820 -6272 -4069 722 330 -4908 -4548 20 -1910 -2635 1237 395 178 2456 3000 3324 1544
338A544j277L151j124l176J843n43j522r80j214J677m38l296K586K817k50j10
$$ 1544 267 3418 2294 -882 961 418 -1104 -2084 -3298 -1621 -2059 -5355 -2769 48 -202 -312
354c12j148K193L427l305o85L535j519j346J895p8l210k541K778K392n731j337
$$ -312 -1460 733 4160 855 170 3705 2186 840 2735 2657 -553 -3094 -316 2076 -3655 -4992
370d992M238j135p68K075k283P31L444j51p65Q78J293l94r23L499j069o986K849
$$ -4992 -754 -1889 -2657 -582 -2865 -2134 1310 1159 394 1272 2565 2171 1248 4747 3678 -3308 -459
387d59M704n755k449K891m33j185J947J50m670j004Q717K230p636J929N441k511
$$ -459 4245 -1510 -3959 -1068 -1501 -2686 -739 -589 -5259 -6263 2454 4684 -2952 -1023 4418 1907
403A907m96K216k794k912L825N449n320p926L714L554l935P98l98l624M777N407
$$ 1907 1411 3627 833 -2079 1746 7195 1875 -6051 -2337 1217 -2718 -1920 -2318 -5942 -1165 4242
419D242n929n563N845P544k954l749L985j910m412Q722J260j1205k7R525j612
$$ 4242 -1687 -7250 -1405 6139 3185 -564 3421 1511 -2901 5821 7081 -4124 -4151 5374 3762
434C762p834r61J819j091L419O545p712p105J0835L412r898K335P543k228j131
$$ 3762 -4072 -5033 -3214 -4305 -886 5659 -2053 -9158 1677 5089 -4809 -2474 5069 2841 1710
449A710N360l472j0806L827J2607o080r863P158K672o863J321R6o333M600J1938
$$ 1710 7070 3598 -7208 -3381 9226 3146 -6717 441 3113 -3750 -2429 -2333 -8666 -4066 7872
464G872k277j2173J780R625n006k543J0053j639q683N948M496j0505n100R799
$$ 7872 5595 -6578 -4798 4827 -179 -2722 7331 5692 -2991 2957 7453 -3052 -8152 1647
478A647N094q501k341N323l639l449M597k406j373J0953K136j0550k752P231j02
$$ 1647 6741 -1760 -4101 1222 -2417 -5866 -1269 -3675 -5048 5905 8041 -2509 -5261 1970 1868
493A868m664P478O599j0711m993Q690m623r375Q589P978o355o137M542K240o511
$$ 1868 -2796 4682 11281 570 -4423 4267 -356 -9731 -1142 6836 481 -5656 -1114 1126 -5385
508e385o88M861L62N399O352j0173r177P930O203m695o70O686j718r500J700M874
$$ -5385 -6073 -1212 -850 4549 10901 728 -8449 -519 5684 989 319 7005 5287 -4213 -2513 2361
524B361r239j747J4410J794j1491k882N292N49j712K130K001n02P291J681j5500
$$ 2361 -6878 -8625 5785 7579 -3912 -6794 -1502 -953 -2665 -535 1466 964 8255 9936 -5564
539e564n428J3560M582m444K618j273j1401k113J3244O38j5615L243J8508k920
$$ -5564 -10992 2568 7150 2706 5324 4051 -7350 -9463 3781 4419 -11196 -7953 10555 7635
553G635j3209q73J390K480Q003K856q267j934R753j158j4746J006J1078r33J828
$$ 7635 -5574 -6447 -5057 -2577 5426 8282 15 -1919 7834 6676 -8070 -7064 4014 3081 4909
568D909M725j5474j4068J5859J7334j2107j4387J2066J1136r040l664M99o229
$$ 4909 9634 -5840 -19908 -4049 13285 1178 -13209 -1143 9993 953 -2711 -2212 -8441
581h441Q031J7032p658j6515N945Q609r622m650J1739p15r114R988L430k2454
$$ -8441 -410 16622 8964 -7551 -1606 7003 -2619 -7269 4470 3755 -5359 4629 8059 -14395
595a4395l362K3805M602j3994M00P534n313k073P175n160p567J5218Q849j5886
$$ -14395 -17757 6048 10650 -3344 -2944 4590 -723 -2796 4379 -781 -8348 6870 15719 -167
609a67n217P150o097l031J3904K053j5924o8J4295p650j4431J2713J1459q981
$$ -167 -5384 1766 -4331 -7362 6542 8595 -7329 -7397 6898 -752 -15183 -2470 8989 8
623HN83O363r766m751J2806K404j2718K549J3869n859j1562M919J72q365J0069
$$ 8 591 6954 -2812 -7563 5243 7647 -5071 -2522 11347 5488 -6074 -1155 -983 -9348 721
638G21J1009j2643j0011R572M279r180J436J1257k346m931O278l015r896P631
$$ 721 11730 -913 -10924 -1352 2927 -6253 -4817 6440 4094 -837 5441 2426 -7470 161
652A61Q185q954l394J0159n55j1080N72O510n879j386J2236j761j3197L851P608
$$ 161 8346 -608 -4002 6157 5602 -5478 -4906 1604 -4275 -5661 6575 4814 -8383 -4532 3076
667C076n541j409Q855J552p163O20M846n857l048P741j62o101L424K175o188j759
$$ 3076 -2465 -3874 4981 6533 -630 -10 4836 -1021 -4069 3672 3510 -2591 833 3008 -3180 -4939
683d939L942j68k253M435L606p021l686P049Q19l652N023K817n939q79M330p27
$$ -4939 -997 -1165 -3418 1017 4623 -2398 -6084 965 1784 -1868 3155 5972 33 -846 3484 2757
699B757o697J925O698l482m881L958p98m474L390K545l084r6N004L78o480k11
$$ 2757 -3940 -2015 4683 1201 -3680 278 -520 -4994 -1604 941 -2143 -2239 2765 3143 -3337 -3548
715c548O985n22k138L152k207m139L951J835n131k107M833J135n423K98L873l835
$$ -3548 3437 2915 777 3929 1722 -2417 1534 3369 -1762 -3869 964 2099 -3324 -3026 847 -2988
731b988j137O630r67m915M135L228l794k720M592K032l957P45K940m330k373M426
$$ -2988 -4125 2505 1538 -3377 758 3986 192 -2528 2064 4096 139 884 3824 -506 -2879 1547
747A547j475k740J850O45k186M15K322r91k975K941M272l775q74L737j288j791
$$ 1547 72 -2668 -818 -173 -2359 -1944 378 -613 -3588 -647 3625 -150 -1024 2713 1425 -366
763c66K557L57k876l1K740j078m610J624L301l728r61L385j535j808L439R35k649
$$ -366 2191 2548 -328 -359 2381 1303 -3307 -1683 1618 -2110 -3071 314 -1221 -3029 410 1345 -1304
780a304r3L542R79l467P49K301k107J99J752l254m28K286j021k636M38J940q10
$$ -1304 -1397 2145 3124 -343 406 2707 600 799 2551 -703 -1131 1155 134 -2502 -2064 -124 -934
797i34j819K128J165k901J908K693k295l00K394l65r34L62N28o08j365J188j38
$$ -934 -2753 -625 540 -2361 -453 2240 -55 -355 2039 1674 740 1102 1630 1022 -343 845 707
814G07k485P85P42j838M63J149j011P5J095N06K24r25J481Q54j078Q48J29j480
$$ 707 -1778 -993 -251 -2089 -1626 -477 -1488 -1413 -318 188 412 -513 968 1822 744 1592 1721 241
832B41Q95O51j628p89J07O91p99j890J465P27j862R95J517j314M46J175J26J77
$$ 241 1136 1787 159 -630 -523 168 -631 -2521 -1056 -329 -2191 -1196 321 -993 -547 628 754 931
850I31Q3Q19m83q43J283n61k144J461K39k296N62N27j005l55P23Q05o50m16J647
$$ 931 1014 1833 1350 507 1790 1229 -915 546 785 -1511 -949 -422 -1427 -1782 -1059 -254 -904 -1320 327
869C27J50p75J657j80j327K029M42j772l01J95L29m98j127N79p30p77J240p22
$$ 327 477 -298 1359 1179 -148 1881 2323 551 250 445 774 276 -851 -272 -1002 -1779 -539 -1261
887a261j002J727J84k1Q11j97j7K94P87J296j400j614J832M01j733j120J21R41
$$ -1261 -2263 -536 -352 -373 438 241 224 518 1305 2601 1201 -413 1419 1820 87 -1033 -912 29
905B9m10o70L50p19j104K119P67j033N77L15K25J029l72j012L12J597J393l248
$$ 29 -381 -1051 -701 -1420 -2524 -405 362 -671 -94 221 446 1475 1103 91 403 2000 3393 145
923A45k056K956j53k634P15P57j193N06Q31n63j869N26L437m60p82J474j655m47
$$ 145 -1911 1045 892 -1742 -1027 -270 -1463 -957 -126 -689 -2558 -2032 1405 945 163 1637 -18 -465
941d65K867m16k816O75K658k78l887n08K483j606p03K987j252k221K231P34k413
$$ -465 2402 1986 -830 -155 2503 2225 -1662 -2170 313 -1293 -1996 991 -261 -2482 -251 483 -1930
958a930K83K563Q98n30J047m54m011J186N130l035l595L867R68m395r35L153q90
$$ -1930 -1647 916 1814 1284 2331 1877 -2134 -948 4182 1147 -2448 1419 2387 -2008 -2943 210 -680
975f80k758L666K882m632j110M255k098j500L757J211k211P73R79l862j559M998
$$ -680 -3438 228 3110 -1522 -2632 1623 -475 -1975 1782 2993 782 1555 2534 -1328 -2887 2111
991B111R78n242J594M007n691k689N389k20l853K903M231k957l280L086N34l246
$$ 2111 3089 -2153 -559 3448 -2243 -4932 457 237 -3616 -713 3518 561 -2719 367 901 -2345
1007b345L151M128l496j722K456k914k986L949K957l719j797L724j055n120K442
$$ -2345 806 4934 1438 -284 2172 -742 -3728 221 3178 -541 -2338 1386 331 -4789 -2347
1022b347L804k588LM172j448l468J520J050j442J231L683j073m454J950n3m840
$$ -2347 1457 -1131 -1128 3044 1596 -1872 -352 698 -744 487 4170 3097 -1357 593 540 -4300
1038d300K024O484k385m675J365K224k780j614M113J335k932K446K676l955j988
$$ -4300 -2276 4208 1823 -2852 -1487 737 -2043 -3657 456 1791 -1141 1305 3981 26 -1962
1053a962J634M46J400J525p01l190o29J380k067j631N222K332m903j749K331o81
$$ -1962 -328 118 1518 3043 2342 -848 -1477 -97 -2164 -3795 1427 3759 -1144 -2893 -562 -1243
1069a243j110K372K767j785j645L192o2m347p8K834R0J109Q63l111l301O64K854
$$ -1243 -2353 19 2786 1001 -644 2548 2486 -1861 -1939 895 985 2094 2957 -154 -3455 -2791 63
1086F3q74r63L589M42m462J69K015r40R2L286P81k684p93K144j672k862K903J400
$$ 63 -811 -1774 1815 2257 -2205 -2036 -21 -961 -869 2417 3198 514 -279 1865 193 -2669 234 1634
1104A634j820J697M23n394j800M933K090k809O74K986k924l517M749J230m210
$$ 1634 -186 1511 1934 -3460 -5260 -327 1763 -1046 -372 2614 -310 -3827 922 2152 -2058
1119b058K516M376l263l250K273J64l193J078L824j888k289L138j958m937L455
$$ -2058 458 4834 1571 -1679 594 758 -2435 -1357 2467 579 -1710 1428 -530 -5467 -2012
1134b012M411j894r19K483j596l394K687L824l412j397N011j191n075K215J873
$$ -2012 2399 505 -414 2069 473 -2921 -234 3590 178 -1219 3792 2601 -2474 -259 1614
1149A614l843m1M435l89m072J329K056l799r49N696K9k991K170P63l968Q94L903
$$ 1614 -2229 -2270 2165 1776 -2296 -967 1089 -2710 -3659 2037 2066 -925 1245 2008 -1960 -1066 2837
1166B837j075k847K229J726m154r66L701k419k274M127J247l818J42K494k071
$$ 2837 1762 -1085 1144 2870 -1284 -2250 1451 -968 -3242 885 2132 -1686 -1544 950 -1121
1181a121j508L383K111k812k75K895l155j662L957Q02l289R0K175j864k062K003
$$ -1121 -2629 754 2865 53 -222 2673 -482 -2144 1813 2615 -674 -584 1591 -273 -2335 -332
1197c32M02k029J012K807k190j386J954m55r77J990J371j380q86J414k10k375
$$ -332 70 -1959 -947 1860 -330 -1716 238 -217 -1194 796 2167 787 -99 1315 1105 -1270
1213a270J258K213k125j425J914r30j356P01P50j39l98J048Q96j813K7J168m45
$$ -1270 -12 2201 76 -1349 565 -365 -1721 -1020 -270 -409 -807 241 1137 -676 -649 519 74
1230G4L51Q65k45o31m00N02k43o29K71N97j081n96R74o74k72R80J9j49N0P83K
$$ 74 425 1290 1045 414 14 516 273 -356 -85 512 -569 -1165 -191 -865 -1137 -157 -138 -287 -237 546 548
1251E48r24O90J056j136R8J503j264j277P05M37n05p65O88P4j250K77J340j185
$$ 548 -376 314 1370 234 332 1835 571 -706 -1 436 -69 -834 -146 -72 -1322 -1045 295 -890
1269h90J62J240l2q17P62M28m09M5J46K93q91K34O91j173n79J130o00o08M04J46
$$ -890 -728 512 480 -337 425 853 444 489 635 928 37 271 962 -211 -790 340 -260 -868 -464 -318
1289c18m85l39J196K45j306J122J286j104k13J264k39j200K04Q73n62r64P14J15
$$ -318 -803 -1142 54 299 -1007 115 1401 297 84 1348 1109 -91 113 986 424 -540 174 289
1307B89j321K36R46r57J87Q24q30n9P53L78k56l85J252k83p05O19L11j189J51
$$ 289 -1032 -796 150 -807 -620 204 -626 -685 68 446 190 -195 1057 774 69 688 999 -190 -39
1326c9P49j113l70M90K28n72m21Q27j10o97R90O39j371P45P97k26l71K04K12L8
$$ -39 710 -403 -773 -283 -55 -627 -1048 -221 -331 -1028 -38 601 -770 -25 772 546 175 379 591 629
1346F29m77K7L40r24K96k0o66M80o4l92R9M28j09K0K0Q06Lp95J057N13j322K92
$$ 629 152 179 519 -405 -109 -129 -795 -315 -379 -771 -672 -244 -353 -333 -313 493 496 -299 758 1271 -51 241
1368B41P17p86k93K11K35q13m75P82k51o71R66J95j005Q67O69q57K15P49j18m46
$$ 241 958 172 -121 90 325 -488 -963 -181 -432 -1103 -137 58 -947 -80 589 -268 -53 696 578 132
1388A32L17K08n74k1P96q64p53J027k07j163N74M56l58m48M53Q23o41l18J135
$$ 132 449 657 83 62 858 -6 -759 268 61 -1102 -528 -72 -430 -878 -425 398 -243 -561 574
1407E74j53o86J377l34p05N04L08p97k77K71J42p85J64K92p61m23J290j92m04
$$ 574 421 -265 1112 778 73 577 885 88 -189 82 224 -561 -397 -105 -866 -1289 1 -191 -595
1426e95L88O13j73k03K26K37m35J47R76r95n16Q25m64p14M82M79o80m34P59J50
$$ -595 -207 406 233 30 256 493 58 205 1181 186 -330 495 31 -683 -201 278 -402 -836 -77 73
1446G3j173J31J658o86l86J233n1j004M93K84m52L7P64O8j549%R33j104l03J310
$$ 73 -1100 -969 689 3 -383 850 799 -205 288 572 120 157 921 989 -560 -560 373 -731 -1034 276
1466B76n11m90N95M50p96n83J231Q23r71N47P99j425l90J114k55p04Q32L99j184
$$ 276 -235 -725 -130 320 -476 -1059 172 995 24 571 1370 -55 -445 669 414 -290 542 941 -243
1485b43r04Q24K89j266P01J642j368n66J573o99q12O95J451o65o19J197j55k334
$$ -243 -1147 -323 -34 -1300 -599 1043 -325 -891 682 -17 -829 -134 1317 652 33 1230 1075 -1259
1503a259N41J791r23o38J633j028j939Q46R93o89j47K005m05k071J647R39k445
$$ -1259 -718 1073 150 -488 1145 117 -1822 -976 17 -672 -819 1186 781 -1290 357 1296 -1149
1520a149M30K383k57j717J236M74k501k72K262L4j793J345M34k816L24K084p06
$$ -1149 -719 1664 1407 -310 926 1400 -1101 -1373 889 923 -870 475 909 -1907 -1583 501 -205
1537b05o87J963J47j938%K027j022j898K675R25k229K02J196k067j304K384Q30
$$ -205 -892 1071 1218 -720 -720 1307 285 -1613 1062 1987 -242 -40 1156 -911 -2215 169 999
1554I99j508N8J269k018j118K782O95j985J168J600k068j017J840M56j848N54
$$ 999 -509 -451 818 -1200 -2318 464 1159 -826 342 1942 -126 -1143 697 1153 -695 -141
1570a41J941j083j508J159o68j722J541J621j100j84O16j001j492J578J804j114
$$ -141 1800 717 -791 368 -300 -2022 -481 1140 40 -144 472 -529 -2021 -443 1361 247
1586B47p76K044l05k308J093Q73j175M7J472l83j454j1N31j181J96K025O2j509
$$ 247 -529 1515 1210 -1098 -5 868 -307 -260 1212 829 -625 -636 -105 -1286 -1090 935 997 -512
1604e12N06k65p49N50J336L83q51p0L62p34k45O25l60k95R19j45r81l37J71N5
$$ -512 -6 -271 -1020 -470 866 1249 398 328 690 -44 -289 336 -24 -319 600 455 -526 -863 -692 -637
1624f37n2Q72J008q47j130N74J83m25Q93J111n29j080k4K94n42k71O70J2m07O14
$$ -637 -689 183 1191 344 -786 -212 -29 -454 439 1550 1021 -59 -83 211 -331 -602 68 80 -327 287
1644B87j55j286J71L55N88R9M27M14r53p31R67N2l19J005J80j503J12M72o47k70
$$ 287 132 -1154 -983 -628 -40 59 486 900 -53 -784 183 235 -84 921 1101 -402 -290 182 -465 -735
1664g35O23N60o48j50Q67r82j043J169R39n15K48P81n69j272N43J102p20q9O92
$$ -735 -112 448 -200 -350 517 -465 -1508 -339 600 85 333 1114 545 -727 -184 918 198 109 801
1683H01n90j109P34J55p28K82O28l22o99Q06L95j212L33J265l82k72Q57m57j166
$$ 801 211 -898 -164 -9 -737 -455 173 -149 -848 -42 353 -859 -526 739 357 85 942 485 -681
1702f81K01J114l28n58O96Qj430P2J156q50l94J271%q96O40L54l54k01M49L78
$$ -681 -480 634 306 -252 444 452 -978 -906 250 -600 -994 277 277 -619 21 375 21 -180 269 647
1722F47l28K12L52j222j07P92q2p27O54k1q17k02Q53Q0q02P75J84k50k05O11j82
$$ 647 319 531 883 -339 -446 346 264 -463 191 170 -647 -849 4 84 -718 57 241 -9 -214 397 215
1743B15j19K21K36k54l8k15K03n95J77L80o14J84K49n54j0K72N3j56K97p8L19
$$ 215 96 317 553 299 261 46 249 -346 -169 211 -403 -219 30 -524 -534 -262 -209 -365 -68 -146 173
1764A73k0J17K3l01K94J22j04k46L1j48k22j36L19N6l83l0K98J12k2L5j1L30j79
$$ 173 153 270 293 -8 286 408 304 58 89 -59 -281 -417 -98 -42 -425 -455 -157 -45 -67 -32 -43 287 108
1787A08K2M02j59m2K52l40j49R4k92q0j42J33O7l59J13L63k24k29M46J70K0J08
$$ 108 130 532 373 331 583 243 94 188 -104 -184 -326 -193 -126 -485 -372 -9 -233 -462 -16 154 174 282
1809B82p6j90J28J69K52n95J96J35m49j45N74m41l78L31K62l58j24L36P8k55M89
$$ 282 206 16 144 313 565 -30 166 301 -148 -293 281 -160 -538 -207 55 -303 -427 -91 -13 -268 221
1830B21P0j92L7J83m05J82N21m45j95n5J56l5m16oM70p81J99L78J39k19J34K26
$$ 221 291 99 136 319 -86 96 617 172 -23 -78 78 43 -373 -379 91 -690 -491 -113 26 -193 -59 167
1852A67j22L25R2k39p2K40q0m81K34J94l20j97K9K0p1k01M74j30k60K32K14q1
$$ 167 45 370 462 223 151 391 311 -170 64 258 -62 -259 -230 -210 -281 -482 -8 -138 -398 -166 48 -33
1874c3J72K01j82K07pr0k6l08M29k84l24K32J88n77K19J87j37l1O0k0L0j10M42
$$ -33 139 340 158 365 358 268 242 -66 363 79 -245 -13 175 -402 -183 4 -133 -164 -104 -124 -94 -204 238
1897B38j75j97N56j16l01P06l36m51J33N6l48lK9J58j52l79N33j92k00N86q0j65
$$ 238 63 -134 422 306 5 711 375 -76 57 113 -235 -238 -209 -51 -203 -582 -49 -241 -441 145 65 -100
1919a00K96M9j96J06L12j16l37K42K27o93n1K69k15k00L32j97j34J45K18k75J8
$$ -100 196 245 49 155 467 351 14 256 483 -210 -261 8 -207 -407 -75 -272 -406 -261 -43 -318 -300
1940c00M68K43o00K13N97n90J87K06r2o1j3k35k2l06K37L6l58J91L87m85j54P89
$$ -300 168 411 -189 24 621 31 218 424 332 271 258 23 1 -305 -68 -32 -390 -199 188 -297 -451 338
1962C38m57J11N58k00k11j45L42Po52L41M99l68l97L45l88m24O80P6k69q2L42
$$ 338 -119 -8 550 350 139 -6 336 343 -309 32 531 163 -234 111 -277 -701 -21 55 -214 -296 46
1983D6K20p56K80O42n71J12P70l93n04J96K35m78R5M33k44o46K43J97m71K83M36
$$ 46 266 -490 -210 432 -139 -27 743 350 -154 42 277 -201 -106 327 83 -563 -320 -123 -594 -311 125
2004A25k0j9K6Jk33K9J68N27n44L84M21j044J5K56j43j79M03M87o81p32M96L51
$$ 125 105 86 112 113 -120 -91 77 604 60 444 865 -179 -164 92 -51 -230 173 660 -21 -753 -257 94
2026I4q00N65Q16o41l86P26l33k62L99N55l92l00N91m82j059N65P30r08L9J288
$$ 94 -706 -141 675 34 -352 374 41 -221 178 733 341 41 632 150 -909 -344 386 -522 -483 805
2046H05j009r00O57L91j98L23Q86l45j292P28M71r48J89J159n50p26P53Q2j295
$$ 805 -204 -1104 -447 -56 -254 69 955 610 -682 46 517 -431 -242 917 367 -359 394 476 -819
2065h19j27J272j21q54J042K65j403j85J472o23rQ56Nj149l6J102q05n48J321
$$ -819 -946 326 205 -649 393 658 -745 -930 542 -81 -90 766 771 -378 -414 688 -117 -665 656
2084F56L62j543L39R16j233p88J340N31q66L62N29j225n26J436J74q24J137J51
$$ 656 1018 -525 -186 730 -503 -1291 49 580 -286 76 605 -620 -1146 290 464 -360 777 928
2102I28j181l77J049k79p22O00R84j351l88R93k96j125J019P64q85mR46n81j084
$$ 928 -253 -630 419 140 -582 18 1002 -349 -737 256 -40 -1165 -146 618 -267 -271 675 94 -990
2121i90R00P71n41P2R25j149p05O50L58p71O37J32j25o19L26K46q45L35J047n44
$$ -990 -90 681 140 212 1137 -12 -717 -67 291 -480 157 289 164 -455 -129 117 -728 -393 654 110
2141A10k20O51l91p55M65N59p3q5K06l08p20J22O92k35k14K72p5k10n0K66j61
$$ 110 -110 541 150 -605 -140 419 346 261 467 159 -561 -439 253 18 -196 76 1 -209 -259 7 -154
2162a54j91N45N26n18j47K81m04k67M95L58l86j21k72j33k62M51M94l75L1J36
$$ -154 -345 200 726 208 61 342 -62 -329 166 524 138 17 -255 -388 -650 -199 295 -80 -49 87
2182H7m02r2M58n1j10M13k8J97m48j34L43m9n1J19r0j75l00M9M1o4J51K52k71
$$ 87 -315 -407 51 0 -110 303 275 472 24 -110 233 184 133 252 162 -13 -313 -264 -223 -287 -136 116 -155
2205a55m5J24l9N0J27R3j31J98J44j57j73j75K75k42mJ71k56k72K17m5N3J40K44
$$ -155 -200 -76 -115 -65 62 155 24 222 366 209 36 -139 136 -106 -110 61 -195 -467 -250 -295 -242 -102 142
2228A42j85j33K49J18m10K95L92l57j16L34j44k91R6J11n5k97M52m26l51L81J73
$$ 142 -43 -176 73 191 -219 76 468 111 -5 329 185 -106 -10 101 46 -251 201 -225 -576 -195 -22
2249b2k68M6M80l0k70L51L3l41K13k1p5j71L21J62m75J87p6n1j87L19l87K48m33
$$ -22 -290 -244 236 206 -64 287 320 -21 192 171 96 -75 246 408 -67 120 44 -7 -194 125 -262 -14 -447
2272d47K96L83k91L07k9j61O9Q4k62P5o7K18O6m03K49l77p7J62Q8j18O1J69j45
$$ -447 -151 232 -59 248 219 58 127 211 -51 24 -43 175 241 -162 87 -290 -367 -205 -117 -235 -174 -5 -150
2295a50J24k4J28rN9K20n8l28J51jk27L86m27P6K2K6j07p7J92m5j90J98j55J10
$$ -150 -26 -50 78 69 128 348 290 -38 113 112 -115 271 -156 -80 -58 -32 -139 -216 -24 -69 -259 -61 -216 -106
2319a06R6J38j03o3M50l48k55M89j30j73L38j03k69J04k3j06k33o4M04l46J79
$$ -106 -10 128 25 -38 412 64 -191 298 168 -5 333 230 -39 65 42 -64 -297 -361 43 -303 -124
2340a24J58j79M2L04n7j88J03J36q1j1q3J26l00L5r0J02J41l20J06K6J29K4Rj30
$$ -124 34 -145 -103 201 144 -44 59 195 114 103 20 146 -154 -119 -209 -107 34 -286 -180 -154 -25 -1 8 -122
2364a22O6J89k79K89J76l84R7n9J18k00K67j76J6j30J72m0j27K32j35j35J32P6
$$ -122 -56 133 -146 143 319 -65 32 -27 91 -109 158 -18 -2 -132 40 0 -127 105 -30 -165 -33 43
2386D3k42M60j54R6O8j74K42k73j27m6J37o4J6j79j00J10q1J69j2L5N2J94j34
$$ 43 -199 261 107 203 271 97 339 66 -61 -107 30 -34 -18 -197 -297 -187 -268 -99 -111 -76 -24 170 36
2409C6J13J52m03J86Q9j05K57l86Ll1j54M3J10P1k7J23l42L73j39Q6j63J27j20
$$ 36 149 301 -102 84 173 68 325 -61 -58 -89 -243 -200 -90 -19 -46 77 -265 108 -31 55 -108 19 -101
2432a01J63k3m0J00Lqj29O9J59l11j34L25j23j83J58j80L08q2N1l0J09j07K48
$$ -101 62 39 -1 99 102 94 -35 34 193 -118 -252 73 -50 -233 -75 -255 53 -29 22 -8 101 -6 242
2455B42j42j33L57l51J04L5j10o8M7M0R0j54k17M03k43j53L72l75j22L26J15q4
$$ 242 100 -33 324 -27 77 112 2 -66 -19 21 111 -43 -260 143 -100 -253 119 -256 -378 -52 63 -21
2477b1K0P6Q2j37J06R5m99L30R2j7j7j48J05k90l7K79j53J0K11L9m78M62J23k03
$$ -21 -1 75 157 20 126 221 -278 52 144 127 110 -38 67 -223 -260 19 -134 -124 87 126 -352 110 233 30
2501C0QL00O7n18P5L3j13k1K37j2j77J06O6m65n6N43l6j2K4K97m59j47L12J0k4
$$ 30 38 338 405 -113 -38 -5 -118 -139 98 86 -91 15 81 -384 -440 103 67 55 79 376 -83 -230 82 92 68
2526F8J86J70n12O2J55j13k92L50N2l5j98O5j61J3J81m8P0J04J19l32J47m8J17
$$ 68 254 424 -88 -26 129 16 -276 74 126 91 -107 -42 -203 -190 -9 -57 13 117 236 -96 51 3 120
2549A20k6j4l2J05j29l0r1j31Q0R8M0j93O4K22r0j02K86Q1k49Q9K7j98L2J80L7
$$ 120 94 80 48 153 24 -6 -97 -228 -148 -50 -10 -203 -139 83 -7 -109 177 258 9 98 125 -73 -41 139 176
2574A76o4j96K69k45k94K94J20l67J02N31m18m3J22j77j0K59J87J08l74J56km79
$$ 176 112 -84 185 -60 -354 -60 60 -307 -205 326 -92 -135 -13 -190 -200 59 246 354 -20 136 134 -345
2596c45L52L26k70k73L23j87l69L53J64J85o09M87J07n14J60rJ1J76K54K11o15
$$ -345 7 333 63 -210 113 -74 -443 -90 74 259 -350 137 244 -270 -110 -119 -108 68 322 533 -82
2617h2j32K99p7q1L35R1n56l08P32l66M0M63j01l14J45K20m83j01M10n1k66M56
$$ -82 -214 85 8 -73 262 353 -203 -511 221 -145 -105 358 257 -57 88 308 -175 -276 134 83 -183 273
2639B73L07p26j94M77m39m6M38L29o02k54P21k41l44L70R6k54M3L89j04j97P2
$$ 273 580 -146 -340 137 -302 -348 90 419 -183 -437 284 43 -301 69 165 -89 -46 343 239 42 114
2660A14Q3j48R6J99m99L1K10k37K8J76J63k86k22L08qp4j83N15n0l99K00l7NJ46
$$ 114 197 49 145 344 -155 -124 86 -151 -123 53 216 -70 -292 16 8 -66 -249 266 216 -183 17 -20 -15 131
2684A31Q8k50P6M8j03j25o1J06J15j41J16j78l4O3K41j09J18P9Jl60J89J44j82
$$ 131 219 -31 45 93 -10 -135 -196 -90 25 -116 0 -178 -212 -149 92 -17 101 180 181 -179 10 154 -28
2707b8j57K28J6j7jj17O4k29J79L4k37L40K31m23J34J44p0m5Q7o2n3k0J66p8j6
$$ -28 -185 43 59 42 41 -76 -12 -241 -62 -28 -265 75 306 -117 17 161 91 46 133 71 18 -2 164 86 70
2732G0j01J90j9k50M0O9K2k82K02O4P0j60K48l40K72J95j71R5j62l2J81j94J80
$$ 70 -31 159 140 -110 -70 -1 21 -261 -59 5 75 -85 163 -177 95 290 119 214 52 20 201 7 187
2755A87k47k66J98J47o0r0l0mnJ31K19j13p0Q9j56M0K30j52lJ0L67o13J76J9q2
$$ 187 -60 -326 -128 19 -41 -131 -161 -165 -170 -39 180 67 -3 86 -70 -30 200 48 45 55 422 -191 -15 4 -78
2780g8q5J04J62q5j5p0P7j29J75O8lJ35q8qq5j5j27K97l37J17L5m17M74N9l69
$$ -78 -163 -59 103 18 3 -67 10 -119 56 124 121 256 168 160 75 60 -67 230 -107 10 45 -372 102 161 -208
2805b08O1K62l37K4J65j41R5J32j56J81K1M3r7r0J27q7J34n3k35J26k91J56J19
$$ -208 -147 115 -222 -198 -33 -174 -79 53 -103 78 99 142 45 -45 82 -5 129 76 -159 -33 -324 -168 -49
2828d9OP7M3L7rj63J26q8j95L59k65J35L8n9q1P1J87j98o6J28p9j77K75r6J51
$$ -49 -43 34 77 114 105 -58 68 -20 -215 144 -121 14 52 -7 -88 -17 170 -28 -94 34 -45 -222 53 -43 108
2853A08O0k8j61J52l14K39J08j63J79j57J14j84r7J27L2K09k36j22J7J72q0q1
$$ 108 168 140 -21 131 -183 56 164 1 180 23 137 -47 -144 -17 15 224 -12 -134 -117 55 -25 -106
2875a06O8k2J23j91J37R3K15k53qk7j5J1j25L93k75j02J43k19J23j59k5K16J8
$$ -106 -38 -60 63 -128 9 102 317 64 56 29 14 25 -100 293 18 -84 59 -160 -37 -196 -221 -5 13
2898A3m2Q8n1K10j75M4J0r4Q4j16Q5n8j37qP8J25R1j9l26L01r5jj73R0k8K31o
$$ 13 -29 59 8 218 43 87 97 3 87 -29 56 -2 -139 -147 -69 56 147 128 -198 103 8 7 -166 -76 -104 127 121
2925A21M4j92R0N6n9j26J09J2j34J30j38J03r1P4n7l1j04K94J9n1JPl2j76J36
$$ 121 165 -27 63 119 60 -66 43 55 -79 51 -87 16 -75 -1 -58 -89 -193 101 120 69 70 77 45 -131 5
2950EK35k75m4K31r6k38J94J16o6j67Q1r1J28M8N6k07K01lq8l7R5J92m57M91m19
$$ 5 240 -35 -79 152 56 -182 12 128 62 -105 -24 -115 13 61 117 -90 111 108 20 -17 78 270 -187 304 -115
2975a15J44r1PK68k16oK7j15k3M3K08q0k8j13K11k29J76j4j6J9J60k12q0M20l03
$$ -115 29 -62 -55 213 -3 -9 18 -97 -120 -77 131 51 23 -90 121 -108 68 54 38 57 217 5 -75 345 42
3000D2j15J97l7K3k57J38K4k14M49m1k13J12k22R3j29P8J24k0j50K01m6j83K11
$$ 42 -73 124 87 110 -147 -9 15 -199 250 209 -4 108 -114 -21 -150 -72 52 32 -118 83 37 -146 65
3023F5jJ2j29j3Q3j16L6R5r1O5P1%j51k6J40j44J46J96j26j10o9n6J9K89k01J34
$$ 65 64 76 -53 -66 17 -99 -63 32 -59 6 77 77 -74 -100 40 -104 42 238 112 2 -67 -123 -104 185 -16 118
3049A18k07pJ32o7J78J4J56l05L60k41qj85L7J90m44J75K57k00L7OK8j37K31k63
$$ 118 -89 -96 36 -31 147 161 317 12 372 131 123 -62 -25 165 -279 -104 153 -47 -10 -4 24 -113 118 -145
3073a45L27Nj05p5o0P3J12k72J37K17k84q1rQ5K76q7j69Q8k65j04K76o9J46K01
$$ -145 182 187 82 7 -53 20 132 -140 -3 214 -70 -151 -160 -75 201 114 -55 33 -232 -336 -60 -129 17 218
3097B18k05j7n8J6l4j9J71J92m26L32m3p0k03J49J51j32rJ45j29k81L49K51l36
$$ 218 13 -4 -62 -46 -80 -99 72 264 -162 170 127 57 -146 3 154 22 13 158 29 -252 97 348 12
3120A2j17O5J86l18J58J32j90M6K78q6k28N0R9nr5j07R7j79K93j20j08J31K43
$$ 12 -105 -40 146 -172 -14 118 -72 -26 252 166 -62 -12 87 82 -13 -120 -23 -202 91 -29 -137 -6 237
3143B37k32L0K10l01J74J93l78K72k26lj6L3l6K30l14n1K17J78k41k2K01l75K77
$$ 237 5 35 245 -56 118 311 -67 205 -21 -24 -40 -7 -43 187 -127 -178 39 217 -24 -46 155 -220 57
3166E7n5j1j2K18j75j88J76j45J06k31K74J4K59l05j8J75n11J05N06j67m8J29
$$ 57 2 -9 -21 197 22 -166 10 -135 -29 -260 14 28 287 -18 -36 139 -372 -267 239 72 24 153
3188A53j94j8M9J09k14J3J06o2j93K03P5k55K28J89j15k67J03J02j26Q1j7R8j23
$$ 153 -41 -59 -10 99 -115 -102 4 -58 -251 -48 27 -228 0 189 74 -193 -90 12 -114 -33 -50 48 -75
3211g5K58K0j94j15N9kp5k9J87k23K59j19N1j95K24J53m41K58j90J56j79M06k59
$$ -75 183 203 9 -106 -47 -49 -124 -153 34 -189 70 -49 2 -193 31 184 -257 1 -189 -33 -212 194 -65
3234f5J80m0j8j91Q0M9Mm3J69k19K5J35L1l1j88K05j01j07j90K83J81k5n6N6J6
$$ -65 115 75 57 -134 -54 -5 -1 -44 125 -94 -69 66 97 66 -122 83 -18 -125 -315 -32 149 124 68 124 140
3259A40j97L00k40J43j31k23J40m5l4J24J12jm4j56j79K64o4N8O3l1J22L4k75
$$ 140 -57 243 3 146 15 -208 -68 -113 -147 -23 89 88 44 -112 -291 -27 -91 -33 30 -1 121 155 -120
3282a20L29k38J30r3k5J88j51R3j13P0J2m4j04N0O1K33Rj02k48J2J47p8K09k70
$$ -120 209 -29 101 8 -17 171 20 113 0 70 82 38 -66 -16 45 278 287 185 -63 -51 96 18 227 -43
3306d3n6N6J71k31K11k59K87j8k76J55P0k0j62J00j30J09k58L95o0lo5J19l9j09
$$ -43 -99 -43 128 -103 108 -151 136 118 -158 -3 67 47 -115 -15 -145 -36 -294 101 41 38 -27 92 53 -56
3330e6K08k59j4J16J32k40n0J94q6R1k9PK0n0J20j71J51J3j35J21o0rJ17k12Q5
$$ -56 152 -107 -121 -5 127 -113 -163 31 -55 36 7 14 34 -16 104 -67 84 97 -38 83 23 14 131 -81 4
3355DO8j93N1j1n1r3L05j37J16k10L22o7k57J79J03k17O8K49l51J36J23M4j61
$$ 4 72 -121 -70 -81 -132 -225 80 -57 59 -151 171 104 -153 26 129 -88 -20 229 -122 14 137 181 20
3378B0n1m9M9j29K21k00J14n0L8J66O8j88p9QJ84K8r5r5mK8p4K10j26J03j33n7
$$ 20 -31 -80 -31 -160 61 -139 -25 -75 -37 129 197 9 -70 -62 122 150 55 -40 -44 -16 -90 120 -6 97 -36 -93
3404i3K5R3J04j05P3l31J10K95q6P1q4Q1j25J41k61k9P9J60m1k51L05j18q0K31
$$ -93 -68 25 129 24 97 -234 -124 171 85 156 72 153 28 169 -92 -121 -42 118 77 -174 131 13 -67 164
3428A64J2l00J04o7P1m7K05k77J92n6J11l4n0l1p4L1L8N8q3Lo2rJ47P7l9J0j1
$$ 164 176 -124 -20 -87 -16 -63 142 -135 57 1 112 78 28 -3 -77 -46 -8 50 -33 -30 -92 -101 46 123 84 94 83
3455H3l3j40lK31j05j74J65p0K06j44k88K36k2j89L40k14J34r8J01mP5K6j8j23
$$ 83 50 -90 -93 138 33 -141 24 -46 160 16 -272 -36 -58 -247 93 -121 13 -85 16 12 87 113 95 -28
3479b8K90j94p6j6J8N4N0j79K33n8j78N0O8LJ72j13k63NK7K43m0M0k21k1P0L0
$$ -28 262 68 -8 -24 -6 48 98 -81 152 94 -84 -34 34 37 209 96 -167 -162 -135 108 68 108 -113 -134 -64 -34
3505c4mJ4j0L30l41J36j43J2j21P6K57O1l04q6L3Q9J30K5j63p6J81k81K36r2k8
$$ -34 -38 -24 -34 296 -45 91 -52 -40 -161 -85 172 233 -71 -157 -124 -35 95 120 -43 -119 62 -219 17 -75 -103
3530a03J73N8Lj14k51M12j62m1J53l00K05J31j17L1J17l44J74l2J13l6jj68J84
$$ -103 70 128 131 17 -234 178 16 -25 128 -172 33 164 47 78 195 -149 25 -7 106 70 69 -99 85
3553H5j83J79n2kJ50r6j93L4K5K88n56M04Olk34o8L17Qj89r0R9j82J83l6Q1l9
$$ 85 -98 81 29 27 177 81 -112 -78 -53 235 -321 83 89 86 -148 -216 101 109 -80 -170 -71 -253 -70 -106 -25 -64
3579f4L6M7J37p4k32O1P9N8oR8q9j39J28J26k28R6jP7J61k25O9j84J00LJ7J7q0
$$ -64 -28 19 156 82 -150 -89 -10 48 42 140 51 -88 40 166 -62 34 33 110 271 46 115 -69 31 34 51 68 -12
3606a2J96m05K37J4L02l07k5Lj02K61k29L6m1M1K63k19n0k9j55L14k00K15k34
$$ -12 184 -221 16 30 332 25 0 3 -99 162 -67 -31 -72 -31 232 13 -37 -66 -221 93 -107 108 -126
3629a26K94M8k54l7J84j49J27qn0l8n0n0K48j88K2k57L28k5r3N4l74M76j51j52
$$ -126 168 216 -38 -75 109 -40 87 79 29 -9 -59 -109 139 -49 -27 -284 44 19 -74 -20 -394 82 -69 -221
3653b21L27N5k64K07j70J01R3r2p1n4Q9p4j16J84k9J6N6j8j68K45o9q2R9ro8J5
$$ -221 106 161 -103 104 -66 35 128 36 -35 -89 0 -74 -190 -6 -35 -19 37 19 -149 96 27 -55 44 35 -33 -18
3679a8j36O5m9J10LJ64j12o3o8K96l65J98LK01o3j83q7K38j74P9k68L71P8k83
$$ -18 -154 -89 -138 -28 -25 139 27 -36 -104 192 -173 25 28 229 166 -17 -104 134 -40 39 -229 142 220 -63
3703f3l2N1J13J23j73k59K57j94J00J79j88J49r3o8mJ16j26J16O5K1k70O3L99
$$ -63 -95 -44 69 192 19 -240 17 -177 -77 102 -86 63 -30 -98 -102 14 -112 4 69 90 -180 -117 282
3726B82l00J07j23k4Q1n8O9J32k12j06m3K73j29K9M8j47K73n5K3P1k14n6K4J44
$$ 282 -18 89 -34 -58 23 -35 34 166 -46 -152 -195 78 -51 -22 26 -121 152 97 120 191 -23 -79 -55 89
3750H9Q1m26J26L37k38P8Lj46Q4j23J58j7r7M6R0km9or6K25%j27kM6n3mL2j75
$$ 89 170 -256 -130 207 -31 47 50 -96 -12 -135 23 6 -91 -45 45 43 -6 -12 -108 117 117 -10 -12 34 -19 -23 9 -166
3778a66oJ60n8J75Kk95J75J06m2j03J70j92Q6Q7j91J37k2J34m7o7j95J65N5j6
$$ -166 -172 -12 -70 105 107 -188 -13 93 51 -52 118 -74 12 99 -92 45 23 157 110 43 -152 13 68 52
3802E2p6o6M10m87K14L30l94m9j43L49k06r1K04O7j28p8K97l36J58j43P2J66k97
$$ 52 -24 -90 320 -167 47 377 -17 -66 -209 140 -66 -157 47 114 -14 -92 205 -131 27 -116 -44 122 -175
3825a75K25N8k3k27K66j29M9l8j22J6K16k32o8M10j81O9R3j79r3K39k53O5J50
$$ -175 50 108 85 -142 124 -5 44 6 -116 -100 116 -116 -184 226 45 114 207 28 -65 174 -79 -14 136
3848A36j0j10j57M20l02nj3J77l88N21j60l52J54J21K7j07m3j3N8Q1j16n1J68
$$ 136 126 16 -141 279 -23 -28 -41 136 -252 269 109 -243 -89 32 59 -48 -91 -104 -46 35 -81 -132 36
3871C6j15K32j20k4M5q6R2q8j02J98j72Q4P2P1j88J13n5j81J13K09o7j24N8j83
$$ 36 -79 153 33 9 54 -32 60 -28 -130 68 -104 -20 52 123 -65 48 -7 -188 -75 134 67 -57 1 -182
3895a82J92j09J11j28L03m8l22L81l4l23K37r0n0l8J85k40J62j46J51K06l13K01
$$ -182 10 -99 12 -116 187 139 -183 198 164 -159 78 -12 -62 -100 85 -155 7 -139 12 218 -95 106
3917A06J03l47J84q4L1L1k18K2K89k62K33k73N12k76j83lJ09l9P1R5l75J00L65
$$ 106 209 -138 46 -38 -7 24 -194 -172 117 -145 88 -185 327 51 -132 -135 -26 -65 6 101 -274 -174 191
3940A91k34j08J35oQ5LJ58k37J25p4O5k71L35l14J30j69J05K24o8k5m1J12K7j03
$$ 191 -43 -151 -16 -22 63 66 224 -13 112 38 103 -168 167 -147 -17 -186 -81 143 75 50 9 121 148 45
3964D5n9k01L37m9p0NR3j06j06J88Jl5j59L1K22k6J8j29j91M82l02O6k23J32p3
$$ 45 -14 -215 122 73 3 8 101 -5 -111 77 78 43 -116 -85 137 111 129 0 -191 291 -11 55 -168 -36 -109
3989a09J05k7j18K98l01J65k77J66K83l67Q9L05k95NK40k55J30q7o0N3q9N7J85
$$ -109 -4 -31 -149 149 -152 13 -264 -98 185 -182 -93 212 -83 -78 162 -93 37 -50 -110 -57 -146 -89 96
4012I6Q8j96R4J15k92K88j4k02m9k33M03j59j90J84L1J38j76P3J14J01j74J30
$$ 96 184 -12 82 197 -95 193 179 -23 -72 -305 98 -61 -251 -67 -36 102 -74 -1 113 214 40 170
4034A70p9j27J46Q9j82l9K06q5j84l6L27j58p8Kj42J38l3J71P1k28K18p5j29J14
$$ 170 91 -36 110 199 17 -22 184 99 -85 -121 206 48 -30 -28 -170 -32 -65 106 177 -51 167 92 -37 77
4058G7j92J6K24j26KJM9k99J66J02m2j03J79j83j8J79N1j02lj81L13J15j47m5
$$ 77 -115 -99 125 -1 1 2 51 -248 -82 20 -22 -125 54 -129 -147 32 83 -19 -22 -203 110 225 78 33
4082C3m0J2J33R2m0o7j12N6j16n4J49%J24q9r9Q3J31j91J83L4j38m6j87N8o0l0
$$ 33 -7 5 138 230 190 123 11 67 -49 -103 46 46 170 81 -18 65 196 5 188 222 84 38 -149 -91 -151 -181
4108a81L16k26L10l77j30L33L7k32J66P1RJ3j39Q8j60l9N5J49k8L7j93J83j32
$$ -181 135 -91 219 -158 -288 45 82 -150 16 87 96 109 -30 58 -102 -141 -86 63 35 72 -121 62 -70
4131g0O2%J40j83Q1J77k27q6K9o9J57L6M4M1rj89P0J33K3k87KK47m00M49j69K1
$$ -70 -8 -8 132 -51 30 207 -20 -106 -77 -146 11 47 91 132 123 -66 4 137 160 -127 -125 122 -278 171 2 23
4157B3Q3r9Rl3j90J88N4j73P5m8K50j29Q5j18J43on5j86O0N4r3R2J65m06M12j28
$$ 23 106 7 16 -17 -207 -19 35 -138 -63 -111 139 10 95 -23 120 114 59 -127 -67 -13 -106 -14 151 -255 157 29
4183B9J33k68J67j12j77M14p7k14R0J55j8k05J69J7q6j4l5k08J21K48k24K25k43
$$ 29 162 -106 61 -51 -228 186 109 -105 -15 140 122 -83 86 103 17 3 -32 -240 -119 129 -95 130 -113
4206a13J81m2j01j11L21J2j68J16l8R8j05n1J9K36k30J32n9L5r3o4J42j33Jj53
$$ -113 68 26 -75 -186 135 147 -21 95 57 155 50 -1 18 254 24 156 97 132 39 -25 117 -16 -15 -168
4230a68J74L1k70K38Q4k3K1M1J10n4k10j16K05l09J72N7p5N0K1P3l9j8l06M06
$$ -168 6 37 -233 5 89 66 87 128 238 184 -26 -142 63 -246 -74 -17 -92 -42 -21 52 13 -5 -311 95
4254I5n2K8J13j8l37K17R5Q9j83j56R9j83K80M4J40l10p4J1JJ04J7j03M3L6Q9
$$ 95 43 71 184 166 -171 46 141 230 47 -109 -10 -193 87 131 271 -39 -113 -102 -101 3 20 -83 -40 -4 85
4279H5k84J95l0JJ10q9L2J58n4k50K95l35J54K2J23q5Jj67P1j02K0n7K58o7j0
$$ 85 -199 -4 -34 -33 77 -12 20 178 124 -126 169 -166 -12 10 133 48 49 -118 -47 -149 -129 -186 72 5 -5
4304eL1K02N8k64Pj64l5K12R3jk67K07q4j77L5K10lj52qJ24l4k2J21LJ5j62N6
$$ -5 26 228 286 22 29 -135 -170 42 135 134 -133 74 -10 -187 -152 58 55 -97 -105 19 -15 -37 84 87 102 -60 -4
4331dj89J24J27r6J62J2k47l4K25j6J83k70K26j55l80L37j20P8P7m4N2p9M7j22
$$ -4 -193 -69 58 -38 124 136 -111 -145 80 64 247 -23 203 48 -332 5 -115 -37 40 -4 48 -31 16 -106
4355a06k0J40jJ0j33O7J09k6j11Q3r1Q4P9o2j01J42k07K87rKk2r1r0L0j8n5P0
$$ -106 -126 14 13 23 -110 -43 66 40 -71 12 -79 5 84 22 -79 63 -144 143 134 136 114 23 -67 -37 -55 -110 -40
4382d0J62j28j4k49J36J70j32K0R3o1jJ05n4K80k17r0j69K60m8K22m57J15J57
$$ -40 122 -6 -20 -269 -133 37 -95 -75 18 -43 -44 61 7 287 70 -20 -189 71 23 245 -212 -97 60
4405F0J4J44k86R4K49j17L4j74n1l6JJ8P5j15%j92J49J8K7L63n33R5L68p3k60
$$ 60 74 218 -68 26 275 158 192 18 -33 -69 -68 -50 25 -90 -90 -282 -133 -115 -88 275 -258 -163 205 132 -128
4430a28J95j25k7J52J50Pj59j96K03K48j69r3j43P4J94l5k68K23k42nj9J76j43
$$ -128 67 -58 -85 67 217 224 65 -131 72 320 151 58 -85 -11 183 148 -120 103 -139 -144 -163 13 -130
4453a30K43L6L3Rl17N5Q6mKk7J41q5K10l59J13J98k25J85k26O5K2PJ23l03j10
$$ -130 113 149 182 191 -126 -71 15 11 13 -14 127 42 252 -107 6 204 -21 164 -62 3 25 32 155 -148 -258
4478b58Q6L2N8K45o5p6J01j45j66L25k53N6kQ6q1J1NK94l23O9N8j28K87l12K55
$$ -258 -172 -140 -82 163 98 22 123 -22 -188 137 -116 -60 -62 24 -57 -46 -41 253 -70 -1 57 -71 216 -96 159
4503A59k79K94j01J74k43p9K90j50j3OO5l27L22r9o1l4J26J13k15m9j32K67p1
$$ 159 -120 174 73 247 4 -75 215 65 52 58 123 -204 118 19 -42 -76 50 163 -52 -101 -233 34 -37
4526c7P9j03N8J03k6l8j00J6l9%J21K8j38J74m32L64q4K8o9L12n4l13Q5M8J4O0
$$ -37 42 -61 -3 100 74 36 -64 -48 -87 -87 34 62 -76 98 -334 30 -54 -26 -95 217 163 -150 -65 -17 -3 57
4552E7N0O5p4n5k29K13o9J24k7j61J48Q5n7j71J02Q6l1Q1k54R2rk6K55l89L22
$$ 57 107 172 98 43 -186 27 -42 82 55 -106 42 127 70 -101 1 87 56 137 -117 -25 -34 -60 195 -194 128
4577A28q4J33l17K35Q0k60k5Q0r6m2K7K6J89J01K0j27j50j56K60l4m9P2J17M9
$$ 128 44 177 -140 95 175 -85 -110 -30 -126 -168 -141 -115 74 175 195 68 -82 -238 22 -12 -61 11 128 177
4601A77j47j80J42n4J31j63J67k3j47J53j01K53j80n8j9J66j20N0kl5n8J24m1
$$ 177 30 -150 -8 -62 69 -94 73 50 -97 56 -45 208 28 -30 -49 117 -3 47 45 10 -48 76 35
4624C5P0k68K44J52j88J22p3j95nJ27j39J11j61J48J12k70K79j71P9p4L19n01
$$ 35 105 -163 81 233 45 167 94 -101 -106 21 -118 -7 -168 -20 92 -178 101 -70 9 -65 254 -247
4646b47J96J8J94j50q5L22p4q7l31K32j14J0p8K92j47oK15j24j5L5k2k04O8J17
$$ -247 -51 -33 161 11 -74 248 174 87 -244 -12 -126 -116 -194 98 -49 -55 160 36 21 56 34 -170 -102 15
4670A5k04N8J75r1O3r3J73k38J79J28pj70k36L48j62j1J38j68J43l2j05J48K4
$$ 15 -189 -131 44 -47 16 -77 96 -142 37 165 158 -12 -248 100 -62 -73 65 -103 40 8 -97 51 75
4693G5p5j13J39%j81J16N3nk2P7k30J43L2J94p2l18K89j87J52m4Nk03L67j54K87
$$ 75 0 -113 26 26 -155 -39 14 9 -13 64 -166 -23 9 203 131 -187 102 -85 67 23 28 -175 192 38 325
4718C25l45j62J06k46L82j03J53k10o6J97R7k46n1K67k7j6J01l99N65m82K61K5
$$ 325 -20 -182 -76 -322 60 -43 110 -100 -166 31 128 -118 -169 98 71 55 156 -243 322 -160 101 126
4740A26l28J55J31O2m27K16q8K02m9j05L7K34k01K32o7j08j16Oq4R7K06K1k63
$$ 126 -202 -47 84 146 -281 -65 -153 49 0 -105 -68 166 -35 197 130 22 -94 -88 -172 -75 131 152 -111
4763a11K44k68k9L2J61j09r7jJ38J01j09jJ45N2j62J93j53J3M4J9j44o9K7oP6
$$ -111 133 -135 -164 -132 29 -80 -177 -178 -40 61 -48 -49 96 148 -14 179 26 39 83 102 -42 -111 -84 -90 -14
4788a4K37j08R0j09q7r4K21m1j13J60k21J94j89P2l2j03J54j76L8n2K08j98J95
$$ -14 223 115 205 96 9 -85 136 95 -18 142 -79 115 -74 -2 -34 -137 17 -159 -121 -173 35 -163 32
4811C2J76j79q5n4K59k33O5K87k79MJ0j13R9l0j21K05j61L40j33N0j11j1q3J03
$$ 32 208 29 -56 -110 149 -84 -19 268 -11 -7 3 -110 -11 -41 -162 43 -118 222 89 139 28 17 -66 37
4835C7L9l23J38J35K3J59k22O3N4J49j63Q9l88J96J09k7k19qK94n2j69M53m46
$$ 37 76 -247 -109 26 49 208 -14 49 103 252 89 178 -210 -14 95 68 -151 -159 135 83 -86 367 -79
4858g9j32K42k26K79j09Q2k8K16k14k68J17L28k80NJ12q0o6K51j29R6q3M7o0o
$$ -79 -211 31 -195 84 -25 57 29 245 31 -237 -120 208 -72 -67 45 -35 -101 150 21 117 34 81 21 15
4882A5K32k31j4j50L21l62Q2J42J9j1j53K6O0K0K2p4N0LM5j50J39J70l22J8J06
$$ 15 247 16 2 -148 173 -189 -107 35 54 43 -110 -84 -24 -4 18 -56 -6 -3 42 -108 31 201 -121 -103 3
4907Cj45K8J76j44m8K12m5P0j75J19k9m4k5K8j25J42L9k86K65J85j14P3k10J13
$$ 3 -142 -114 62 -82 -130 82 37 107 -68 51 22 -22 -47 -19 -144 -2 37 -249 16 201 87 160 -50 63
4931F3J69l18Q9J56k02j3o5J61o8K60k64J78pl59N0J15J45k4j79L08k53p2j26
$$ 63 232 -86 3 159 -43 -56 -121 40 -28 232 -32 146 139 -220 -170 -55 90 66 -113 195 -58 -130 -256
4954b56J39j46K68p3K10k00L0L4M3q1K74k22j75J45l8J48j61J03J20m2L4j18P9
$$ -256 -117 -263 5 -68 142 -58 -28 6 49 -32 242 20 -155 -10 -48 100 -61 42 162 120 154 36 115
4977A15n9m2r8N9p4K13k01J51K0j21j57L40k1j10k4K18k74M5P4r7J23j05j7k4
$$ 115 56 14 -84 -25 -99 114 -87 64 84 -37 -194 146 125 15 -9 209 -65 -20 54 -43 80 -25 -42 -66
5001f6J10J8L7j55j74K86k15R9J74j32J71k47q1N7J18k17M15m49L68m9j17J26
$$ -66 44 62 99 -56 -230 56 -159 -60 114 -18 153 -94 -175 -118 0 -217 198 -251 117 68 -49 77
5023G7p8j80K71j25k1M6J33k17q2j5J71j20O6QJ14J7j13l4q1J14O8j28j19K12
$$ 77 -1 -181 90 -35 -56 -10 123 -94 -176 -191 -20 -140 -74 -66 48 65 -48 -82 -163 -49 19 -109 -228 -16
5047a6k4r9J36o4J12n5j8J13k24M4l2l1J47l0j4J68j37j0J31k3k8p7o1N3M8j27
$$ -16 -40 -139 -3 -67 45 -10 -28 85 -139 -95 -127 -158 -11 -41 -55 113 -24 -34 97 74 46 -31 -92 -39 9 -118
5073a18L92k94J65oj52J00o1j40N6J8MK0j35K09n0r3J90k39P8P5j86J02m6m4M9
$$ -118 274 -20 145 139 -13 87 26 -114 -58 -40 -36 -16 -151 58 8 -85 105 -134 -56 19 -167 -65 -111 -155 -106
5098a06P0j6O5j39J04J33j85J20M4k96K37o8J82j73J7P7J4k5j82Q6L3Q7k89L69
$$ -106 -36 -52 13 -126 -22 111 -74 46 90 -206 31 -37 145 -28 -11 66 80 55 -127 -41 -8 79 -210 159
5122A59k11J30j91J82Q8k73o1R7o2K52n5ON7j34j9j24M9L2P9O3j85K90K9m8k28
$$ 159 -52 78 -113 69 157 -116 -177 -80 -142 110 55 61 118 -16 -35 -159 -110 -78 1 64 -121 169 198 150 -78
5147g8K03j79o6J25J5J27j33J45j81j59K35j5j4J50j66r6J6k5M4K48m9j05m5J13
$$ -78 125 -54 -120 5 20 147 14 159 -22 -181 54 39 25 175 9 -87 -71 -96 -52 196 147 42 -3 110
5171A10j17nQ6l4j43J66K20k51q4K6J92j96O1J54k43J71j58J2O6R0l42J26K24
$$ 110 -7 -12 74 40 -103 63 283 32 -52 -26 166 -30 31 185 -58 113 -45 -33 33 123 -219 -93 131
5194A31j46K31j80J1r3j57L72R9k50L2j16j5J42q3J17ol5l5j63N0J78K2j29m9
$$ 131 -15 216 36 47 -46 -203 169 268 18 50 -66 -81 61 -22 95 89 54 19 -144 -94 84 106 -23 -72
5218g2o7K95n5p7j58J54J7r8P1L3N7n2M0pj18J22l11R8J64j21N3L8K6J6J5J4m1
$$ -72 -139 156 101 24 -134 20 37 -61 10 43 100 48 88 81 -37 85 -226 -128 36 -85 -32 6 32 48 63 77 36
5245C6j13R5o6J9j1j00K15k47L04N5l5k60P7J05Q1M3k75J19K7N8j52J38k60P9
$$ 36 -77 18 -48 -29 -40 -140 75 -172 132 187 152 -108 -31 74 155 198 -77 42 69 127 -25 113 -147 -68
5269f8n9P5J40r8j65J30J00j80J45ml84M97n3k49J67K0P5q4O6J4m5o5J8L6O8j13
$$ -68 -127 -52 88 -10 -175 -45 55 -125 20 16 -368 129 76 -173 -6 14 89 5 71 85 40 -25 -7 29 97 -16
5295a6k9J90j73l3p7K85j46J0O1J5m4o7J8K26l19M36l19J10j68O4q3K2J86j44
$$ -16 -45 145 -28 -61 -138 147 1 11 72 87 43 -24 -6 220 -99 337 18 128 -40 24 -59 -37 149 5
5319EJ92k24P9o1l1J61j53M3k4J47q9k58L90j49l1n8J67m2q5K49k03O1j07J93
$$ 5 197 -27 52 -9 -40 121 -32 11 -13 134 45 -213 177 28 -3 -61 106 64 -21 228 25 86 -21 172
5343A72l81K98o3k29M25k00o2ML09k39J17l86J04N6n0K39j10k22K66P5m6n0O9
$$ 172 -209 89 26 -203 222 22 -40 -36 273 34 151 -235 -131 -75 -125 114 4 -218 48 123 77 27 96
5366I6k17j0O2O6L3j17K19M7q7n6O5m7j25Q2o8J37j10J17k96J65J39j0r8j43m6
$$ 96 -121 -131 -69 -3 30 -87 132 179 92 36 101 54 -71 11 -57 80 -30 87 -209 -44 95 85 -13 -156 -202
5391b02R7J37Q2M6k51O8j31J93l3J84k86j27R2R6k00K44J1M1o9K9R8k91K85m00
$$ -202 -105 32 114 160 -91 -23 -154 39 6 190 -96 -223 -131 -35 -235 9 20 61 -8 21 119 -172 113 -287
5415b87K59p2J1M8J37p1P3k7l02M7Q0L4K9p2M3j56K25k4M8J0J19l8j74q2O5j87
$$ -287 -28 -100 -89 -41 96 25 98 71 -231 -184 -104 -70 -41 -113 -70 -226 -1 -25 23 33 152 114 -60 -142 -77 -264
5441b64J72K4L3l11M67j3j1j66J39j22o7K58k32J2Q6J48k45J1J17K9N4j11j38
$$ -264 -92 -68 -35 -346 121 108 97 -69 70 -52 -119 139 -93 -81 5 153 -92 -81 36 65 119 8 -130
5464a30l6R7j23K11N2l2n2m1K08lk0j87N8%j06J19O3j15O4n6K70k74r1J45J87
$$ -130 -166 -69 -192 19 71 39 -13 -54 154 151 131 -56 2 2 -104 15 78 -37 27 -29 241 -33 -124 21 208
5489B08k43l9L30j37J60l73K20n0L4j22q1K15k19M32j11k39J04k09L34l9o4N1
$$ 208 -35 -74 256 119 279 -94 126 76 110 -12 -93 122 -97 335 224 -15 89 -120 214 175 111 162
5511A62j3j39J34k24K51O6l66Q9o7K4L13J4k55J04j84K02J2J81j05j14k73L02
$$ 162 149 10 144 -80 171 237 -129 -40 -107 -83 230 244 -11 93 -91 111 123 304 199 85 -188 114
5533A14j09J00n6J48j67L9K6Q0j84M2K37l30K71l1k29J08r8J13N4k16R4l7J38
$$ 114 5 105 49 197 30 69 95 175 -9 33 270 -60 211 180 -49 59 -39 74 128 -88 6 -31 107
5556A07q9J17r7j6j63J38k32J46J86q6m9J36rk22J19n3m3P8J63l33J87m6r9K38
$$ 107 18 135 38 22 -141 -3 -235 -89 97 11 -38 98 89 -133 -14 -67 -110 -32 131 -202 -15 -61 -160 78
5580G8p5o2K03j35P3j9rj06R8J6j58K00j66o6K42M6j55L4p7r5L26p4m7P8J4j69
$$ 78 3 -59 144 9 82 63 54 -52 46 62 -96 104 -62 -128 114 160 5 39 -38 -133 193 119 72 150 164 -5
5606ej68K07n5L7J05k55O6k8K22j33J0P9J84j58j41Q7p9j28P2K08j34j35J29k4
$$ -5 -173 34 -21 16 121 -134 -68 -96 126 -7 3 82 266 108 -33 54 -25 -153 -81 127 -7 -142 -13 -37
5630c7J71j60N1K5j13P8n0n6J71q7M2kj06J4J96k43J14O7K0L9p4J2k44L1L18l07
$$ -37 134 -26 25 50 -63 15 -35 -91 80 -7 35 33 -73 -59 137 -106 8 75 95 134 60 72 -172 -141 177 -130
5656a30K95k62L8j3N5P4l15K63k01J12J7K9K2j6K6j5kj04K16%o5l2K12k1j96J26
$$ -130 165 -97 -59 -72 -17 57 -258 5 -196 -84 -67 -38 -16 -32 -6 -21 -23 -127 89 89 24 -8 204 183 -13 113
5682A13r8O2p3j9J3Mj6K4j7Q3M1o3N0qj26j0J44l66L18o6j2Q4l0j06L7J25j10
$$ 113 15 77 4 -15 -2 2 -14 10 -7 76 117 54 104 96 -30 -40 104 -262 56 -10 -22 62 32 -74 -37 88 -22
5709b2L8P6j63L0J46l17J37j25J94K12q4k9o7J89k36l6J63K0N8j76k1j68M2J47
$$ -22 16 92 -71 -41 105 -212 -75 -200 -6 206 122 93 26 215 -21 -57 106 126 184 8 -13 -181 -139 8
5733Hp9N6J03n7k08m9N8nJ4K68o9j73J67k88L85k5j01j5J64p8j21J52q5P7k73
$$ 8 -71 -15 88 31 -177 -226 -168 -173 -159 109 40 -133 34 -254 131 106 5 -10 154 76 -45 107 22 99 -174
5758a74K99p8j02l1Q6j18K81l22M7J76j07K80l09p9K25j05j39K13M7j19P4Rj84
$$ -174 125 47 -55 -86 0 -118 163 -159 -112 64 -43 237 -72 -151 74 -31 -170 43 90 -29 45 54 -130
5781a30K31k43L11j07l56K05Q9p8K20k82J15Kj8P6j5j91K97r1m8J24l02K61J06
$$ -130 101 -142 169 62 -294 -89 0 -78 142 -140 -25 -23 -41 35 20 -171 126 35 -13 111 -191 70 176
5804A76m11L72nN8j54J4rr5M9l6j6k9J11j10J52j1j93l8J47J27j42j02K52j18
$$ 176 -235 137 132 190 36 50 41 -54 -5 -41 -57 -86 25 -85 67 56 -137 -175 -28 99 -43 -145 107 -11
5828a1P5m4k10L63l10J41l0J9J50j45J90j94O6Po1j39oK24k05n2K57o4M7q2j7
$$ -11 64 20 -190 173 -137 4 -26 -7 143 -2 188 -6 60 67 6 -133 -139 85 -120 -172 85 21 68 -14 -31
5853c1L06j48k46K22k19LK4J15J80j26L4r9j03J18Kk88K89j36J30l7j24J86J3
$$ -31 275 127 -119 103 -116 -113 -89 26 206 80 114 15 -88 30 32 -256 33 -103 27 -10 -134 52 65
5876F5J9k24J43j27r5K35l3P0Kr8L6N1l4j00K32k02J87q0R6j03o2q6J8J00J82
$$ 65 84 -140 3 -124 -219 16 -17 53 55 -43 -7 44 10 -90 142 -60 127 47 143 40 -22 -108 -90 10 192
5901A92j47j06l3l83N77k57K13j6jQ5k71K80k05R0j60J88J52k36O4J22j23K1J2
$$ 192 45 -61 -94 -477 100 -157 56 40 39 124 -147 133 -72 18 -142 46 198 -38 26 148 25 46 58
5924E8p6J01j12n5J04O1l8J06k78J9J73q7R4j30M4j36L02L3q0q8J02Nk86J93R4
$$ 58 -18 83 -29 -84 20 81 43 149 -129 -110 63 -24 70 -60 -16 -152 150 183 103 15 117 122 -164 29 123
5949A23k91K39k50O7J98jj3P5k46J12P3j87Q9j26O7K0J25k50P5K62k09J71k17
$$ 123 -168 71 -179 -112 86 85 72 147 -99 13 86 -101 -12 -138 -71 -51 74 -176 -101 161 -48 123 -94
5972i4p0M53l20O6Q0j23k86L36jk59L95k30K2Jj23J59n4J19R3l47K36J10m9j17
$$ -94 -164 289 -31 35 115 -8 -294 42 41 -218 177 -53 -31 -30 -153 6 -48 71 164 -183 53 163 114 -3
5996cj28N2L08l83O3J22jO9r5l0k7L3M9N8J0Qk79K18N3m0j15Q9j63J29J2J33q4
$$ -3 -131 -79 229 -154 -91 31 30 99 4 -26 -53 -20 29 87 97 105 -174 44 97 57 -58 31 -132 -3 9 142 58
6023E8k33J83J5Q2r7j61L30qj86j23J22n2j4J96j38j05p8J77M0Q0r2k34K21j5
$$ 58 -175 8 23 105 8 -153 177 169 -17 -140 -18 -70 -84 112 -26 -131 -209 -32 8 88 -4 -238 -17 -32
$$ [...]
8191a10
##END NTUPLES=NMR FID
##END=
