##TITLE=1H_Pr C2-Boc
 CDCl3
 8 sc, 
 14.12.2022
##JCAMPDX= 6.0         $$ Bruker NMR JCAMP-DX V2.0
##DATA TYPE= NMR FID
##DATA CLASS= NTUPLES
##ORIGIN= UXNMR, Bruker Analytische Messtechnik GmbH
##OWNER= root
$$ XWIN-NMR		Version 3.5
$$ Wed Dec 14 14:43:42 2022 Russian Standard Time (UT+4h)  she@DPX200
##.OBSERVE FREQUENCY= 200.13135
##.OBSERVE NUCLEUS= ^1H
##.DELAY= (6, 6)
##.ACQUISITION MODE= SIMULTANEOUS
##.ACQUISITION SCHEME= undefined
##.AVERAGES= 8
##.DIGITISER RES= 18
##SPECTROMETER/DATA SYSTEM= spect
##.PULSE SEQUENCE= zg30
##.SOLVENT NAME= CDCl3
##.SHIFT REFERENCE= (INTERNAL, CDCl3, 0, 15.7039)
##AUDIT TRAIL= $$ (NUMBER, WHEN, WHO, WHERE, WHAT)
$$ ##TITLE= Audit trail, XWIN-NMR		Version 3.5
$$ ##JCAMPDX= 5.01
$$ ##ORIGIN= Bruker BioSpin GmbH
$$ ##OWNER= she
$$ F:/spectra/data/she/nmr/H-F/1/audita.txt
$$ ##AUDIT TRAIL=  $$ (NUMBER, WHEN, WHO, WHERE, WHAT)
(   1,<2022-12-14 14:41:49.14 +0400>,<she>,<DPX200>,
      <created by zg, POWCHK disabled, PULCHK disabled
       configuration hash MD5:
       00 E9 B6 7A A2 85 ED C7 34 08 36 98 17 FE 4E 26
       data hash MD5: 16K
       F4 E2 9B 6B 2F D7 5B DD CF FD 9D D6 15 68 30 81>)
$$ ##END=
$$ 
$$ hash MD5
$$ 5C 76 DB 06 C2 EA 37 D6 D8 31 89 0B 66 17 8D BB
##$RELAX= 
##$RELAX= 
##$RELAX= 
##$RELAX= 
##$RELAX= 
##$RELAX= 
$$ Bruker specific parameters
$$ --------------------------
##$DU= <F:/spectra>
##$EXPNO= 1
##$NAME= <H-F>
##$PROCNO= 1
##$TYPE= <nmr>
##$USER= <she>
##$AMP= (0..31)
100 100 100 100 100 100 100 100 100 100 100 100 100 100 100 100 100 100 
100 100 100 100 100 100 100 100 100 100 100 100 100 100 
##$AQSEQ= 0
##$AQ_mod= 1
##$AUNM= <au_zg>
##$AUTOPOS= <>
##$BF1= 200.13
##$BF2= 200.13
##$BF3= 200.13
##$BF4= 200.13
##$BF5= 200.13
##$BF6= 200.13
##$BF7= 200.13
##$BF8= 200.13
##$BYTORDA= 1
##$CFDGTYP= 0
##$CFRGTYP= 5
##$CHEMSTR= <none>
##$CNST= (0..31)
1 1 145 1 1 1 1 1 1 1 1 1 1 1 1 1 1 1 1 1 1 1 1 1 1 1 1 1 1 1 1 1 
##$CPDPRG= <>
##$CPDPRG1= <>
##$CPDPRG2= <>
##$CPDPRG3= <>
##$CPDPRG4= <mlev>
##$CPDPRG5= <mlev>
##$CPDPRG6= <mlev>
##$CPDPRG7= <mlev>
##$CPDPRG8= <mlev>
##$CPDPRGB= <>
##$CPDPRGT= <>
##$D= (0..31)
0 1.2 0 0 0 0 0 0 0 0.06 0 0.03 0 0 0 0 0.0002 0 0 0 0 0 0 0 0 0 0 0 0 
0 0 0 
##$DATE= 1671014508
##$DBL= (0..7)
120 120 120 120 120 120 120 120 
##$DBP= (0..7)
150 150 150 150 150 150 150 150 
##$DBP07= 0
##$DBPNAM0= <>
##$DBPNAM1= <>
##$DBPNAM2= <>
##$DBPNAM3= <>
##$DBPNAM4= <>
##$DBPNAM5= <>
##$DBPNAM6= <>
##$DBPNAM7= <>
##$DBPOAL= (0..7)
0.5 0.5 0.5 0.5 0.5 0.5 0.5 0.5 
##$DBPOFFS= (0..7)
0 0 0 0 0 0 0 0 
##$DE= 6
##$DECBNUC= <off>
##$DECIM= 32
##$DECNUC= <off>
##$DECSTAT= 4
##$DIGMOD= 1
##$DIGTYP= 9
##$DL= (0..7)
0 120 120 120 120 120 120 120 
##$DP= (0..7)
150 150 150 150 150 150 150 150 
##$DP07= 0
##$DPNAME0= <>
##$DPNAME1= <>
##$DPNAME2= <>
##$DPNAME3= <>
##$DPNAME4= <>
##$DPNAME5= <>
##$DPNAME6= <>
##$DPNAME7= <>
##$DPOAL= (0..7)
0.5 0.5 0.5 0.5 0.5 0.5 0.5 0.5 
##$DPOFFS= (0..7)
0 0 0 0 0 0 0 0 
##$DQDMODE= 0
##$DR= 18
##$DS= 0
##$DSLIST= <SSSSSSSSSSSSSSS>
$$ [...]
##$SUBNAM2= <"">
##$SUBNAM3= <"">
##$SUBNAM4= <"">
##$SUBNAM5= <"">
##$SUBNAM6= <"">
##$SUBNAM7= <"">
##$SUBNAM8= <"">
##$SUBNAM9= <"">
##$SW= 18.05172834244
##$SWIBOX= (0..15)
0 0 2 0 0 0 0 0 0 0 0 0 0 0 0 0 
##$SW_h= 3612.71676300578
##$TD= 16384
##$TD0= 1
##$TE= 0
##$TE2= 300
##$TE3= 300
##$TEG= 300
##$TL= (0..7)
0 120 120 120 120 120 120 120 
##$TP= (0..7)
150 150 150 150 150 150 150 150 
##$TP07= 0
##$TPNAME0= <>
##$TPNAME1= <>
##$TPNAME2= <>
##$TPNAME3= <>
##$TPNAME4= <>
##$TPNAME5= <>
##$TPNAME6= <>
##$TPNAME7= <>
##$TPOAL= (0..7)
0.5 0.5 0.5 0.5 0.5 0.5 0.5 0.5 
##$TPOFFS= (0..7)
0 0 0 0 0 0 0 0 
##$TUNHIN= 0
##$TUNHOUT= 0
##$TUNXOUT= 0
##$USERA1= <user>
##$USERA2= <user>
##$USERA3= <user>
##$USERA4= <user>
##$USERA5= <user>
##$V9= 5
##$VALIST= <valist>
##$VCLIST= <CCCCCCCCCCCCCCC>
##$VD= 0
##$VDLIST= <DDDDDDDDDDDDDDD>
##$VPLIST= <PPPPPPPPPPPPPPP>
##$VTLIST= <TTTTTTTTTTTTTTT>
##$WBST= 1024
##$WBSW= 4
##$XGAIN= (0..3)
0 0 0 0 
##$XL= 0
##$YL= 0
##$YMAX_a= 622773
##$YMIN_a= -678211
##$ZGOPTNS= <>
##$ZL1= 120
##$ZL2= 120
##$ZL3= 120
##$ZL4= 120
##$ABSF1= 10
##$ABSF2= 0
##$ABSG= 5
##$ABSL= 3
##$ALPHA= 0
##$AQORDER= 0
##$ASSFAC= 0
##$ASSFACI= 0
##$ASSFACX= 0
##$ASSWID= 0
##$AUNMP= <proc_1d>
##$AZFE= 0.1
##$AZFW= 0.1
##$BCFW= 1
##$BC_mod= 2
##$BYTORDP= 1
##$COROFFS= 0
##$CY= 11.3945322036743
##$DATMOD= 1
##$DC= 2
##$DFILT= <>
##$DTYPP= 0
##$F1P= 2.36226072786647
##$F2P= -0.459571619588291
##$FCOR= 0.5
##$FTSIZE= 0
##$FT_mod= 4
##$GAMMA= 1
##$GB= 0.15
##$INTBC= 1
##$INTSCL= 1
##$ISEN= 128
##$LB= 0.24
##$LEV0= 0
##$LPBIN= 0
##$MAXI= 10000
##$MC2= 0
##$MEAN= 0
##$ME_mod= 0
##$MI= 1.114404
##$NCOEF= 0
##$NC_proc= 0
##$NLEV= 6
##$NOISF1= 3.799351
##$NOISF2= 2.8
##$NSP= 1
##$NTH_PI= 0
##$NZP= 0
##$OFFSET= 15.70392
##$PC= 1
##$PHC0= -19113.14
##$PHC1= 17.40072
##$PH_mod= 1
##$PKNL= yes
##$PPARMOD= 0
##$PSCAL= 0
##$PSIGN= 0
##$REVERSE= no
##$SF= 200.130013532006
##$SI= 16384
##$SIGF1= 3
##$SIGF2= 2
##$SINO= 400
##$SIOLD= 16384
##$SREGLST= <1H.CDCl3>
##$SSB= 0
##$STSI= 0
##$STSR= 0
##$SW_p= 3612.71676300578
##$SYMM= 0
##$S_DEV= 0
##$TDeff= 0
##$TDoff= 0
##$TI= <>
##$TILT= no
##$TM1= 0
##$TM2= 0
##$TOPLEV= 0
##$USERP1= <user>
##$USERP2= <user>
##$USERP3= <user>
##$USERP4= <user>
##$USERP5= <user>
##$WDW= 1
##$XDIM= 8192
##$YMAX_p= 0
##$YMIN_p= 0
$$ End of Bruker specific parameters
$$ ---------------------------------
##NTUPLES= NMR FID
##VAR_NAME=  TIME,          FID/REAL,        FID/IMAG
##SYMBOL=    X,             R,               I
##VAR_TYPE=  INDEPENDENT,   DEPENDENT,       DEPENDENT
##VAR_FORM=  AFFN,          ASDF,            ASDF
##VAR_DIM=   8192,          8192,            8192
##UNITS=     SECONDS,       ARBITRARY UNITS, ARBITRARY UNITS
##FACTOR=    0.0002768,     1,               1
##FIRST=     0,             0,               0
##LAST=      2.2672688,     0,               0
##MIN=       0,             -678211,         0
##MAX=       2.2672688,     622773,          0
$$ Real data points
##PAGE= N=1
##DATA TABLE= (X++(R..R)), XYDATA
$$ plain form
0 0 0 0 0 0 0 0 0 8 -8 8 -8 11 -16 24 -24 32 -40 49 -64 72 -88 104 -128 149 -175 201 -237 274 -316 361
30 361 -414 474 -540 609 -686 773 -872 978 -1092 1217 -1357 1509 -1673 1854 -2048 2266
46 2266 -2501 2757 -3036 3344 -3687 4061 -4475 4936 -5452 6036 -6698 7454 -8330 9363
60 9363 -10600 12108 -13997 16442 -19748 24481 -31856 44994 -75418 293439 -161969 -570644
72 -570644 398119 150403 -370082 86444 237646 -428059 -26493 622773 -98552 -559982
82 -559982 345604 331245 -460520 -88521 359629 -258199 -237379 437138 92078 -443270
92 -443270 180213 370558 -381264 -176489 441653 -149481 -431141 335515 297212 -361043
102 -361043 -33585 352598 -162944 -201120 347859 -53971 -487927 247028 433366 -357095
$$ packed form
0@%%%%%%%Qj6J6j6J9k7M0m8N6p2Q9j13J36j60J92k32K77l24L76m38N11n90O77
30C61p75Q88j014J149j295J459j645J850k070K309k574K866l182L527l902M314
46B266m767N258n793O380p031P748q536R411j0388J1488j2734J4152j5784J7693
60I363j9963K2708k6105L0439l6190M4229n6337P6850j20412L68857m55408m08675
72e70644R68763k47716n20485M56526J51202o65705M01566O49266p21325m61430
82e59982R05586j4359p91765L71999M48150o17828K0820O74517l45060n35348
92d43270O23483J90345p51822K04775O18142n91134k81660P66656l8303o58255
102c61043L27458L86183n15542l8176N48979m01830m33956P34955J86338p90461
$$ plain form
112 -357095 -228222 379879 39567 -249186 167281 51889 -376731 104839 419834 -292611
122 -292611 -337844 400794 176894 -336262 47875 196812 -240180 -57590 320327 -126346
132 -126346 -327691 291894 242991 -337967 -20767 317732 -167919 -210078 261052 45083
142 45083 -295040 97989 245603 -209987 -86723 301290 -97871 -294821 233831 174291
152 174291 -311474 -60923 264896 -58908 -148568 182652 8271 -252359 155497 235739
162 235739 -291050 -158127 309189 39558 -225800 87352 120407 -160289 29015 210618
172 210618 -175373 -198833 267627 99006 -278971 29935 212183 -121019 -93305 175057
182 175057 -32197 -198534 131638 140471 -222978 -35824 238788 -87384 -173068 175881
$$ packed form
112c57095J28873O08101l40312k88753M16467j15392m28620M81570L14995p12445
122b92611m5233P38638k23900n13156L84137J48937m36992J82590L77917m46673
132a26346k01345O19585m8903n80958L17200L38499m85651m2159M71130k15969
142D5083l40123L93029J47614m55590J23264L88013l99161j96950N28652n9540
152A74291m85765K50551L25819l23804q9660L31220j74381k60630M07856Q0242
162B35739n26789J32923M67316k69631k65358L13152L3055k80696J89304J81603
172B10618l85991k3460M66460j68621l77977L08906J82248l33202K7714K68362
182A75057k07254j66337L30172Q833l63449J87154K74612l26172q5684L48949
$$ plain form
192 175881 77580 -202373 12636 173709 -100881 -103219 173536 -2960 -182336 134602
202 134602 143365 -204804 -60960 207497 -20277 -163318 85447 84355 -135924 27813 154010
213 154010 -142781 -116230 205357 29588 -210257 39823 150676 -98106 -69394 137860
223 137860 -29156 -142485 131580 92870 -197170 -4964 194175 -76520 -131892 135407
233 135407 59455 -151815 32961 143166 -120608 -81562 177607 -19455 -171713 112721
243 112721 112593 -163443 -35806 168221 -46392 -144728 114460 67871 -165706 34564 152994
254 152994 -132176 -88440 180296 6364 -174682 66817 133233 -124664 -54880 161302
264 161302 -44629 -137727 143656 68995 -184189 23628 169906 -95678 -115306 143736
$$ packed form
192A75881r8301k79953K15009J61073k74590k338K76755j76496j79376L16938
202A34602Q763l48169J43844K68457k27774j43041K48765j092k20279J63737J26197
213A54010k96791K6551L21587j75769k39845K50080J10853k48782K8712K07254
223A37860j67016j13329K74065l8710k90040J92206J99139k70695n5372K67299
233A35407p5952k11270J84776J10205k63774L9046K59169j97062j52258K84434
243A12721j28k76036J27637K04027k14613r8336K59188m6589k33577K00270J18430
254A52994k85170M3736K68736j73932j81046K41499O6416k57897O9784K16182
264A61302k05931r3098K81383p4661k53184K07817J46278k65584j9628K59042
$$ plain form
274 143736 35871 -162771 61126 130952 -151900 -51803 183956 -52535 -160218 124733
284 124733 89750 -165110 -6917 165200 -84911 -121972 161423 31527 -184431 76990
294 76990 144990 -149803 -59095 179391 -26903 -158653 111674 104669 -170020 -8418 180016
305 180016 -97701 -124720 167897 29159 -181656 61311 143141 -135688 -78889 173044
315 173044 -19455 -170074 116206 101773 -179228 -96 176964 -93387 -123531 153646
325 153646 46047 -173016 49342 153571 -134922 -75110 187419 -28244 -168156 122257
335 122257 100006 -168519 -9432 169227 -81034 -130166 153533 45395 -188956 58445
345 58445 153701 -147954 -72223 177865 -28475 -159425 109592 100241 -165873 -12909 179857
$$ packed form
274A43736j07865j98642K23897O9826k82852J00097K35759k36491j07683K84951
284A24733l4983k54860J58193J72117k50111l7061K83395j29896k15958K61421
294G6990O8000k94793R0708K38486k06294j31750K70327p005k74689J61602J88434
305A80016k77717k7019K92617j38738k10815K42967Q1830k78829N6799K51933
315A73044j92499j50619K86280j4433k81001J79132J77060k70351l0144K77177
325A53646j07599k19063K22358J04229k88493N9812K62529k15663j39912K90413
335A22257k2251k68525J59087J78659k50261m9132K83699j08138k34351K47401
345E8445R5256l01655P5731K50088k06340j30950K69017r351k66114J52964J92766
$$ plain form
356 179857 -86375 -131405 164387 40367 -178451 62950 142081 -131552 -66701 168131
366 168131 -18943 -159608 109090 102754 -169936 -7162 170873 -90536 -117864 146324
376 146324 32573 -162357 48665 133549 -125539 -71602 167319 -24041 -156912 111590
386 111590 90620 -156207 -1046 151955 -76714 -106735 137282 39324 -159247 52042
396 52042 137340 -127022 -60954 160770 -29262 -137854 101586 79952 -143039 -7442 147059
407 147059 -74408 -112744 136190 32348 -157180 54422 118578 -120107 -52314 141869
417 141869 -22578 -129576 90928 84970 -137083 -6472 144405 -73331 -96109 128446
427 128446 24192 -133776 49256 108750 -101555 -56010 133281 -14677 -126460 86113
$$ packed form
356A79857k66232m5030K95792j24020k18818K41401P9131k73633O4851K34832
366A68131j87074j40665K68698o336k72690J62774J78035k61409k7328K64188
376A46324j13751j94930K11022Q4884k59088N3937K38921j91360j32871K68502
386A11590k0970k46827J55161J53001k28669l0021K44017r7958j98571K11289
396E2042Q5298k64362O6068K21724j90032j08592K39440k1634k22991J35597J54501
407A47059k21467l8336K48934j03842j89528K11602O4156k38685O7793J94183
417A41869j64447j06998K20504n958k22053J30611J50877k17736k2778K24555
427A28446j04254j57968J83032N9494k10305M5545J89291j47958j11783K12573
$$ plain form
437 86113 73410 -129734 562 122237 -69886 -85863 108471 27909 -126184 34012 107406
448 107406 -95638 -54055 125575 -20245 -109565 83284 62272 -112381 -1805 116681
458 116681 -52374 -89400 102054 38237 -119049 33576 96223 -88886 -40167 110416 -20738
469 -20738 -102728 68278 70972 -104522 -22799 110391 -41847 -83231 88065 22062 -103781
480 -103781 36289 85230 -78714 -50723 102013 5965 -100939 48642 71274 -87020 -11975
491 -11975 95993 -42884 -68383 81452 30892 -94521 13524 90641 -58504 -62506 89584
502 89584 8312 -91852 43237 56393 -78553 -12671 85463 -33799 -79952 71005 51791
513 51791 -96987 -5688 90695 -43442 -50482 74337 -1012 -76491 49052 66408 -80564
$$ packed form
437H6113j2703k03144J30296J21675j92123j5977J94334q0562j54093J60196P3394
448A07406k03044M1583J79630j45820q9320J92849k1012j74653J10576J18486
458A16681j69055l7026J91454o3817j57286J52625O2647j85109M8719J50583j31154
469b0738q1990J71006K694j75494Q1723J33190j52238m1384J71296o6003j25843
480a03781J40070M8941j63944K7991J52736r6048j06904J49581K2632j58294P5045
491a1975J07968j38877k5499J49835n0560j25413J08045P7117j49145m002J52090
502H9584q1272j00164J35089J3156j34946O5882R8134j19262m6153J50957j9214
513E1791j48778R1299R6383j34137p040J24819p5349p5479J25543J7356j46972
$$ plain form
524 -80564 -37678 100803 -1933 -88909 48447 47803 -73512 7969 70898 -55095 -51961 82009
536 82009 20277 -96085 16611 82408 -60093 -45398 79194 -9678 -70917 51536 40292
547 40292 -74561 -2909 82551 -36508 -70421 76400 39061 -91636 10169 77572 -46190
558 -46190 -34174 65335 -11178 -65510 55211 54792 -91258 -26503 103832 -16585 -83337 48931
570 48931 32058 -62970 20269 54721 -66633 -39152 96069 8109 -105754 31077 80857
581 80857 -62348 -27773 70746 -25787 -52673 67824 26989 -88072 10435 92460 -49693
592 -49693 -66060 82709 18898 -85458 30948 59731 -62569 -20658 72129 -25314 -69105
603 -69105 67993 42872 -101959 -2765 101301 -39974 -68389 60477 17085 -59683 35014
$$ packed form
524h0564M2886J38481j02736q6976J37356o44j21315Q1481O2929j25993L134J33970
536H2009o1732j16362J12696O5797j42501J4695J24592q8872o1239J22453j1244
547D0292j14853P1652Q5460j19059l3913J46821l7339j30697J01805O7403j23762
558d6190J2016R9509p6513n4332J20721m19j46050O4755J30335j20417o6752J32268
570D8931j6873r5028Q3239L4452j21354K7481J35221q7960j13863J36831M9780
581H0857j43205L4575R8519r6533k6886J20497m0835j15061R8507Q2025j42153
592d9693j6367J48769o3811j04356J16406K8783j22300M1911R2787r7443m3791
603f9105J37098k5121j44831R9194J04066j41275k8415J28866m3392p6768R4697
$$ plain form
614 35014 46255 -79393 -18179 110735 -17590 -105567 55250 68413 -68079 -9075 58944
625 58944 -42856 -33181 82610 1007 -103681 37017 92849 -73447 -52590 83694 -6246
636 -6246 -68008 51732 31280 -79268 7471 83316 -50853 -65595 86832 23379 -98670
647 -98670 28875 79796 -62649 -35402 73020 -9831 -59247 56203 33118 -91311 8990
658 8990 104672 -51490 -82739 75322 36109 -70698 12761 42883 -57523 -9817 86433
669 86433 -32203 -96889 68280 71080 -87338 -23789 73742 -25184 -39167 60740 -230 -77367
681 -77367 41795 76585 -75593 -44973 94116 -1515 -78475 46340 42226 -67580 1202
692 1202 68333 -40539 -50962 73077 13737 -91259 31590 78191 -69569 -43730 76593
$$ packed form
614C5014J1241j25648O1214J28914j28325q7977J60817J3163j36492N9004O8019
625E8944j01800R675J15791q1603j04688J40698N5832j66296K0857J36284q9940
636f246o1762J19740k0452j10548Q6739P5845j34169j4742J52427o3453j22049
647i8670J27545N0921j42445K7247J08422q2851m9416J15450k3085j24429J00301
658H990R5682j56162l1249J58061l9213j06807Q3459L0122j00406M7706R6250
669H6433j18636o4686J65169K800j58418O3549R7531r8926j3983R9907o0970p7137
681g7367J19162L4790j52178L0620J39089r5631p6960J24815m114j09806O8782
692A202O7131j08872j0423J24039n9340j04996J22849M6601j47760K5839J20323
$$ plain form
703 76593 -265 -61169 35680 28339 -65010 12530 79748 -55394 -68384 85492 35800 -82918
715 -82918 6369 56583 -36367 -15010 57868 -24797 -64023 64500 51443 -88021 -17386 83101
727 83101 -22330 -52801 46810 9865 -57342 26625 50767 -60750 -31406 79289 -6581
738 -6581 -75905 43560 46441 -63246 -7494 60835 -24529 -41380 51112 13467 -64367 27387
750 27387 62660 -61306 -35798 76808 2703 -63863 25131 35515 -42602 -1329 50181 -37788
762 -37788 -46947 68071 21955 -80456 7497 62019 -32274 -30734 41486 -4698 -42855 37986
774 37986 33612 -63482 -8921 72704 -20602 -54300 43916 24126 -47255 8890 41601 -33262
786 -33262 -25140 53440 -130 -59107 32349 43175 -55282 -15258 55611 -13736 -43639 30822
$$ packed form
703G6593p6858o0904R6849p341r3349P7540O7218j35142j2990J53876m9692j18718
715h2918Q9287N0214r2950K1357P2878q2665l9226J28523j3057j39464P0635J00487
727H3101j05431l0471R9611l6945o7207Q3967K4142j11517K9344J10695q5870
738f581o9324J19465K881j09687N5752O8329q5364j6851R2492l7645p7834R1754
750B7387L5273j23966K5508J12606p4105o6566Q8994J0384p8117M1273N1510q7969
762c7788r159J15018m6116j02411Q7953N4522r4293J540P2220m6184l8157Q0841
774C7986m374r7094N4561Q1625r3306l3698R8216j9790p1381N6145L2711p4863
786c3262Q122P8580n3570n8977R1456J0826r8457M0024P0869o9347k9903P4461
$$ plain form
798 30822 20647 -44522 6638 45547 -39890 -31732 60787 3987 -60381 21187 42782 -33676
810 -33676 -16166 40613 -9914 -36609 40856 22494 -59316 5395 58437 -29102 -37478 40105
822 40105 11355 -40207 13512 32329 -38144 -17078 52500 -11299 -51291 35288 28805 -47016
834 -47016 -3967 42643 -18211 -31365 35503 13193 -45816 14746 42921 -39271 -20035 51604
846 51604 -4120 -43753 25301 29813 -36015 -8970 42153 -16869 -35785 41638 13184 -52775
858 -52775 12689 42761 -32612 -25514 39386 2817 -41255 19434 30992 -42371 -8935 50710
870 50710 -19298 -39651 39081 18384 -42861 4795 40005 -23823 -26684 43067 5100 -47563
882 -47563 23903 35187 -42318 -10560 45169 -12685 -37384 29283 21437 -43197 -266 44340
$$ packed form
798C0822j0175o5169N1160L8909q5437Q158R2519n6800o4368Q1568K1595p6458
810c3676J7510N6779n0527k6695P7465j8362q1810O4711N3042q7539q376P7583
822D0105k8750n1562N3719J8817p0473K1066O9578o3799l9992Q6579o483p5821
834d7016M3049M6610o0854j3154O6868k2310n9009O0562K8175q2192J9236P1639
846E1604n5724l9633O9054M512o5828K7045N1123n9022j8916P7423k8454o5959
858e2775O5464L0072p5373P098O4900l6569m4072O0689J1558p3363L3436N9645
870E0710p0008k0353P8732k0697o1245M7656L5210o3828k861O9751l7967n2663
882d7563P1466J1284p7505L1758N5729n7854k4699O6667p846o4634M2931M4606
$$ plain form
894 44340 -28224 -31082 45041 3473 -46133 19962 32887 -35370 -14786 43402 -6819 -41251
906 -41251 32249 26281 -46896 3240 46112 -26512 -27619 40656 7157 -42810 15269 37292
918 37292 -36322 -19762 48327 -8963 -44376 32624 22062 -44528 1200 40496 -23125 -31484
930 -31484 39051 11301 -48574 14885 41069 -37903 -17359 46481 -8370 -37498 29074 23998
942 23998 -40378 -2550 46250 -20442 -35826 42077 12516 -46920 15010 35096 -33564 -15991
954 -15991 40755 -5775 -41701 26676 28684 -45387 -5967 46523 -21857 -32102 37709 8213
966 8213 -40841 13478 35587 -31555 -20316 46529 -2115 -44736 29095 28336 -41789 -1270 40771
979 40771 -19713 -28433 35600 11294 -44593 10759 40767 -34363 -22477 44330 -5443 -39503
$$ packed form
894D4340p2564k858P6123m1568m9606O6095J2925o8257K0584N8188n0221l4432
906d1251P3500n968p3177N0136M2872p2624j107O8275l3499m9967N8079K2023
918C7292p3614J6560O8089n7290l5413P7000j0562o6590M5728L9296o3621q359
930c1484P0535k7750n9875O3459K6184p8972K0544O3840n4851k9128O6572n076
942B3998o4376L7828M8800o6692j5384P7903k9561n9436O1930K0086o8660J7573
954a5991N6746m6530l5926O8377K008p4071L9420N2490o8380j0245O9811k9496
966H213m9054N4319K2109o7142J1239O6845m8644m2621P3831p59p0125M0519M2041
979D0771o0484q720O4033k4306n5887N5352L0008p5130J1886O6807m9773l4060
$$ plain form
991 -39503 25205 21620 -37721 -3406 40360 -18172 -34349 37530 15071 -45358 11287 36844
1003 36844 -30422 -15585 38615 -3685 -34977 23606 26728 -38456 -6658 44490 -17617 -33044
1015 -33044 35053 10820 -38802 10562 30460 -27814 -18413 37603 -1536 -41040 22794 28046
1027 28046 -38985 -5804 38308 -16800 -26273 30151 10709 -36036 8640 35766 -26437 -21759
1039 -21759 40589 -85 -36729 22393 21918 -32191 -3390 34050 -13496 -29381 29135 15223
1051 15223 -39524 5172 34129 -26080 -18175 33331 -2920 -31470 17811 22399 -30228 -9163
1063 -9163 36824 -10422 -30698 28917 13729 -33842 7938 28747 -21440 -15667 30990 2686
1075 2686 -33148 15309 27116 -30178 -8772 34186 -12187 -25748 24676 10036 -31106 3427
$$ packed form
991c9503O4708l585n9341L4315M3766n8532j6177P1879k2459o0429N6645K5557
1003C6844o7266J4837N4200m2300l1292N8583L122o5184L1798N1148o2107j5427
1015c3044O8097k4233m9622M9364J9898n8274R401N6016l9139l9504O3834N252
1027B8046o7031L3181M4112n5108r473N6424j9442m6745M4676K7126o2203M678
1039b1759O2348m0674l6644N9122m75n4109K8801L7440m7546j5885N8516j3912
1051A5223n4747M4696K8957o0209P905N1506l6251k8550M9281M588n2627K1065
1063i163M5987m7246k0276N9615j5188m7571M1780K0809n0187N773M6657k8304
1075B686l5834M8457J1807n7294K1406M2958m6373j3561N0424j4640m1142L4533
$$ plain form
1087 3427 29131 -19337 -22543 30679 4298 -33779 14837 22194 -27253 -5242 29722 -9109
1099 -9109 -24886 22526 16876 -30873 -335 32509 -16757 -19375 28435 2004 -26866 14144
1111 14144 20316 -24514 -10931 30937 -3529 -30577 18583 17303 -28844 815 25070 -17648
1123 -17648 -16048 25372 4531 -29448 7860 27087 -21097 -15141 29115 -2847 -24480 19268
1135 19268 13038 -25041 995 26904 -12208 -22639 24347 11890 -30485 5435 25297 -20466
1147 -20466 -11169 24656 -5395 -23246 16380 16304 -27447 -6830 31111 -8905 -25937 21179 9967
1160 9967 -24605 7428 19285 -19305 -9974 28187 1079 -30364 13065 25401 -23342 -8379
1172 -8379 25241 -8902 -16726 20999 5467 -26781 5178 27156 -17845 -21551 26352 5344
$$ packed form
1087C427K5704m8468l206N3222k6381l8077M8616P357m9447K2011L4964l8831
1099i109j5777M7412n650m7749L0538L2844m9266k618M7810k6431k8870M1010
1111A4144O172m4830J3583M1868l4466k7048M9160j280m6147K9659K4255m2718
1123a7648J600M1420k0841l3979L7308J9227m8184N956M4256l1962k1633M3748
1135A9268o230l8079K6036K5909l9112j0431M6986j2457m2375L5920J9862m5763
1147b0466R297L5825l0051j7851L9626p6m3751K0617L7941m0016j7032M7116j1212
1160I967l4572L2033J1857l8590R331L8161k7108l1443M3429J2336m8743J4963
1172h379L3620l4143p824L7725j5532l2248L1959K1978m5001l706M7903k1008
$$ plain form
1184 5344 -27961 10976 16637 -22085 -3711 23795 -9805 -21727 21084 14442 -29540 22
1196 22 30133 -14714 -17928 23846 2369 -21187 12765 15563 -22762 -5748 30733 -6660 -30093
1209 -30093 19693 18528 -26021 -1383 20530 -14081 -11112 22665 -1016 -28738 12336 26378
1221 26378 -24408 -15637 28437 -1408 -21517 15666 8502 -21832 5160 24251 -15813 -19893
1233 -19893 27212 9830 -30294 7201 23718 -18862 -8486 22425 -6111 -19411 17143 12042
1245 12042 -27427 -1438 30169 -14277 -24663 23518 8823 -24232 6157 15762 -17415 -5292
1257 -5292 24944 -6538 -27073 20286 21600 -28412 -6076 26686 -7831 -14528 18100 1318
1269 1318 -21638 12007 22240 -23917 -15110 30865 840 -28191 12470 14366 -20323 103
$$ packed form
1184E344l3305L8937N661l8722J8374K7506l3600j1922M2811o642m3982K9562
1196B2L0111m4847l214M1774k1477k3556L3952K798l8325J7014L6481l7393k3433
1209c0093M9786j165m4549K4638K1913l4611K969L3777k3681k7722M1074J4042
1221B6378n0786Q771M4074k9845k0109L7183p164l0334K6992J9091m0064m080
1233a9893M7105j7382m0124L7495J6517m2580J0376L0911k8536j3300L6554n101
1245A2042l9469K5989L1607m4446j0386M8181j4695l3055L0389R605l3177J2123
1257e292L0236l1482k0535M7359J314n0012K2336L2762l4517o697L2628j6782
1269A318k2956L3645J0233m6157Q807M5975l0025k9031M0661J896l4689K0426
$$ plain form
1281 103 19459 -13801 -16540 23390 7297 -30001 6234 26536 -19179 -13796 24016 -782 -19230
1294 -19230 13373 11592 -20932 352 25901 -13101 -22291 25376 11615 -27807 3398 20198
1306 20198 -13629 -8263 18092 -5127 -20562 17275 15983 -28473 -6386 29140 -8079 -20817
1318 -20817 15738 5945 -18029 7258 16366 -18418 -10236 27391 -80 -27724 13329 19148 -19759
1331 -19759 -3848 19815 -8023 -13494 17453 5534 -23332 5579 23030 -18382 -15177 24472
1343 24472 726 -22285 9314 12685 -16500 -2667 18492 -9446 -17458 20974 9312 -27127
1355 -27127 3333 23191 -12277 -11872 16709 1040 -15327 11242 13177 -20545 -3326 26060
1367 26060 -7696 -21695 16852 10141 -18899 1670 14867 -11950 -9441 18929 -180 -22975
$$ packed form
1281A03J9356l3260k739L9930j6093l7298L6235K0302m5715N383L7812k4798j8448
1294a9230L2603j781l2524K1284K5549l9002r190M7667j3761l9422L1205J6800
1306B0198l3827N366K6355k3219j5435L7837j292m4456K2087L5526l7219j2738
1318b0817L6555r793k3974K5287R108l4784Q182L7627k7471k7644M1053N819l8907
1331a9759J5911K3663k7838n471L0947j1919k8866K8911J7451m1412L205L9649
1343B4472k3746k3011L1599L371k9185J3833K1159k7938q012L8432j1662l6439
1355b7127L0460J9858l5468M05K8581j5669j6367K6569J935l3722J7219K9386
1367B6060l3756j3999L8547o711k9040K0569J3197k6817K509K8370j9109k2795
$$ plain form
1379 -22975 10944 17711 -20623 -6906 21240 -5250 -15735 12835 7293 -16905 2770 18620
1391 18620 -12899 -12661 22222 2542 -22215 9308 15658 -14332 -5454 16291 -3709 -14513 13626
1404 13626 8311 -21506 1451 21186 -12733 -14469 16629 2989 -16480 5224 12152 -13634
1416 -13634 -5984 19413 -4701 -19036 15010 11429 -19109 -40 17243 -7588 -10808 14316
1428 14316 4046 -16953 6371 16010 -16058 -7508 20220 -3560 -17142 11230 9621 -15525
1440 -15525 -2234 15631 -7445 -13318 15813 4153 -20311 6404 15748 -14202 -7738 16465
1452 16465 -670 -14908 8959 11029 -15422 -1917 18978 -8265 -13622 16660 5225 -17069
1464 -17069 4082 14553 -10504 -9127 15460 333 -17564 9661 11658 -17541 -2346 17157
$$ packed form
1379b2975L3919O767l8334J3717K8146k6490j0485K8570n542k4198J9675J5850
1391A8620l1519K38L4883j9680k4757L1523O350k9990Q878K1745k0000j0804K8139
1404A3626n315k9817K2957J9735l3919j736L1098j3640j9469K1704O928k5786
1416a3634P650K5397k4114j4335L4046l581l0538J9069J7283k4831l220K5124
1428A4316j0270k0999K3324R639l2068Q550K7728k3780j3582K8372j609k5146
1440a5525J3291J7865k3076n873K9131j1660k4464K6715R344k9950O464K4203
1452A6465j7135j4238K3867K070k6451J3505K0895k7243n357L0282j1435k2294
1464a7069K1151J0471k5057J377K4587j5127j7897K7225J997k9199J5195J9503
$$ plain form
1476 17157 -7698 -13082 12836 6183 -16283 1476 15807 -10910 -10078 17632 -259 -16516 10285
1489 10285 11199 -14683 -2740 16351 -4150 -14146 12432 8361 -17384 2437 16042 -12137 -8601
1502 -8601 15867 -332 -16048 7147 12094 -14070 -6408 17184 -4128 -15463 12857 6830 -16728
1515 -16728 2844 14334 -10073 -9737 14851 3037 -16845 6366 14296 -13727 -4675 17163 -4942
1528 -4942 -12960 12519 6513 -15704 386 16161 -8469 -12334 15282 2975 -17152 6640 11303
1541 11303 -14145 -3932 15367 -4183 -14310 10865 9739 -16368 -1099 17270 -8565 -10367
1553 -10367 15042 1482 -14523 7306 11902 -12537 -6210 17294 -1961 -16467 10529 9614 -15622
1566 -15622 569 13881 -9360 -9151 13874 2291 -16783 4622 14600 -12862 -7994 16574 -2450
$$ packed form
1476A7157k4855n384K5918o653k2466J7759J4331k6717Q32K7710j7891j6257K6801
1489A0285R14k5882J1943J9091k0501r996K6578m071k5745J9821J3605k8179L536
1502h601K4468j6199j5716K3195M947k6164P662K3592k1312j1335K8320o027k3558
1515a6728J9572J1490k4407L36K4588j1814j9882K3211P930k8023R052K1838k2105
1528d942q018K5479o006k2217J6090J5775k4630l865K7616j2307k0127K3792M663
1541A1303k5448J0213J9299j9550j0127K5175j126k6107J5269J8369k5835j802
1553a0367K5409j3560j6005K1829M596k4439O327K3504j9255j4506K6996r15k5236
1566a5622J6191J3312k3241K09K3025j1583j9074K1405R978k7462M868K4568j9024
$$ plain form
1579 -2450 -13823 10634 6703 -14126 836 14617 -7406 -11735 14555 5630 -16632 4751 13692
1592 13692 -11811 -4782 14249 -3714 -12594 9890 8431 -15202 -2327 16291 -7091 -12694 12866
1605 12866 2963 -14464 5386 10433 -11543 -5384 14624 -1179 -15163 9347 10930 -14510 -1443
1618 -1443 14953 -6582 -8566 12347 2623 -13459 4655 13175 -10903 -8250 15472 -35 -14733
1631 -14733 8236 7653 -12653 -217 12191 -7028 -10355 11857 5108 -15803 2406 13903 -10196
1644 -10196 -6909 13088 -1791 -11174 8608 7807 -12300 -1600 15074 -4894 -12138 11858 5764
1657 5764 -13812 3494 10926 -9634 -5077 12290 -1047 -13479 7001 9928 -13291 -3793 13821
1670 13821 -5172 -10171 10313 3158 -12045 3119 10938 -8589 -7673 13436 1425 -13708 6672
$$ packed form
1579b450j1373K4457l931k0829J4962J3781k2023m329K6290q925k2262K1383Q941
1592A3692k5503P029J9031j7963q880K2484j459k3633J2875J8618k3382n603K5560
1605A2866r903j7427J9850N047k1976O159K0008j5803j3984K4510J583k5440J3067
1618a443J6396k1535j984K0913r724j6082J8114Q520k4078K653K3722j5507j4698
1631a4733K2969n83k0306J2436J2408j9219l327K2212o749k0911J8209J1497k4099
1644a0196L287J9997j4879r383J9782q01k0107J0700J6674j9968p244K3996o094
1657E764j9576J7306P432k0560M557J7367j3337j2432K0480K927k3219R498J7614
1670A3821j8993m999K0484p155j5203J5164P819j9527R16K1109j2011j5133K0380
$$ plain form
1683 6672 9260 -11096 -1531 11865 -4684 -8714 9701 5426 -12848 984 12890 -8209 -8267
1696 -8267 11716 230 -11255 6134 7182 -10649 -2713 11649 -3165 -12062 8946 6848 -12921
1709 -12921 1250 11085 -7420 -5531 10848 580 -11089 5002 9912 -9683 -4758 12995 -2344
1722 -2344 -10436 8751 4659 -10753 1390 9606 -6663 -7922 10409 2521 -13113 3692 9883
1735 9883 -9817 -3989 10747 -3407 -8644 7929 5154 -11006 -381 12273 -5240 -9281 10594
1748 10594 3009 -10877 4457 7962 -8590 -2605 10577 -1682 -10918 6700 7999 -11221 -1960
1761 -1960 11011 -5242 -6962 8983 734 -10323 3844 9133 -8560 -6172 11448 276 -11279
1774 -11279 6592 6438 -9361 425 9697 -5289 -6693 9422 3776 -11363 1958 11137 -7649
$$ packed form
1683F672K588k0356R565J3396j6549m030J8415m275j8274J3832J1906k1099n8
1696h267J9983j1486j1485J7389J048j7831P936J4362j4814q897K1008k098j9769
1709a2921J4171R835j8505J889J6379j0268j1669J6091M910j9595M925J7753j5339
1722b344q092J9187m092j5412J2143Q216j6269j259J8331p888j5634J6805O191
1735I883j9700N828J4736j4154n237J6573k775j6160J0625J2654j7513m041J9875
1748A0594p585j3886J5334L505j6552N985J3182j2259r236J7618J299j9220R261
1761a960J2971j6253j720J5945q249j1057J4167N289j7693K388J7620j1172j1555
1774a1279J7871j54j5799R786R272j4986j404J6115n646j5139J3321R179j8786
$$ plain form
1787 -7649 -5723 10358 -1143 -8710 6396 4836 -9678 -1145 10627 -4316 -10082 8529 4889
1800 4889 -11277 1566 8443 -6792 -3514 8865 -1210 -9522 6221 8343 -9806 -3490 11932
1813 11932 -2354 -8438 7963 2741 -8609 3136 8216 -7178 -5896 10639 1568 -11970 4119
1826 4119 8501 -8869 -2165 8524 -4317 -6603 7700 3095 -10394 967 10663 -6470 -7500
1839 -7500 10233 1496 -9369 4718 5867 -7530 -699 9285 -3313 -8634 8190 6149 -11058
1852 -11058 -188 10185 -5278 -5251 7744 -797 -7991 4805 6353 -9368 -3876 11411 -1740
1865 -1740 -10281 6374 4924 -8477 1308 6978 -5656 -4423 9314 1044 -10892 3831 9690
1878 9690 -8156 -4100 9600 -1597 -6665 6459 2924 -8134 1183 8848 -5764 -7720 9679
$$ packed form
1787g649J926J6081j1501p567J5106j560j4514Q533J1772j4943n766J8611l640
1800D889j6166J2843O877j5235L278J2379j0075q312J5743K122j8149O316J5422
1813A1932j4286o084J6401n222j1350J1745N080j5394J282J6535r071j3538J6089
1826D119M382j7370O704J0689j2841k286J4303m605j3489J1361R696j7133j030
1839g500J7733q737j0865J4087J149j3397O831R984j2598n321J6824k041j7207
1852a1058J0870J0373j5463K7J2995q541p194J2796J548j5721N492J5287j3151
1865a740q541J6655j450j3401R785N670j2634J233J3737q270j1936J4723N859
1878I690j7846M056J3700j1197n068J3124l535j1058R317P665j4612j956J7399
$$ plain form
1891 9679 2301 -10495 3045 6828 -6837 -2284 7363 -2674 -7099 6704 4755 -10271 -602
1904 -602 11003 -4516 -6927 7705 1470 -6997 3402 5376 -6998 -2373 9982 -1436 -9892
1917 -9892 6531 6351 -8807 -591 7476 -4175 -4296 6844 676 -8784 3530 8125 -7925 -4841
1931 -4841 9780 -1162 -8303 5162 3965 -7071 485 7144 -4224 -5609 8502 2470 -9914
1944 -9914 2887 8676 -6459 -3455 7422 -1042 -5790 4924 3623 -8174 -536 9397 -4757
1957 -4757 -7934 7633 2541 -7904 1769 5154 -5435 -2419 7035 -1369 -8056 5862 5961 -8488
1971 -8488 -1068 8878 -2893 -4947 6035 1470 -6195 2226 6410 -5782 -3918 8987 -423 -8623
1985 -8623 4822 4915 -6541 -1089 6075 -2923 -5491 5741 2350 -8606 1773 7865 -6321 -4420
$$ packed form
1891I679p378j2796J3540L783j3665M553R647j0037m425J3803j949j5026R669
1904f02J1605j5519k411J4632o235q467J0399J974j2374M625J2355j1418q456
1917i892J6423j80j5158Q216Q067j1651j21J1140o168r460J2314M595j6050L084
1931d841J4621j0942p141J3465j197j1036P556O659j1368j385J4111o032j2384
1944i914J2801N789j5135L004J0877q464m748J0714j301j1797P638R933j4154
1957d757l177J5567n092j0445R673L385j0589L016R454q404o687J3918R9j4449
1971h488P420R946j1771k054J0982m565p665Q421M184j2192J864J2905r410q200
1985h623J3445R3j1456N452P164q998k568J1232l391j0956J0379O092j4186J901
$$ plain form
1999 -4420 7710 -178 -6088 3508 4355 -5585 -717 7262 -2782 -6510 7251 3184 -8167 1456
2013 1456 6525 -4442 -3146 5849 275 -6605 3563 5368 -7295 -1855 8143 -3122 -6752 5412
2027 5412 2613 -6216 806 5479 -3763 -4037 6763 389 -7607 4169 5766 -6626 -1181 6766
2041 6766 -1583 -5007 4429 3255 -6252 476 6958 -4724 -4371 7549 18 -6971 3076 4366
2055 4366 -5226 -2177 5673 -1271 -6333 4830 3271 -7357 735 6638 -4168 -3705 5856 961
2069 961 -5916 2087 5343 -5169 -2421 7476 -1696 -6088 5399 2995 -6488 558 5697 -3129 -4479
2084 -4479 5057 1380 -6852 2204 5277 -6289 -2162 6429 -1950 -5476 3962 3415 -5527 -726 6328
2099 6328 -2862 -4773 6357 1166 -6352 3091 4847 -5137 -2009 6059 -386 -5758 3428 4252 -6202
$$ packed form
1999d420J2130p888n910R596Q47r940M868P979j0044l728J3761m067j1351R623
2013A456N069j0967J296Q995n574o880J0168J805j2663N440R998j1265l630J2164
2027E412k799q829P022M673r242k74J0800o374p996J1776J597j2392N445P947
2041F766q349l424R436j174r507O728O482j1682L53J1920p531o989J0047J290
2055D366r592L049P850o944n062J1163j559j0628Q092N903j0806M63R561m895
2069I61o877Q003L256j0512K748R897r172m392J1487k404r483P046N139q826j350
2084d479R536l677q232R056L073j1566M127Q591q379l526R438n47q942M801P054
2099F328r190j911J1130n191p518R443J756r984L128Q068o445n372R186Q24j0454
$$ plain form
2114 -6202 -474 6304 -3832 -4212 5692 705 -6103 1926 4931 -4355 -3385 5938 -447 -5983 4162
2129 4162 3325 -6020 581 5722 -2853 -4092 4928 2291 -5832 1287 5705 -4209 -2674 6275 -1241
2144 -1241 -5100 4019 2923 -5574 -1130 5799 -2022 -5476 4641 1853 -6277 1639 4553 -4905 -1928
2159 -1928 5553 -674 -5754 2990 4397 -5048 -1661 6290 -2222 -4298 5133 1265 -5188 1964 4754
2174 4754 -3718 -3069 5449 765 -6036 2755 4137 -5486 -619 5200 -2935 -3928 4414 1840 -5965
2189 -5965 453 5708 -3488 -3748 5735 -24 -5237 3294 3181 -4633 -445 5574 -1382 -4864 4406
2204 4406 2908 -5652 590 4913 -3444 -2225 5033 -779 -4894 2757 3985 -4977 -2258 5537 -1230
2219 -1230 -5021 4115 1732 -5280 1211 4037 -3465 -2580 4791 1115 -5711 2027 4525 -4509 -1266
$$ packed form
2114f202N728O778j0136l80R904m987o808Q029L005r286R70R323o385n536J0145
2129D162q37r345O601N141q575j239R020k637q123P119M418r914J535Q949p516
2144a241l859R119j096q497M444O929p821l454J0117k788q130P916K914r458K977
2159a928P481o227n080Q744J407r445L387P951q512k076R431l868o453P152K790
2174D754q472O49Q518m684o801Q791J382r623M867N819q135r93Q342k574p805
2189e965O418N255r196k60R483n759n213Q531j13p814M188O019o956l482R270
2204D406j498q560O242M323q357J219P258n812m115P651J228q962K719P795o767
2219a230l791R136k383p012O491K826p502Q85P371l676o826P738K498r034L243
$$ plain form
2234 -1266 5352 -1542 -3597 4131 1514 -4879 359 5090 -2813 -3917 4431 791 -5322 2299 3018
2249 3018 -4499 -634 4460 -1789 -4498 3175 2969 -5209 -426 5191 -2795 -3032 4532 126 -4331
2264 -4331 2621 3569 -3900 -1555 5482 -537 -4905 3486 2706 -4822 465 3953 -3034 -2575 4155 599
2280 599 -4781 1485 4214 -4138 -2421 4748 -1080 -4185 3408 1638 -4367 318 4624 -2149 -3577
2295 -3577 4293 1744 -5063 1450 4165 -3568 -1068 4485 -1004 -3487 3035 2435 -4371 -676 4641
2310 4641 -2057 -3879 3836 1003 -4497 1646 3020 -3449 -1635 4242 -203 -4421 2641 3346 -4270
2325 -4270 -340 4107 -2304 -2284 3863 878 -4215 1298 4140 -2993 -2426 4664 88 -4009 2629 1999
2341 1999 -4025 83 3663 -2068 -3366 3372 1659 -4610 473 4052 -3143 -1852 3953 -725 -3598
$$ packed form
2234a266O618o894k055P728k617o393N238M731p903j104Q348l640o113P621P19
2249C018p517L865N094o249k709P673k06q178M783N617p986k37P564m406m457
2264d331O952R48p469K345P037o019m368Q391p80p528N287L488o987M59O730l556
2280E99n380O266K729q352J717P169n828l105P593j770o005M685M306o773j428
2295c577P870k549o807O513K715p733K500N553n489k483O522o00o806L695N317
2310D641o698j822P715k833n500O143J374o469J814N877m445m218P062P05p616
2325d270L930M447o411K0O147k985n093N513K842p133N67P090m576m097O638o30
2341A999o024M108L580n731j298O738j713o269N083L579p195J291N805m678k873
$$ plain form
2356 -3598 2594 2133 -3676 -978 4559 -979 -3671 3563 1544 -4111 1227 3356 -3229 -1327 3631
2371 3631 -5 -4110 1804 3429 -3793 -1394 3900 -1772 -2898 3325 843 -3897 778 3517 -2580
2386 -2580 -2863 3871 918 -4090 2079 2617 -3334 -344 3683 -1537 -2579 3388 1844 -3922 194
2401 194 4298 -2233 -2632 3774 -7 -3401 2207 1884 -3561 -819 3843 -902 -3922 2857 2086 -4069
2417 -4069 271 3119 -2342 -1670 3550 -328 -3854 1864 3214 -3252 -1667 4289 -908 -3306 2982
2432 2982 1264 -3234 991 2916 -2365 -2382 3672 921 -4357 1272 3190 -3127 -1237 3209 -1405
2447 -1405 -2525 2779 1608 -3866 37 3878 -1909 -3050 3459 994 -3491 1722 2211 -2777 -423
2462 -423 3523 -1288 -3251 2468 2759 -3802 -214 3596 -1858 -2122 2699 20 -3223 1725 2470 -3027
$$ packed form
2356c598O192m61n809K698N537n538k692P234k019n655N338K129o585J902M958
2371C631l636m105N914J625p222K399N294n672j126O223k482m740M675K739o097
2386b580k83O734k953n008O169N38n951K990M027n220j042N967j544n766M116
2401A94M104o531l99O406l781l394N608l23n445K742M662m745l020O779p71o155
2417d069M340K848n461O72N220l878l526N718J350o466J585N956n197k398O288
2432B982j718m498M225J925n281j7O054k751n278N629J918o317J890M446m614
2447a405j120N304j171n474L903L841n787j141O509k465m485N213M89m988K354
2462d23L946m811j963N719K91o561L588L810n454k64M821k679l243M948P45n497
$$ plain form
2478 -3027 -1729 3648 -368 -3782 2193 1849 -3193 411 2634 -2016 -1575 3183 817 -3615 1058
2493 1058 3821 -2773 -1580 3702 -779 -2631 2364 1249 -2643 130 3261 -1730 -2913 2998 1138
2508 1138 -3713 558 2557 -2317 -979 3048 -862 -2860 2280 2204 -3496 -717 3918 -1425 -2639
2523 -2639 2825 586 -2756 1183 1943 -2337 -1267 3419 -153 -3741 2174 2107 -3256 -526 2644 -1303
2539 -1303 -1728 2338 437 -3108 854 3000 -2660 -1867 3590 93 -3123 1637 1691 -2504 72 2714
2555 2714 -1367 -2172 2833 1464 -3620 850 3119 -2180 -1396 2617 -352 -2487 1606 1615 -3149 -880
2571 -880 3574 -1512 -3033 2501 1051 -2944 676 2055 -1857 -1040 2693 45 -2872 1617 2712
2586 2712 -3018 -724 3240 -969 -1962 1961 950 -2295 373 2525 -1930 -1883 3034 219 -3348 1454
$$ packed form
2478c027J298N377m016l414N975l44n042L604K223m650M41M758k366m432M673
2493A058K763o594J193N282m481j852M995j115l892K773L131m991j183N911j860
2508A138m851M271J999m874J338M027l910j998N140p6n700K779M635n343j214
2523b639N464k239l342L939P60m280J070M686l572l588N915o7n363K730L170l947
2539a303m25M066j901l545L962K146n660P93N457l497l216M760N4m195K576K642
2555B714m081q05N005j369n084M470K269n299P84M013k969k135M093Rm764K269
2571h80M454n086j521N534j450l995L620J379l912Q17L733k648k917M489J095
2586B712n730K294L964m209r93L923j011l245K668K152m455M7M917k815l567M802
$$ plain form
2602 1454 2003 -2274 -352 2154 -1007 -2240 2073 1165 -2807 210 3100 -1844 -1668 2911 173 -2054
2618 -2054 1291 1489 -2165 -794 2775 -603 -2642 2233 1448 -3140 563 2449 -1826 -1341 2003 311
2634 311 -2458 978 2089 -2823 -1156 3035 -777 -2394 1913 1082 -2279 63 2157 -1132 -1807 2533
2650 2533 748 -2938 1243 2343 -2384 -631 2551 -623 -1849 1665 1436 -2307 -150 2576 -1725
2665 -1725 -1905 2534 307 -2647 1099 1744 -2197 -1066 2224 -163 -2427 1765 1498 -2781 241 2617
2681 2617 -1448 -1722 2283 480 -1920 339 2066 -1449 -1098 2587 -369 -2273 2140 1195 -2638 -121
2697 -121 2104 -914 -1925 1549 608 -2540 435 1972 -2556 -1205 2690 -453 -2125 1304 1213 -1970
2713 -1970 -459 2391 -943 -1889 2387 782 -2530 1128 1941 -1650 -1042 2085 156 -2031 1042 1602
$$ packed form
2602A454N49m277J922K506l161j233M313r08l972L017K890m944J76M579k738k227
2618b054L345J98l654J371L569l378k039M875p85m588L703J886m275M85L344j692
2634C11k769L436J111m912J667M191l812j617M307q31l361K342K094l289o75M340
2650B533j785l686M181J100m727J753L182l174j226L514k29l743K157K726m301
2665a725j80M439k227k954L746O45l941J131L290k387k264M192k67m279L022K376
2681B617m065k74M005j803k400K259J727l515L51L685k956j904M413r45l833K517
2697a21K225l018j011L474r41l148K975J537m528J351L895l143j672L429r1l183
2713a970J511K850l334r46M276j605l312L658Q13l591O08L127j929k187L073N60
$$ plain form
2729 1602 -2025 -434 2670 -1311 -1632 2162 288 -2562 202 1871 -1378 -1297 2248 66 -2293 1481
2745 1481 1422 -2270 132 2228 -1055 -1562 1745 1084 -1884 341 2293 -1371 -1128 2502 -638 -1974
2761 -1974 1445 1139 -2078 -586 2329 -456 -2121 1730 1048 -2320 676 1738 -1851 -884 2091 -77
2777 -77 -1907 1024 1737 -1577 -619 2322 -845 -1694 2039 745 -1996 576 2032 -1195 -1318 1827
2793 1827 439 -2170 785 1589 -2092 -403 2118 -1256 -1605 1502 573 -2025 31 1894 -963 -1215
2809 -1215 1956 -374 -1954 1428 1034 -1655 -269 2213 -288 -1971 1382 1304 -2039 86 1913 -1511
2825 -1511 -816 1766 -281 -1832 977 1421 -1652 -1076 1992 -323 -1951 1437 789 -1960 383 1507
2841 1507 -1285 -1116 1967 462 -1826 461 1957 -1295 -582 1926 -882 -1295 1618 957 -1825 87
$$ packed form
2729A602l627J591L104l981l21L794j874k850K764J669l249Q1L545k182k359L774
2745A481n9l692K402K096l283n07L307o61k968K225J952l664K43L630l140j336
2761a974L419l06l217J492K915k785j665L851o82l368K996J062l589R67K975k168
2777g7j830K931P13l314R58K941l167q49L733j294k741K572J456l227j23L145
2793A827j388k609K955Q04l681J689K521l374l49L107r29k598K056J863k857k52
2809a215L171k330j580L382l94k689J386K482k501j683L353p8l343K125J827l424
2825a511O95K582k047j551K809M44l073N76L068k315j628L388o48k749K343J124
2841A507k792J69L083j505k288K287J496l252P13K508k808m13K913o61k782J912
$$ plain form
2857 87 1947 -706 -1710 1677 381 -2047 747 1240 -1774 -155 1715 -792 -1576 1153 1247 -1795
2873 -1795 -177 1781 -939 -1307 1670 -77 -1509 1048 1377 -1344 -647 2217 18 -1491 1189 1183
2889 1183 -1801 177 1606 -1252 -903 1426 318 -2096 368 1735 -1351 -1112 2020 -533 -1377 1372
2905 1372 519 -1682 112 1495 -526 -1423 1537 960 -1728 494 1514 -1212 -468 1705 -548 -1378
2921 -1378 897 1007 -1670 -496 1978 -635 -1358 1615 200 -1637 547 1084 -1373 -659 1534 129
2937 129 -1847 800 1692 -1582 -89 1666 -1110 -762 1538 412 -1619 670 1663 -1118 -898 1725
2953 1725 247 -1636 1163 866 -1625 122 1563 -918 -1426 983 518 -1802 -89 1711 -1182 -562
2969 -562 1606 -464 -1290 1173 645 -1100 -317 1823 -349 -1538 1171 802 -1532 538 1020 -1402
$$ packed form
2857H7J860k653j004L387j296k428K794M93l014J619J870k507p84K729R4l042
2873a795J618J958k720l68K977j747j432K557L29k721O97K864k199j509K680o
2889A183k984J978J429k858L49K329j108k414K464J367l086K39L132k553q44K749
2905A372q53k201J794J383k021q97K960n77k688K222J020k726P44K173k253q30
2921a378K275J10k677J174K474k613p23K973j415j837K184N37k457P14K193j405
2937A29j976K647Q92l274J493J755k776L48K300j126k031K289R93k781K20K623
2953A725j478j883K799k97k491J747J441k481n08K409m65k320J713J800k893O20
2969e62K168k070q26K463n28j745P83K140k172j189K709l69k334K070M82k422
$$ plain form
2985 -1402 -529 1391 52 -1668 594 1409 -1512 -636 1413 -453 -942 1253 213 -1225 371 1172
3001 1172 -818 -1080 1515 364 -1625 718 1043 -1458 132 1321 -680 -948 1340 682 -1454 169
3017 169 1786 -776 -892 1404 62 -1265 1020 674 -1354 -327 1185 -257 -1641 914 949 -1592
3033 -1592 271 1410 -960 -731 1413 -90 -1313 501 1121 -1233 -682 1685 -245 -1139 1212 431
3049 431 -1191 254 1010 -996 -687 1229 82 -1636 379 1004 -1389 -52 1006 -725 -789 1163
3065 1163 527 -1340 241 1745 -658 -1100 1550 264 -1184 715 827 -787 -142 1416 -239 -1417
3081 -1417 825 960 -1375 -36 1514 -668 -722 1043 -110 -1391 568 732 -1214 -636 1405 -310
3097 -310 -1401 1059 589 -1283 167 848 -663 -659 1252 191 -1381 201 1655 -995 -599 1261 -278
$$ packed form
2985a402Q73J920j339j720K262Q15k921Q76K049j866m89K195j040j438J596Q01
3001A172j990k62K595j151j989K343L25k501J590J189k001k68K288o58k136J623
3017A69J617k562j16K296j342j327K285l46k028J027J512j442j384K555L5k541
3033a592J863J139k370K29K144j503j223J814O20k354N51K367j930q94K351p81
3049D31j622J445P56k006L09J916j147j718K015O25k393J337J058j731o4J952
3065A163o36j867J581J504k403m42K650j286j448J899J12j614O45J558j655j178
3081a417K242J35k335J339J550k182n4J765j153j281J959J64j946N78K041j715
3097c10j091K460m70j872J450O81j511MJ911j061j572J582J454k650L96J860j539
$$ plain form
3114 -278 -775 968 554 -1080 215 1361 -583 -1255 1148 484 -1437 440 1025 -1173 -239 1055 -477
3131 -477 -1023 782 859 -1282 172 1741 -561 -1173 1327 367 -921 460 758 -949 -557 1236 142
3148 142 -1112 845 997 -1561 -72 958 -600 -444 951 -216 -1276 379 1180 -1062 -953 1312
3164 1312 -7 -1155 828 636 -894 265 866 -578 -740 1094 706 -1246 244 1203 -943 -546
3180 -546 906 197 -851 452 599 -1236 -60 1381 -693 -1069 1104 88 -1149 251 787 -559
3196 -559 -505 1064 116 -895 491 993 -1128 31 1197 -647 -745 720 144 -811 286 609 -942
3213 -942 -632 1388 44 -1333 671 935 -859 -164 1010 -461 -923 823 162 -1087 196 1319
3229 1319 -989 -834 1155 -61 -870 319 701 -662 -411 1138 -434 -777 1058 435 -1331 72
$$ packed form
3114b78m97J743m14j634J295J146j944o72K403o64j921J877N85k198R34J294j532
3131d77n46J805P7k141J454J569k302o12K500r60j288J381K98j707L92J793j094
3148A42j254J957J52k558J489J030j558J56J395j167j060J655Q01k242J09K265
3164A312j319j148J983j92j530J159O01j444j62J834l88j952J490R59k146L97
3180e46J452p09j048J303J47j835J176J441k074l76K173j016j237J400N36j346
3196e59N4J569r48j011J386N02k121J159J166j844r8J465n76r55J097L23j551
3213i42L10K020j344j377K004K64j794O95J174j471m62J746o61j249J283J123
3229A319k308J55J989j216q09J189L82j363K51J549j572l43J835o23j766J403
$$ plain form
3245 72 1138 -587 -525 674 -150 -937 218 756 -1134 -500 1210 -541 -868 878 321 -1039 -97 780
3263 780 -282 -526 852 255 -1377 733 867 -1091 -418 893 -181 -754 498 593 -883 -42 1063
3280 1063 -563 -617 948 35 -1206 513 875 -658 -434 761 -225 -1045 519 436 -1096 287 1153
3297 1153 -780 -679 939 349 -813 122 842 -646 -146 1233 -134 -1176 839 612 -1154 183
3313 183 933 -639 -471 653 412 -1083 389 833 -1188 -314 1214 -603 -825 733 245 -823 140
3330 140 875 -383 -505 1079 263 -1164 559 936 -799 -141 799 -288 -920 319 835 -696 -149
3347 -149 762 -730 -658 959 40 -1080 202 398 -539 -618 930 -35 -959 826 540 -1066 84 970
3365 970 -396 -747 597 353 -859 2 921 -656 -440 1269 -545 -916 572 572 -1037 -497 669 -494
$$ packed form
3245G2J066j725O2J199q24p87J155N38j890O34J710j751l27J746n57j360R42Q77
3263G80j062k44J378n97j632K110J34j958O73J311j074n73J252R5j476Q41J105
3280A063j626n4J565r13j241J719L62j533K24J195r86q20J564q3j532J383Q66
3297A153j933J01J618n90j162R35P20j488N00J379j367j042K015k27j766J337
3313A83P50j572J68J124k41j495J472M44k021Q74J528j817k22J558m88j068R63
3330A40P35j258j22J584q16j427J723L77j735O58R40j087o32J239N16j531N47
3347a49R11j492P2J617r19j120J282J96r37p9J548r65r24J785k86j606J150Q86
3365I70j366l51J344k44j212Q61R19j577K16J709j814l71J488%j609N40J166j163
$$ plain form
3383 -494 -880 627 102 -1233 547 895 -869 -272 980 -66 -1099 486 743 -785 -164 988 -662
3400 -662 -579 802 -210 -1002 357 623 -676 -607 843 -1 -1049 548 294 -990 -5 992 -676 -809
3418 -809 643 388 -868 44 891 -408 -844 786 -282 -916 785 724 -935 23 848 -162 -672 662
3436 662 640 -785 57 735 -877 -238 918 -265 -889 431 817 -572 -296 795 -138 -680 792 -14
3454 -14 -893 437 672 -631 -627 775 219 -544 119 600 -723 -134 905 -504 -771 851 266 -869
3472 -869 -52 727 -466 -741 627 -42 -936 717 459 -873 -162 699 -388 -693 498 435 -752 -120
3490 -120 927 -640 -432 878 -97 -848 626 757 -399 -228 584 123 -760 756 634 -956 144
3507 144 585 -663 -570 681 62 -923 222 799 -737 -488 1029 -268 -676 819 342 -513 49 874
$$ packed form
3383d94l86J507n25j335J780L48j764N97J252j046j033J585K57j528O21J152j650
3400f62Q3J381j012p92J359K66j299O9J450q44j048J597k54j284R85R97j668j33
3418h09J452k55j256R12Q47j299m36J630j068o34J701o1j659R58Q25j010n10J334
3436F62k2j425Q42O78j612O39J156j183o24J320L86j389K76J091r33n42J472q06
3454a4q79J330K35j303MJ402n56p63O63M81j323N89J039j409k67J622n85j135
3472h69Q17P79j193k75J368o69q94J653k58j332P11Q61j087l05J191o3j187O32
3490a20J047j567K08J310r75p51J474J31j156J71Q12m61q83J516j22j590J100
3507A44M41j248R3J251o19r85J145N77j536K49J517j297m08J495m77q55N62Q25
$$ plain form
3525 874 -238 -625 641 498 -765 362 616 -946 -152 643 113 -610 466 490 -831 -243 831 -430
3543 -430 -486 583 -475 -894 430 506 -523 -429 686 -21 -787 358 754 -860 66 533 -393 -290 954
3562 954 96 -637 99 748 -371 -611 741 139 -618 515 252 -794 234 592 -427 -495 496 413 -774
3581 -774 31 855 -551 -150 664 125 -832 383 300 -722 -207 800 -23 -547 501 277 -882 203
3599 203 623 -692 -244 643 -79 -766 409 910 -584 -372 838 -569 -444 688 -127 -604 308 433
3617 433 -434 -440 915 108 -903 468 156 -543 111 678 -577 -290 526 175 -865 -182 658 -460 -383
3636 -383 612 -65 -655 440 346 -813 -79 688 -153 -931 496 590 -764 61 368 -370 -283 489 -88 -579
3656 -579 720 789 -610 -339 834 119 -379 639 214 -618 307 501 -662 -528 907 -59 -703 324
$$ packed form
3525H74j112l87J266j43j263J127K54j562P94P95n30p23J076K4j321N88J074j261
3543d30n6J069j058m19J324P6j029R4J115p07p66J145L96j614R26M67r26J03J244
3562I54q58p33P36O49j119k40J352o02p57J133k63j046J028L58j019o8R91q3j187
3581g74Q05Q24j406M01Q14n39r57J215q3j022N15J007q23n24J048k24j159J085
3599B03M20j315M48Q87p22o87J175N01j494K12J210j407J25J132q15m77R12J25
3617D33q67oJ355q07j011J371l12o99O54N67j255K87Q16l51j040O83Q40j118P7
3636c83R95o77n90J095r4j159P34P67q41p78J427R4j354Q25L07p38Q7P72n77m91
3656e79J299O9j399K71J173p15m98J018m25q32R25J94j163J34J435r66o44J027
$$ plain form
3674 324 895 -481 -264 544 -562 -492 454 168 -559 153 945 -565 -453 555 122 -781 494 387 -805
3693 -805 189 883 -402 -260 311 291 -649 -127 719 -461 -417 585 -210 -749 343 69 -834 -410 669
3712 669 -76 -939 244 524 -663 179 433 -556 -486 612 -226 -666 218 825 -511 -409 888 17 -367
3731 -367 568 104 -503 -32 625 -360 -598 719 134 -813 256 505 -599 -70 443 -158 -432 721 612
3750 612 -864 -109 1078 -220 -417 596 44 -526 429 361 -459 -120 715 -21 -722 532 522 -616 -140
3769 -140 620 -374 -318 279 278 -694 -18 814 -540 -713 881 -138 -714 546 201 -414 205 648 -293 -456
3789 -456 497 49 -778 152 884 -506 -286 543 -313 -443 346 191 -637 -108 724 -288 -638 539 388
3808 388 -621 126 332 -312 100 380 -14 -738 430 532 -749 -292 691 -257 -352 522 214 -277 109
$$ packed form
3674C24N71j376K17Q08j106P0R46k86p27P12P92j510J12J008m33r03J275j07j192
3693h05R94O94j285J42N71k0r40N22Q46j180M4J002p95n39J092k74r03M24J079
3712F69p45q63J183K80j187Q42K54r89P0J098q38m40Q84O07j336J02J297q71l84
3731c67R35m64o07M71O57r85k38J317n85r47J069K49j104N29N13o01k74J153j09
3750F12j476P55J187j298j97J013n52n70R55o8q20L39Q35p36p01J254j0j138M76
3769a40P60r94N6N97jr72O76Q32j354j73J594j019n76J260l45o15O19M43r41j63
3789d56R53m48q27R30P32j390K20Q29q56j30P89j55q28N29Q32j012l50J177j51
3808C88j009P47K06o44M12K80l94p24J168J02j281M57R83r48r5Q74l08m91L86
$$ plain form
3827 109 367 -497 -78 764 2 -1028 395 533 -751 -75 573 -227 -465 412 454 -759 283 652 -709
3846 -709 -386 563 -174 -323 269 431 -429 -130 510 -59 -423 399 506 -917 -190 516 -496 -83 330
3865 330 -133 -704 97 325 -742 -418 591 -236 -860 568 165 -422 -3 626 -212 -234 572 97 -595
3884 -595 447 429 -937 -40 477 -20 -350 116 204 -637 3 413 -459 -685 767 -66 -616 245 394 -411
3904 -411 -285 374 -258 -536 505 516 -896 235 711 -394 -419 449 109 -381 240 176 -374 -166 775 -28
3924 -28 -811 795 232 -634 -117 340 -267 -254 256 -29 -482 125 492 -567 -230 499 -209 -649 270 256
3944 256 -286 -129 338 -292 -567 307 123 -701 504 471 -331 -235 451 200 -331 436 178 -681 -3 752
3964 752 -368 -396 659 -38 -464 224 306 -381 -387 509 38 -434 508 438 -724 -37 648 -518 -306 358
$$ packed form
3827A09K58q64M19Q42p62j030J423J38j284O76O48q00k38Q77M2j213J042L69j361
3846g09L23R49p37j49N92J62q60K99O40n69l64Q22J07j423P27P06j012M13M13
3865C30m63n71Q01K28j067L24J009q27o24J428m03n87M19O29q38k2Q06m75o92
3884e95J042j8j366Q97N17m97l30M66Q8q41O40M10q72k26J452q33n50Q61J49q05
3904d11J26O59o32k78J041J1j412J131M76j105k5Q68l40m90O21o4n50K08R41q03
3924b8p83J606n63q66N17M57o07J3N10k85m53O07L67j059L37P29p08m40R19j4
3944B56n42J57M67o30k75Q74j84q24J205l3q02R6O86k51n31P67k58q59O78P55
3964G52j120k8J055o97m26O88Q2o87oQ96m71m72R42p0j162O87O85j166K12O64
$$ plain form
3984 358 13 -433 -41 607 -673 -419 656 -201 -569 404 379 -307 -203 312 -366 -533 73 23 -553 235
4004 235 415 -582 -432 374 -13 -580 100 338 -312 -316 727 -493 -401 730 222 -457 -37 376 -310 -62
4024 -62 323 -7 -727 33 261 -434 -205 382 -364 -394 267 140 -589 -69 461 -285 -253 792 55 -459 583
4045 583 204 -404 5 687 5 -654 224 435 -589 79 594 -350 -424 596 137 -280 12 120 -343 -554
4065 -554 758 -46 -597 488 41 -586 230 582 -181 -436 232 47 -412 434 422 -558 -7 670 -363
4084 -363 -406 381 145 -593 -213 531 -55 -355 238 -42 -633 113 59 -591 -29 559 -15 -411 206 528 -269
4105 -269 217 722 -59 -121 624 -147 -362 303 282 -230 -284 522 164 -157 44 275 -642 107 593 -538 -276
4126 -276 398 72 -388 -126 288 -287 -250 377 -337 -407 497 300 -474 -201 168 -227 -349 275 326 -305 -29
$$ packed form
3984C58l45m46L92O48j280K54J075q57l68R73k5o86J04N15o78j67O06n0n76P88
4004B35J80r97J50Q06l87n67O80K38o50mJ043j220R2J131n08o79M20M13o86K48
4024f2L85l30p20P60K28o95K29N87p46l0O61j27p29N20N30p46L2J045p37n14J042
4045E83l79o08M09O82o82o59Q78K11j024O68N15r44p4J020m59m17K92J08m63k11
4065e54J312q04n51J085m47o27Q16L52p63k55O68j85m59Q46j2r80N51O77j033
4084c63m3P87k36p38L80P44n86l00N93k80n91P46n4o50N62N88n74l96O17L22p97
4105b69M86N05p81o2P45p71k15O65k1n12n4Q06l58l21K01K31r17P49M86j131K62
4126b76O74l26m60K62M14n75L7O27p14p0R04j97p74K73L69l95j22O24N1o31K76
$$ plain form
4147 -29 567 -468 -27 458 -341 -452 191 345 -439 -157 549 -117 -483 449 -25 -629 146 306 -514 -16
4167 -16 647 28 -593 190 469 -219 56 644 -315 -185 343 -196 -147 41 403 -258 -490 431 -146 -381 394
4188 394 189 -694 95 370 -242 -147 334 160 -416 -43 342 -417 118 687 176 -463 429 327 -425 -135
4208 -135 404 42 -459 369 79 -210 -67 256 -521 85 156 -64 -607 8 317 -617 -149 309 60 -423
4228 -423 484 231 -417 62 324 -54 -424 388 290 -408 112 518 -485 58 442 -185 -36 385 171 -592
4248 -592 -269 568 84 -101 223 -157 -459 332 219 -428 -296 259 146 -503 253 239 -619 -89 751 -282
4268 -282 -44 579 -115 -484 -8 450 -233 -284 562 73 -300 526 35 -359 124 388 -293 -215 384 -21 -602
4289 -602 155 433 -555 -133 274 -157 -278 336 110 -367 -231 274 -198 -533 386 249 -513 345 275 -167
$$ packed form
4147b9N96j035M41M85p99j11O43J54p84K82P06o66l66R32m74o04P75J60q20M98
4167a6O63o19o21P83K79o88K75N88r59J30N28n39M9J88L62o61k32R21n77k35P75
4188C94k05q83P89K75o12R5M81j74n76L73L85p59N35N69n11o39Q92j02p52K90
4208a35N39l62n01Q28k90k89J43L23p77O06P1k20n43O15L09r34M68M58k49m83
4228d23R07k53o48M79K62l78l70Q12r8o98N20M06j003N43L84o27J49M21k14p63
4248e92L23Q37m84j85L24l80l02P91j13o47J32N55j13o49P56j4q58N30Q40j033
4268b82K38O23o94l69M76M58o83n1Q46m89l73Q26m91l94M83K64o81P8N99m05n81
4289f02P57K78r88M22M07m31j21O14k26m77J36N05m72l35R19j37p62Q58p0m42
$$ plain form
4309 -167 -220 311 -172 -293 297 130 -437 -223 565 -453 -411 281 -57 -413 173 447 -207 -169 455 60 -350
4330 -350 224 493 -415 88 279 -314 -193 279 539 -254 6 725 -231 -26 352 -10 -336 182 165 -463
4350 -463 -30 338 -14 -289 337 180 -683 -29 228 -151 -197 375 -118 -402 78 250 -349 -37 693 -37
4370 -37 -393 577 22 -543 240 313 -291 -204 400 -62 -663 215 338 -439 -79 363 73 -312 93 219 -279
4391 -279 6 519 -285 -212 455 -21 -356 352 348 -350 296 374 -56 -249 306 202 -714 -95 626 -344 -366 187
4413 187 -77 -183 62 144 -334 -333 450 -26 -498 289 215 -287 -94 245 -87 -98 648 233 -131 325 499 -385
4435 -385 -73 689 -54 -230 382 -11 -237 160 132 -123 -472 295 -196 -607 162 86 -120 -90 233 -264 -336
4456 -336 109 -19 -432 -23 712 -301 -279 518 83 -285 163 92 -187 63 484 96 -135 575 264 -526
$$ packed form
4309a67n3N31m83j21N90j67n67K14P88j018M2O92l38l56N86K74o54L8O24l95m10
4330c50N74K69r08N03J91n93J21M72K60p93K60P19r56K05L78l62l26N18j7o28
4350d63M33L68l52k75O26j57q63O54K57l79m6N72m93k84M80J72n99L12P30p30
4370c7l56R70n55n65P83P3o04Q7O04m62o01Q78J23p77L60M42k90l85M05J26m98
4391b79K85N13q04P3O67m76l35P08mo98O46P8m30j93N55j04r16O19P21r70k2N53
4413A87k64j06K45Q2m78JP83m76m72P87p4n02J93L39l32j1P46m15l64M56J74q84
4435c85L12P62p43j76O12l93k26L97k8k55l49P67m91m11P69p6k06L0L23m97p2
4456c36M45j28m13M09P35j013K2P97m35l68M48p1k79K50M21l88k31P10l11p90
$$ plain form
4476 -526 -93 259 -124 -375 33 -93 -345 131 395 -255 -226 532 -52 -447 264 199 -494 -198 160 -114 -82
4497 -82 531 91 -410 238 314 -280 -191 280 -161 -317 53 204 -244 -108 372 -144 -529 178 256 -253 60
4518 60 152 -49 -295 494 -69 -381 262 303 -433 46 494 -217 -87 262 202 -318 9 342 -97 -367 684
4539 684 125 -490 373 177 -371 257 233 33 -215 354 192 -302 -5 486 -357 -356 431 -68 -577 276 92
4560 92 -217 191 321 -231 -173 548 162 -446 36 236 -270 -95 118 112 -200 415 111 -375 -354 548 -91 -455
4582 -455 279 239 -453 -23 261 -97 18 444 -16 -464 114 117 -466 215 323 3 -207 81 297 -292 -18
4603 -18 225 -480 -391 373 -97 -471 221 190 -412 -525 190 -138 -502 25 9 -612 10 426 -292 -6 339
4624 339 -98 -92 158 278 -275 -69 523 -54 -500 156 -23 -390 167 448 -72 -203 207 118 -351 -139 527
$$ packed form
4476e26M33L52l83k51M08j26k52M76K64o50K9P58n84l95P11o5o93K96L58k74L2
4497h2O13m40n01O48P6n94Q9M71m41j56L70J51m48J36M80n16l85P07P8n09L13
4518F0R2k01k46P89n63l12O43M1p36M79M48p11J30L49o0n20L27L33m39k70J051
4539F84n59o15Q63j96n48O28k4k00k48N69j62m94K97M91q43JP87m99n09Q53j84
4560I2l09M08J30n52N8P21l86o08M82K00n06J75K13ol12O15l04m86K1R02o39l64
4582d55P34m0o92M30K84l58J15M26m60m48N78Ln83O81J08l20k10K88K16n89K74
4603a8K43p05Q9P64m70l74O92l1o02j13P15l28l64N27j6o21O22M16p18K86L45
4624C39m37OK50J20n53K06N92n77m46O56j79l67N57K81n20j31M10q9m69K12O66
$$ plain form
4645 527 -318 -202 366 -198 -86 253 133 172 0 558 13 -78 560 23 -407 292 281 14 -341 130 -95
4666 -95 -331 20 60 -294 69 224 -22 -269 30 34 -313 138 182 -546 -205 284 -136 -246 359 91 -363 243
4688 243 326 -62 133 417 86 -575 -13 590 -211 -147 403 111 -372 421 200 -448 54 327 -308 -224 278
4709 278 17 -557 -36 302 -77 -60 357 33 -300 31 315 -379 59 348 -305 -302 391 234 -347 -106 391
4730 391 -224 -327 313 69 -125 -81 276 -172 -251 315 -420 -424 190 113 -309 -230 374 -380 20 441 8 -280
4752 -280 244 -113 -262 -7 362 148 -279 338 147 -291 166 292 -179 -29 433 -37 -332 97 291 -237
4772 -237 -307 214 92 -265 29 145 -228 383 289 -280 -345 22 -36 -444 -244 574 -122 -39 383 -32 -241 257
4794 257 44 -436 186 340 -104 -339 48 1 -515 151 405 -270 -363 99 7 -271 161 222 -237 -12 762
$$ packed form
4645E27q45J16N68n64J12L39j20L9j72N58n45r1O38n37m30O99j1k67l55M71k25
4666i5k36L51M0l54L63J55k46k47K99Ml47M51M4p28L41M89m20j10O05k68m54O06
4688B43Q3l88J95K84l31o61N62O03q01O4N50k92m83P93k21o48N02K73o35Q4N02
4709B78k61n74N21L38l79J7M17l24l33L31K84o94M38K89o53LO93j57n81K41M97
4730C91o15j03O40k44j94M4L57m48p9N66p35mO14p7m22P9O04p54M00M21m33k88
4752b80N24l57j49K55L69k14m27O17j91m38M57J26m71J50M62m70k95M29J94n28
4772b37p0N21j22l57K94J16l73O11r4n69o5L67n8m08K00Q18o96Q3M22m15k09M98
4794B57k13m80O22J54m44k35L87m7n16O66K54o75r3M62r2k78M32O1m59K25P74
$$ plain form
4815 762 -224 -217 370 1 -412 361 109 -205 -30 277 184 -491 106 301 -172 34 236 19 -113 236 61
4836 61 -286 -19 287 -406 -200 297 -259 -146 230 197 -228 30 290 74 -52 391 41 65 121 66 -146 11
4858 11 477 -71 -311 175 183 -66 -105 310 -140 -374 123 -35 -81 132 340 -54 -137 367 19 -299 158 297
4880 297 -411 189 350 -462 -161 323 192 -215 -12 372 -80 -162 454 -39 -141 158 301 -428 8 82 -286
4901 -286 -64 -241 366 -190 -192 128 -90 -236 385 47 -178 222 238 -95 16 528 71 -236 386 227 -452
4922 -452 131 225 -211 -80 124 188 -54 -50 155 -371 -183 236 -240 -157 260 -97 -160 -105 238 -27 -340 273
4944 273 281 -241 -79 199 -584 -144 242 -63 -129 306 294 -258 6 625 -108 -307 276 -133 -356 173 -237
4965 -237 -346 -206 262 -34 -385 272 -67 -286 -111 237 -55 9 239 -114 -171 305 418 -102 -41 377 -58
$$ packed form
4815G62r86PN87l69m13P73k52l14J75L07r3o75N97J95m73K06K02k17j32L49j75
4836F1l47K67L06o93K06M97n56J13L76l3m25K58K60k16j26M43l50K4N6n5k12J57
4858A1M66n48k40M86Qk49l9M15m50k34M97j58m6K13K08l94q3N04l48l18M57J39
4880B97p08O00J61q12L01M84j31m07K03L84m52q2O16m93j02K99J43p29M36P4l68
4901b86K22j77O07n56kL20k18j46O21l38k25M00J6l33J11N12m57l07O22j59o79
4922d52N83R4m36J31K04O4k42MK05n26J88M19m76Q3M17l57o3N5L43k65l13O13
4944B73Qn22J62K78p83M40L86l05o6M35j2n52K64O19p33j99N83m09k23N29m10
4965b37j09J40M68k96l51O57l39k19J75L48k92O4K30l53n7M76J13n20O1M18m35
$$ plain form
4986 -58 -352 343 153 -171 18 131 -50 -19 438 144 -490 71 58 -350 -133 436 -364 -185 -88 210 -335
5007 -335 -284 244 43 -64 444 131 -246 -206 62 -343 -154 335 -47 -36 -1 159 -274 -6 361 -109 -235
5028 -235 -3 214 -88 192 161 -216 -170 195 -61 -383 -26 249 -326 92 134 -93 -78 150 225 -381 264 575
5050 575 -281 -223 184 -7 -228 262 35 -83 54 21 -84 -178 136 179 -335 135 183 -308 -137 412 -56 -13
5072 -13 70 363 -142 78 415 98 -210 278 232 -315 36 298 -224 -201 270 289 -274 242 267 -304 -77 411
5094 411 -148 -356 44 -103 -259 -139 268 -225 -160 294 -13 -103 402 400 -450 140 199 132 -183 70 406 -297
5116 -297 132 277 -56 27 551 -28 -208 35 246 -498 -117 255 -249 -130 329 30 -437 245 324 -260 -76
5137 -76 112 -124 -197 45 256 -133 -12 437 -46 14 291 158 -230 -219 200 190 -473 105 117 -91 123 -149
$$ packed form
4986e8k94O95j90l24J89J13j81L1M57k94o34N61j3m08K17N69q00J79R7K98n45
5007c35N1N28k01j07N08l13l77M0K68m05J89M89l82J1L5J60m33K68L67m70j26
5028b35K32K17l02K80l1l77M6L65k56l22L57K75n75M18M2k27J5K28P5o06O45L11
5050E75q56N8M07j91k21M90k27j18J37l3j05r4L14M3n14M70M8m91J71N49m68M3
5072a3Q3K93n05K20L37l17l08M88m6n47L51K62n22K3M71J9n63N16K5n71K27M88
5094D11n59k08M00j47j56J20M07m93O5M54l07r0N05kq50N90N9o7l15K53L36p03
5116b97M29J45l33Q3N24n79j80K43K11p44L81L72n04J19M59k99m67O82P9n84J84
5137g6J88k36p3K42K11l89J21M49m83O0K77j33l88J1M19j0o63N78J2k08K14k72
$$ plain form
5159 -149 -370 18 14 -322 -132 36 76 -133 -272 269 -274 -297 235 -80 -322 291 38 -41 -130 388 68 -373
5181 -373 338 209 -332 302 -159 -157 -150 68 125 -68 -84 378 -324 -316 93 5 -379 250 -28 -242 79 384 2
5204 2 -103 116 73 -138 76 378 -475 130 115 -60 -39 337 174 -22 40 416 -269 -85 307 -186 -380 96
5226 96 271 -376 -305 163 41 -331 -109 192 -528 -129 410 -154 -59 304 29 13 418 59 27 -231 187 -115
5248 -115 -107 259 271 -301 73 126 118 2 67 82 -107 133 275 -148 -262 148 -61 -166 -42 -93 -50 91 502
5271 502 -84 77 303 89 -223 100 296 -124 214 248 268 -180 154 78 -124 3 348 -155 -42 198 -229
5292 -229 -458 -137 201 -261 -64 26 -133 -362 108 171 -269 -212 238 31 -177 167 73 -174 38 125 87 -404
5314 -404 389 48 -449 32 -169 -58 -224 224 -38 -317 345 21 -182 -102 336 -266 21 67 -166 -177 -44
$$ packed form
5159a49k21L88ml36J90J68M0k09j39N41n43k3N32l15k42O13k53p9q9N18l20m41
5181c73P11j29n41O34m61KPK18N7j93j6M62p02QM09q8l84O29k78k14L21L05l82
5204Bj05K19m3k11K14L02q53O05j5j75K1L76j63j96O2L76o85J84L92m93j94M76
5226I6J75o47P1M68j22l72K22L01p20L99N39n64R5L63k75j6M05l59l2k58M18l02
5248a15QL66J2n72L74N3qj16O5J5j89K40J42m23j14M10k09j05J24n1M3J41M11
5271E02n86J61K26k14l12L23J96m20L38L4K0m48L34p6k02J27L45n03J13K40m27
5292b29k29L21L38m62J97R0j59k29M70O3m40N7M50k07k08L44r4k47K12Q7l8m91
5314d04P93l41m97M81k01J11j66M48k62k79O62l24k03Q0M38o02K87M6k33j1J33
$$ plain form
5335 -44 393 -81 54 344 49 -324 305 -61 -169 13 143 -192 19 140 382 -106 55 384 -246 12
5355 12 110 70 -125 18 51 -319 -222 175 -47 -277 217 150 -14 143 300 23 205 108 116 -77 -29 180 -80
5378 -80 -83 -82 -94 -266 243 130 -155 74 230 -39 -176 296 0 -199 -70 146 -560 53 170 -162 -96 -79 251
5401 251 -181 -19 42 87 109 170 -13 -380 250 290 16 50 325 -20 -147 -5 -185 -458 47 39 -216 -49 37
5424 37 -162 -26 61 101 -358 67 512 -84 64 237 -30 -114 49 45 17 22 -83 -96 -11 163 183 -227 14 25
5448 25 -149 -164 -71 99 -118 6 403 -33 -103 391 -168 -331 210 67 -216 16 141 -19 4 62 357 -149
5470 -149 -255 -86 -105 -149 248 80 -142 11 101 137 -320 112 67 -302 42 -219 -85 -169 203 -28 70 332
5492 332 135 -128 78 68 -266 -8 127 -71 -250 -35 0 117 224 327 -93 -282 15 52 -279 -86 357
$$ packed form
5335d4M37m74J35K90k95l73O29l66j08J82J30l35K11J21K42m88J61L29o30K58
5355A2R8m0j95J43L3l70R7L97k22k30M94o7j64J57J57k77J82r7Qj93M8K09k60
5378h0lJj2j72N09j13k85K29J56k69j37M72k96j99J29K16p06O13J17l32O6J7L30
5401B51m32J62O1M5K2O1j83l67O30M0k74L4K75l45j27J42j80k73N05qk55J67Q6
5424C7j99J36Q7M0m59M25M45n96J48J73k67q4J63mk8Nj05j3Q5J74K0m10K41J1
5448B5j74j5R3J70k17J24L97m36p0M94n59j63N41j43k83K32J25j60K3N8K95n06
5470a49j06J69j9m4L97j68k22J53R0L6m57M32m5l69L44k61J34q4L72k31R8K62
5492C32j97k63K06j0l34K58J35j98j79K15L5J17J07J03m20j89K97L7l31J93M43
$$ plain form
5513 357 -288 262 310 -13 -134 118 93 -367 -49 218 -281 -125 171 -130 -255 153 55 -79 69 319 110
5534 110 -118 16 -32 -45 -70 115 31 114 214 31 54 -93 202 -454 -66 40 -8 -237 150 143 -446 -21 251
5557 251 213 87 330 415 -156 -71 320 73 -171 52 -85 -186 140 -112 -52 -175 423 -198 -428 218 -30
5578 -30 -103 38 173 181 -56 126 -177 7 -28 10 -21 -214 266 -108 -49 295 2 -307 67 36 -91 -203 305
5601 305 111 -277 -78 284 -395 43 -171 -214 -108 76 -23 54 -142 319 -199 -152 126 -150 -87 233 106 11
5623 11 55 37 120 -234 62 -80 -171 11 31 -181 -81 63 231 46 113 -60 -176 -227 196 -140 -236 -8 133
5646 133 -172 -103 338 -164 -130 219 -40 -101 224 58 -302 -108 210 -75 8 231 142 73 -33 312 -288 -144
5668 -144 197 -14 78 247 100 -170 -197 -73 -8 -218 99 245 -276 -112 328 -88 -133 107 34 -47 72 254
$$ packed form
5513C57o45N50M8l23j21K52k5m60L18K67m99J56K96l01j25M08r8j34J48K50k09
5534A10k28J34m8j3k5J85q4Q3J00j83K3j47K95o56L88J06m8k29L87pn89M25K72
5557B51l8j26K43Q5n71Q5L91k47k44K23j37j01L26k52O0j23N98o21k30O46k48
5578c0p3J41J35Qk37J82l03J84l5L8l1j93M80l74N9L44k93l09L74l1j27j12N08
5601C05j94l88J99L62o79M38k14m3J06J84r9P7j96M61n18M7K78k76O3L20j27r5
5623A1M4j8Q3l54K96j42r1J82K0k12J00J44J68j85O7j73j16n1M23l36r6K28J41
5646A33l05O9M41n02L4L49k59o1L25j66l60J94L18k85Q3K23q9o9j06L45o00J44
5668a44L41k11R2J69j47k70k7J24O5k10L17J46n21J64M40m16m5K40p3q1J19J82
$$ plain form
5690 254 -127 254 405 81 -350 357 127 -101 153 239 -15 -30 1 157 87 69 216 -142 -37 136 -20 -398
5712 -398 -15 9 -126 -133 5 -94 -243 236 233 -214 123 61 38 -91 236 18 -221 190 49 4 -49 226 -155
5735 -155 -165 195 12 -131 86 -23 58 -169 167 188 -44 49 25 -154 -74 -67 -131 -158 443 267 -108 54 131 -148
5759 -148 14 135 -136 -123 221 -95 -109 -172 125 -39 -381 221 174 -209 -33 115 -105 31 156 -48 -188
5780 -188 -106 73 132 39 -16 -265 3 8 -199 -9 143 93 25 24 28 101 -75 0 24 -385 115 241 -83 -205 -36
5805 -36 -97 -148 3 -90 -81 -310 103 -98 -146 -50 90 -105 166 146 -14 -209 112 344 -40 -36 181 -100 28 98
5829 98 -147 -181 92 159 -377 -60 272 -180 -115 272 13 -208 122 93 -203 -211 143 94 -243 250 87 -103 -251
5852 -251 199 -100 31 0 -62 72 -58 332 -48 -32 -53 305 -150 -19 -93 -344 141 44 7 -182 -55 -20 -92
$$ packed form
5690B54l81L81J51l24m31P07k30k28K54Q6k54j5L1J56p0j8J47l58J05J73j56l78
5712c98L83K4j35pJ38r9j49M79lm47L37o2k3j29L27k18k39M11j41m5n3K75l81
5735a55j0L60j83j43K17j09Q1k27L36K1k32R3k4j79Q0Po4k7O01j76l75J62P7k79
5759a48J62J21k71J3L44l16j4o3K97j64l42O02m7l83J76J48k20J36J25k04j40
5780a88Q2J79N9r3n5k49K68Nk07J90J52n0o8jMP3j76P5K4m09N00J26l24j22J69
5805c6o1n1J51r3Rk29M13k01m8R6J40j95K71k0j60j95L21K32l84MK17k81J28P0
5829I8k45l4K73O7n36L17L32m52O5L87k59k21L30k9k96qL54m9l37M93j63j90j48
5852b51M50k99J31l1o2J34j30L90l80J6k1L58m55J31p4k51M85r7l7j89J27L5p2
$$ plain form
5875 -92 -223 175 60 -145 71 5 -82 119 164 -46 -209 359 324 -203 6 336 -168 -129 232 -295 -138 181
5897 181 189 -32 70 -10 -223 -217 53 65 -181 -63 58 -224 -269 339 42 -45 -131 -99 -216 -114 168 -17 -249
5920 -249 95 122 48 97 -16 -89 2 55 -60 -87 182 91 -46 -165 25 -352 -83 -137 77 -25 -106 230 -99
5943 -99 -157 45 35 -410 164 119 -32 104 49 -98 -198 177 -236 -39 107 187 138 -133 163 63 -11 141 58
5966 58 -140 162 33 -48 -28 65 114 -334 43 241 70 -98 92 -47 -500 160 136 -51 68 187 -306 156
5988 156 144 124 132 158 -15 -129 -236 151 50 -154 84 178 -214 -107 -108 43 -135 119 95 -90 -1 177 -238
6011 -238 -8 297 -137 223 65 206 56 92 350 31 -65 -99 -146 -2 185 43 -198 8 -61 71 -385 85
6033 85 -40 -195 -87 201 -332 -76 18 -81 -196 -142 70 -1 -231 61 126 26 245 123 -237 105 260 -206
$$ packed form
5875i2j31L98j15k05K16o6q7K01M5k10j63N68l5n27K09L30n04L9L61n27J57L19
5897A81Qk21J02q0k13OK70J2k46J18J21k82m5O08k97q7q6L2j17J02K82j85k32
5920b49L44K7p4M9j13p3R1N3j15k7K69r1j37j19J90l77K69n4K14j02q1L36l29
5943i9n8K02j0m45N74m5j51J36n5j47j00L75m13J97J46Q0m9k71K96j00p4J52q3
5966E8j98L02j29q1K0R3M9m48L77J98j71j68J90j39m53O60k4j87J19J19m93M62
5988A56j2k0QK6j73j14j07L87j01k04K38R4l92J07jJ51j78K54k4j85Q9J78m15
6011b38K30L05m34L60j58J41j50L6K58l19r6l4m7J44J87j42k41K06o9J32m56M70
6033H5j25j55J08K88n33K56R4r9j15N4K12p1k30K92O5j00K19j22l60L42J55m66
$$ plain form
6055 -206 58 81 22 -83 161 142 -232 22 238 85 -193 -10 -112 198 -285 10 47 -268 353 -39 -167
6076 -167 15 -160 -188 -44 27 283 -67 181 226 -217 -94 331 -290 -311 131 117 -138 63 105 -107 -268 256
6098 256 -124 -293 -24 -27 -352 29 239 -148 -130 -114 197 -116 2 -263 -17 -87 8 211 88 82 93 -166 29
6121 29 157 -6 -64 380 73 -35 40 -61 -174 -4 12 -222 -187 51 198 -199 -52 101 18 -110 -73 338
6143 338 -191 243 447 162 3 -174 241 -186 213 315 -116 32 272 160 -69 -5 41 -160 -30 181 -140
6164 -140 -187 161 -32 58 -31 44 -26 51 196 91 -200 197 230 -174 -24 28 -348 -92 -42 241 -42 100 -46
6187 -46 70 115 46 -71 98 -174 -157 -27 58 13 -32 -89 -116 14 -19 29 -14 -87 79 58 154 -311 14 198 -132
6212 -132 142 127 88 -144 92 169 -180 93 3 78 167 318 -14 151 42 -49 -134 -44 109 -185 -137 -123 52 -230
$$ packed form
6055b06K64K3n9j05K44j9l74K54K16j53k78J83j02L10m83K95L7l15O21l92j28
6076a67J82j75k8J44P1K56l50K48M5m43J23M25o21k1M42j4k55K01M2k12j61N24
6098B56l80j69K69ll25L81K10l87J8J6L11l13J18k65K46p0R5K03j23oJ1k59J95
6121B9J28j63n8M44l07j08P5j01j13J70J6k34L5K38J47l97J47J53q3j28L7M11
6143C38n29M34K04k85j59j77M15m27L99J02m31J48K40j12k29O4M6k01J30K11l21
6164a40m7L48j93R0q9P5p0P7J45j05k91L97L3m04J50N2l76K56N0K83k83J42j46
6187d6J16M5o9j17J69k72J7J30Q5m5m5n7k7J30l3M8m3p3J66k1R6m65L25J84l30
6212a32K74j5l9k32K36P7l49K73r0P5Q9J51l32J65j09r1q5R0J53k94M8J4J75k82
$$ plain form
6236 -230 69 4 -57 -165 -51 87 -274 60 113 -111 131 115 91 7 153 133 -162 -45 64 -259 -170 253 126
6259 126 -230 -76 396 -228 -156 283 83 -168 210 417 -247 -76 132 127 7 218 134 -95 -117 64 1 125
6281 125 198 14 -323 -9 -37 -328 88 -74 -55 -134 68 298 -153 53 349 -24 -114 237 -160 93 176 20
6303 20 -55 -39 18 62 -80 132 145 -168 110 346 -179 43 96 -48 -188 -66 53 -51 -95 83 -93 -128 338
6326 338 -143 -110 102 225 -74 -130 -46 -78 127 147 89 -24 -2 56 -150 43 116 29 25 52 153 -71 169 158 9
6351 9 -3 205 110 -178 186 -243 32 -75 148 -75 -217 156 175 -167 4 -20 -27 107 352 -104 -66 -17 147
6374 147 -108 -368 280 199 -146 -159 61 -376 -123 -344 54 -10 34 -34 -88 -1 37 -177 60 -7 173 194 -51
6397 -51 298 -49 46 -40 78 37 25 -359 -168 -23 195 118 -128 81 178 -136 41 172 -107 -267 -81 129
$$ packed form
6236b30K99o5o1j08J14J38l61L34N3k24K42j6k4q4J46k0k95J17J09l23Q9M23j27
6259A26l56J54M72o24P2M39k00k51L78K07o64J71K08nj20K11q4k29k2J81o3J24
6281A25P3j84l37L14k8k91M16j62J9p9K02K30m51K06K96l73r0L51l97K53Q3j56
6303B0p5J6N7M4j42K12J3l13K78K36n25K22N3j44j40J22J19j04m4J78j76l5M66
6326C38m81L3K12J23k99n6Q4l2K05K0n8j13K2N8k06J93P3q7mK7J01k24K40j1j49
6351Ij2K08r5k88L64m29K75j07K23k23j42L73J9l42J71k4pJ34K45m56L8M9J64
6374A47k55k60O48q1l45j3K20m37K53k21L98o4M4o8n4Q7L8k14K37o7J80K1k45
6397e1L49l47R5q6J18m1j2l84J91J45K18p7k46K09R7l14J77J31k79j60J86K10
$$ plain form
6419 129 -191 -143 66 37 111 171 -16 -15 111 40 -313 88 -19 -140 -67 -158 -68 100 110 8 -119 -140 313 -256
6443 -256 18 31 8 -193 82 126 -120 -232 115 27 -277 -270 -131 -184 81 -14 -133 -120 -38 24 -44 -93 409 137
6467 137 80 215 -89 -195 137 108 -103 6 -166 30 -68 337 140 -258 -61 217 -341 -224 27 -13 -95 -38
6489 -38 -115 -271 -244 127 212 -45 16 -138 45 -143 52 -131 -20 140 -42 -264 -53 171 -24 1 120 172
6511 172 -169 383 -43 -214 -33 159 -126 -115 126 -124 -246 99 -13 103 166 137 -92 -63 -157 254 -38 -11
6533 -11 108 83 69 68 -6 -87 -37 158 -85 -172 287 -104 -220 17 36 -149 -130 -9 131 -151 -20 -7 -327 -182
6557 -182 -55 -287 -138 -191 -64 -95 -43 234 -321 12 231 -49 -257 186 18 -100 125 -5 -271 -123 -21
6578 -21 233 276 95 245 63 -84 137 -41 -311 63 10 -20 61 -32 -190 49 -70 -263 -57 77 325 45
$$ packed form
6419A29l20M8K09k9P4O0j87JJ26p1l53M01j07j21P3r1R0J68J0j02j27k1M53n69
6443b56K74J3k3k01K75M4k46j12L47q8l04PJ39n3K65r5j19J3Q2O2o8m9N02k72
6467A37n7J35l04j06L32k9k11J09j72J96r8M05j97l98J97K78n58J17K51m0q2N7
6489c8p7j56K7L71Q5k57O1j54J83j88J95j83J11J60j82k22K11K24j95K5J19N2
6511A72l41N52m26j71J81J92k85J1K41k50j22L45j12J16O3k9k29K9r4M11k92K7
6533a1J19k5j4jp4q1N0J95k43q7M59l91j16K37J9j85J9J21J40k82J31J3l20J45
6557a82J27k32J49n3J27l1N2K77n55L33K19k80k08M43j68j18K25j30k66J48J02
6578b1K54M3j81J50j82j47K21j78k70L74n3l0Q1r3j58K39j19j93K06J34K48k80
$$ plain form
6600 45 167 24 -294 62 -30 294 -17 -84 -111 -8 -304 -45 -96 214 45 106 -45 78 -40 -22 55 -34 134
6623 134 -333 -108 45 -62 -56 135 -40 -40 -114 132 228 72 149 26 -233 71 201 34 150 -29 -29 -190 144
6646 144 -119 -213 -110 -219 -130 -100 -131 93 -69 215 185 -59 -176 -103 233 -27 47 98 -168 298 70 -107 90
6669 90 24 -79 18 276 -109 -108 42 -121 -174 -43 129 -2 -118 278 -126 -338 39 228 -7 -1 -145 214 -299
6692 -299 65 360 31 -66 48 -62 -64 256 -96 -189 211 182 245 -86 81 -126 -237 -149 -167 21 -115 5 -57
6715 -57 -11 -82 -56 70 -42 -44 114 -97 96 87 -48 -244 115 111 -16 332 58 -80 133 218 -262 34 6 115
6739 115 -19 -18 196 -333 -122 23 154 123 255 40 -39 163 -164 -181 -121 -29 323 -212 141 -60 -120 144 259
6762 259 185 125 17 -91 -169 -85 217 -264 -270 226 7 233 17 -78 -33 -23 0 203 -219 -6 109 -15 323
$$ packed form
6600D5J22j43l18L56r2L24l11o7k7J03k96K59n1L10j69O1j51J23j18J8P7q9J68
6623A34m67K25J53j07OJ91j75%p4K46R6j56P7j23k59L04J30j67J16j79%j61L34
6646A44k63r4J03j09Q9L0l1K24j62K84l0k44j17P3L36k60P4N1k66M66k28j77J97
6669I0o6j03R7K58l85JJ50j63n3J31J72j31j16L96m04k12L77J89k35Oj44L59n13
6692b99L64K95l29r7J14j10kL20l52r3M00k9O3l31J67k07j11Q8j8J88j36J20o2
6715e7M6p1K6J26j12kJ58k11J93rj35j96L59mj27L48k74j38K13Q5m80K96k8J09
6739A15j34JK14n29K11J45J31l1J32k15p9K02l27j7O0R2L52n35L53k01o0K64J15
6762B59p4o0j08j08p8Q4L02m81oM96k19K26k16r5M5J0K3K03m22K13J15j24L38
$$ plain form
6785 323 63 237 -141 52 -38 -185 -38 164 -222 10 265 -82 99 45 -24 -78 -33 -54 -6 -22 -141 205 25
6808 25 -74 -125 145 -75 -83 -189 10 40 211 -203 132 270 29 103 -277 37 194 40 6 6 -65 236 193 -158
6832 -158 65 198 -38 -60 6 154 70 -104 22 -305 104 237 -14 -131 239 156 -92 -26 -24 179 -113 146
6854 146 34 -296 -57 143 53 9 -38 -88 -87 225 -119 222 95 -115 56 84 347 186 -220 -105 160 -22
6876 -22 -66 -116 -205 109 21 94 -178 200 73 -44 -60 71 -91 117 99 -108 -77 47 176 152 41 255 -1
6899 -1 -169 41 -17 -49 -298 -234 28 93 33 -175 -72 -13 34 104 51 398 42 86 66 23 82 77 70 4 33 204 105
6926 105 -20 -73 40 -33 -107 107 -63 20 -118 -61 95 88 104 -236 -2 174 225 -265 226 -236 71 -59 183
6949 183 59 -110 217 188 -135 45 51 45 138 63 106 -71 -113 -10 -100 -86 95 -57 -412 -460 -153 -336 -94 -170
$$ packed form
6785C23k60J74l78J93r0j47J47K02l86K32K55l47J81n4o9n4M5k1M8j6j19L46j80
6808B5r9n1K70k20qj06J99L0J71m14L35J38k41P4l80L14J57j54l4%p1L01m3l51
6832a58K23J33k36k2O6J48q4j74J26l27M09J33k51j17L70q3k48O6KK03k92K59
6854A46j12l30K39K00r0m4m7n0JL12l44L41j27k10J71K8K63j61m06J15K65j82
6876b2m4n0q9L14q8P3k72L78j27j17j6J31j62K08j8k07L1J24J29k4j11K14k56
6899aj68K10n8l2k49O4K62O5o0k08J03N9M7P0n3L47l56M4k0m3N9npo6K9J71r9
6926A05j25n3J13p3p4K14j70Q3j38N7J56pJ6l40K34J76N1m90M91m62L07j30K42
6949A83j24j69L27k9l23J80OoR3p5M3j77m2J03r0J4J81j52l55m8L07j83K42p6
$$ plain form
6973 -170 -31 84 -70 106 -141 -308 143 -158 -166 40 -82 -33 -104 62 -73 -157 -5 -169 -122 343 128 -86
6995 -86 -270 153 15 -21 22 -130 215 -127 2 -122 -176 253 56 -12 -37 -30 -141 160 246 154 5 313 -150
7018 -150 -362 -89 -25 68 56 138 -71 -72 45 78 59 -27 217 -17 -60 212 -98 -3 -37 155 204 -258 90 146 72
7043 72 142 114 83 130 98 54 21 132 293 -211 285 174 -192 22 74 -22 142 -69 -98 -209 -143 -29 -120 -7
7067 -7 -5 -51 -151 112 16 8 20 85 411 41 -53 206 1 -71 -60 -144 69 -118 131 30 64 133 -101 84 -13 6
7093 6 -56 -94 75 -15 175 -60 1 153 23 -44 61 37 17 -39 -36 -33 -1 16 -11 72 -86 -21 99 241 -35 98
7119 98 113 -2 -93 -89 -72 -57 108 40 32 210 35 -38 -176 151 -72 311 101 169 -35 -39 167 -95 48 -74 84
7144 84 174 9 178 -71 -10 -33 -10 -8 -154 -47 59 -122 237 87 -407 -247 -49 14 -100 182 71 -79 -106
$$ packed form
6973a70J39J15j54J76k47j67M51l01qK06j22M9p1J66j35q4J52j64M7M65k15k14
6995h6j84M23j38l6M3j52L45l42J29j24n4M29j97o8k5Pj11L01Q6r2j49L08m63
7018a50k12K73O4R3j2Q2k09jJ17L3j9q6K44k34m3K72l10R5l4J92M9m62L48N6p4
7043G2P0k8l1M7l2m4l3J11J61n04M96j11l66K14N2r6J64k11k9j11O6J14r1J13
7067gKm6j00K63r6qJ2O5L26l70r4K59k05p2J1q4K13j87K49j01L4O9k34J85r7J9
7093Fo2l8J69r0J90k35O1J52j30o7J05k4k0n6LLL2J7k7Q3j58O5J20J42k76J33
7119I8J5j15r1MJ7J5J65o8qJ78j75p3j38L27k23L83k10O8k04mK06k62J43j22J58
7144H4R0j65J69k49O1k3K3Kj46J07J06j81L59j50m94J60J98O3j14K82j11j50k7
$$ plain form
7167 -106 -113 -25 103 -65 255 43 231 -99 -287 11 52 92 175 -34 118 20 151 -295 39 93 -12 -31 52
7190 52 135 -82 -251 48 -37 -26 -277 -78 -308 -312 111 170 -154 -111 144 8 58 -116 181 169 136 -16 -148 -38
7214 -38 23 12 101 184 54 144 -2 -41 100 -60 -153 8 -213 155 -184 -207 -249 -46 -188 -82 -64 -44 22 -183
7238 -183 20 -28 116 94 -50 22 104 -127 18 33 -9 72 111 128 153 -80 143 -116 127 21 -43 -112 -12 51
7262 51 140 270 -280 94 -97 44 -45 4 -79 150 97 -13 78 -187 -162 -29 -93 88 -60 -86 -13 38 -58 53
7286 53 54 -147 59 119 139 -147 73 159 -146 -97 -70 50 -210 63 -34 -120 28 -67 96 173 134 -17 116 45 101
7311 101 17 -13 -36 -150 -36 37 15 -283 124 -77 -9 23 110 238 -151 -59 330 -157 -50 82 161 -192 -113 -103
7335 -103 -142 83 57 2 4 101 58 -185 -45 -137 -57 -97 -5 126 55 179 89 -55 133 93 191 -3 116 -284 -167
$$ packed form
7167a06pQ8J28j68L20k12J88l30j88K98M1M0Q3k09J52r8J31m46L34N4j05j9Q3
7190E2Q3k17j69K99q5J1k51J99k30mM23N9l24M3K55j36N0j74K97j2l3j52j32J10
7214c8O1j1Q9Q3j30R0j46l9J41j60r3J61k21L68l39k3m2K03j42J06J8K0O6k05
7238a83K03m8J44k2j44P2Q2k31J45J5m2Q1L9J7K5k33K23k59K43j06o4o9J00O3
7262E1Q9J30n50L74j91J41q9M9q3K29n3j10R1k65K5J33o4J81j48k6P3N1r6J11
7286E3Jk01K06O0K0k86K20Q6l05M9K7J20k60K73r7q6J48r5J63P7l9j51J33p1N6
7311A01q4l0k3j14J14P3k2k98M07k01O8L2Q7J28l89R2L89m87J07J32P9l53P9J0
7335a03l9K25k6n5KR7m3k43J40r2Q0m0R2J31p1J24r0j44J88m0R8j94J19m00J17
$$ plain form
7360 -167 -134 17 -31 -106 49 51 -19 -73 254 -193 -85 181 29 221 47 -94 -88 264 73 -20 95 123 21 -34
7384 -34 93 66 28 -198 28 79 -87 -23 29 -127 -63 54 -76 278 163 -289 -259 78 -29 6 -90 90 -120
7407 -120 -111 155 -117 135 -35 97 -108 -38 -73 -43 129 8 -201 -81 201 189 -101 -106 -9 108 42 -50 124 -75
7431 -75 -8 83 -65 -15 255 74 -47 55 253 -73 168 264 -82 -143 -8 -4 55 43 -92 -112 -247 -123 -158 69
7455 69 38 47 86 -109 -8 -95 -253 145 54 -118 138 11 111 185 -259 -157 -47 117 85 -140 -21 21 385
7478 385 -42 99 11 -196 73 39 77 -84 47 -65 81 -91 -65 -90 -42 349 59 23 -63 -69 -77 40 286 -12
7502 -12 -187 147 -18 46 20 76 39 126 -125 -25 -42 130 27 -25 22 102 119 -150 -52 -107 -65 63 57 -224 -155 40
7528 40 -189 -43 7 -181 -107 6 109 -61 108 144 191 100 219 -28 -191 195 -112 -9 -197 76 -54 79
$$ packed form
7360a67L3J51m8p5J55Kp0n4L27m47J08K66j52J92j74j41OL52j91r3J15K8j02n5
7384c4J27k7l8k26K26N1j66O4N2j56O4J17j30L54j15m52L0L37j07L5r6J80k10
7407a20RK66k72K52j70J32k05P0l5L0J72j21k09J20K82j2k90nR7J17o6r2J74j99
7431g5O7R1j48N0K70j81j21J02J98l26K41R6l46o1J35MN9j2j35k0j35J24l5K27
7455F9l1RL9j95J01q7j58L98r1j72K56j27J00P4m44J02J10J64l2k25J19M2L64
7478C85m27J41q8k07K69l4L8j61J31j12J46j72K6k5M8L91k90l6q6oqJ17K46k98
7502a2j75L34j65O4k6N6l7Q7k51J00j7J72j03n2M7Q0J7k69R8n5M2J28ok81O9J95
7528D0k29J46N0j88P4J13J03j70J69L6M7r1J19k47j63L86l07J03j88K73j30J33
$$ plain form
7550 79 -298 182 -64 -177 -7 -105 -47 -102 -52 -20 264 -242 -80 133 53 -24 157 -6 190 -50 -154 77 -130
7573 -130 -310 9 78 -26 -161 237 -62 -167 176 -78 47 -233 -24 93 -103 -128 92 18 -29 -171 -194 -67
7595 -67 175 -81 -113 81 -71 79 -279 92 -49 -44 165 -8 -4 67 -156 -27 -92 51 -172 -101 -12 -118 -52 -296
7619 -296 -90 28 96 16 -173 -82 144 382 -27 -191 -149 -260 106 54 156 -128 -133 -144 -40 -65 153 187 -287
7642 -287 -20 13 4 -278 -8 -42 -344 -231 -81 1 192 -41 -48 161 -110 343 -47 -146 192 -32 302 -9 1
7665 1 74 120 54 49 -54 75 -72 -35 -156 127 -77 -133 144 -340 190 110 -88 -330 264 79 -307 2 140
7688 140 53 -13 38 136 156 91 -20 146 -10 -130 -104 -9 219 -166 -81 -15 18 -139 178 -110 -12 -27 -27 25 -143
7713 -143 -96 -179 161 -87 -148 -38 228 -147 -30 110 -51 44 29 70 -87 367 -158 -193 123 153 44 -151 118
$$ packed form
7550G9l77M80k46j13J70r8N8n5N0L2K84n06J62K13q0p7J81j63J96k40j04K31k07
7573a30j80L19O9j04j35L98k99j05L43k54J25k80K09J17j96k5K20p4m7j42k3J27
7595f7K42k56l2J94j52J50l58L71j41NK09j73MP1k23J29o5J43k23P1Q9j06O6k44
7619b96K06J18O8q0j89R1K26K38m09j64M2j11L66n2J02k84nj1J04k5K18L4m74
7642b87K67L3rk82K70l4l02J13J50Q2J91k33pK09k71M53l90r9L38k24L34l11J0
7665AP3M6o6nj03J29j47L7j21K83k04n6K77m84N30q0j98k42N94j85l86L09J38
7688A40q7o6N1R8K0o5j11J66j56j20K6R5K28l85Q5O6L3j57L17k88R8j5%N2j68
7713a43M7q3L40k48o1J10K66l75J17J40j61R5j5M1j57M54n25l5L16L0j09j95K69
$$ plain form
7736 118 -304 96 -163 61 4 160 59 60 97 134 140 -159 208 186 -122 -135 27 -212 -86 21 -10 154 -189
7759 -189 131 -32 -195 190 -2 -97 -13 246 -21 -113 11 -66 -29 283 -45 -106 -15 -143 -47 45 118 -253 157
7782 157 -50 -125 -84 -57 265 -71 18 141 221 3 49 -34 -209 -121 118 -160 268 92 178 -105 -149 -29 102
7805 102 -202 -130 -179 -146 206 137 147 -59 53 -129 -307 -30 -137 136 423 118 -89 -15 98 -112 -78 -205
7827 -205 -114 13 276 59 -239 58 203 -45 91 -56 85 30 -23 1 -134 -33 222 5 -40 -43 -133 -208 -24
7850 -24 31 -116 -98 40 397 -101 -183 -66 -123 -112 297 84 -139 195 83 145 -75 3 -99 86 -282 -13 -66
7873 -66 299 25 278 -120 35 263 10 17 -73 -324 -279 152 -234 24 -108 -195 57 90 251 -28 -143 157
7895 157 -80 -94 -72 130 53 128 157 -41 165 -73 33 281 14 61 -160 -188 -165 -3 -116 -115 -28 -36 -150 38
$$ packed form
7736A18m22M00k59K24n7J56j01JL7L7Ok99L67k2l08j3J62k39J26J07l1J64l43
7759a89L20j63j63L85j92r5Q4K59k67r2J24p7L7L12l28o1R1j28R6R2P3l71M10
7782A57k07p5M1K7L22l36Q9J23Q0k18M6q3j75Q8K39k78M28j76Q6k83m4J20J31
7805A02l04P2m9L3L52o9J0k06J12j82j78K77j07K73K87l05k07P4J13k10L4j27
7827b05R1J27K63k17k98K97J45k48J36j47J41n5n3K4j35J01K55k17m5lr0p5J84
7850b4N5j47J8J38L57m98q2J17n7J1M09k13k23L34j12O2k20P8j02J85l68K69n3
7873f6L65k74K53l98J55K28k53Pr0k51M5M31l86K58j32q7K52L3J61k79j15L00
7895A57k37j4K2K02p7P5K9j98K06k38J06K48k67M7k21k8K3J62j13JQ7qj14J88
$$ plain form
7919 38 -17 -193 -182 73 221 -20 62 88 86 167 136 -125 -141 40 51 -204 94 -67 -50 -124 28 -18 -155 -125 -245
7944 -245 -61 -193 130 13 -160 158 114 177 63 88 -66 -110 -54 243 194 99 -95 58 55 130 -239 187 -206
7967 -206 173 -37 -333 -86 0 -49 -26 62 11 262 145 -114 132 -109 -16 -2 81 -157 141 5 18 -106 119
7990 119 -76 -87 342 16 -79 -298 32 263 -34 84 111 -141 -268 116 4 65 -73 -34 50 221 -51 246
8012 246 84 87 63 -72 -152 -38 -150 1 11 104 167 39 63 -212 -203 -50 34 -157 123 -40 -98 -26 -162 -89 -49
8037 -49 191 218 -152 94 -46 0 -173 -169 5 44 17 -63 -30 20 -212 64 -83 -39 80 -254 -90 189 201 -133
8061 -133 -336 -47 -59 -115 30 53 19 225 -150 -66 77 -162 37 -82 -7 217 45 -31 -91 28 149 -11 -123
8084 -123 134 71 -34 -244 -137 135 -76 130 -28 -93 -83 47 -89 -56 22 3 108 85 110 -432 -151 18 -102
$$ packed form
7919C8n5j76J1K55J48k41Q2K6kQ1l1k61j6J81J1k55K98j61J7p4J52m6j37L0j20
7944b45J84j32L23j17j73L18m4O3j14K5j54m4N6K97m9r5j94J53lP5l69M26l93
7967b06L79k10k96K47Q6m9K3Q8n1K51j17k59K46k41R3J4Q3k38K98j36J3j24K25
7990A19j95j1M29l26r5k19L30K31k97J18K7k52j27L84j12O1j38L9Q4J71k72K97
8012B46j62Lk4j35q0J14j12J51J0R3O3j28K4k75RJ53Q4j91K80j63n8P2j36P3M0
8037d9K40K7l70K46j40M6j73MJ74L9k7q0L3N0k32K76j47M4J19l34J64K79J2l34
8061a33k03K89j2n6J45K3l4K06l75Q4J43k39J99j19P5K24j72p6o0J19J21j60j12
8084a23K57o3j05k10J07K72k11K06j58o5J0J30j36L3P8j9J05k3K5n42K81J69j20
$$ plain form
8107 -102 -211 -109 -18 75 160 91 -247 -75 22 -26 -142 -185 140 182 -184 -320 -72 60 80 -8 -59 -22 181 -172
8131 -172 123 229 -178 -205 176 -126 -114 -123 110 -11 47 187 23 -26 54 57 -82 145 -68 29 22 270 241 42
8155 42 199 -30 -89 57 -164 48 -171 -34 64 -241 231 89 115 -213 -24 -136 125 -308 41 -88 11 178
8177 178 29 51 -260 149 79 192 133 136 -14 -217 37 174 21 -35
$$ packed form
8107a02j09J02R1R3Q5o9l38J72R7m8j16m3L25M2l66j36K48J32K0q8n1L7K03l53
8131a72K95J06m07k7L81l02J2rK33j21N8J40j64m9Q0Lj39K27k13R7pK48k9j99
8155D2J57k29n9J46k21K12k19J37R8l05M72j42K6l28J89j12K61m33L49j29R9J67
8177A78j49K2l11M09p0J13n9Lj50k03K54J37j53n6
8191c5
$$ Imaginary data points
##PAGE= N=2
##DATA TABLE= (X++(I..I)), XYDATA
$$ plain form
0 0 0 0 0 0 0 0 0 0 0 0 8 -8 8 -8 8 -16 16 -21 24 -28 34 -40 48 -56 64 -77 88 -101 114 -132 150 -172 192
33 192 -215 242 -274 306 -340 379 -422 467 -519 574 -631 698 -773 849 -935 1030 -1135 1251
51 1251 -1378 1519 -1678 1861 -2069 2304 -2578 2908 -3302 3786 -4393 5191 -6270 7816 -10205
66 -10205 14296 -22604 45675 -232663 -678211 307268 337153 -395567 -34272 332509 -252187
77 -252187 -111282 559055 -21294 -622649 222223 449976 -430666 -221880 430276 -85829
87 -85829 -290577 376138 179982 -457626 34004 409560 -305081 -303708 419340 8859 -448439
98 -448439 267204 384536 -359075 -168442 363197 -74468 -299142 254632 76901 -430392
108 -430392 167420 494106 -305198 -331362 389270 134053 -329993 59745 149491 -282387
$$ packed form
0@%%%%%%%%%%Qj6J6j6J6k4L2l7M5n2O2p4Q8j04J20j41J65j89K15k46K82l22L64
33A92m07M57n16N80o46P19q01Q89r86J093j205J329j471J622j784J965k165K386
51A251k629K897l197L539l930M373m882N486o210P088q179R584j1461J4086j8021
66a0205K4501l6900O8279k78338m45548R85479K9885p32720L61295L66781n84696
77b52187J40905O70337n80349o01355Q44872K27753q80642K08786O52156n16105
87h5829k04748O66715j96156o37608M91630L75556p14641J373P23048m10481m57298
98d48439P15643J17332p43611J90633N31639m37665k24674N53774j77731n07293
108d30392N97812L26686p99304k6164P20632k55217m64046L89738Q9746m31878
$$ plain form
118 -282387 28043 421508 -197384 -390337 365273 264464 -390986 -72658 262779 -160825
128 -160825 -134105 289116 -32170 -333245 219017 302122 -328190 -141099 336202 -85718
138 -85718 -274010 226896 132274 -281163 35994 288924 -151542 -172799 264728 -6676
148 -6676 -313986 172901 241275 -284433 -115026 301920 2167 -213331 120458 77733 -231883
159 -231883 68066 249777 -236943 -206310 314599 101655 -274921 27516 175720 -128863
169 -128863 -49238 190124 -103983 -213352 233907 161427 -280219 -29099 257764 -78949
179 -78949 -154080 152526 29280 -193479 83591 178898 -182691 -93542 241268 -29054 -215994
190 -215994 135413 122032 -200421 -34866 191053 -59042 -144650 141389 54808 -186285
$$ packed form
118b82387L10430L93465o18892j92953P55610j00809o55450L18328L35437m23604
128a60825K6720M23221l21286l01075N52262Q3105o30312J87091M77301m21920
138h5718j88292N00906r4622m13437L17157K52930m40466k1257M37527k71404
148f676l07310M86887O8374n25708J69407M16946k99753k15498L33789m2725l09616
159b31883K99949J81711m86720L0633N20909k12944l76576L02437J48204l04583
169a28863P9625K39362k94107j09369M47259p2480m41646K51120K86863l36713
179g8949p5131L06606j23246k22759K77070R5307l61589Q9149L34810k70322j86940
190b15994L51407j3381l22453J65555K25919k50095q5608K86039q6581k41093
$$ plain form
200 -186285 71246 169854 -178581 -103509 215434 20894 -186633 57880 131537 -109839
210 -109839 -28940 153408 -87216 -142007 182548 74911 -216273 7136 184846 -71605
220 -71605 -113843 118606 19431 -148986 78826 121590 -174363 -53034 202853 -39408 -167502
231 -167502 110298 96977 -147060 -13984 153357 -76990 -117076 157901 36442 -180260
241 -180260 72644 149369 -142021 -73083 171360 -5362 -161106 81664 111856 -146360
251 -146360 -20037 166032 -89242 -127566 161054 44832 -185349 29924 156119 -99261
261 -99261 -99517 147392 6657 -156928 98715 108940 -171350 -20881 184785 -60885 -143961
272 -143961 125030 81008 -155888 13530 155481 -109577 -95671 176865 -740 -179584
$$ packed form
200a86285K57531R8608l48435P5072L18943j94540k07527K44513P3657k41376
210a09839Q0899J82348k40624n4791L24555j07637k91184K23409J77710k56451
220g1605m2238K32449r9175j68417K27812M2764k95953J21329K55887k42261j28094
231a67502K77800j3321k44037J33076J67341k30347m0086K74977j21459k16702
241a80260K52904P6725k91390O8938K44443j76722j55744K42770L0192k58216
251a46360J26323J86069k55274l8324K88620j16222k30181K15273J26195k55380
261i9261k56K46909j40735j63585K55643J0225k80290J50469K05666k45670q3076
272a43961K68991m4022k36896J69418J41951k65058J3906K72536j77605j78844
$$ plain form
282 -179584 92458 127247 -150743 -51058 168109 -40885 -152173 124891 79398 -183148
292 -183148 22113 170938 -120162 -105186 170311 15848 -173260 71691 138179 -143627
302 -143627 -58788 185049 -43674 -157645 141709 80795 -180427 19330 168168 -101222
312 -101222 -114558 158820 31894 -179558 68677 141399 -156799 -54454 183829 -52232
322 -52232 -156944 126591 85163 -169789 -648 169484 -94738 -120176 169090 25501
332 25501 -185203 81445 140426 -149898 -53465 175719 -34738 -153323 122049 94076 -177632
343 -177632 6416 179905 -108337 -117712 169486 20093 -175614 70402 132110 -143516
353 -143516 -61448 177606 -38737 -164946 130023 88466 -180007 12802 165904 -101271
$$ packed form
282a79584K72042L4789k77990R9685K19167k08994j11288K77064m5493k62546
292a83148K05261J48825k91100J4976K75497j54463j89108K44951O6488k81806
302a43627Q4839K43837k28723j13971K99354o0914k61222J99757J48838k69390
312a01222j3336K73378j26926k11452K48235P2722k98198J02345K38283k36061
322e2232j04712K83535m1428k54952J69141J70132k64222k5438K89266j43589
332B5501k10704K66648N8981k90324R6433K29184k10457j18585K75372k7973k71708
343a77632J84048J73489k88242r375K87198j49393j95707K46016O1708k75626
353a43516Q2068K39054k16343j26209K94969m1557k68473J92809J53102k67175
$$ plain form
363 -101271 -106244 155646 26510 -168195 67314 139152 -143544 -56015 180348 -43168 -148638
374 -148638 125165 77395 -159084 8563 152417 -89914 -108366 150977 23916 -171614
384 -171614 69533 127204 -142197 -47959 158351 -41473 -134048 109425 75875 -153459 5725
395 5725 155965 -92615 -102542 152476 17044 -153846 70717 113617 -124867 -43503 150834
406 150834 -32758 -134891 109683 76543 -153921 11562 142981 -93337 -88828 134414
416 134414 12958 -141462 56258 109874 -119826 -49986 146207 -35869 -126191 106636
426 106636 61518 -135902 15030 125841 -76519 -83675 122494 23922 -133889 53701 106244
437 106244 -112323 -36174 132200 -37609 -106876 92272 57921 -121377 1075 120505
$$ packed form
363a01271m973K61890j29136j94705K35509P1838k82696Q7529K36363k23516j05470
374a48638K73803m7770k36479J67647J43854k42331j8452K59343j27061j95530
384a71614K41147N7671k69401R4238K06310j99824r2575K43473l3550k29334J59184
395E725J50240k48580r927K55018j35432j70890K24563M2900k38484Q1364J94337
406A50834j83592j02133K44574l3140k30464J65483J31419k36318M509K23242
416A34414j21456j54420J97720N3616k29700O9840J96193j82076r0322K32827
426A06636m5118j97420J50932J10811k02360p156K06169r8572j57811J87590N2543
437A06244k18567P6149J68374j69809o9267J99148l4351j79298J22452J19430
$$ plain form
447 120505 -68205 -86829 114480 15827 -124780 53819 86947 -103087 -32878 117082 -26178
458 -26178 -106440 79823 67815 -114666 -1665 114316 -63342 -68752 105780 10647 -108407
469 -108407 47544 90224 -88061 -48970 112038 -9406 -101891 67844 53879 -101693 7218
480 7218 96026 -61664 -71165 91026 28214 -106215 20262 89483 -71475 -44108 96288
491 96288 -16897 -84366 66113 51346 -88972 -7665 96548 -35006 -78538 78617 38559
502 38559 -94423 19545 77901 -63930 -34653 84144 -12026 -85459 52062 67391 -87940
513 -87940 -32209 96864 -21458 -75357 61099 23671 -78903 26050 72514 -66581 -53740
524 -53740 93799 20409 -98082 27060 73023 -62989 -18610 76985 -32472 -61519 71701
$$ packed form
447A20505j88710j8624K01309r8653j40607J78599L3128j90034P0209J49960j43260
458b6178q0262J86263j2008j82481J13001J15981j77658n410J74532r5133j19054
469a08407J55951M2680j78285L9091J61008j21444r2485J69735j3965j55572J08911
480G218Q8808j57690r501J62191o2812j34429J26477O9221j60958K7367J40396
491I6288j13185o7469J50479j4767j40318Q1307J04213j31554m3532J57155m0058
502C8559j32982J13968N8356j41831K9277J18797r6170p3433J37521J5329j55331
513h7940N5731J29073j18322n3899J36456l7428j02574J04953M6464j39095J2841
524e3740J47539p3390j18491J25142M5963j36012M4379R5595j09457k9047J33220
$$ plain form
535 71701 38229 -90718 -2619 92870 -39736 -67559 72512 16897 -80068 31716 55914
546 55914 -66907 -23471 79131 -18051 -80277 56623 56670 -88416 -14714 89122 -30214
557 -30214 -56965 59348 12418 -66099 35025 63115 -73378 -41571 102707 6331 -97496
568 -97496 35859 60081 -58836 -5065 60079 -45563 -48783 82170 24127 -105767 9698
579 9698 96301 -50065 -57725 68848 -1172 -64568 48618 40496 -80395 -8763 93979 -29225
591 -29225 -82067 70083 45670 -87202 8808 76995 -48376 -40081 70317 -1193 -72239
602 -72239 47298 58471 -88116 -24577 105588 -21367 -89504 52284 42119 -63499 8305
613 8305 53167 -59635 -34953 97341 986 -113310 38124 90975 -64880 -38311 66938
$$ packed form
535G1701l3472j28947Q8099R5489j32606k7823J40071n5615r6965J11784K4198
546E5914j22821M3436J02602r7182o2226J36900M7j45086P3702J03836j19336
557c0214k6751J16313m6930p8517J01124K8090j36493L1807J44278r6376j03827
568i7496J33355K4222j18917N3771O5144j05642l220J30953n8043j29894J15465
579I698Q6603j46366p660J26573p0020o3396J13186q122j20891P1632J02742j23204
591b9225n2842J52150k4413j32872R6010O8187j25371Q295J10398p1510p1046
602g2239J19537J1173j46587O3539J30165j26955o8137J41788j0165j05618P1804
613H305M4862j12802K4682J32294r6355j14296J51434N2851j55855K6569J05249
$$ plain form
624 66938 -17295 -46003 65917 19150 -94743 18693 103641 -55813 -75645 82736 23337
635 23337 -78999 31008 50557 -68678 -12862 82775 -30288 -78886 69281 45854 -98025
646 -98025 2396 92146 -49729 -59764 70297 12593 -67816 33798 48625 -74718 -12417
657 -12417 103127 -30172 -96642 68190 62433 -75358 -10409 59094 -35802 -26876 74173
668 74173 -10952 -95654 51041 87323 -82649 -50323 83032 -2988 -58948 43772 18441
679 18441 -72166 20730 79706 -60375 -64316 88231 23377 -89775 26849 62953 -59187
690 -59187 -19106 71391 -20405 -60661 59413 35455 -84728 9162 88712 -53420 -62913 76687
702 76687 20904 -71835 18108 45083 -52394 -9963 73562 -35521 -78696 72578 53750 -89130
$$ packed form
624F6938q4233k8708J11920m6767j13893J13436Q4948j59454j9832J58381n9399
635B3337j02336J10007J9549j19235N5816R5637j13063m8598J48167k3427j43879
646i8025J00421Q9750j41875j0035J30061n7704q0409J01614J4827j23343O2301
657a2417J15544j33299o6470J64832n757j37791O4949O9503r4896Q926J01049
668G4173q5125q4702J46695L6282j69972L2326J33355q6020n5960J02720k5331
679A8441r0607R2896N8976j40081l941J52547o4854j13152J16624L6104j22140
690e9187M0081R0497r1796m0256J20074k3958j20183R3890P9550j42132r493J39600
702G6687n5783r2739Q9943K6975r7477M2431Q3525j09083m3175J51274j8828j42880
$$ plain form
714 -89130 -14742 72034 -22866 -36105 49033 -4062 -62279 46246 61812 -77897 -35128 90742
726 90742 -2523 -69492 37560 32641 -53324 8983 56042 -45005 -43673 71960 12958 -82238
738 -82238 25232 62571 -57627 -28140 63542 -10474 -53254 38205 28240 -59934 6060 66579
750 66579 -45519 -51040 73513 19921 -72444 13661 52195 -33764 -18071 48595 -17419 -50152
762 -50152 55065 36795 -77948 -7364 74039 -22055 -48229 37506 11611 -44040 20503 38497
774 38497 -52972 -23840 70467 -6472 -66743 33894 39630 -47460 -6816 46213 -20950 -33895
786 -33895 45432 14556 -57835 17585 54726 -45271 -28959 58709 112 -50581 23405 32705
798 32705 -39016 -8288 46274 -24233 -41837 51749 17628 -64563 8856 52244 -29573 -30762
$$ packed form
714h9130P4388Q6776r4900j3239Q5138n3095n8217J08525J5566j39709M2769J25870
726I0742r3265o6969J07052m919q5965O2307M7059j01047J332J15633n9002r5196
738h2238J07470L7339j20198K9487R1682p4016m2780R1459r965q8174O5994O0519
750F6579j12098n521J24553n3592r2365Q6105L8534q5959J5693O6666o6014l2733
762e0152J05217j8270j14743P0584Q1403r6094k6174Q5735k5895n5651O4543J7994
774C8497r1469K9132R4307p6939o0271J00637N736q7090M0644N3029o7163j2945
786c3895P9327l0876p2391P5420L7141r9997J6312Q7668n8597n0693P3986R300
798C2705p1721L0728N4562p0507j7604R3586l4121q2191P3419M3388q1817j189
$$ plain form
810 -30762 37274 3337 -39770 26076 31483 -51847 -8831 62733 -17699 -48741 37567 25536
822 25536 -40341 1994 38462 -25579 -25982 47248 3542 -54523 24313 41301 -43598 -16880
834 -16880 45292 -8745 -38636 26294 22597 -42960 -846 46136 -28699 -33685 47736 7603
846 7603 -49440 16164 38194 -30802 -19380 41180 -2519 -40265 31238 26923 -48846 548
858 548 50571 -23835 -34534 36800 14153 -41599 7694 37102 -32640 -22262 48192 -6460
870 -6460 -48009 29996 28816 -42839 -7202 41817 -14803 -34721 34036 17560 -46552 10599
882 10599 44164 -34400 -22483 46581 -726 -41587 22148 30680 -36306 -11704 45806 -14005
894 -14005 -40011 37934 17249 -48306 8520 39866 -29735 -25187 39281 3716 -45006 19074
$$ packed form
810c0762O8036l3937m3107O5846N407q3330M3016P1564q0432l1042Q6308j2031
822B5536o5877M2335L6468o4041m03P3230m3706n8065P8836J6988q4899K6718
834a6880O2172n4037k9891O4930l697o5557M2114M6982p4835m986Q1421m0133
846G603n7043O5604K2030o8996J1422O0560m3699l7746P1503m315p5769M9394
858E48N0023p4406j0699P1334k2647n5752M9293K9408o9742J0378P0454n4652
870f460m1549P8005j180p1655L5637M9019n6620j9918O8757j6476o4112N7151
882A0599L3565p8564J1917O9064m7307m0861O3735Q532o6986K4602N7510n9811
894a4005k6006P7945k0685o5555N6826L1346o9601M548O4468l5565m8722O4080
$$ plain form
906 19074 35105 -41806 -12407 48803 -15619 -37513 35561 17993 -42028 4710 42089 -25039
918 -25039 -29474 45005 6856 -48045 22548 34749 -40207 -10360 43788 -12804 -37687 30938
930 30938 22004 -45976 318 46254 -28541 -31301 43777 3377 -44175 19349 31147 -35469
942 -35469 -13907 44919 -8157 -42454 33316 26061 -46003 2661 43238 -24879 -25212 38920 5681
955 5681 -41768 16423 36920 -37347 -18741 47940 -9026 -41806 30922 19726 -41797 1905
967 1905 38347 -23663 -29709 39799 9550 -48256 16311 38606 -37243 -14612 43441 -9451
979 -9451 -34556 29143 21402 -40219 -236 45359 -22633 -33038 41944 9102 -43877 16528
991 16528 31012 -32758 -13002 39498 -7617 -39335 27734 25421 -44509 -2493 42639 -22906
$$ packed form
906A9074J6031p6911K9399O1210o4422k1894P3074j7568o0021M6738L7379o7128
918b5039m435P4479l8149n4901P0593J2201p4956K9847N4148n6592k4883O8625
930C0938q934o7980M6294M5936p4795k760P5078m0400m7552O3524J1798o6616
942c5469K1562N8826n3076l4297P5770p255p2064M8664M0577o8117l33O4132l3239
955E681m7449N8191K0497p4267J8606O6681n6966l2780P2728j1196o1523M3702
967A905L6442o2010o046O9508l0249n7806O4567K2295p5849K2631N8053n2892
979i451k5105O3699p741o1621L9983M5595o7992j0405P4982l2842n2979O0405
991A6528J4484o3770J9756N2500m7115l1718O7069k313o9930M2016M5132o5545
$$ plain form
1003 -22906 -27627 35572 5703 -37532 14394 32290 -31295 -17216 44016 -4582 -40065 28850
1015 28850 23433 -37964 1083 36008 -19347 -24816 33520 9275 -41180 11770 35959 -32929
1027 -32929 -17751 39757 -7320 -34083 23709 17742 -34440 -1533 36615 -17946 -30764 35003
1039 35003 11400 -40530 12648 31011 -27840 -12015 34609 -4753 -31743 22612 24244 -35003
1051 -35003 -5221 39149 -16388 -26967 31110 6980 -33740 10488 26973 -25045 -17237 33603
1063 33603 -1036 -36350 19590 22718 -33538 -2867 32325 -15870 -22477 26956 10069 -32493
1075 -32493 6729 32157 -22941 -18368 34570 -1177 -30364 20113 18298 -28120 -3155 30680
1087 30680 -11678 -27235 25748 13939 -34463 5047 28812 -23109 -14392 28807 -3201 -28217
$$ packed form
1003b2906m721O3199k9869m3235N1926J7896o3585J4079O1232m8598l5483O8915
1015B8850n417o1397L9047L4925n5355n469N8336k4245n0455N2950K4189o8888
1027c2929J5178N7508m7077k6763N7792n967n2182L2907L8148n4561j2818O5767
1039C5003k3603n1930N3178J8363n8851J5825M6624l9362k6990N4355J632n9247
1051c5003K9782M4370n5537j0579N8077k4130m0720M4228J6485n2018P808N0840
1063C3603l4639l5314N5940L128n6256L0671L5192m8195o607M9433j6887m2562
1075c2493L9222K5428n5098M573N2938l5747k9187N0477j815m6418K4965L3835
1087C0680m2358j5557N2983j1809m8402L9510K3765n1921Q717M3199l2008k5016
$$ plain form
1099 -28217 15709 21020 -27668 -9852 33476 -8217 -27073 24250 11221 -28240 7589 24894
1111 24894 -19120 -14996 28880 4680 -31483 11700 25662 -25034 -8321 28194 -10531 -21621
1123 -21621 21699 9859 -28560 674 28594 -15181 -23142 25980 6047 -28586 11588 19014
1135 19014 -23434 -5656 26901 -6608 -24749 19036 18680 -28063 -2990 30223 -13118 -18048
1147 -18048 24195 3086 -23984 11135 20184 -22026 -12789 29877 -950 -30962 15473 18151
1159 18151 -24809 -1429 22054 -14533 -15329 23542 5449 -30357 5736 29320 -18886 -17438
1171 -17438 26118 -251 -21281 16470 11590 -23772 263 28177 -10944 -25052 23069 14722
1183 14722 -28663 3182 22972 -17901 -10093 23120 -4158 -24055 14671 18253 -26518 -8526
$$ packed form
1099b8217M3926N311m8688J7816M3328m1693j8856N1323j3029l9461L5829J7305
1111B4894m4014M124M3876k4200l6163M3183J3962n0696J6713L6515l8725j1090
1123b1621M3320j1840l8419K9234K7920m3775p961M9122j9933l4633M0174P426
1135A9014m2448J7778L2557l3509j8141M3785l56m6743K5073L3213m3341m930
1147a8048M2243k1109k7070L5119R049m2210R237M2666l0827l0012M6435K678
1159A8151m2960K3380K3483l6587p96L8871j8093l5806L6093K3584m8206J448
1171a7438M3556k6369k1030L7751m880l5362K4035K7914l9121j4108M8121q347
1183A4722m3385L1845J9790m0873P808L3213k7278j9897L8726L582m4771J7992
$$ plain form
1195 -8526 30991 -7938 -25561 19939 10328 -23329 5635 19093 -17468 -10948 27952 749
1207 749 -31016 14410 26063 -23500 -9457 24716 -6830 -15800 18997 4835 -26189 6269
1219 6269 28422 -19202 -22806 27043 6724 -26639 9034 14943 -20114 -1997 23374 -10723
1231 -10723 -23106 21954 15971 -29518 -1189 28667 -13214 -16399 22437 1401 -20821 12425
1243 12425 16988 -22131 -6984 30085 -6468 -28689 19807 16681 -25648 -1106 20465 -12825
1255 -12825 -11401 21013 -967 -27494 13188 25484 -26003 -14685 28978 -1299 -21240 14130
1267 14130 8079 -20158 6129 23259 -17258 -19272 28962 9379 -30374 6950 22251 -17338
1279 -17338 -6594 20533 -7385 -18891 18637 12054 -27872 -1199 29234 -13597 -21612 22295
$$ packed form
1195h526L9517l8929j7623M5500r611l3657K8964J3458l6561O520L8900k7203
1207G49l1765M5426J1653m9563J4043L4173l1546q970L4797j4162l1024L2458
1219F269K2153m7624l604M9849k0319l3363L5673N909l5057J8117K5371l4097
1231a0723j2383M5060n983m5489K8329K9856m1881l185L8836k1036k2222L3246
1243A2425M563l9119J5147L7069l6553k2221M8496l126m2329K4542K1571l3290
1255a2825J424L2414k1980k6527M0682J2296n1487J1318M3663l0277j9941L5370
1267A4130o051k8237K6287J7130m0517k014M8234j9583l9753L7324J5301l9589
1279a7338J0744K7127k7918j1506L7528o583l9926K6673L0433m2831q015M3907
$$ plain form
1291 22295 5896 -22790 7584 15430 -17273 -5797 24075 -6448 -25131 20120 18305 -27553
$$ packed form
1291B2295j6399k8686L0374P846l2703J1476K9872l0523j8683M5251j815m5858
$$ [...]
8191a8
##END NTUPLES=NMR FID
##END=
