##TITLE=1H_Pr C12
 CDCl3
 8 sc, 
 10.12.2021
##JCAMPDX= 6.0         $$ Bruker NMR JCAMP-DX V2.0
##DATA TYPE= NMR FID
##DATA CLASS= NTUPLES
##ORIGIN= UXNMR, Bruker Analytische Messtechnik GmbH
##OWNER= root
$$ XWIN-NMR		Version 3.5
$$ Fri Dec 10 12:44:14 2021 Russian Standard Time (UT+4h)  she@DPX200
##.OBSERVE FREQUENCY= 200.131346
##.OBSERVE NUCLEUS= ^1H
##.DELAY= (6, 6)
##.ACQUISITION MODE= SIMULTANEOUS
##.ACQUISITION SCHEME= undefined
##.AVERAGES= 8
##.DIGITISER RES= 18
##SPECTROMETER/DATA SYSTEM= spect
##.PULSE SEQUENCE= zg30
##.SOLVENT NAME= CDCl3
##.SHIFT REFERENCE= (INTERNAL, CDCl3, 0, 15.7039)
##AUDIT TRAIL= $$ (NUMBER, WHEN, WHO, WHERE, WHAT)
$$ ##TITLE= Audit trail, XWIN-NMR		Version 3.5
$$ ##JCAMPDX= 5.01
$$ ##ORIGIN= Bruker BioSpin GmbH
$$ ##OWNER= she
$$ F:/spectra/data/she/nmr/H-F/1/audita.txt
$$ ##AUDIT TRAIL=  $$ (NUMBER, WHEN, WHO, WHERE, WHAT)
(   1,<2021-12-10 12:42:52.17 +0400>,<she>,<DPX200>,
      <created by zg, POWCHK disabled, PULCHK disabled
       configuration hash MD5:
       00 E9 B6 7A A2 85 ED C7 34 08 36 98 17 FE 4E 26
       data hash MD5: 16K
       11 1B 1B 03 6D 40 67 2B A1 A5 BC FF 42 CD C9 C8>)
$$ ##END=
$$ 
$$ hash MD5
$$ D9 70 30 D8 9C 11 56 28 39 DB DC 8A 08 C7 A4 62
##$RELAX= 
##$RELAX= 
##$RELAX= 
##$RELAX= 
##$RELAX= 
##$RELAX= 
$$ Bruker specific parameters
$$ --------------------------
##$DU= <F:/spectra>
##$EXPNO= 1
##$NAME= <H-F>
##$PROCNO= 1
##$TYPE= <nmr>
##$USER= <she>
##$AMP= (0..31)
100 100 100 100 100 100 100 100 100 100 100 100 100 100 100 100 100 100 
100 100 100 100 100 100 100 100 100 100 100 100 100 100 
##$AQSEQ= 0
##$AQ_mod= 1
##$AUNM= <au_zg>
##$AUTOPOS= <>
##$BF1= 200.13
##$BF2= 200.13
##$BF3= 200.13
##$BF4= 200.13
##$BF5= 200.13
##$BF6= 200.13
##$BF7= 200.13
##$BF8= 200.13
##$BYTORDA= 1
##$CFDGTYP= 0
##$CFRGTYP= 5
##$CHEMSTR= <none>
##$CNST= (0..31)
1 1 145 1 1 1 1 1 1 1 1 1 1 1 1 1 1 1 1 1 1 1 1 1 1 1 1 1 1 1 1 1 
##$CPDPRG= <>
##$CPDPRG1= <>
##$CPDPRG2= <>
##$CPDPRG3= <>
##$CPDPRG4= <mlev>
##$CPDPRG5= <mlev>
##$CPDPRG6= <mlev>
##$CPDPRG7= <mlev>
##$CPDPRG8= <mlev>
##$CPDPRGB= <>
##$CPDPRGT= <>
##$D= (0..31)
0 1.2 0 0 0 0 0 0 0 0.06 0 0.03 0 0 0 0 0.0002 0 0 0 0 0 0 0 0 0 0 0 0 
0 0 0 
##$DATE= 1639125771
##$DBL= (0..7)
120 120 120 120 120 120 120 120 
##$DBP= (0..7)
150 150 150 150 150 150 150 150 
##$DBP07= 0
##$DBPNAM0= <>
##$DBPNAM1= <>
##$DBPNAM2= <>
##$DBPNAM3= <>
##$DBPNAM4= <>
##$DBPNAM5= <>
##$DBPNAM6= <>
##$DBPNAM7= <>
##$DBPOAL= (0..7)
0.5 0.5 0.5 0.5 0.5 0.5 0.5 0.5 
##$DBPOFFS= (0..7)
0 0 0 0 0 0 0 0 
##$DE= 6
##$DECBNUC= <off>
##$DECIM= 32
##$DECNUC= <off>
##$DECSTAT= 4
##$DIGMOD= 1
##$DIGTYP= 9
##$DL= (0..7)
0 120 120 120 120 120 120 120 
##$DP= (0..7)
150 150 150 150 150 150 150 150 
##$DP07= 0
##$DPNAME0= <>
##$DPNAME1= <>
##$DPNAME2= <>
##$DPNAME3= <>
##$DPNAME4= <>
##$DPNAME5= <>
##$DPNAME6= <>
##$DPNAME7= <>
##$DPOAL= (0..7)
0.5 0.5 0.5 0.5 0.5 0.5 0.5 0.5 
##$DPOFFS= (0..7)
0 0 0 0 0 0 0 0 
##$DQDMODE= 0
##$DR= 18
##$DS= 0
##$DSLIST= <SSSSSSSSSSSSSSS>
$$ [...]
##$SUBNAM2= <"">
##$SUBNAM3= <"">
##$SUBNAM4= <"">
##$SUBNAM5= <"">
##$SUBNAM6= <"">
##$SUBNAM7= <"">
##$SUBNAM8= <"">
##$SUBNAM9= <"">
##$SW= 18.0517287032376
##$SWIBOX= (0..15)
0 0 2 0 0 0 0 0 0 0 0 0 0 0 0 0 
##$SW_h= 3612.71676300578
##$TD= 16384
##$TD0= 1
##$TE= 0
##$TE2= 300
##$TE3= 300
##$TEG= 300
##$TL= (0..7)
0 120 120 120 120 120 120 120 
##$TP= (0..7)
150 150 150 150 150 150 150 150 
##$TP07= 0
##$TPNAME0= <>
##$TPNAME1= <>
##$TPNAME2= <>
##$TPNAME3= <>
##$TPNAME4= <>
##$TPNAME5= <>
##$TPNAME6= <>
##$TPNAME7= <>
##$TPOAL= (0..7)
0.5 0.5 0.5 0.5 0.5 0.5 0.5 0.5 
##$TPOFFS= (0..7)
0 0 0 0 0 0 0 0 
##$TUNHIN= 0
##$TUNHOUT= 0
##$TUNXOUT= 0
##$USERA1= <user>
##$USERA2= <user>
##$USERA3= <user>
##$USERA4= <user>
##$USERA5= <user>
##$V9= 5
##$VALIST= <valist>
##$VCLIST= <CCCCCCCCCCCCCCC>
##$VD= 0
##$VDLIST= <DDDDDDDDDDDDDDD>
##$VPLIST= <PPPPPPPPPPPPPPP>
##$VTLIST= <TTTTTTTTTTTTTTT>
##$WBST= 1024
##$WBSW= 4
##$XGAIN= (0..3)
0 0 0 0 
##$XL= 0
##$YL= 0
##$YMAX_a= 484250
##$YMIN_a= -513583
##$ZGOPTNS= <>
##$ZL1= 120
##$ZL2= 120
##$ZL3= 120
##$ZL4= 120
##$ABSF1= 10
##$ABSF2= 0
##$ABSG= 5
##$ABSL= 3
##$ALPHA= 0
##$AQORDER= 0
##$ASSFAC= 0
##$ASSFACI= 0
##$ASSFACX= 0
##$ASSWID= 0
##$AUNMP= <proc_1d>
##$AZFE= 0.1
##$AZFW= 0.1
##$BCFW= 1
##$BC_mod= 2
##$BYTORDP= 1
##$COROFFS= 0
##$CY= 11.3945322036743
##$DATMOD= 1
##$DC= 2
##$DFILT= <>
##$DTYPP= 0
##$F1P= 2.36226072786647
##$F2P= -0.459571619588291
##$FCOR= 0.5
##$FTSIZE= 0
##$FT_mod= 4
##$GAMMA= 1
##$GB= 0.15
##$INTBC= 1
##$INTSCL= 1
##$ISEN= 128
##$LB= 0.24
##$LEV0= 0
##$LPBIN= 0
##$MAXI= 10000
##$MC2= 0
##$MEAN= 0
##$ME_mod= 0
##$MI= 1.114404
##$NCOEF= 0
##$NC_proc= 0
##$NLEV= 6
##$NOISF1= 3.799351
##$NOISF2= 2.8
##$NSP= 1
##$NTH_PI= 0
##$NZP= 0
##$OFFSET= 15.70392
##$PC= 1
##$PHC0= -15876.93
##$PHC1= 19.4008
##$PH_mod= 1
##$PKNL= yes
##$PPARMOD= 0
##$PSCAL= 0
##$PSIGN= 0
##$REVERSE= no
##$SF= 200.130013532006
##$SI= 16384
##$SIGF1= 3
##$SIGF2= 2
##$SINO= 400
##$SIOLD= 16384
##$SREGLST= <1H.CDCl3>
##$SSB= 0
##$STSI= 0
##$STSR= 0
##$SW_p= 3612.71676300578
##$SYMM= 0
##$S_DEV= 0
##$TDeff= 0
##$TDoff= 0
##$TI= <>
##$TILT= no
##$TM1= 0
##$TM2= 0
##$TOPLEV= 0
##$USERP1= <user>
##$USERP2= <user>
##$USERP3= <user>
##$USERP4= <user>
##$USERP5= <user>
##$WDW= 1
##$XDIM= 8192
##$YMAX_p= 0
##$YMIN_p= 0
$$ End of Bruker specific parameters
$$ ---------------------------------
##NTUPLES= NMR FID
##VAR_NAME=  TIME,          FID/REAL,        FID/IMAG
##SYMBOL=    X,             R,               I
##VAR_TYPE=  INDEPENDENT,   DEPENDENT,       DEPENDENT
##VAR_FORM=  AFFN,          ASDF,            ASDF
##VAR_DIM=   8192,          8192,            8192
##UNITS=     SECONDS,       ARBITRARY UNITS, ARBITRARY UNITS
##FACTOR=    0.0002768,     1,               1
##FIRST=     0,             0,               0
##LAST=      2.2672688,     0,               0
##MIN=       0,             -513583,         0
##MAX=       2.2672688,     484250,          0
$$ Real data points
##PAGE= N=1
##DATA TABLE= (X++(R..R)), XYDATA
0@%%%%%%%%qJ6j6J6k4L2m0M8n6P2q9J13j36J60j92K29k69L12l67M30m95N67o49
31c46P43q48R61j086J224j378J548j735J938k155K396k663K954l271L613l989
47b094M404m856N350n891O489p150P886q707R624j0662J1848j3215J4808j6696
61h862J8978k1801K5394l0141L6741m6611O3136r7469K86256m51063j78606Q86061
73D82013n19238l80196P47207o5813p72543M98915M09172n80964J7033M99125
83C34711m06612k50615N14893J6810m46655J90830K16454l01405J2714L66172
93B47297j91769k95255K86088J19918l23970J39429K51026l77135q7352M76980
103B45257j57300l40666L98643L4028m99850L23392L64408n58929l9539N38847
$$ plain form
0 0 0 0 0 0 0 0 0 0 -8 8 -8 8 -16 16 -24 24 -32 40 -49 64 -72 88 -104 125 -144 168 -199 231 -264 303 -346
31 -346 397 -451 510 -576 648 -730 818 -917 1021 -1134 1262 -1401 1553 -1718 1895 -2094
47 -2094 2310 -2546 2804 -3087 3402 -3748 4138 -4569 5055 -5607 6241 -6974 7834 -8862
61 -8862 10116 -11685 13709 -16432 20309 -26302 36834 -60635 225621 -225442 -404048 482013
73 482013 -37225 -417421 329786 263973 -508570 -9655 399517 -181447 -164414 334711
83 334711 -71901 -322516 192377 209187 -237468 -46638 169816 -131589 -118875 247297
93 247297 55528 -239727 46361 166279 -157691 -18262 232764 -144371 -231723 245257
103 245257 87957 -252709 145934 179962 -319888 3504 367912 -191017 -230556 308291
113C08291l53326k81553O04525q5968n73462M10085K89089n42304J03762M47418
123C26557m18160k06074N10104p3991l85862K86749J55482l59204P4684L13808
133B24093k16272j88991K55558K3982k37642J24794J73727k29390o7127K68939
143A31671o5154k11969J99360O8540k78083J07379K31579k56513o9488K97596
153A54918j41410j94001L05215j423l18108K05432J71686l18865N4785K76845
163A95074k53030j10841L25642r1408k40619K41672O4406k71934J11828J85892
173A56682k18490n0869K17073p8638j41126J55597M3979j66307M4701J34884j03494
184f008p6322J29443j779j31357P9551R7941j37671k2540J56616o8555j08502
$$ plain form
113 308291 -45035 -326588 277937 191969 -381493 28592 317681 -224623 -120861 326557
123 326557 -91603 -297677 212427 138436 -247426 39323 194805 -164399 -89715 224093
133 224093 7821 -181170 74388 98370 -139272 -14478 159249 -70141 -137268 131671
143 131671 66517 -145452 53908 122448 -155635 -48256 183323 -73190 -142678 154918
153 154918 13508 -180493 124722 123299 -194809 10623 182309 -136556 -81771 195074
163 195074 -57956 -168797 156845 65437 -175182 66490 130896 -141038 -29210 156682
173 156682 -61808 -112677 104396 25758 -115368 40229 84208 -82099 -37398 97486 -6008
184 -6008 -82330 47113 45334 -86023 -6472 91469 -46202 -68742 87874 19319 -89183
195h9183J47146Q023j69276R9930J07031j69608Q884J59263j24760o9500J82840
206I0790m9507j47449J40174L8567j62705P8445J04847j50487o091J44619q0643
217E60p0529J24456j8502j08199Q2296N1425j00905J1101P6199n7719l3286P7741
229C4638m596o8589L5123M4052n5800j0810O1683k9116n5497N9893K5200p2931
241c6750K3154O0695o7156j8363Q6257l6902o5615P7874Q647q5025N3946N1733
253E2495q8588J0128Q1327o3259l2503Q4186k9358o4538O9769J3553p4750L7785
265c753M4246o4655L035N9495m1257k9012N4766r950m5054L5914J8002m4025J0598
278a1650L6042k8795j5649L6569n095l1484K2874J7540l4933J350L5157k0679
$$ plain form
195 -89183 57963 65986 -103290 -3360 103671 -65937 -57053 102210 -22550 -92050 90790
206 90790 41283 -106166 34008 72575 -90130 -11685 93162 -57325 -63416 81203 560
217 560 -69969 54487 35985 -72214 10082 61507 -39398 -28297 47902 -9817 -43103 34638
229 34638 30042 -38547 -3424 40628 -15172 -25982 35701 6585 -48912 10981 36181 -36750
241 -36750 -13596 47099 -20057 -38420 47837 10935 -54680 23194 31841 -53184 762 52495
253 52495 -36093 -25965 55362 -7897 -40400 43786 14428 -50110 19659 33212 -41538 -3753
265 -3753 40493 -24162 -21127 38368 -2889 -31901 22865 12915 -32139 3775 21777 -22248 -11650
278 -11650 24392 -4403 -20052 16517 11422 -20062 2812 20352 -14581 -13231 21926 1247
290A247k2479L6069L15l7842K5548K4051m3543J418M1113l1040k0892M7199j1053
303A0111m2187M0073J5908m9032J9434L4863m5785m652M9263k7637k8734M6683
315A8308m597m1625L5382J9553m6922J0877L6427l5032j1350M1496j7093l0904
327b5480L5034Q423l7017J5588K4888l1999n827L4741j4600k5522K7684P650l2021
340a8458J3185K6070k8509r361L5175j1527k7895L0121R203l8013J4933L0702
352B5626l4960q014M1053j9424k9469M0351K553m3716K5628K6184m4033L220M1603
365B6602l1625k0485M5355r285l8598L4166J5237m2935J3357L3380l4286j0522
377a9639M0030j3538k9001L0895Q917l5157J3051K7117k8653j0702L2939q923
$$ plain form
290 1247 -21232 14837 15152 -22690 2858 26909 -16634 -15216 25897 -5143 -26035 21164 10111
303 10111 -32076 7997 23905 -25127 -5693 29170 -16615 -21267 27996 359 -28375 18308
315 18308 13711 -27914 7468 27021 -19901 -9024 27403 -7629 -18979 22517 5424 -25480
327 -25480 9554 17977 -19040 -3452 21436 -10563 -16390 18351 3751 -21771 5913 13563 -18458
340 -18458 -5273 20797 -7712 -17073 18102 6575 -21320 8801 18004 -20009 -5076 25626
352 25626 -9334 -17348 23705 4281 -25188 15163 17716 -26000 -372 25812 -18221 -15001 26602
365 26602 -5023 -25508 19847 10562 -28036 6130 21367 -21568 -8211 25169 -9117 -19639
377 -19639 20391 6853 -22148 8747 17664 -17493 -4442 22675 -5978 -16680 16259 7336
389G336k7021K5918J1514l5293Q485L1000k6874j4794L6523j0102l2308L2741
401G125J3669m2147J2693L3399l5252q100M3889k1105l2004M1123N181m1467K4405
414A409K3837m2447L151M0486k6486k0965L6382o517l1597K7787J5577l5848L554
427a1677K8602j9931j2639K8754m651k8947J8356J9912k5865k734K6844j6996
439i72j9142L2430M572l5226J5402K2993l2297J000L7605k6363k5571M0079j023
452A3487l6026K9435J4800m5019J2148L7921l2912j2371L7652j8620k6277L8739
464A2957M698l7966J6265K0529k8068L049K8463j9300j9068K4742M868k0475R572
477B66J3079k0405n667K5749l252k2727J3237J1405k3820N395K7271k2752j8986
$$ plain form
389 7336 -19685 6233 17747 -17546 -9061 21939 -4935 -19729 16794 6692 -25616 7125
401 7125 20794 -21353 -8660 24739 -10513 -18613 25276 4171 -27833 13290 18471 -22996 1409
414 1409 25246 -17201 -14050 26436 -50 -21015 15367 8850 -22747 5040 20617 -15231 -11677
427 -11677 16925 -3006 -15645 13109 8458 -20489 -2133 17779 -8086 -10820 16024 -972
439 -972 -20114 12316 16888 -18338 -2936 20057 -12240 -11240 26365 2 -25569 14510 13487
452 13487 -22539 6896 21696 -23323 -11175 26746 -6166 -18537 19115 495 -25782 12957
464 12957 17655 -20311 -4046 16483 -11585 -8536 19927 627 -18441 6301 11169 -9306 266
477 266 13345 -7060 -12727 13022 9770 -12957 280 11685 -12135 -6740 20531 -2221 -21207
490b1207L2270k141k8616K6800J0708m0431J3682L3899l2541q431L6848k2122
502a282k3137M1527p55l8101K3594J5940l3658J1780K7481l0020j0023K9974q854
515D466j7106K0588L75k2182J0051J6005j2980p149J1072j762j0300R278J0950
528A1306j5303p981J9091j397j6204J6344N916k7635J0216K6141k4745q088K8817
541A6478j7485j8745L6129j920l5995K2992J4758l3301J3989K5901l4150o618
553a7967L4168j4529j6503K7147o641k5185K1465J2093k1337L805J1157j3991
565f318J74J5793l976j0994L066M864j605r76M656j861j1551M762J4295r962p266
580f899J3856q541j1655K2937J411k6026J2944J2409k3833J0498K2420k7812p466
$$ plain form
490 -21207 11063 8922 -19694 7106 17814 -22617 -8935 24964 -7577 -16008 20840 -1282
502 -1282 -24419 17108 16353 -21748 1846 17786 -15872 -4092 23389 -6631 -16654 13320 4466
515 4466 -12640 7948 8323 -13859 -3808 12197 -783 -7932 3140 1378 -8922 356 11306
528 11306 -3997 -11978 7113 5716 -10488 5856 11772 -15863 -5647 20494 -4251 -12339 16478
541 16478 -1007 -19752 16377 14457 -21538 1454 16212 -17089 -3100 22801 -11349 -17967
553 -17967 16201 1672 -14831 12316 5675 -19510 1955 14048 -7289 -3484 7673 -6318
565 -6318 -6144 9649 5673 -5321 -2255 2609 1004 28 4684 2823 -8728 -3966 10329 367 -6899
580 -6899 6957 -1584 -13239 9698 11109 -14917 -1973 10436 -13397 -2899 19521 -8291 -15757
593a5757L0294j3110j4638K7946p881k7217K4014J1201k5329R889J3491k3037
605a0134K389K2298j2755r713J2803n311p455J1969J314r777J091K769MJ768m45
620H15J26k536l801P283L848j0014K870O504j1264L342J5089j3586p131J7427
634H972p890j1621K0193k433k1721J6347Q697k1655J0344J4883k3227K79K1640
647A2808j5021q257K0280q972j4050J8058J550j4957J0370M994j3294M998Q620
660G127q903m50N545m772l39M129q79o90p00j389L174j408k124M942l302o967
676g006Q973J941j0336P667M571j4074N772J2604j4090k175J4850j1703o778J9526
690I742n414j4783J5157J929j5997J2465Q005j8606L461J2470j2432m21J2874
$$ plain form
593 -15757 14537 1427 -13211 14735 6854 -20363 3651 14852 -10477 -588 12903 -10134
605 -10134 -7745 14553 1798 -7915 4888 -423 -7878 4091 5405 -4372 -3281 -512 -508 1260 815
620 815 941 -1595 -5396 1887 5735 -4279 -1409 5095 -6169 -2827 12262 -1324 -8455 8972
634 8972 1082 -10539 9654 7221 -14500 1847 10544 -11111 -767 14116 -9111 -8832 12808
647 12808 -2213 -10470 9810 838 -13212 4846 6396 -8561 1809 6803 -6491 -1493 7127
660 7127 -1776 -2226 3319 -1453 -1792 2337 1458 768 68 -1321 1853 445 -1679 3263 -39 -7006
676 -7006 1967 3908 -6428 1239 5810 -8264 -2492 10112 -3978 -6153 8697 -3006 -9784 9742
690 9742 4328 -10455 4702 6631 -9366 3099 11104 -7502 -4041 8429 -4003 -4424 8450
703H450r748o835J2569j626p113O998p39p994N085M005m184J9O39j079J232J148
719H27J572o16m890J963N138m857p18O279o673l815J2105k532r594R051J101j2329
735g988R261P322j5245J826J1861j1051j536J4361r007r210J4221r20j1064R937
749B768K264j2868O176Q846r452k53P855o287k603Q313k000n960L237J576k873
764a261Q21K525j801k922J850L655k521l017M205j240n233O105L413r543K141
779b823Q165p671j121J0975p110p903J2161j72j0886Q442L896j2699N033J0557
793H844j0960k252J0673o847n808J1278j730r964O666L615p660L299N663o930
807b113j774O367j178l746K964R37l889Q24M643j244m181K816K763m642O39N618
$$ plain form
703 8450 -1298 -8133 4436 2810 -4303 2695 1956 -6038 -953 3052 -1132 -1113 -474 -1553 -321 827
719 827 2399 1783 -3107 -1144 3994 -863 -1581 4698 -1975 -5790 6315 3783 -5811 3240 4341 -7988
735 -7988 1273 8595 -6650 -4824 7037 -4014 -5550 8811 -196 -9406 4815 3895 -7169 2768
749 2768 5032 -7836 -1660 7186 -2266 -2519 5336 -951 -3554 4759 2759 -3201 36 1612 -1261
764 -1261 -440 2085 284 -2638 -788 2867 346 -2671 1534 294 -4939 1166 4579 -4964 -2823
779 -2823 5342 -2329 -3450 7525 415 -7488 4673 4501 -6385 2057 5953 -6746 -1713 8844
793 8844 -2116 -4368 6305 -542 -6350 4928 3198 -6766 -100 3515 -4145 -846 4817 -2113
807 -2113 -3887 2480 1302 -2444 520 1457 -2432 -1608 3035 1791 -2390 426 3189 -1453 -814 4804
823D804n341m265P648k59p456O313K953r846L695Q321q892k623J0237o026o212
838f949J0821k94j0327P253M543r605L514P434q318k312Q887l593n089O642J68
853B775o469L774L846n112l61M066k132k853K933J211l770J49L567j555l024L953
869I98J333n509K322M600n627j440P153l539m944P721k1p649N680M279q905K053
885a495P267p506k068Q543m320n534P881j62p282N212L202p256J537N484m892
900a389j725N344k018l192L817R18l308R95K237j489j214J935O47k461J75K937
916B209j841k254L827l69m218L131K497n650R12N008m931j682O690l086m747O775
932B271P6o632M777K827p002K360N589o164n61O104l576k605N639j421m470L918
$$ plain form
823 4804 -537 -4802 2846 2587 -4869 1444 4397 -5449 -1754 6567 -2325 -4948 5289 -737 -6949
838 -6949 3872 3578 -6749 504 5047 -4558 -1044 6390 -1928 -4240 4647 1054 -4035 2607 2775
853 2775 -3694 80 3926 -1186 -1547 2519 387 -2466 467 1678 -2092 -1943 1624 69 -2955 998
869 998 2331 -3178 -856 3744 -1883 -3323 3830 291 -4653 3068 3047 -4602 1078 5357 -3548 -1495
885 -1495 5772 -1734 -3802 4741 421 -5113 2768 2606 -4676 536 3738 -3518 -1981 3503 -1389
900 -1389 -3114 2230 212 -2980 837 1755 -1553 -558 1679 190 -1024 911 1558 -903 -728 2209
916 2209 368 -1886 1941 1572 -2646 485 2982 -2668 -1756 3252 -1679 -3361 3329 243 -4504 2271
932 2271 2347 -4285 492 3319 -3683 -1323 4266 -1898 -2459 3645 69 -2536 3103 1682 -2788 1130
948A130J195m077J739K214l494J29K349p05j174P99j24n66j41J037M35k493L94
965a353K597j683q60L337j836l081M521Q18m947L057K206n537K136M937n226j209
981b123N416l813k644O607k145n455M986R63n096L929K238n992J352M263l445
996i59l39L538l051j549L778k13j770J021l26j007J291N86r0p63j304J488P15
1013A046j630J186P20l563J316L792l517j321L892k931k186N856j089n316M165
1028D20J379n262M374K963o649J032N084m403n45N437l997l248N720o07l895L698
1044A501j8m259K812K135l074K62J465k108M16J672o62n61m40q7J399m52o68J540
1062H73j246j531L514m7l499K676J337m502K676L517n528O3M996m247j710O152
$$ plain form
948 1130 2325 -1752 -13 2201 -1293 -1164 1185 480 -694 105 -19 -585 -726 311 746 -1747 -1353
965 -1353 1244 -439 -1299 2038 202 -2879 1642 2460 -2487 570 2776 -2761 -625 4312 -914 -2123
981 -2123 3293 -520 -3164 3443 1298 -4157 829 1792 -3304 625 2863 -3129 -1777 2486 -959
996 -959 -1298 2240 -811 -2360 1418 1205 -565 456 130 -877 414 1000 910 147 -1157 331 1046
1013 1046 -584 602 1322 -2241 -925 2867 -650 -1971 1921 -1010 -3196 2660 1571 -3745 420
1028 420 1799 -3463 911 3874 -2775 -1743 3341 -1062 -1607 3830 -167 -3415 2305 1698 -2197 1501
1044 1501 1483 -2776 36 2171 -903 -641 824 -1284 -868 804 142 -419 -859 -946 453 1 -667 873
1062 873 -373 -1904 1610 1563 -1936 740 2077 -2425 251 3768 -1760 -1697 3299 -948 -2658 3494
1078C494l128m107N677k97n259M670J369n954K723L660m678K80M191l663j128
1093b150M176j665k010K751l58j832J623M28j350P57k66J25M98j272P21R87k424
1110a261P43K270l034m14L815k615k257M802j446l814M730L54n328L690K824n776
1126b717J652M587n001n58N595l454k621N163j557l737M103N02m036K294J417
1141A632l214J127K062k451j10J546q24j13M92n32P2K4j62J204o49j498K303l8
1159H71k563K575R36l840J894K873m104L80L947l559j603M983k394l267M682n46
1175A265m492M004J468m991K265K758m040M79L905l385j285L628j352j750K691
1190A168m59j989J686M61j012L38K61n28L18j63K08L51j462K00J642j481o07K428
$$ plain form
1078 3494 366 -3741 1936 1639 -3620 1050 2419 -3535 -812 2848 -1830 -1550 2641 -1022 -2150
1093 -2150 2026 361 -1649 1102 744 -1088 535 963 -387 370 104 229 727 -545 176 1163 -1261
1110 -1261 -518 1752 -1282 -1696 2119 -496 -2753 2049 603 -3211 1519 1873 -3455 235 3059 -2717
1126 -2717 -1065 3522 -1479 -2037 3558 104 -2517 2646 1089 -2648 1455 1957 -2079 215 1632
1141 1632 -1582 -455 1607 -844 -954 592 -232 -345 147 -385 -313 -289 -451 753 104 -1394 909 871
1159 871 -1692 883 1819 -2021 -127 2746 -1358 -978 2969 -590 -2193 2790 396 -2871 1811 1265
1175 1265 -3227 777 2245 -2746 -481 2277 -1763 -1284 2621 -764 -2049 1579 227 -1523 1168
1190 1168 709 -1280 406 867 -145 193 454 -74 244 81 289 640 -822 -622 1020 -461 -1068 1360
1208A360j784j652L404p23l020L101M45l660K764K197m307Q77L485l558j71L993
1224B751k868j997M034r07k864L137J5l336K280J574k859M94J791k260K69J706
1240I60j063p72Q55l49P4L17k96K20p0n70J220R8j482J186O37k095J259J797k782
1259h56N9K620k080r27L052j725k183L270k23k987K409R64l462J532K474l195
1275a258K54K712k523o06K987j280j602K041N5j711J430M32j568O66O70p01O2
1292F0K32l18J25m6pN31r89k43J298p98q05J626n20j474J846K00k268J609J170
1311A229k474Q19K160k467m61K873j553j526K852p55k333K359N03k407J334J220
1327A373k316M14J711j600m51J660j018n76J285l80p42O34L8m20K61K25m4J1l47
$$ plain form
1208 1360 -424 -2076 1328 605 -2415 686 1131 -2529 235 2432 -1875 -998 2487 -1071 -1242 2751
1224 2751 -117 -2114 1920 1013 -1851 1286 1301 -2035 245 1819 -1040 -546 1245 -1015 -746 960
1240 960 -103 -875 -20 -369 -295 22 -274 -54 -124 -694 526 624 -858 328 965 -1130 129 1926 -856
1259 -856 -797 1823 -257 -1184 1868 143 -2040 1230 1007 -1980 429 1393 -2069 -537 1937 -1258
1275 -1258 -1004 1708 -815 -1421 1566 286 -1316 725 780 -931 499 931 -637 29 699 -2 60
1292 60 292 -26 99 53 46 577 -412 -655 643 -155 -960 666 146 -1328 518 718 -1550 59 1229
1311 1229 -1245 -426 1734 -733 -1194 1679 126 -1400 1452 697 -1636 723 1226 -1181 153 1373
1327 1373 -943 -529 1182 -418 -869 791 -227 -803 482 102 -640 -6 32 -388 -127 98 54 65 -282
1346b82N22M07j023M39Q45j293J22J446j185o90J716q08j338J795jj998J640P75
1364A089k610J182J572k120j31K257j643p50K160r35j250J784j00j467J220Q35
1380A093j730N89R85j073R1O71n79k02M72k30P6j51j16J78k52k39O56j51r63R60
1400H5K15r78O10R52j703L86J473j275k77J770j384r53K065l34j618J687L83k318
1418a214J389J078k051L09J436j388l41J790j130q71J239k00p45Q52J00p94M33
1435a08K33k17O3N1r3J78P2p0L66m53j71O72l64n23R47n31r03J231J54j431J088
1456A91N61j711O41J246j609n6J549j260l55J637o86j208J765n5j370J232K91
1473H03j516P29Q94j217J59R56r93m9P59m15k92L73j34j88L53l41j16K27l92L78
$$ plain form
1346 -282 240 647 -376 63 908 -385 -263 1183 -2 -692 1024 216 -1122 673 672 -1326 314 1089
1364 1089 -1521 -339 1233 -887 -1018 1239 -404 -1154 1006 71 -1179 605 505 -962 258 1093
1380 1093 -637 -48 937 -136 -45 626 47 -155 317 87 163 12 -104 74 -178 -417 239 88 -875 85
1400 85 300 -678 -68 884 -819 -433 1040 -235 -512 1258 -126 -1079 986 652 -966 721 1104 -1214
1418 -1214 175 1253 -798 -489 947 -441 -782 1008 -122 -993 246 46 -699 153 253 -541 -108
1435 -108 125 -92 -29 22 -71 107 179 109 475 22 -149 523 159 -364 583 52 -851 380 534 -897 191
1456 191 752 -959 -318 928 -681 -737 812 -448 -803 834 148 -1060 705 650 -720 512 803
1473 803 -713 16 910 -307 -148 808 -185 -234 525 110 -182 191 57 -131 222 -119 -235 -8 -400 -22
1493b2K87p66K53N82r47L93J078j186m01J169k91q64J595n06j218J322M98j827
1511h51J001P59j716N31J481j523k87J415j085l86J284l19j253J164j02r42R72
1528A43L83r53L56K91l08M21p1l62J33Lj27N65k21n84M97q6n20Q99J77j463Q06
1549b1L38q70M69Q65j553L5J520r55l42J242q90q51J588j13j184J060J93j301
1567g70P72R12j226K17Q33j058J34P62m94m99O76l57k52O67k72l19L37l25qN82
1587C12m95o2L99m27J2P66p90m29J201l45m87J000l87r64J113J47j236Q52P28
1606I08j575N59J005j405j0J271j102l98J238l92q02R19J8q77J030j09p76N10
1624A2K37o86N76J98l89J10J53k67K57J44n40L98J17n92O22J23q56L60N07j013
$$ plain form
1493 -22 265 -501 -248 334 -613 -220 858 -328 -729 440 149 -715 880 374 -844 478 976 -851
1511 -851 150 909 -807 -276 1205 -318 -605 810 -275 -661 623 304 -949 215 113 -829 143
1528 143 526 -427 -71 220 -88 333 262 -100 33 36 -91 474 253 -331 166 80 -440 459 636 -827 -21
1549 -21 317 -553 -84 781 -772 -737 783 -172 -514 728 -162 -1013 575 462 -722 338 531 -770
1567 -770 2 914 -312 -95 738 -320 -186 576 82 -417 259 -98 -350 317 45 -274 63 -262 -270 312
1587 312 -183 -245 154 -273 -261 505 -285 -714 487 142 -345 655 268 -696 417 564 -672 180 908
1606 908 -667 -108 897 -508 -518 753 -349 -747 491 99 -703 216 234 -643 387 278 -498 12
1624 12 249 -437 139 337 -52 58 211 -56 201 345 -195 203 320 -272 350 473 -383 -23 484 -529
1644e29M12Q36j080J63Q16j057l36J301n23p61J181j91r63J166K00j344P47N67
1662F05j013K38Q78j037Q9P47n89q2M68m76l16P93j56l31M75m76m7L05j43o3L76
1683B45m69j38O93l24l02Q41l90n64P13J25r10Q16J15j042Q38M01j049J70P71
1702E40r74J6J092r56l74J104m54n49P99o2q64P94J17p62M98J87p45N71L06l36
1722e2M2K22k94J42K12k82J24J5l80K51L43l55j27M81p15K93N78q55m1P75o32
1743b55j98R65m89n80Q50r0o66O94J12q37M93L41p52L76O04p29M9P42p22j76O25
1764C57l36m25P11k04n00N07l9l92M77p9l95L25nl64O10l29P2J06j3k05L18J9
1786B16m15L69J49o44K77M37p30K85N97p61ON86m56m54J005l63o87P40p4n32L93
$$ plain form
1644 -529 -117 719 -361 -198 618 -439 -775 526 3 -758 423 232 -731 435 635 -709 38 605
1662 605 -408 -170 708 -329 -240 507 -82 -164 304 -172 -488 305 149 -182 293 -183 -230 75 -68 -131 245
1683 245 -224 -362 331 7 -295 546 156 -408 305 430 -480 336 451 -591 247 648 -401 -231 540
1702 540 -434 -418 674 -282 -656 448 -6 -555 244 182 -682 112 229 -533 -35 152 -593 -22 284 -52
1722 -52 -10 212 -82 60 272 -10 114 129 -251 0 343 -12 -139 342 -373 -80 498 -357 -398 377 -255
1743 -255 -453 512 23 -557 293 203 -463 231 343 -494 -1 340 -412 -36 568 -161 -112 630 -92 -268 357
1764 357 21 -404 307 103 -397 110 71 -321 156 77 -318 7 2 -362 248 -81 -9 97 84 -121 197 216
1786 216 -199 170 319 -325 -48 389 -341 -56 541 -220 -214 372 -84 -538 467 104 -583 157 83 -449 -56
1807e6J36n31L22N38o73K14K42l73J36K59l39M2L08k09m6L00j57j9J62k53j14
1828a11L62k76k56M24l31m4M27m53n1M53k9l75M08o8m86N78J77o42K05N09n88
1849a67J98L46m09mL01j65k35M93l85k14O12j45l90K28L2l34L82j20k34J95J17
1870A02k59K60M2l34L18j55k00L03K00m19J76J70l71J00L92o37J59N35n66J06
1890g8N03n47k10O03k52m15O08k18m72N75L3n14K66L65m47J97K93k96M9K77m45
1911a25O1L55k31j84L94j35k60J11j27J49J46j66j89L50l11o4J27M9o8K67j77
1932b8m34N36J59n09N19Pm08K06J42j91k3L81l24j69O69n81k71O23k52k97N16
1953B71N4n94K36K16m96K21J06l84L84l4j01j00K76k5j3K3o2NR3k38R8L14l02
$$ plain form
1807 -56 80 -451 -129 409 -264 -50 192 -181 -45 214 -125 -83 225 16 -30 270 113 94 256 3 -111
1828 -111 251 -25 -281 143 -188 -232 195 -258 -309 144 115 -260 148 80 -406 172 349 -293 -88 421 -167
1849 -167 31 377 -32 -36 265 100 -135 358 -27 -241 371 226 -164 64 96 -238 144 24 -210 -15 102
1870 102 -157 103 145 -189 129 -26 -226 77 277 -142 34 204 -167 -67 325 -312 -153 382 -184 -78
1890 -78 425 -122 -332 271 19 -396 212 -6 -478 97 130 -384 -118 247 -200 -3 290 -6 43 320 -125
1911 -125 -64 291 60 -124 270 135 -125 -14 -141 8 154 -12 -201 149 -162 -226 -99 -50 -118 149 -28
1932 -28 -462 74 233 -276 243 250 -158 48 190 -1 -24 357 33 -136 533 -48 -319 304 52 -245 271
1953 271 325 -269 -33 183 -313 -92 14 -370 14 -20 -121 -221 55 30 17 40 -22 -17 76 -162 -64 250 -52
1976e2L09p0l02R0L34l33k19M87k35j38K57p3m82M40J62m67L80O0l63J90K27m77
1998b75R2L61m60j6M69j80j19L53k12j31L92k47j59L00Rk62K2J55j98L62j57j03
2020dk8j2j94K73o0k57K30J57m01L67J74k90k6L32l60J8M77o22K4L85k09k81O25
2043C18j23l59K72J74n70L01P4l50J37J82j54l5K14k90O2J52k25K15Pq2N3K53
2065B26j72j75R7P4l3J90k57m1L38j63l35M23j11k28L79j72j10J90K8k47O0J39
2087A00n38L92K56m67J91K81l60o2N56l88o6R4J99n21N92Kl73K90j17j7K01k62
2109a7m8J14O5j93L6J36j63n2J85l44K52N1j34J35J37k84l6J98n3n6M06j71k88
2132a24K84p3m66O50j51j94J63m6j75L05n5k69J22J41k88J63J69k06q9Q2l3P4
$$ plain form
1976 -52 257 187 -115 -25 309 -24 -243 244 9 -129 128 55 -427 13 175 -292 88 148 -215 -25 202 -275
1998 -275 -183 178 -282 -298 171 -9 -128 225 13 -118 274 27 -132 168 177 -85 -63 92 -106 256 99 -4
2020 -4 -32 -44 -238 35 -25 -282 -52 105 -296 71 245 -45 -71 261 -99 -81 396 -226 -202 183 -26 -307 318
2043 318 195 -164 108 282 -288 13 87 -263 -126 56 -98 -133 81 -209 -147 5 -220 -5 2 -80 -27 226
2065 226 54 -121 -24 50 17 207 -50 -91 247 84 -251 172 61 -167 212 40 -70 120 148 -99 -39 100
2087 100 -438 -46 210 -257 -66 215 -145 -207 349 -39 -105 -11 188 -333 259 261 -112 178 61 44 245 -17
2109 -17 -65 49 114 -79 -43 93 -70 -122 63 -281 -29 22 -112 23 160 -124 -160 38 -15 -71 335 164 -124
2132 -124 160 87 -379 271 120 -74 89 43 -132 173 118 -151 -29 112 -176 -13 156 -50 -139 -57 -90 -16
2154a6J39k45JL38j41j39L3ro1K84k08j04K21O0j42J70j14j09J80ln04K43K00
2177G4l70J95J41k37K4K47k75K48J15k22m7K69j88nK88j28k49K50Q5k37J60N7
2199A95k98J30K00l81J41J80j86L8Q5j42M1J50l43Q0O0n0N5J81j53j85K11j5j12
2222a18M20m14j3L94l00j24L47L2m10L37j98j56L50k7k67J85L5k57J50M8j08j67
2244b61L77k23M9J77j57l0J61O0k46J68r3p4L47j55j8J09j11j05R3j6j37R1J30
2267A36l92J63K14k42J13K35m38P8J80J1k97M08j72j3J67k03o9K94m4l08K66J68
2289B55n28L30J42k28K12j7m12Q0L32j33r0J91l23m3L81j91j0l6o5J95m0j22N7
2312f3J77j87m4O3J27J00p6l4j13J16O3k18K47m5j34Q5m1r0j39L70k83J25J69
$$ plain form
2154 -16 123 -122 -121 217 76 -63 -30 -39 -100 184 -24 -128 93 153 11 181 67 -42 138 135 -369 -126 74
2177 74 -296 -101 40 -197 -173 74 -201 47 162 -60 -107 162 -26 -31 257 129 -120 130 215 -22 138 195
2199 195 -103 27 227 -154 -13 167 -19 19 104 -38 3 153 -190 -110 -50 -100 -45 136 -17 -202 9 -6 -118
2222 -118 302 -112 -125 269 -31 -155 192 224 -186 151 -47 -203 147 120 -147 38 73 -184 -34 14 -94 -261
2244 -261 116 -107 -58 119 -38 -68 93 153 -93 75 -18 -92 255 100 82 191 80 -25 68 52 -85 6 136
2267 136 -256 -93 121 -121 -8 227 -211 -133 47 58 -239 169 -3 -16 151 -52 -121 173 129 -179 87 255
2289 255 -273 57 199 -29 183 166 -246 -166 166 33 -57 134 -189 -232 149 -42 -52 -88 -153 42 2 -120 -63
2312 -63 114 -73 -117 -54 73 173 97 63 -50 66 129 -89 158 113 -21 64 23 -67 -206 164 -119 6 175
2335A75l21n2K67N2l06K28M1j69M3K66j88Q0j62M7m1L00k01M5n4pl0J25j33l5
2359c0J37j92J44k6j14N1N6j19kJ62Rk83K60j09Ll0K03j48J48N3l12J60J03j07
2383A7J15j08j32Q0J54k93L5J95l40L15j01l9K29j43N4o2J0j4j01K32j41L8K2
2406B2J07j61m0K19k4R0j21k2q3J86k08RP6q6J01J16m06K04J01j23p4Q5P2k18
2430a78L50k05N5J23k81p3K78l6j47K63p9j52l2K18l6r1J91j04p1P0L1J26J9l14
2454g5L00k48O8j57J44M7k46J77j7j53J67L8p6O4q3r3J65l1r5J83q7n0L30j42
2478A30j21n8J32k01M8K35j20o5j23L23k20J17j5k05R4J35j79J72J22j96p6J39
2500F8j48N8Q5j27J76Nk7k4P6k70K17L3k88J84K54j83o8R0o8p0P9k6J5m4l6o9
$$ plain form
2335 175 -146 -198 69 121 -185 43 84 -85 -42 224 36 116 -46 1 -40 260 59 104 50 43 13 138 5 -30
2359 -30 107 -85 59 33 -81 -30 26 -93 -95 67 76 -207 53 -56 -53 -83 120 -28 120 173 -139 21 124 17
2383 17 132 24 -108 -28 126 -167 -132 63 -277 38 -63 -102 127 -16 38 -24 -14 -28 -129 103 -38 0 22
2406 22 129 -32 -72 147 123 213 92 70 -13 173 -35 -26 50 -36 65 181 -225 -21 80 -43 -117 -32 40 -178
2430 -178 172 -33 22 145 -136 -209 69 33 -114 149 70 -82 -114 104 68 -23 168 64 -7 63 94 220 239 -75
2454 -75 225 -23 45 -112 32 79 -167 10 -7 -160 7 45 -31 33 -50 -143 22 -9 -104 79 -8 -58 272 130
2478 130 9 -49 83 -118 -70 165 45 -20 -143 180 -40 77 62 -143 -49 86 -93 79 201 5 -71 68
2500 68 -80 -22 63 -64 112 117 90 66 142 -128 89 122 -166 18 272 89 21 111 43 -27 52 26 41 -3 -39 -108
2526a08K45j25k05J97o5J08q9j1Q6J1j10P7j7O8M0q5J01r6k6Q4o8j52J59mK8j01
2552e8mk3R7J1j78J24L7r5J82p6p7J74j9l77L20P8k2r1M0J1nKN9q1j6k6JJ36j45
2581b1r4J30j94K49q0j0P4m5jj65J52o2l4J56l6j6J16k3j35L9M0q4M9r3J07j83
2607a64K35k6n4J0o1o7K21Jj74P3J9J1m2j2j6j73L11k99N8K35l7q9K37l07R3K80
2633B63j05k44J87J06r9Mq1j77J37M7k47L37k36o2P7K9nM0J22k9J4q8K8L9q3m4
2659g0K18m2j22j38K19p0J92j23n6m1K4j08J09J05m3j86K7R9j59M9J57q9j5O9
2683Fj93J13J06l8K0N4n2PL6j42P0M2Q5j34J36j59m8J33m9k2J06R9m38L68q9j68
2709a51K01j12K23oK3l91K50O5k0k29J34J4%N8Lj1Oj14k3J6J25j53k0J28J9q1
$$ plain form
2526 -108 137 12 -193 4 -61 47 -42 -53 33 44 -66 11 -6 62 102 17 118 22 -4 80 12 -140 19 15 43 -58
2552 -58 -62 -85 12 23 -155 -31 6 -89 93 17 -60 114 95 -282 38 116 94 3 43 54 49 51 110 29 13 -13 -12 124 -21
2581 -21 -115 15 -179 70 -10 -20 54 9 8 -157 -5 -67 -101 55 19 3 119 96 -39 0 40 -44 5 -88 19 -164
2607 -164 71 45 -9 1 -60 -127 94 95 -79 -6 13 24 -18 -30 -46 -219 92 -207 -149 86 49 -40 197 -110 -17 263
2633 263 158 -86 101 207 108 112 31 -146 -9 38 -209 128 -108 -170 -93 -64 -69 -29 93 64 78 -10 18 57 -26 -70
2659 -70 148 106 -16 -154 65 -5 187 64 8 -33 -9 -117 -8 97 54 -132 -105 -6 -165 -116 41 -48 -63 6
2683 6 -187 -74 32 -6 14 68 16 23 59 -83 -13 29 114 -20 116 -43 -91 42 -7 -29 77 176 -262 106 17 -151
2709 -151 50 -62 161 155 178 -213 37 102 82 -147 -13 1 1 59 62 51 57 -57 -80 -64 61 -92 -112 16 35 -46
2735d6K85k17J8n7k18K52o8l5oJ33k87J61K00k29J14Q3r5j4NJ0k0n3J24j60K49
2760A29j80M7J19k10Q8k1J13k10J66k6j22J15j06N3K6K39k56L3N7j10J6J29n5
2783C4j62J51L4j16m5J2J12J12q5n8p3K60k94J67j24J7O3N4l8J38j13k56J39K44
2807A73j41m0plK9l6J02j51J08k06L05r3J47o3o4l1K6R4j0j51N0k5J1O3p1J0p0
2834d4no6J99j69m2K21o1j61K39M0l59O3J20N2J10p3k2K4j65J47p3K9R7j46k0
2859f5Q4r9JJ93j13N9J08m18J60J83k37J00N6nl3o3K00j52M7J22j77N9K8J2m8
2884BL1j12K33n4q7j03R3o4L7M0J9qL1q4RK02j97J10k03K99k52J62j45q5J62Q8
2910A24j54J53q7N7q9o4M8Q2K8n8k55K83l0J13j90J9Rj60K81r1pk71J96N8o5K3
$$ plain form
2735 -46 239 22 40 -17 -235 17 -51 -86 -92 41 -246 -85 115 -114 0 83 -12 -26 -21 -11 -31 -84 40 -120 129
2760 129 -51 -4 115 -95 -7 -28 85 -125 41 15 -107 8 -98 -45 -19 220 -36 -3 54 -56 -40 89 34
2783 34 -128 23 57 -59 -104 -92 20 132 47 -11 -84 176 -118 49 -75 -58 5 59 21 159 46 -210 -71 173
2807 173 32 -8 -15 -18 11 -25 77 -74 34 -172 133 40 187 124 60 29 55 149 139 -12 38 13 24 87 16 26 -44
2834 -44 -49 -115 84 -85 -127 94 33 -128 111 151 -208 -145 -25 27 137 64 42 66 -99 48 -25 4 101 -45 -65
2859 -65 19 -80 -79 114 1 60 168 -250 -90 93 -144 -44 12 7 -26 -89 111 -41 6 128 -49 10 38 50 2
2884 2 33 -79 154 100 13 -90 3 -61 -24 16 35 27 58 -26 -17 185 -12 98 -105 194 -58 104 -41 -126 36 124
2910 124 -30 123 36 93 4 -60 -12 70 98 40 -215 68 38 151 -39 -20 -11 -171 110 19 12 -259 -63 -5 -70 -47
2936d7L4P3j38J91mj19J59j23Rp9P9j17Q1Q8r0N2J9k16K23Q6j26J59j63o7j46
2961a82L24j16j92J92k1K3rJ12j57%j4J4J20m3m4L3J80k75m2L5K2J31Q9k73K0
2986g3J79j71J4l0L3j3l3j61K25K9o2M5R9l1j75K65k21K78j77k5o4K05pk20J48
3011E7O8j97J72%j9j68J01j36J48N7k8j14J06k3p6n5J37j17K52n3j91J5J6P3Q6
3036A11p8m5o4o7K16j37J20k29K13J80k50j46K90n9l9N2j2m3p3J10Kj56l0J56
3060B2j05L8n8N9O1P7k59K80j34O0R5j74Q3J86j82o7L3J63k26n0K44j87J06K8
3084I3j72R8l3p7m0K02j54j00K51j42J1J17k0l1Nj24N8K16l11J23l4J08J40k03
3108a9k1N2M0o1Rr3J25r0K04j58K9R3j01r9O2%l3Q9m0n8J11L7r2o1J66j00J02
$$ plain form
2936 -47 -13 60 -78 113 109 -10 149 26 35 -44 35 -82 -1 87 -3 49 68 -148 75 161 35 194 31 -36 -182
2961 -182 142 26 -166 26 5 28 19 131 -26 -26 -40 -26 94 51 7 40 220 -55 -97 -62 -40 91 180 -93 -73
2986 -73 106 -65 -51 -81 -48 -61 -94 -255 -30 -1 -63 -18 81 50 -125 140 -81 197 20 -5 -69 136 129 -91 57
3011 57 125 -72 100 100 81 -87 14 -122 26 83 55 -59 47 24 -52 -107 30 -87 165 112 -79 -64 -48 25 111
3036 111 33 -12 -76 -143 73 -64 56 -173 40 220 -30 -176 114 55 16 68 56 13 -60 50 52 -104 -134 22
3060 22 -83 -45 -103 -44 17 94 -165 115 -19 41 136 -38 45 231 49 -18 15 178 -48 -98 146 -41 65 93
3084 93 -79 19 -14 -91 -131 71 -83 -183 68 -74 -63 54 34 3 8 -116 -58 158 -153 -30 -64 44 184 -19
3108 -19 -40 12 52 -9 0 -93 32 -58 146 -12 17 110 9 -90 -28 -28 -61 28 -12 -70 41 78 -14 -75 91 -9 93
3135I3O9j26j44J72k21K25nj05Q9q8L3r6R9j94J60J00No2J37k22K32j95R9j41
3159h6J17o5j0QM1NJ73k18r6J43r9Q8l1Q9n0j63J05O0j49R2l2j5K40k53LJ23K16
3186B36k68JJ56j47O7r4K7J65l5j28k7J16j97J46O3j13pJ58j64J98j14q9Q0j78
3210a48J84j38J7R4n9l5R5m9k0L8J73j01m4K15r0q6o7P7k26K54r6J9Q8L3r4n8
3236b4q3L1M5j4R9o4M2L4n5j18J20L3qM1J03j94M2k7q0K55r6O4j93m3J14j02K05
3263A27j19j58J17P4o4J49j57J33k60K30j83J01K16j88m6lK8oQ9j65K59j77R7
3286I4l6o7j3J09j66KR4L4j02J11j08MM1k6%j12L51m74L29l4r3N6L3J7m7l2o5
3313a00J45o7j32J43NJ71j19j68P6p7L30j50j36KPK96j23j50KN1M3R0k48J30l9
$$ plain form
3135 93 162 36 -108 64 -157 68 63 -42 47 -41 -8 -104 -5 -199 -39 61 66 4 141 -81 151 -44 55 -86
3159 -86 31 -34 -44 -36 5 10 183 -35 -131 12 -87 1 -30 59 9 -154 -49 11 -138 -46 -78 -93 147 -106 -103 20 236
3186 236 -32 -31 125 -22 45 -49 -22 143 108 -20 -47 69 -128 18 81 -32 -39 119 -45 153 39 -50 30 -148
3210 -148 36 -102 -85 9 -50 -85 10 -39 -59 -21 152 51 7 222 132 46 -21 56 -170 84 -12 7 95 128 34 -24
3236 -24 -107 -76 -31 -45 54 -10 32 66 11 -107 13 46 38 79 182 -12 30 3 -77 178 82 146 -47 -90 24 -78 127
3263 127 8 -150 -33 41 -23 126 -31 102 -158 72 -111 -10 206 18 -28 -31 -3 -9 80 -85 174 -3 94
3286 94 58 -9 -22 87 -79 -77 17 51 -51 60 -48 -44 -3 -29 -29 -141 210 -264 65 31 -62 -6 27 44 -3 -35 -100
3313 -100 45 -22 -154 -11 -6 165 46 -122 -46 -123 207 57 -79 -77 -70 226 103 -47 -45 6 49 139 -109 21 -18
3338a8r3N5Q6l0PN3o9l6j1N8qJ13j09M1j19J1N3n7J89j16k9J38k53K34j15M3o9
3365e1P3j5KP2M5L7n3k21P6J3J02l0j63R7n4J21q0RR3p2j0J4k11J55Lj08P7Q4
3393Ej13L5N3J04m5p7R2k9r1K88j85p9K50j81o0J14l5j66K05q1j5l5J34j62K8
3418d6K1J03j78R1Q2r0j89K50N1r4K2l1j3Kn0J36j01j20K2J35j0kNj8M7K4j38
3445h9K29N4j56p2p9N8M1k5R2j3J24m7o9Q6j83K7kJJ30k08J60j42K14j35p9QJ73
3472I8j24M1Lj2L2r9k5j9M4l8J32J19l61K68j39J29kj28L47k94J5J15j93K35n8
3497H6l2L2p6m2RP1m1M1L2q2q4J01J45j00J56k20R7j00L8l5j02J7O0J34p7J36
3523A64j29Pq7O5j32J46l0K07k28N7R8j80M9L1q5O0p0J29j75J20MJ57p1o8q8L
$$ plain form
3338 -18 -111 -56 30 0 7 60 -9 -45 -56 2 -6 107 -2 39 -80 -69 -16 -73 116 0 -29 109 -144 90 -25 18 -51
3365 -51 22 7 9 81 126 163 110 -111 -35 -22 80 50 -113 -16 -70 51 -29 -20 73 1 -9 5 -206 -51 -48 -156 -79 5
3393 5 -108 -73 -20 84 39 -38 54 25 -66 222 37 -42 208 27 -33 81 46 -120 85 4 -11 -46 88 -74 -46
3418 -46 -25 78 -100 -9 73 -17 -206 44 95 1 23 -8 -21 -19 -69 67 -34 -154 -132 3 -7 -9 -4 -22 25 49 -89
3445 -89 140 194 38 -34 -113 -55 -14 -39 53 40 164 117 48 134 -49 -22 -24 -23 107 -101 59 -83 131 -4 -83 -75 98
3472 98 -26 15 18 6 38 -61 -86 -105 -61 -99 33 152 -209 59 -80 49 47 -81 266 -28 -13 102 -91 144 86
3497 86 54 86 10 -32 -23 48 7 48 80 -2 -86 15 160 60 216 -4 93 -7 31 -4 -106 -89 -29 105 28 164
3523 164 35 42 -45 20 -112 34 4 211 -17 40 138 -42 7 38 -47 13 -57 72 -103 17 21 178 107 39 -49 -46
3549d6o3J52rl7P6k5J6j11J63j71K01j10q1k4J06Q8l35K50jo1K2m3R0N7j71m9
3575a16L38k18J7k0j33J59p8J69o3n2L0N7Q3j80R3j84Q8m7J67p8P8j9O1j27N8
3600H3p7q4J20j56O0O5o9J6omJ36rk66J96J5r3m1L8R4K4M8m0k1P4J5k0n0l6K3
3629C5l5j40R8L3j60L10k03J05L0k27J91j40P8L5J31l4k26J24m8O7j87J82Q2K0
3653A21n8j10N5J00r1r6KJ22j48L04j37p9Q3J3j60J19Q3j22qj37P5K07k39M1M1
3678a9K5M0p8N7R0j81J04J0j23J34R8m2j17l3l3J10J43j81J41r1Qk36J69J79k89
3703a15K73j73l8J38j44J7n2J44k9j5k5p2K8o6KJ15J24o9j17oq2J01K06o0j11
3728b6J33j65p9J91kQj75K38j06l0KR7j01p9R6J05k86K51m1J6l7J2j35o8J31m0
$$ plain form
3549 -46 -109 43 34 -3 73 48 64 -47 116 -55 146 36 -45 -69 37 125 -210 40 39 -22 0 -43 47 104 -67 -116
3575 -116 222 4 21 1 -132 27 -51 118 55 3 33 90 173 -7 86 -98 -10 -57 110 32 110 91 152 25 83
3600 83 6 -78 42 -114 -54 11 -58 -42 -48 -52 84 75 -191 5 20 -73 -114 -76 18 42 90 50 29 103 118 98 48 12 35
3629 35 0 -140 -42 -9 -169 141 -62 43 73 -154 37 -103 -25 10 141 107 -119 5 -43 24 -163 19 101 121
3653 121 63 -47 8 108 17 -79 -77 45 -103 201 64 -15 68 81 -79 40 123 1 -7 -144 -69 138 -101 -60 -19
3678 -19 6 46 -32 25 115 -66 38 48 -75 59 157 115 -2 -35 -68 42 185 4 145 54 62 -174 -5 174 -115
3703 -115 158 -15 -53 85 -59 -42 -94 50 21 6 -19 -91 -63 -129 -127 -12 112 43 -74 -80 -162 -61 145 85 -26
3728 -26 107 -58 -137 54 52 60 -115 123 17 -13 -11 86 -15 -94 2 107 -179 72 31 47 10 22 -113 -181 -50 -90
3754i0r4K82o7j59J96P8l30N5K66j12o0n3K0k7j2J51j28N7N0q2J83q0k1M2n9j06
3780a00K91j99P4j68J60k4j05J31J13j9k18rO8O9j22n2J56lJ9m1o6P4r2JP0NJ10
3807A23k22K4q9J01r0J36O6r1K17k29N6J34j47m%p4R2j57Q0J01J14j11o6j33J80
3832A1p0O4K3j78O3j8K03j62Q2K3r2n2J10r0J47j33N3N8k99K14Q8p9o5J85n2k0
3858A4p1J17k11Q6J04n0j1n3m0N3J26K49l88O9K0o9N3K2J0j18J43q1J32o3p5K07
3884A75k74N6J5l1N7J57k00m1K08k85J86oOJ5J05l7p2j67L2P3P8l7k2M3J43j99
3910b2jJ05K9q2l5L1p3L6j16m3J59J16p6M9M0j80o7K90k18Q9K0j00R9oL6P2k01
3937d9N7M1l9k3J11l1j49J24k08PJ28J26k8r5j21K20r3J6M4m0N4o2O1k0L8j6j3
$$ plain form
3754 -90 -184 98 31 -128 68 146 -184 -129 137 25 -35 -88 -68 -95 -107 44 -84 -27 23 -59 124 44 23 65 6 -100
3780 -100 191 -8 66 -102 58 34 -71 60 173 154 -64 -73 -5 64 -58 -110 46 43 62 21 -45 29 -63 -62 8 13 123
3807 123 -99 -75 -164 -63 -153 -17 49 -42 175 -54 2 136 -11 -15 -15 -89 3 -154 -74 27 141 30 -36 -169 11
3832 11 -59 5 28 -150 -87 -105 98 -64 18 41 -51 -103 7 -83 64 -69 -16 42 -257 -43 45 -34 -99 86 34 14
3858 14 -57 60 -151 -65 39 -11 -22 -75 -115 -62 64 313 -75 -6 14 -55 -2 20 30 -88 55 -26 106 43 -32 175
3884 175 -99 -43 -28 -59 -2 155 -45 -86 122 -163 23 17 23 38 143 106 34 -133 -101 -28 50 13 -9 34 177 -22
3910 -22 -23 82 111 29 -6 25 -48 -12 -128 -171 -12 104 28 77 117 -63 -130 160 -58 31 51 -49 50 44 80 152 -49
3937 -49 8 49 10 -13 98 67 -82 42 -166 -159 -31 95 67 -28 -149 71 -22 -6 38 -2 52 -10 51 31 69 53 40
3964D0M2k38J11%R4j52N9j6J10J1J14j76J3N5j05J17j41L6N9j09J21l7j5J2OR3
3990A04j74P0OJ5rj1P1k1L0pn6n5l7J29k04J94M5J03j61j30J70pj26K84j04j47
4016b8J4L4J1M9j16Q8l1l4p4Q3O0n6k7K6J12q4k4o7j72K49j03k1J55n6N0o8P2
4043D2n9j12J03rJ27j43L7J9J01p2m2L8%n3M7j47K02l4j24J79R1k29oK70k37j6
4069b7K31k37J09J9p8l4N6P4n7j04K49o5m9o3qrP3n6j01J38j30K7j05J42j15J77
4095E7j00q5K71p3j21n2J40p2L12k78j05Q9J4L4q5J06M1j80J02n5k3M8m3J13n4
4120AmK9jLk7M2l72K22O4jK0k2n2N0k15L47K0j12J14j25k5K3l3J4k8j38K70j93
4148a29P4N4O5r7O0q8N1jl6Q8K7q7N0l6o1L20l08J62q2OmL6k29K23Q9k29p5Q6
$$ plain form
3964 40 82 -156 -45 -45 49 -103 -44 -60 50 61 175 -1 12 67 -38 79 -62 -26 33 -76 45 8 -7 5 11 104
3990 104 -70 0 6 21 12 1 72 51 81 74 18 -37 -74 55 -149 45 90 193 32 -98 72 65 -61 223 119 -28
4016 -28 -14 20 31 80 -36 52 21 -13 -87 -4 56 0 -27 -1 111 27 3 -64 -236 13 -90 -111 44 -12 38 -30 42
4043 42 -17 -129 -26 -35 92 -51 -14 5 106 34 -8 30 30 -23 24 -123 79 45 -79 100 191 -38 -44 226 -11 -27
4069 -27 204 -33 76 95 17 -17 39 113 56 -48 201 136 87 24 16 7 80 24 -77 61 -69 -42 -147 -5 -120 57
4095 57 -43 -128 143 70 -51 -103 37 -35 277 -1 -106 -17 -3 31 -54 52 93 -87 15 -40 -63 -15 -58 55 1
4120 1 -3 26 25 28 1 43 -329 -107 -43 -44 -24 -46 -98 -48 -263 84 104 -8 106 -19 -44 -21 -54 -40 -68 -206 64 -129
4148 -129 -55 -1 64 -33 27 -61 -10 -11 -47 41 68 -19 31 -5 -66 254 -54 108 26 32 28 64 -165 58 147 -82 -157 -71
4176g1N3j6Q9o1o3Q9j17M0KJ0P4j57J86n4m4M5Qk25J36J24Lr0n4J72j3K7p5k8
4204a0J1J3N0o1j30J80j77J68L5j29n4J31O1l5n4Q9j38rm4J80m5j8L5j29J75q2
4230A3M9o6R0p1Q4j47M1j4L6o6j06J92p6R9j24j13K62j4k4N0m1m5k0J2M9k01J59
4257HL5j85K79j09j17K84k05jO5q0J36r8l9r1O8j0n1J42j76J13LN2N5p8K4N3k41
4284a64J79M8j38L02k7j61j20R5M8j09K07j77J15j70o9K05k58J92O6k2q4K8n5
4307f9k6N0P2n6N8m9j89K89R4l10J52Oj15K19j29P9lL5J6Kj04j02J18r6O6J75
4333A83l4j27K2N0j90jK09j30J06j05l3J2RJ6j78K87J1j62J02j39N8j18k1J52
4357b1j8l7J51M2k93K28n1n8j6J16q1o2O1m6K57j20j10pJ87m7j66R2N2l3N3jj30
$$ plain form
4176 -71 -18 -34 55 -6 -69 20 -97 -57 -55 -45 29 -128 58 4 -40 5 13 -212 -76 48 51 -39 -93 79 66 93 18 -10
4204 -10 1 14 64 3 -127 53 -124 44 79 -50 -104 27 88 53 -1 88 -50 -59 -103 77 32 14 49 -80 95 13
4230 13 62 -4 86 15 99 -48 -7 -21 15 -51 -157 35 -41 58 -66 -179 83 69 45 95 54 9 -11 1 50 -151 8
4257 8 43 -142 137 28 -89 195 -10 -11 54 -26 110 12 -27 -118 -50 -60 -111 31 -145 -32 -29 23 78 0 24 77 -164
4284 -164 15 63 -75 227 200 39 -81 14 62 -47 160 -17 98 -72 -141 64 -194 -2 64 42 -42 -14 -69
4307 -69 -95 -45 27 -29 29 -20 -209 80 174 -136 16 22 -93 126 -3 76 73 108 124 126 22 -80 38 -58 8 183
4333 183 149 22 44 94 -96 -97 112 -18 88 -17 -50 -38 -29 -13 -191 96 107 -55 47 -92 -34 -152 -173 -21
4357 -21 -39 -76 75 117 -176 52 1 -57 -73 43 -38 -100 -39 -85 172 52 -58 -65 122 75 -91 1 53 20 73 72 -58
4384e8j21M4kK75j58j7l0J09lj8j12q1K75qj28K7oo7J53r9Q5j08k6J11J00k00
4410f3O5k4J17m3j42Q7jN1j1JoLj60K28L2j88J52k69K02j09N9r6J07j2N3l6P6
4437G3j42P0p7Q0J16j70J90j24j14N5N0n9J35j28J04n2L8K2l3j67J24K42k52m6
4461f5P0O5j33J4O1J30k28P8J83l59K84l4R3l28J69M2m8k0O4l5k5J01p4m4j25
4486a64K13O2k3l2j27L10r4j90J5N1O9j59O0j6r3J0J10R0j12J9J34j06j08J11
4510C0J4o9J44r0m8j7m1R9o7J6R3j4Jj7qP9j97J3O0J18nn1rj39K77j96k3J49j44
4539d2j6J72j24P5q0J18j66J14P9m5K7nJ6Nj26m5J32o4p9n9k8K03j42N7J75k03
4565e1J27j07P9j12J75k9m3L2j92K36k27K13p6m7J62k98J25K9qJK4N8q6O8j82
$$ plain form
4384 -58 -179 -135 -137 138 -20 -37 -67 42 39 21 -91 -172 103 95 -33 -6 -12 -79 74 -25 60 -48 -74 37 137 -63
4410 -63 2 -22 95 52 -90 -3 -4 47 36 37 31 34 -126 102 134 -54 98 -171 31 -78 -19 -115 -8 -20 33 -3 73
4437 73 -69 1 -76 4 120 -50 140 16 -98 -43 7 -52 83 -45 59 7 45 67 34 -133 -9 233 -19 -65
4461 -65 5 70 -63 -49 12 142 -86 -8 175 -184 100 66 159 -169 0 42 -6 -26 38 3 -22 79 5 -39 -164
4486 -164 49 111 88 56 -71 239 145 -45 -30 21 90 -69 -9 -25 -118 -108 2 92 -20 -1 133 27 -81 30
4510 30 44 -25 119 29 -19 -36 -77 22 -45 -29 64 50 51 34 26 105 -92 -79 -19 99 94 43 34 -105 172 -24 -47 102 -42
4539 -42 -58 114 -10 65 -15 103 -63 51 130 85 112 107 123 128 2 -43 89 25 -54 -113 -141 62 -80 -23 152 -51
4565 -51 76 -31 48 -64 111 82 39 71 -121 115 -112 101 25 -22 140 -158 -33 -4 -12 -11 13 71 -15 53 -129
4590a29K5J81j18J58n2Q2J3r2N6j60J43q6P7j65k1JNJ32q7L9o9J08m1Q9l2O3m4
4617G6q9K4J00k05K34n6j44M4O6P2j35J16k24KN1K01j00L3qk8l8L2M5j10p0K96
4643A85n7j28p6k6O7Q1r4Q4J40j76R4%j32M7L4O2j76M1J20o8M3q8j7L5m3L1N1
4670C4K8o8L8M3j73N0Q2L3l7j50K43j06R9k29K73K7l05J14Q6o9Q3k6j97K19Pr0
4696Ij02N1M5m1O5NO9j06Q5p1n1N9LK3j83J69Kp7k0K1J18J5k0P9j77J09j66k7
4724a14M4O0Q8l8p4q4J05Oj6o3O8J24p5m3j8J78j31j08R1j90K07J07O0j40l9o0
4750e5J93j05m3M2K1K5j44J84L4p7j14j7P5K7j3P6r1q5n9K30j93N5l2P2Q6j04
4776a2K0j4l7Q0J14j61P9n7o0l0J94j75n2K26j33mJ19l3j08l8J5j09J36J52l05
$$ plain form
4590 -129 -104 77 -41 117 65 147 160 68 124 -36 107 21 98 -67 -88 -87 -82 50 -37 2 -67 41 0 89 57 120 76
4617 76 -13 11 111 -94 140 84 -60 -16 50 122 -13 103 -121 -119 -68 133 33 66 58 30 -8 24 69 -41 -111 185
4643 185 128 0 -76 -102 -35 46 -48 36 176 0 94 94 -38 9 43 105 -71 -30 90 22 65 -23 -40 -5 -48 -17 34
4670 34 62 -6 32 75 -98 -48 34 67 30 -120 123 17 116 -113 160 187 -118 -4 82 13 96 70 -127 92 99 9
4696 9 -93 -42 3 -38 27 32 101 -5 80 9 -42 17 20 43 -140 29 31 -46 -66 -45 73 88 68 147 -30 79 -87 -114
4724 -114 -70 -10 78 40 -34 -118 -13 -7 -23 -86 -18 106 31 -12 -30 148 17 -91 0 -190 17 124 184 44 5 -55
4750 -55 138 33 -10 32 53 78 -66 118 152 75 -39 -56 19 46 33 109 18 -67 -126 104 -89 -34 -66 6 92 -12
4776 -12 8 -6 -43 37 151 -10 69 12 -48 -78 116 -59 -111 115 -18 -22 97 64 -44 -82 -67 -176 -40 112 -193
4801a93J87j3l8NP3KL2M2q0K3J0j39N7J0P3L8p3L2j25J18r0K9p9L9r0J19J75j07
4829C7k7j79P6J46m0R9j12J1L5j62n1K31p2j31J59N9j20J01k16J02J04k12K59
4852I7m5j30J27j29m8K92k64Q1RJ20k89P4P4j46J08r3J55q2N7L2o1l6R5J43p1
4877G0k12R2k0M1l7J64j62J32j76J52j3j59R7Mm6M3R0l8L7J35k10Q6j36OJ22p6
4903a4l0j0J24j2n8J01k02k4Q2J04j10J4M0N2j69J66L2L1n4Or6m4K47j17Qk34
4929a67J81j4j01m1J04J06q8n1J54k17K6J12q1l4L2M1Q8j15P5q1J45q3mP5j68
4954a06J33o0nJ01k24J45OQ1k40K19q7j89P2K76j31l6%N3Lo0J46j93R2m7K5J21
4980I5q9K7n3O8j02L3Q8j03l5o5N1K73k50J6L3J01m7O2pk00J82j8l4k48J66n0
$$ plain form
4801 -193 -6 -19 -57 -52 21 23 55 97 17 40 50 -89 -32 -22 51 89 16 48 -77 41 -49 -20 -99 -60 -150 -31 144 37
4829 37 10 -169 -93 53 13 112 0 11 46 -116 -167 64 -8 -139 20 79 -41 60 -156 -54 50 -162 97
4852 97 52 -78 49 -80 -128 164 -100 -19 -10 110 -179 -105 -31 -177 -69 -162 -7 -89 -32 0 -61 -97 -2 141 70
4877 70 -142 -50 -70 -29 -66 98 -64 68 -108 44 31 -128 -31 -27 -73 -30 60 22 59 194 -16 70 -66 -60 62 -14
4903 -14 -44 -54 70 58 0 101 -101 -125 -43 61 -49 -35 5 57 -112 54 86 117 63 69 -27 -71 176 59 67 -167
4929 -167 14 0 -101 -142 -38 68 -20 -71 83 -134 -108 4 -77 -111 -79 -38 50 -65 10 -71 74 -9 -13 62 -106
4954 -106 27 -33 -38 63 -161 -16 -10 71 -169 50 -37 -226 -154 122 -9 -45 -45 8 11 -49 97 -96 -4 -51 -26 95
4980 95 6 33 -20 48 -54 -21 67 -36 -71 -136 -85 188 -62 -46 -13 88 41 103 96 -104 78 60 26 -222 -56 -106
5006a06K76j53o1k7R2j05J53P0j51Q5K3j70K0K3j%J31J2j07q0L0J0N2l6l6J48
5032I2Pj36N7j8J3J4n9o5Q2M2n2o7Q1r5J06mJ0Q8p4M6j59K01k17J86j67J27r8
5059e9L7L0j33J65J95k53n6O8No1o8O5K1q1P5K05j85M0J02k59j44L50J58j50n9
5084Hp2J34jj63k6K50r3j7l0q4L9L0R0q5o9J2jL8P3j48Q7J32%j92J44q3j04K35
5112A04k38J49J09J7j10NL2q7%J33l31J08J19R5ML4j97M1j2n1J57j60J06m7%R9
5138G9p6M3pk0K8j11Q0J5J0o6r9J29l1J36q6%L0l2q4J9O6J12p1o0j1j2M8j3p1
5167e5J34j33K06R0k44j65J76k9N2j57J30j1J03j44L1k3n2n6J94pm2M8R5j18k22
5192a99L17k14J54j90J07j2L5K16l34K77k13O%J31K9q8Q9q0M9n2K6M3j78K03k13
$$ plain form
5006 -106 170 17 -44 -71 21 -84 69 139 -12 73 96 -74 -54 -31 -32 -32 99 111 4 -76 -46 -36 16 -20 -56 92
5032 92 99 -37 20 2 15 29 -30 -95 -13 29 -23 -90 -9 -104 2 -2 8 96 22 68 -91 110 -107 79 -88 39 -59
5059 -59 -22 8 -125 40 235 -18 -74 -6 -1 -62 -130 -65 -44 -125 -50 155 -30 10 112 -147 -291 59 217 67 8
5084 8 -64 70 69 -94 -120 130 37 20 -10 -94 -55 -25 65 -20 -89 -77 -78 -40 33 -115 -28 104 104 -88 56 -27 -131 104
5112 104 -134 15 124 141 31 36 68 -19 -19 114 -217 -109 10 105 109 143 -54 -13 -25 -76 81 -79 27 -20 -20 79
5138 79 3 46 39 19 47 -64 16 31 41 -25 -124 5 -26 110 24 24 54 22 -62 -43 23 135 64 4 -7 -19 29 16 -55
5167 -55 79 -54 152 242 -2 -167 9 -20 32 -125 5 -6 97 -47 -16 -39 -91 -147 47 40 -2 46 141 23 -199
5192 -199 118 -96 58 -132 -25 -37 -2 214 -120 157 -56 -50 -50 81 110 22 111 31 80 28 54 97 -81 122 -91
5217i1J80j09k7R3R3k08O8o3L9j02J84j5J08l3j38O3r7O9m7J19m8L2JN6j11l2
5243a6l9p6J50q0kM0Kl2J12o8J08j32l1L8R7k23J65oj3K5l0R1j8r2j11J56Nk2
5271bP4j39qL4o9P3R8Rr0J38j06Q9k87J36j6O3kj47LJ7RJ10J51j91J8J00o3J73
5299A75j03q9Lj23R7r0J38Jl4o0J2J90k35Q6Nk8N2j32K16r4L7J30k00N6j32o2
5325a84J70r3j55M60k37J11j93J30Q6J0p7p0K9m7kO8m6J09P2k49J61l0q7O3%k5
5351b6R8j64J25p9j28L42p7j58J76j33J7J06j96N4L4J26r8n7J8O7l6J6K1r9J39
5376H8o4M0k5o6q1J74k5m0N6PR3k25M0K2k02K99j60J04Q8r6O5j22K5q3Q0j04J79
5403F7pq2qJ30Q3%j46J05j31N7k27K08m5L7j39l6R9J01o5q2O1m4J09r7J7K29j98
$$ plain form
5217 -91 89 -20 -47 46 139 -69 -1 -64 -25 -127 57 42 150 117 -21 42 -55 14 -33 86 38 70 71 127 16 -16
5243 -16 -55 -131 19 -61 -63 -23 -21 -53 59 -9 99 -33 -64 -26 71 -152 13 7 -6 19 -11 80 62 -30 -141 15 20 -2
5271 -2 72 -67 -75 -41 -110 -37 61 70 -20 118 12 101 -186 -50 -66 -3 -5 -152 -149 -132 -123 -13 138 -53 -35 65 2 175
5299 175 72 -17 -14 -137 -40 -130 8 9 -25 -85 -73 117 -118 -32 -27 -55 -3 -135 81 -13 24 154 -46 10 -122 -184
5325 -184 -14 -107 -262 198 -39 72 -121 9 95 105 28 -42 -13 -60 -62 6 -40 69 141 -108 53 23 -64 -1 -1 -26
5351 -26 72 -92 33 -46 -174 168 91 -67 109 -24 -7 99 -97 -43 -9 117 19 -38 -20 47 11 27 48 -51 88
5376 88 24 64 39 -27 -108 66 41 1 57 64 157 -68 -28 -6 -208 91 -69 35 123 27 92 -30 -5 -88 -8 -112 67
5403 67 60 -22 -30 100 183 183 37 142 11 68 -159 49 4 41 -98 -134 -35 66 1 -81 -20 -64 45 -52 -35 194 -4
5430dO2m7p4R6j45M2J01j15P3p1R2j2P8m9r8P8K8k9K7p9k5K0K6N0JQ8k13J68r2
5459b3l5K27k80K21k04J09R3%j93P7j27K18j84m1K26j05J20o0k0m4K3Q2n0j09
5483g9J26R3k95J23Jo9J38j42J02J4j54K34M6k04J21k1l6l8P8q7j3J61j42R7p2
5508a8l1J4J10j49N5lL0J1R7l42J24P6J17j07j6K14k09K1o9O7R9N9j85J08j29
5533e6l2J40Q6k22J00m5J02p9LJ19j49j04O5J2J01K0o3p4l2L8r4O5N4m6J17R5
5559A21k03J94p4Q7Nn2l4J2p4J98j18K1q1P7j63J08L6l8R4j37K8r9K18j91J67
5584A02j92J91r6J15j14J6l2N0j14m9J42K4o7J19j22j31O6Q6P6nq1j31Q1J27o
5609E5j05J62r3j19j00K48J06j45P3J17j30j42M8o1R1Q0j36M0J05k17K49M6j67
$$ plain form
5430 -4 58 11 -63 33 -112 -70 31 -84 -11 -82 10 -2 76 27 -71 7 35 6 33 -46 -71 -51 -25 25 26 114 -99 69 -23
5459 -23 -58 169 -111 110 -94 15 108 108 -85 -8 -135 83 -101 -142 84 -21 99 39 19 -25 -2 80 30 -79
5483 -79 47 140 -155 -32 -31 -100 38 -104 -2 12 -142 92 138 -66 55 34 -2 -40 38 -49 -62 99 -43 54 -18
5508 -18 -49 -35 75 -74 -19 -22 8 19 116 -226 -102 -26 91 -16 -32 182 -27 -6 -75 -8 91 150 -35 73 -56
5533 -56 -88 52 138 -84 16 -29 73 -6 -3 116 -33 -137 -72 -60 41 61 -2 -76 -108 -70 -164 -99 -45 -91 26 121
5559 121 -82 112 38 125 130 78 44 56 -18 180 62 83 2 79 -84 24 60 22 116 -21 7 -92 126 -65 102
5584 102 -90 101 5 120 6 22 -10 40 -74 -123 19 43 -24 95 -27 -158 -92 -6 70 65 -16 -147 -66 61 55
5609 55 -50 112 19 -100 -200 48 154 9 82 199 69 -73 -25 -86 5 85 -51 -11 94 -123 126 172 5
5632EM5J28j84K0p3J25O3r8Q6q6j52J40j60K1J32q3N0N5J8M3j09j14L05n9j58
5657d0N4m4j8J24k65K04L1j42N6O8k8r1J07lN1l8J9r7R8k1o4L9m1Q7nm2J44j75
5685c2RQ1R3M0k54m4J40j1j11k7K23j28L7Pj20R0N6m9r5j6J27k4L4L4N3kj76O7
5713BJ04j54Qq3L2N3Q8j30M5J83j17j16L9J28j30PM0j63L9J31P9j84J77q2J57
5738A53l30L03o7j55J43j24N2q7L3qL0j4J36NJ04j85m2l1J56r3K02p0r4l3K61
5763B45k90N8J58k50J60n8N9j9o9L6j2r7J05n1j00NJ00L8P5j01po1r8K77q9L9
5789E3o2K4l2o3J5J14l5O%j05J79j61Q5l5J2M1P9j91Q2L3n0K1L5k49L14p6j0r
5817A5Q3k7j00L1J74k39J03L8L6j04P8j83Q4j04J45j01P3j25K47q9j32o9J44q
$$ plain form
5632 5 50 178 -6 14 -59 66 129 31 117 31 -121 19 -141 -120 12 -71 -21 34 52 95 -14 -128 177 118 -40
5657 -40 14 -30 -48 76 -189 15 46 -96 -40 28 0 -91 16 13 64 26 45 -52 46 25 -39 0 -41 46 41 -1 143 -32
5685 -32 -23 58 151 191 -63 -107 33 22 -89 -116 107 -21 16 23 -97 -7 49 0 -95 -111 16 -8 26 60 113 111 -65 2
5713 2 106 -48 -40 -123 -91 -38 50 -80 -35 148 31 -85 -46 82 -48 -41 -1 -164 -125 6 85 -99 78 -4 153
5738 153 -177 126 59 -96 47 -77 -25 -112 -79 -87 -57 -71 65 70 174 -11 -53 -84 72 -21 181 111 17 -16 245
5763 245 -45 13 171 -79 81 23 82 63 -6 30 18 -79 26 -25 -125 -120 -20 18 93 -8 -15 -76 -174 103 14 53
5789 53 -9 15 -17 -80 -65 49 14 20 20 -85 94 -67 18 -17 -5 36 115 -76 6 39 -11 10 45 -204 110 34 24 15
5817 15 98 71 -29 2 176 -63 40 78 114 10 88 -95 -11 -115 30 -71 2 -123 124 35 -97 -166 -22 -30
5841c0pP4n3L5lN2k97K16NLk5L2N6l8O5j19Pk9n4J01j81L57k75M2L00k56O6j36
5869i2L6%J39j11k8O5J25O1j83Jk9N1J28pl07K02n8O7r7no6Q7j7P6k1K0j26O6
5897b3k4J92j28L8p4N8p8l5Q2J4q8l7J50m6P0K1%j73L4J41No8K3J0o2j45J26K9
5925A2M5Mqj28j4K21n7J4o0P6n1j09M5J6p1J04pK0q7R2L5k24J02P2J26k08jj9
5953f0p0J55j90P7P5m4M5o7P0M7r2q0L30l06K11m9r1j9N8K4k80L05j45J92j80
5978h4J15m2M9j77J78l3K1R3k39J32j0lm1K1J3o1J07l8j08P6j4PM3R9o8J4j19
6005f9J07m6P0j54P2Q9k0r1N1j09n4P0M3L3NR6k5k47J25P6p3Q6j27Q2j52L5J64
6032C7p4j6No8J41PJ18k68J5M1P7m3M3k9M9O0p0j01N8R6j92NO7K2o1J77n7J3l1
$$ plain form
5841 -30 -37 37 -16 19 16 68 -229 -13 -8 -5 -30 2 58 20 85 -34 -27 -56 -110 -9 -190 167 -108 -66 234 -22 44 -92
5869 -92 -56 -56 83 -28 -56 9 134 195 12 13 -16 35 163 156 -151 51 -7 60 -37 -42 -108 -21 -38 38 17 37 -89 -23
5897 -23 -47 145 17 55 -19 39 -39 -74 8 22 -66 -103 47 1 71 92 92 -81 -47 94 99 31 54 64 2 -143 -17 12
5925 12 57 61 53 -75 -89 132 75 89 29 105 54 -55 -10 6 -65 39 32 52 -35 57 92 -132 -30 42 168 -40 -41 -60
5953 -60 -130 25 -165 -88 -13 -57 -12 -79 -9 38 -54 -134 196 -110 101 52 -39 -58 0 24 -256 49 -96 96 -84
5978 -84 31 -11 38 -139 39 6 27 120 -119 13 3 0 -41 -20 -7 -68 39 1 -107 -31 -45 -38 5 104 36 50 -69
6005 -69 38 -8 62 -92 -20 69 49 -42 9 -100 -154 -84 -41 -8 -3 93 68 -179 -54 22 -51 35 -92 -10 -162 -127 37
6032 37 -37 -53 -48 -116 25 32 150 -118 -103 -62 15 -28 15 -14 35 95 25 -76 -18 78 -114 -109 -42 -20 -81 96 39 52 21
6061B1j47J25LL9r1P6j12J78j06N5j49K1P8l4mK5j48J62l0L8j98J95k1%q3J20
6087A3j63Q7J44j32J94j81J40j35J16k05J64j18M9R9J9Q5Nj07j71K31j00j23J17
6110B8q1j7K18Lk6k43J52K5m9J02J2l6nr6J10q3J17J4j59J21K0j03J7q6J58r1
6136B2Q0k29M1J5R2J25j71J5j27J85j41L7J18k06J22J06j00j35J86J40j48rN7
6159G5j45O7K00k80J21p2Q2l5P3m9j7Nkj39O2K9q3J49J59k75Pp9J26J40j27J3
6185Ej24J38J14j75N9j46J42J49j61K3m5lp0PJ0K0mN2r9J46j14P8R5n5K2p1Q4
6212G7Rp2n8j09J53Nk18J96j13K8l9J42j48J66j31N3Q1q2J48L6Kr7k5R6j38N9
6238B1K18k03pK1J2q2J02j91Q9m8J52m3n4J42r9P3p0j38K74k26P1j88J71o7k3
$$ plain form
6061 21 -126 -1 2 41 -50 26 -86 92 -14 41 -108 -87 -9 -43 -47 -22 -170 -8 -38 0 -198 -3 -24 -24 -107 13
6087 13 -150 -63 81 -51 143 -38 102 -33 83 -122 42 -76 -27 72 91 176 181 74 -97 134 34 -89 28
6110 28 -53 -70 148 151 125 -118 34 59 10 112 124 88 83 -13 97 14 131 145 -14 107 127 24 41 -45 113 22
6136 22 102 -127 -86 -71 21 146 -25 -10 -137 48 -93 -56 62 -144 -22 84 -16 -151 35 175 27 18 75
6159 75 -70 -3 197 -83 38 -34 48 13 86 37 20 25 23 -116 -54 -25 -108 41 200 -75 -68 -147 -21 119 -8 5
6185 5 -119 19 133 -42 17 -129 13 162 1 24 -21 -24 -94 -87 -77 -57 -61 -9 -108 38 -76 2 97 42 64 -7 77
6212 77 86 14 -44 -153 0 5 -213 -17 -130 -102 -141 1 -147 19 -112 -59 22 -60 88 124 126 29 4 100 -38 21
6238 21 239 36 29 50 62 -20 82 -109 -20 -68 84 41 -13 129 30 103 33 -105 169 -57 14 -174 -3 -70 -93
6263i3K9KL2J33j81M4N2r6R8N9n2k5J6o7q2K35m7k6k2N3o0l2Q2n5j26R0J56n7
6291F0j10J87j77J70r5oMj86J75j1q3m7Q9K29j66J03k14O3R0j96J82j57J35j14
6315g5R7p5N6P2l4N7k4J01k47K5LR8j95J0K9K52j42j54J52jR1j15R2n8q5k7Q9
6342hOr8J98k2j44j8JM5P4m2j01N5P3rK6K4j27p7N9O4K6j9L4M0m3l3N3K7k11K02
6372E5j1j54J11R5j43J20j13J21J58r2k01j0n4K11j05P0J69l79P3R4j15L8J75
6395A13l14J53J59l3l6l7J59j01pj01m0N2j6M4r8J33k5K8r6K08j22J2l5LR6J36
6421B35k66JJ6k7l9O7J0j28K15j44M7K5m4P4M3J6j38m7J17k03K28K2j22N9m4j80
6447b07J93O3k4O1n6o8K9M5Q6M1k89J19r0Q6j22K91j66o0O0P7q7j6R7K4kj74L5
$$ plain form
6263 -93 -64 -62 -30 103 -78 -34 18 -78 20 79 27 2 18 -49 -131 104 57 31 9 62 2 -30 52 -3 -129 -39 117 60
6291 60 -50 137 -40 130 35 29 33 -153 22 11 -72 -119 -30 199 33 136 -78 -15 75 -121 61 -96 39 -75
6315 -75 22 -53 3 75 41 98 74 175 -72 -47 -44 54 -141 -131 -102 150 8 -146 6 5 96 -19 73 15 -70 -97 -8
6342 -8 -2 -100 98 76 -68 -86 -85 -40 34 -8 -109 -54 19 10 36 60 -67 -144 -85 -21 5 -14 20 60 17 -16 37 64 -147 55
6372 55 44 -110 1 96 -47 73 -40 81 239 147 -54 -64 -118 93 -12 58 227 -152 -79 15 -100 -62 113
6395 113 -201 -48 111 78 42 5 164 63 56 -45 -85 -33 -49 -5 -103 30 5 33 -63 145 23 35 0 3 99 235
6421 235 -31 -30 -14 -41 -80 -13 -3 -131 84 -60 -13 12 -32 42 85 101 -37 -84 33 -170 58 80 -42 17 -27 -207
6447 -207 -14 49 25 86 30 -38 -9 36 122 163 -126 -7 -97 -11 -133 158 -8 -68 -8 69 -18 -34 63 87 85 -89 -54
6474e4K50j46M9n3N2j60R7Qk0l8l5R2j2j11Q9j23J23j32J11n0qN5j8l9L3J37k48
6501a51J04J15r5J89j82J6m1k6J4N4L2q6J2M0j5O9K24k18j8r6M1P5o4j00J71m3
6527B1K8l3p1K8j34J34j9J14j15J30j3l1lm9J40j01Jn8L7L3j45K03j06Q2J1l03
6553b19K63j43R0L6j75J49r6O1K1J78k07l6J58O7j85J32m0k19J68J65o8q0N1r4
6577b3nl2K2M3l2k35L45o6j4O4MJ25j45k06J69j16n9K92p2o1n1L5P8j21M7J3j32
6604a33J68K7m5M4mj7M0j74O2q3n8L01j45M1oj00J7lJ31J28j20K8q9K2NK5p0k9
6632c7L4r4J08M1O6k67J34k3kJ18j57N3J19jk6j47O1J9j06PJ05M9j4q0QQ3L2j87
6660a04R5l1O4M6j66L4j3J09K6n6J55k39J34M8j24R1m6K8J7j90N9O6o8J21o2j33
$$ plain form
6474 -54 196 50 99 46 98 -62 35 43 23 -15 -50 42 30 -81 8 -115 8 -124 -13 -63 -71 -16 -34 -73 -40 97 -151
6501 -151 -47 68 -27 162 -20 -4 -45 -71 -57 -3 29 -57 -45 -5 -20 49 273 55 37 -59 -18 57 -7 -107 64 21
6527 21 49 16 -55 -27 -161 -27 -46 68 -47 83 70 39 36 -13 127 26 27 -31 6 39 -106 97 -9 73 84 -219
6553 -219 44 -99 -9 27 -148 1 -95 -34 -13 165 -42 -78 80 147 -38 94 54 -165 3 168 100 20 71 -23
6577 -23 -28 -60 -38 5 -27 -262 83 17 3 67 71 196 51 -155 14 -102 -161 131 59 -2 -53 -18 60 -61 -14 -1 -133
6604 -133 35 62 17 61 57 40 80 -94 -32 -115 -173 128 -17 24 18 -82 -65 -68 63 191 71 99 10 32 37 62 -8 -37
6632 -37 -3 -97 11 52 118 -149 -15 -38 -40 78 -79 -26 93 92 66 -81 -20 -1 -107 -100 5 54 40 -40 -32 51 83 -104
6660 -104 -9 -40 24 70 -96 -62 -75 34 60 4 159 -80 54 102 -22 69 23 51 68 -122 -63 3 -65 56 -6 -139
6686a39R8o2K82j55JL8r1M5J0OJ1q1j81J10P1R2O6m1j04J49j96N4m8J29Pk22J71
6713B0j7j11Q6j31J02K03k15J74k24J76j95K44p5j41J59M6r7j2n8P7j38J00k4
6736e1q0J19j29J19J26k1O9rl09J48JM6l8j02J51R8k03R5K6M7j37L5O0k9m5J49
6762A36r0o2j67J62K6k2N0o5K00j92k9J36j30M3M2j6Q0j36r5J28k42K64J7J07
6786A45j22O6j51J99j88L1K90k87J48k96K10J3j40j3P4L9Q5n0l7n8J38o3L1j53
6810h9L9K30m00J69M4j0L0o0R0N0k9q5K12k97K12j36Pk7J89j20j5q1p0L44k91
6835i4j2Q1K64k79J14o7P3q0l8p6J97j42K7q7J58m5%K4J16j62q5J64j37K22j16
6860B0QlRr9J32L1j41m5J21M5k0j56JK62l07J06J02j52l8J22J5r8J96j19J0J04
$$ plain form
6686 -139 -41 -103 179 24 25 63 -28 17 27 33 44 -37 -218 -108 -37 55 121 80 -24 125 -71 -17 -65 64 71 -151 20
6713 20 3 -108 -22 -153 -51 152 -63 111 -113 63 -132 112 37 -104 55 101 4 -8 -66 11 -127 -27 -51
6736 -51 -131 -12 -141 -22 104 83 152 143 -166 -18 -17 29 -9 -111 40 138 -65 30 56 103 -34 1 61 32 -13 136
6762 136 46 -16 -183 -21 5 -17 33 -32 168 -24 -53 83 -47 -4 38 22 102 -34 -129 -1 -243 21 38 145
6786 145 23 89 -62 137 -51 -20 270 -17 131 -165 45 58 -82 -95 -21 18 103 53 16 -42 96 33 64 -89
6810 -89 -50 180 -220 -51 -7 -17 13 -47 43 93 64 -21 191 -106 106 -30 -23 -50 139 19 4 -77 -147 197 -94
6835 -94 -106 -25 239 -40 74 7 80 0 -38 -114 83 -59 -32 -119 39 -6 -6 18 134 -28 -113 51 -86 136 20
6860 20 28 25 34 -65 67 98 -43 -88 33 78 58 -98 -97 165 -142 -36 66 -86 -124 -2 13 -85 111 -8 2 106
6886A06l2j83K26l40J27J77Ql7p7P0j33Q9j11L46l64Q9J9M9j54J26r6r1K44K2
6910H0m8L1k83J93m7J53j26K2j4P4L5k1K0j13J0K04j62km1J42j06m4j29J28P6
6935C2m9q3L9Q7k2N6k16K37q2K4Mj28J10o4%K3j9J45n8l6Q3m6j23J61m2n9O5n3
6963a4l2N5J15p7rp1Q3M6O6j99M4M7K1Q2j66j2J25j02p0O5J67j85n0j17J67j07
6989a28J27j20K42j19On4L8M4L7QL2j20k1k5N2j4k1K8l0K16l33K37k77J84JmJ02
7016H8o4j44K09j26J35j54L0j27K44j33l6m2nK06J34j74M1j82K60j83N4k2K9o
7040C2q0J3NJ52j64%J02j04O6j11J06L5J9j39Q3J4n1K14q6K2n7r7l7mlq1N0J86
7068H5J9q3k3p8J98j71J55j68O3n8p3J24L7Q2j73K9k9O7q1jl1J08L8n1j7P3n3
$$ plain form
6886 106 74 -109 117 -223 -96 81 89 52 -25 45 -88 1 -110 236 -128 -39 -20 29 -125 1 -95 -186 58 80
6910 80 32 63 -220 -27 -74 79 -47 -25 -39 35 70 49 69 -44 -34 170 8 6 -35 107 1 -43 -172 -44 32
6935 32 -17 -100 -61 26 4 60 -156 81 -1 23 27 -101 9 -55 -55 -32 -51 94 36 0 83 37 -86 75 33 -26 39 -14
6963 -14 -46 9 124 47 38 -33 50 96 162 -37 7 54 75 157 -9 -21 104 2 -68 -3 164 -21 -71 -188 -21 -128
6989 -128 -1 -121 121 2 8 -46 -8 36 73 81 113 -7 -28 -53 -1 -15 -36 -8 -38 178 -155 82 -195 -11 -10 -14 88
7016 88 24 -120 89 -37 98 -56 -26 -153 91 -42 -78 -120 -125 81 215 41 82 -100 160 -23 31 9 38 32
7040 32 -48 -35 -30 122 -42 -42 60 -44 22 -89 17 52 71 -68 15 29 -22 192 106 128 71 -26 -63 -67 -70 -151 -101 85
7068 85 104 21 -2 -80 118 -53 102 -66 -3 -61 -134 -10 27 109 -64 -35 -64 3 -78 -79 -110 -2 36 -15 -32 41 -12
7095a2Jj13J10M7j33o2K12o4j59R4K1N5M6j00Q3o0Q8N9j59j4J0j12J32K7j39J64
7121B2n8k00L01k12K97o6j12K7p8J9R6j36J25j13M8kj7M9o3J98j16Q2j85J7P7
7146@r1J62m3k36K31j2n6j02K46q4P7k6oK9j67N6rP9r1k4N8k7o0P0O1L3k0l2j38
7175a22Oq0J80J16j22J00N4j43K27l56Q1J81n9j13J00j20K85r8j14j58J77r4O2
7198a0J90j45N6o1L4m1L1j3o0Q5o0N2O8j65J29q1j7Ml6J22J3j05o8K06j61q5J22
7225Dm5m0J12r5M3rn2O8J02r5rl2O8j2j20J85oj33o1J09j51OJ28L1k9j2N9O7M8
7254A29q8j3m6p6J10oj49K29j02N7P9r3o2J36j22k9m4J60or3l3m5j08J74m3Q3
7280aJ2j05P7j07K03j29M1K04j65P4n1j20K32k66O4R0M6p3Kk2M1P8k05J39j04
$$ plain form
7095 -12 -11 -124 -14 33 -100 -162 50 -14 -173 -79 -58 -3 43 -57 26 -34 54 113 -46 -60 -50 -162 -30 -3 -142 22
7121 22 -36 -236 65 -147 150 84 -28 -1 -79 -60 36 -100 25 -88 -40 -42 -59 -10 -73 125 9 91 -94 -77 0
7146 0 -91 71 28 -208 23 11 -45 -147 99 15 92 66 60 89 -78 -22 -31 48 -43 -67 -9 -36 -96 -26 35 68 48 16 -122
7175 -122 -116 -196 -16 100 -22 78 132 -11 216 -140 -59 122 63 -50 50 -70 215 117 3 -155 22 -72 -10
7198 -10 180 35 91 30 64 23 54 41 -19 66 6 58 126 -39 90 9 -8 -4 -40 82 95 -10 -78 128 -33 -118 4
7225 4 -41 -81 31 -64 -21 -30 -82 -14 88 -7 -16 -48 20 8 -112 73 67 -66 -127 -18 -169 -163 -35 -4 -33 -45 14 81 129
7254 129 41 28 -18 -94 16 10 -139 90 -12 45 124 31 -31 105 -17 -46 -90 70 64 -29 -62 -107 -215 -41 -84 -1
7280 -1 11 -94 -17 -124 79 -50 -9 195 30 104 53 -67 165 -101 -37 53 99 26 28 6 47 125 -80 59 -45
7305d5O3K6m7J67k54l8o4J15J57j37P5j85P7R4q8J36j90K44k02J05q2j33J94R8
7329H6k11J20J11k4j10M8j1j12K47r5j16J23M6j70Q2M6J23J9k08p9R8m7K7J03
7353I6k35O0P2j12M1J50j31MQ6O5j18Qj05L6K55k0q4k02J80k9r8o9J65R5j39Q3
7379E4QQ5j57J95j97J2J08l2L9j44J67k11L9L4o9q9J20J4n7J80r0q5J54o2N3p5
7405fP1M0j98R9J53j69L2O8j14J45j81L07j85pKj83Q9J04J35j68m8J61k03o8J06
7430a8P8k35J99m2O2m5K8l8p6R1M2j35j3J45j42J81j03K37l21J48p2j10J12j89
7454b16P5%K32j60Ro5J37n5l4J38k8J3Qj47J76l4m6L6N1m5M0Qp6kj50J11nL5M0
7483D6o6Jp2K44j43k1l1R5o2rOQ7l0n6j9p6J09O4p2L2Q1r3L0j04JJ72k63Q8j1
$$ plain form
7305 -45 18 44 -3 164 -90 -128 -192 -77 80 -57 18 -167 -90 4 -84 52 -138 106 -96 9 -73 -206 -12 86
7329 86 -125 -5 106 82 -28 20 9 -103 144 49 -67 56 102 -68 14 60 183 202 -6 -85 13 -34 -7 96
7353 96 -139 -79 -7 -119 -78 72 -59 -55 31 96 -22 -14 -119 -83 172 152 68 -134 46 17 -81 -150 15 110 -29 54
7379 54 62 147 -10 185 -12 0 108 76 115 -29 138 -73 -34 0 -69 -158 -38 -24 -81 99 9 -76 78 16 69 -6
7405 -6 65 105 -93 6 159 -10 22 90 -24 121 -60 247 62 55 57 -126 -37 67 202 34 -14 147 -56 -124 -18
7430 -18 60 -175 24 -18 44 -1 27 -11 -87 4 46 -89 -102 43 -99 82 -21 216 -105 43 -29 -139 -27 -216
7454 -216 -141 -141 91 -69 -60 -125 12 -43 -77 61 33 46 54 -93 83 49 3 39 90 45 85 93 17 15 -135 -24 -29 6 46
7483 46 -20 -19 -91 153 10 -11 -42 53 -9 -18 -12 75 45 -11 -30 -106 3 67 -5 27 108 15 45 -59 -58 114 -149 -61 -72
7512g2J03j65P2pn0Q5l6J03r9J8K16l51K43o1n6J71j43J90q7j7nj7Kk36J55R4
7538E0j22M9J47j97J2p4K58n0j58J61r6j32K94j10o0P2L9j32NJ62j76l3O8N3j39
7563a09J35N0k08J49j64oJ20m6Q5J08k5j95J37l8q8j2J1J64p2Kj09M6J04j02j6
7588g9R7J18j94R7N8j55R1lJ0j71Q6j6J9qJ19k22J76r3l4J52N8l60K91m7r9K52
7614A43j93J85j27J5Q5Nk85K4J51J58j0j33j22K6mO9M6j43N7O5p8j15K67j03n3
7639g0J56j03M1k40J99l9J51j44k5k8O6kJ61n4k66J37m4J90L5p7J0j7nj7j1J13
7665A17k21K98j79p6P8m9q3J06m0r7j6R6J99j60oJ9K8p5n1O6j01J08p0J04qK2
7691IR9j54l5N1L8r1J92j88J56j02J29k11K00J2j89M0n7K29k5j40R8k1j08Q8r8
$$ plain form
7512 -72 31 -134 -62 -69 -119 -34 -70 33 -66 -48 168 -183 60 -1 -57 114 -29 161 74 57 52 35 37 -199 -44 50
7538 50 -72 -23 124 -73 -61 -135 123 73 -85 76 -20 -152 142 32 -28 44 83 -49 -44 118 -58 -91 -23 30 -109
7563 -109 26 76 -132 17 -147 -153 -33 -79 6 114 89 -106 31 -7 -95 -107 -96 68 -4 -2 -111 -65 39 -63 -79
7588 -79 18 136 -58 39 97 -58 33 30 40 -131 -45 -61 -42 -50 69 -153 23 -70 -104 48 106 -254 37 -10 -109 143
7614 143 -50 135 8 23 108 113 -172 -148 3 161 151 18 -104 -78 -82 -13 33 -110 -53 12 -66 -181 86 -17 -70
7639 -70 86 -17 24 -216 -17 -56 95 -49 -74 -102 -36 -38 123 69 -197 -60 -104 86 121 44 54 37 32 15 4 117
7665 117 -104 194 15 -61 17 -32 -115 -9 -49 -146 -162 -66 133 -27 -33 -14 14 -61 -112 -46 -147 -39 -109 -5 -13 9
7691 9 108 -46 -81 -30 8 -83 109 -79 77 -25 104 -107 93 105 -84 -44 -101 128 103 -37 61 40 -68 20 -78
7716g8j8J97j03q8R6J44q4j9o1k6J70j94L4N9l1Q2l8j30K4Q5J50r5j13J11j71
7741i7Q0JJ28p4k2j05m4J17K1k3j3l1J98j58r5K30j69J71l8M2r9R7O9j96Q0o7
7767CM2j03N1j89J63J84j40j48Q4Kl1P3j70J95J06J3k13J40j14N0j76K53n0j7
7791HR6j59RP7j54J74j58P3k22K16LK3j82R2J07O3j12J6J87q2m3M5j20J29P2k40
7817h2K26j02q9M8j58J71k8j0J92k70J20o1p5J53L8Pj30R5L2j10J41k53R9J70
7841A24j35P9j04N4j11J04j29J92Rj1p9N2m5j64K63j08PJ28j56K5J82j21l1r7
7865g2K8n9J45J31j23j04J54j19P4j12L9P0M4l0pj25J66N9j98k8p0R2O0M2j53
7890i6J19j24J25n7J28j63M0J03Jl5p3J93k24L3o0q4k0Q2J44q4o1J04m8j80M1
$$ plain form
7716 -78 -96 101 -2 -90 6 150 66 47 -14 -40 130 -64 -30 29 -2 80 42 -88 -64 21 171 76 -37 74 -97
7741 -97 -17 -16 112 38 16 -89 -133 -16 5 -18 -31 -62 136 -22 -117 113 -56 115 77 119 20 117 186 -10 70 3
7767 3 45 -58 -7 -196 -33 151 11 -137 -53 -51 -82 -9 -179 16 122 135 -78 62 -52 -2 -178 75 25 8
7791 8 104 -55 -46 31 -123 51 -107 -34 -256 -40 -37 -14 -196 -104 3 66 -46 -30 157 75 32 77 -43 86 158 -82
7817 -82 144 42 -47 1 -157 14 -14 -24 168 -102 18 -43 -118 35 73 80 -50 45 77 -33 108 -145 -46 124
7841 124 -11 68 -36 18 -93 11 -118 74 83 72 -7 45 0 -164 99 -9 -2 126 -30 -5 177 56 25 -72
7865 -72 -44 -103 42 173 50 -54 100 -19 55 -57 -18 52 96 66 59 -66 100 159 -39 -67 -137 -45 15 57 -96
7890 -96 23 -101 24 -33 95 -68 -28 75 76 41 -32 161 -63 -30 -90 -174 -194 -112 32 -52 -113 -9 -57 -237 -196
7915a96J30L60j97j99K02j07K03k54PJ54j77n6O3J59N0j08j63J86j62J61q5k2
7937e1J0o0N0P0p6J37j36R8j32J77j74P7J35k40JJ80N3j40pJo1L8K15o9l5j56
7963i5K31j93J03o0O6oJ70k40P1M0J34k17j7j02K78k06J04q3P5k1r4Q7p5L3O5
7988D8p3L6L0j53j6J21J8M4Nmo0n6J26o8j2k9m1J53n1L6j03j19J36P1J38j51o6
8015d0J89k77J9J12j06R9lJ08J7j50O3j61J09k9J01r0p8K1k9J45R3lj94K57k20
8040d7J02j02m0K12j08r0j9L2J44j70K8R1No8m4J92j14N2j49L5l4jR5m8j1l8J10
8067A5j40K29k36K67j80P5j92J42J60j69K08j17j08Q5p1P4q9R2J32k31L03l28
8089g9K27r9k36K15j37J85N8p7m9q6J91j72J9J16j35J54j54J06j59O9O9o8o1M9
$$ plain form
7915 -196 -66 294 97 -102 100 -7 196 -58 -51 103 -74 -130 -67 92 142 34 -129 57 -105 56 -29 -51
7937 -51 -41 -101 -51 19 -57 80 -56 42 -90 87 -87 -10 125 -115 -114 66 119 -21 -28 -27 -88 -50 165 96 61 -95
7963 -95 136 -57 46 -14 52 46 216 -24 47 87 221 4 -13 -115 163 -43 61 -22 53 32 -62 25 -50 -17 48
7988 48 -25 11 41 -112 -128 -7 11 55 60 56 -4 -60 66 -2 -14 -43 -84 69 18 54 -49 -168 -32 39 177 26 -40
8015 -40 149 -128 -109 3 -103 -4 -7 101 118 -32 31 -130 -21 -50 51 -39 -117 -96 -125 20 113 110 -84 173 -47
8040 -47 55 -47 -87 125 17 -73 -92 -60 84 -86 -58 33 38 -30 -74 118 4 56 -93 -58 -92 -93 2 -46 -57 -95 15
8067 15 -125 104 -132 135 -45 30 -162 -20 140 -29 179 62 -46 39 -32 42 -47 45 177 -54 249 -79
8089 -79 148 49 -187 28 -109 76 134 57 8 -78 113 -59 -40 76 -59 95 -59 47 -112 -43 26 -42 -103 -54
8113e4Q1p1J72j61M1o1o8K83k08j2J7J43j17L8l7p3K06j59J11m2P4j20O2m8J62
8138A59j80L2l7J34j72q0J88l4r2J21Nj64J47m8J21k21J87p8O5k4K7j58J76j6
8162E8j61K34j26J00Rl5P8j86k1Q6M6k7k2J41k84K21m0j1lj62K10k19J64R6k12
8187f6P9K3l0p7
$$ plain form
8113 -54 27 -44 128 -33 8 -53 -121 162 -46 -58 -41 102 -15 23 -14 -87 119 -40 71 29 103 -17 45 -3 159
8138 159 -21 11 -26 108 -64 -144 44 10 -82 39 44 -120 27 -21 100 -121 66 -12 53 29 56 -102 74 58
8162 58 -103 131 5 105 114 79 157 -29 -50 36 82 55 33 174 -110 111 71 60 57 -105 105 -114 50 146 -66
8187 -66 13 36 6 -71
8191g1
$$ Imaginary data points
##PAGE= N=2
##DATA TABLE= (X++(I..I)), XYDATA
0@%%%%%%%%%%%qJ6j6J6k4L2l2M0m8N6p2Q7r9J13j33J53j76K03k31K63k98L38l83
34b03M31m84N44o08O74p48Q34r28J027j133J249j378J523j678J843k031K239k467
52a294K722l005L323l688M106m586N150n824O646p671Q985j0733J3180j6836K2831
67A3306l4215O2594k46434l08834R08971k22042o37118O56815J70363q12519L20618
78a28495O12745n68230k04778N65753k41495l80418M87525J33463n06577R9216
88a31291L39556k52038r9435L46535j14664l46386K44853K21431l16768N927L00192
99A97912k66116j80046M54730k8102m35793K86264K02917m75816J49000M60773
109C65723m67087k20328N83821j60702m32952N08577J02158o26984K63404M54946
$$ plain form
0 0 0 0 0 0 0 0 0 0 0 0 0 -8 8 -8 8 -16 16 -16 24 -24 32 -40 47 -52 61 -72 81 -95 108 -123 140 -158 180 -203
34 -203 228 -256 288 -320 354 -394 440 -488 539 -594 655 -723 800 -878 965 -1066 1173 -1294
52 -1294 1428 -1577 1746 -1942 2164 -2422 2728 -3096 3550 -4121 4864 -5869 7311 -9525 13306
67 13306 -20909 41685 -204749 -513583 395388 173346 -463772 193043 363406 -449113 -128495
78 -128495 484250 -83980 -288758 276995 35500 -344918 142607 276070 -230507 -131291
88 -131291 208265 -43773 -143208 203327 88663 -257723 -12870 208561 -108207 -102280 197912
99 197912 -68204 -248250 206480 178378 -257415 28849 231766 -244050 -95050 365723
109 365723 -101364 -321692 262129 101427 -331525 177052 279210 -347774 -84370 370576
119C70576n06429r5753N19368k82642l38719M95360O4430m68999J95714K76830
129B29736l40196l3751L48675j59235k59030K46365J08506k51547N5578K12237
139A57338j83128j24596K59809K725k53801J34143J47732k51414J8028K71739
149A78575j90870j61903K94927l5624k62395K36408J02728l34025J08264K61099
159A97184k79331o1597L18225j63931k03732L09868R146k99845J78463J58297
169A62747k73576K8612K39814j77537j20638K30549j7551j84870J25121R2665
179A05336j68648K455J53869p9042j09143J19199L8767j33825M2170J20414j11928
190b0376o4048J54411k2434j41154J12120O2422j67757M8252J48631j42183n2507
$$ plain form
119 370576 -135853 -231606 287762 5120 -333599 161761 226191 -242808 -47094 229736
129 229736 -110460 -144211 204464 45229 -213801 32564 141070 -110477 -54899 157338
139 157338 -25790 -150386 109423 112148 -141653 -7510 140222 -111192 -93164 178575
149 178575 -12295 -174198 120729 85105 -177290 59118 161846 -172179 -63915 197184
159 197184 -82147 -143744 174481 10550 -193182 116686 125832 -174013 4450 162747
169 162747 -110829 -82217 157597 -19940 -140578 89971 72420 -112450 12671 105336
179 105336 -63312 -60857 93012 13970 -95173 24026 62793 -71032 -28862 91552 -20376
190 -20376 -84424 69987 47553 -93601 18519 80941 -86816 -38564 110067 -32116 -84623
201h4623J76311p0421j21751J64136R637j77342J00829R8260j62392K2449J41959
212I7052j22824n7203J57533m1237j13368J09395K4437j23685N5435Q2424r7303
223b9344j8782R2754l6742n4536P2051J3699p6044K1127N7642m7036k8448O0361
235B6702r200o0891M6542M3403o9268k470P0563m7479m3350Q0446r622q1538O0127
248C965M0281q6440K4475P3245p5928k1995R0687l9300o0501P8769J190p9262
260e0814N3831M1794p6928J4060O3690n4975k1115O6156k5160m7081N1060Q883
272B3401n2901K5045L2432m2058l363M1765k1337k6793L4002M724l5677J4580
284f180K5365k9590q248L7118j0808l0146L0109J2614l8933J2941L3048l6654
$$ plain form
201 -84623 91688 21267 -100484 63652 73289 -104053 -3224 95036 -67356 -44907 97052
212 97052 -25772 -82975 74558 33321 -80047 29348 53785 -69900 -14465 67959 -29344
223 -29344 -48126 44628 7886 -46650 25401 39100 -36944 -15817 41825 -5211 -33659 26702
235 26702 17502 -43389 3153 46556 -22712 -25182 45381 -2098 -45448 34998 25376 -56162 3965
248 3965 44246 -42194 -17719 55526 -20402 -42397 48290 8990 -51511 27258 28448 -50814
260 -50814 3017 44811 -32117 -18057 45633 -9342 -30457 35699 10539 -36542 14518 23401
272 23401 -29500 -4455 27977 -14081 -17444 24321 2984 -23809 10193 14917 -20760 -6180
284 -6180 19185 -10405 -18653 18465 7657 -22489 7620 20234 -18699 -5758 27290 -9364
296i364j2359M4966j6817l3002M1647N430m7739K6897L0620m7634J379M4168l5055
309f863k1297N0861j2547m1572L9837J3071m7079K1719L2528m3998m158M4174
321B4676k4333k4729M1021l315l7804K7839K0783l7600L789L2108k5272j6295
333a9132L4929m945l1780K2103J7031l1475K981L0264k2064j8798L3092p76l3218
346b1788K1619J9925l5718K807L7005k5970k0312M0090n510l7092L1358J7290
358B3704m4542J2133L7228l6844j2485M5719j8799l3177M0676N854m4923K2758
370b698K8157m1176o19M0044k5512k2777L9468j880l6290K3831J9502l4489K706
383a1733L2712k1725j9634L2635J197l1432J8475K0257l2212j627L4893j8626
$$ plain form
296 -9364 -21723 23243 6426 -26576 15071 20501 -27238 -341 30279 -17355 -15976 28192 -6863
309 -6863 -28160 22701 10154 -31418 8419 21490 -25589 -3870 28658 -15340 -19498 24676
321 24676 343 -24386 16635 13320 -24484 3355 24138 -13462 -9673 22435 -2837 -19132
333 -19132 15797 10852 -20928 1175 18206 -13269 -10288 19976 -2088 -20886 12206 11430 -21788
346 -21788 -169 19756 -15962 -13155 23850 -2120 -22432 17658 12148 -24944 6414 23704
358 23704 -20838 -8705 28523 -8321 -20806 24913 6114 -27063 13613 19467 -25456 -2698
370 -2698 25459 -15717 -16336 23708 -1804 -24581 14887 13007 -23283 548 20050 -14439 -11733
383 -11733 20979 -746 -20380 12255 13452 -17980 495 20752 -11460 -13087 21806 3180
395C180k4494L3071K581l6475K2075K4583l9835j216M0275k5400k2293M1963o880
408A1135m0442L3260J9904m3714J0267L4916l5363j0535M4366j6039l2250L3572
420I077P422l5792J8624K4361l3711o315L3867j2362k1586K4924L830l0253J2069
433e845K5378k3290j1937K7094p358k3922K6043J2790l5712N128L1279k4346j1890
446a6588L7015j3997l3762L5433J3567m0317J6013K6973l9493j439M4285k4316
458C374k7216L7737l799l3967L0502J5988m1006O453L0576k3521q830K9769j2511
471C549k4714K3682J2520k3579K736J7289j5408r016K3993J528k5220P971J8125
484A3456j8779l522K6824j4651k4948K8918R221l2427J4877K0840l6043J184L9828
$$ plain form
395 3180 -21314 11757 14338 -22137 -62 24521 -15314 -16530 23745 -1655 -23948 18015 11135
408 11135 -29307 3953 23857 -19857 -9590 25326 -10037 -20572 23794 7755 -24495 9077
420 9077 16499 -19293 -669 23692 -10019 -16334 17533 5171 -16415 8509 12339 -17914 -5845
433 -5845 19533 -3757 -15694 11400 4042 -19880 6163 18953 -16759 -11631 19648 -4698 -16588
446 -16588 20427 6430 -27332 8101 21668 -18649 -2636 24337 -15156 -16595 27690 3374
458 3374 -23842 13895 10096 -23871 6631 22619 -18387 -11934 18642 -4879 -13709 16060 3549
471 3549 -21165 2517 15037 -8542 -5806 11483 -3925 -12941 11052 12580 -12640 -4669 13456
484 13456 -5323 -8845 17979 3328 -21620 7298 16519 -15908 -1031 19809 -16234 -15050 24778
497B4778k4423k2922L6643p321l1775L4252J1868m2452J3344K8900l0839j474
509a1421L2663k2592j9481L2395J73k4634J6015Q429k2681N812J9724j2401j1780
522i779J1926K348j0588N644J0492j2844j0175J7850M104j8766Q741J2004k3144
535a2187K038K8947j8069j8608K8831m495k5504K8983R059l8843J3614K7077k9921
548i078l78L1587k6145j7345L6619m454k7239K2469M285k8160J5737J9411k3464
561f155l748J6960r727m796J5880k933j3624L846P750j726k379K540j95q215L292
576c230J4302p517j1699J2001l67j3607J6461P450k6517N316K0682j9483j194
589g402K4800k0718j6369L1385l105k4096K2009L404k9788J7749K0849k6428m40
$$ plain form
497 24778 355 -22567 14076 6755 -25020 9232 21100 -21352 -8008 20892 -9947 -11421
509 -11421 21242 -1350 -20831 11564 11737 -12897 3118 11547 -11134 -5322 14402 2001 -9779
522 -9779 2147 4495 -6093 -449 10043 -2801 -12976 4874 8978 -9788 -1047 10957 -12187
535 -12187 -10149 18798 729 -17879 10952 6457 -19047 9936 18995 -19848 -6234 20843 -9078
548 -9078 -9456 22131 -4014 -21359 15260 10806 -16433 6036 10321 -17839 -2102 17309 -6155
561 -6155 -9903 7057 -2670 -7466 8414 5481 -8143 -4297 3453 1727 -652 1888 1693 -6522 -3230
576 -3230 11072 3555 -8144 3857 3490 -10117 6344 13794 -12723 -7407 13275 -6208 -7402
589 -7402 17398 -3320 -19689 11696 8591 -15505 6504 9908 -19880 -2131 18718 -7710 -8150
602h150K0656j7788n117K4681q740j6798J3794J620j0755J0069M138j1926M16
615c900O185p76K7p22j653r32k259M896M620r250j305R358p201j863J4273q696
631H02j2377J6740J46j5700J5160N174k2640J0362J6723k0374P90J9598j8310
644c906q255K4264q321j6275J8919q62j8344J4908Q116j7848M976J0124j3112
657e616P16J1744p857m464P771k356k847N460n32k583O57r07K352L92l557L334
673A707j40o645O468N055j0365K435Q228j1705K28J4275j0774q199J5492n078
687I82j1740J7066O14j8176J1271Q950j6675N896J2722j6812k117J6861q380o850
701f388J3755n206j0620J2384K536j0702M904K700q144L248O246n044k105K542
$$ plain form
602 -8150 12506 -5282 -10399 14282 5542 -11256 2538 4158 -6597 3472 7610 -4316 -3900
615 -3900 2285 1509 1536 814 -839 -1771 -4030 866 5486 -3764 -5069 4289 -2912 -4775 9498 802
631 802 -11575 5165 5311 -10389 4771 9945 -12695 -2333 14390 -5984 -5194 14404 -3906
644 -3906 -12161 12103 3782 -12493 6426 5564 -12780 2128 10244 -7604 -2628 7496 -5616
657 -5616 -4900 6844 -1013 -5477 2294 -62 -2909 2551 2019 -564 93 -814 1538 1930 -1627 1707
673 1707 1567 -5078 1390 6445 -3920 -1485 6743 -4962 -4734 9541 -1233 -9432 6060 982
687 982 -10758 6308 6922 -11254 17 8967 -7708 -1812 10910 -5902 -8019 8842 462 -6388
701 -6388 7367 2161 -8459 3925 6461 -4241 663 3363 -4781 -1533 4713 -331 -2436 106
715A06q94N24J295k91p44l282P08N744l128l466O109k728n228J0056Q55j1731
731f095O212N730j1438M423J0530j3070l340J4914o952p446J3795m077j3166J2244
745B264M360j3659N808P054j2366K565J1738q574m606R449l456n292P930M7p544
760d282K872L952k824lK661j537k380J754L016k072l966L264J213m981L390M748
776D825q245q00R477n196n287R938l085j0203J0352M270j2150M554Q159j1308
790d699R70J2583q926o380J1378k636q594R734J845j1405M812P142p857N4P053
805E074n714m091P002J36n493K099K254l409K74M287j025m353J874L714l455j050
821a876N124k702n649O976K557p923L438N396q533K07R877o986o017J0015j592
$$ plain form
715 106 -788 -264 1031 740 -4 -3286 -2578 3166 38 -3428 2681 -47 -5275 4781 5636 -6095
731 -6095 117 5847 -5591 -1168 9362 -3708 -7048 7866 914 -6532 7263 3186 -9980 2264
745 2264 6624 -7035 -1227 5827 -6539 -3974 7764 -810 -5416 4033 577 -4715 3215 3262 -4282
760 -4282 -1410 2542 -282 -285 2376 839 -1541 213 3229 1157 -2809 455 1668 -3313 77 4825
776 4825 -3420 -4220 5257 61 -5226 4712 1627 -8576 1776 6046 -6104 -1550 6609 -4699
790 -4699 -3729 8854 -72 -6452 4926 2290 -6304 3430 5275 -6130 -1318 5824 -2033 -1979 5074
805 5074 -640 -4731 2271 2407 -3086 -987 1267 -2142 -1868 2419 1394 -2959 -1085 2629 -826 -1876
821 -1876 3248 546 -5103 1873 4430 -3493 -55 5341 -3192 -2985 6892 -94 -6111 3904 2312
836B312q754Q801K890j1202M086P966r179p53R370o462n246R259o97p267N650
851G74K733o757K273N289m533k265M679r77l431K688K114l418p57L585p34l321
867b058K642J973m881K37N356m156l311O824j200o285N856K841q066K926O408
882E106p627j295Q771n093m833Q929j334p471O474L000q181K841N405o633q64
897b805O577l710l496N216k80m412L078J905l602N3K753j321j749J687J043k178
913a241K06K841r78k684K869J192m250J711L725m763j012O045l273l571O099q50
929B066o128N132K466p059K305M845o368q1O662m423l383O704j742m657N171Q41
945B351n486K858K948m060N87L059k672r23L063n37j765O12K65m71q4O29L07j755
$$ plain form
836 2312 -6442 2359 5249 -5953 -1867 6099 -3080 -3833 5537 -925 -6171 3088 2391 -4876 774
851 774 3507 -3250 -977 4312 -221 -2486 2193 1216 -2215 473 2587 -831 -1588 1997 1263 -2058
867 -2058 584 2557 -2324 -2087 3269 -887 -4198 2626 1426 -4859 997 3838 -4228 -1302 5106
882 5106 -2521 -3816 4955 -138 -4971 3958 2624 -4847 1627 4627 -3554 -713 4692 -1941 -2805
897 -2805 3772 62 -3434 1782 1502 -2910 168 2073 -1529 -1476 1277 -44 -1793 -106 937 -1241
913 -1241 -1035 1806 828 -1856 1013 2205 -2045 -334 3391 -1372 -2384 3661 388 -3183 2916 2066
929 2066 -4062 1070 3536 -3523 -1218 3627 -2741 -2822 3840 -583 -3966 2738 996 -3661 1510 2351
945 2351 -3135 -277 2671 -1389 -802 2257 -415 -1338 1725 1188 -577 35 300 -171 -255 374 681 -1074
963a074L7K160o95k087K623m80l574L344K294m887J036L848m703K96N925m148
979h5l341N968j392m077N319K20o464L808L598n458J558L795n366n18N540k774
995C31k672L707j457k876L718P01k813N85Q94j014J007R56r44o53m05J101J451
1012A617j758k3J266j976j74M074k344l004L944j094l290M620O01n928K763L290
1028B584n189J869M310n707j348O370k778k925N285j988m449N269J425m846K240
1043A22K085m381J522L850l388j011K394j282n65K013o65j299J33J63Q72k61j273
1060i71J085j99j919K653J139l917J170L078l977O67M632m223j906N529k192l553
1076b904N509o49n634M757J994n773K642L488n741N85N097m080j665M712k336
$$ plain form
963 -1074 -1037 1123 428 -1659 964 484 -3090 254 2548 -2339 -1303 2545 -2158 -1862 4063 -85
979 -85 -3426 2542 1150 -2927 2392 2612 -3852 -44 3554 -1904 -346 3449 -1917 -2435 3105 331
995 331 -2341 1366 -91 -2967 751 1452 -1361 -776 118 -896 111 1067 123 -530 -935 166 1617
1012 1617 -141 -164 1102 -874 -1048 3026 682 -2322 1622 528 -2762 1858 2459 -3469 -706 2584
1028 2584 -2605 -736 3574 -2133 -3481 2889 111 -2814 2471 483 -3966 1303 2728 -2118 122
1043 122 2207 -2174 -652 3198 -190 -1201 1193 -89 -654 1359 694 -605 -472 -309 563 302 -971
1060 -971 114 -85 -2004 649 1788 -2129 -959 2119 -1858 -1191 3441 -782 -2688 2841 649 -2904
1076 -2904 2605 1956 -3678 1079 3073 -2700 -58 3430 -2311 -1726 3371 -709 -2374 2338 2
1091Bk983M395m30l294K330R33k481J256J253j510K14N35k48O01p33J84J176j610
1109d10l81K641j741j857L723j334l144L891L75m640L175K455n611J502M650n094
1125a800n91N499l668k692N728j442m565M804O36m647L295K098m317R96L106l218
1141g78k4K806k070j188K191m44q45P47m49m14M91n47P86Jj538J214R39k358R93
1160d87K181l295L73L578k919j389M347k206k865M845k70m687L858J331m949K512
1176d2L200m962K95M272l538j215M289k254k543L667k82k731K142N68k389J271
1192b52J294j646K12O35m67L53L47l96N22p80j68J633j122j287K218n25k210K695
1210A056M12l480J892K027l768J078L250l963n56M258k515j971M243j316l566
$$ plain form
1091 2 -2981 1414 984 -2310 20 953 -1528 -272 981 -529 -315 220 -28 573 -160 24 1200 -410
1109 -410 -791 1850 109 -1748 1975 641 -2503 1388 1763 -2877 298 2753 -2858 -1356 3294 -1800
1125 -1800 -2391 3108 -560 -3252 2476 1034 -3531 1273 1909 -2738 557 2655 -1662 -666 2440 -778
1141 -778 -802 2004 -66 -1254 937 493 -352 395 -54 -468 23 -524 262 263 -1275 -61 878 -1480 -487
1160 -487 1694 -1601 -1228 2350 -569 -1958 2389 183 -2682 2163 1893 -2794 1064 2395 -2554 -42
1176 -42 3158 -1804 -1509 2763 -775 -1990 2299 45 -2498 1169 887 -1844 298 866 -1523 -252
1192 -252 1042 -604 -392 243 -224 129 476 80 602 -178 -346 1287 165 -1122 1096 571 -1639 1056
1210 1056 1468 -2012 -120 1907 -1861 -783 2467 -1496 -2052 2206 -309 -2280 1963 647 -2919
1225b919M064Q04m061K471J453l529J295K709k670n30K452j581o84J958p24j406
1241h98J290p9n34L11k04o4J21n83P36M62j497N81J267j822K61K050j818j058
1259a478L089j185k039L053l66l013K739J134l511J261K434l215J5L342k777j254
1275a771L046j274j839K668j08k558J889Q84k194J072R59j747M58J250p15k28
1291b08O06m95K18K1p2M41m78l94J123l20j038J168J26j825J180J189k339O11
1309d86J787k245j81K481j508j647K727m18k207K370M78k674J476J558k373M32
1325d30K079k166l56K198j116r49J632o06j124J199M4j027M75M11n65O2K82j93
1343a50J22l08M0N80n96j02R68p26m57J479p91r88J686Q2j939J640O27k297J175
$$ plain form
1225 -2919 1145 1949 -2112 359 1812 -1717 -422 2287 -383 -913 1539 -42 -726 1232 508 -898
1241 -898 392 313 -221 90 -114 -178 -57 -640 96 558 -939 -358 909 -913 -652 1398 -420 -1478
1259 -1478 1611 426 -1613 1440 1074 -1939 800 1934 -1577 -316 2118 -1097 -1082 2260 -517 -1771
1275 -1771 1275 1 -1838 830 722 -1836 53 937 -1257 -185 774 -973 -515 735 20 -208
1291 -208 398 -97 121 142 70 511 33 -361 762 442 -596 572 698 -1127 53 1242 -1097 -486
1309 -486 1301 -944 -1125 1356 -152 -1799 928 510 -1697 673 1151 -1523 -47 1511 -862 -430
1325 -430 1649 -517 -873 1325 209 -740 892 286 -838 361 405 -622 -147 264 -301 -239 43 -150
1343 -150 -28 -336 -296 284 -312 -414 554 -172 -629 850 59 -929 757 839 -1100 540 1167 -1130 45
1362D5J494k420K22K123j697q86K297r52j767K273l43j774J486O84k027P27J372
1379H57j445JJ177p16k96J109l97n95O19J20k51j3r8k1J07m27O11r9q34N81M52
1400D42j064J85J161j141m16J742j040r31J733n94j396J686M62j898J068J047
1416A046k001O17J765j978l8J671r03j041J855n41j337J243N19j305O23K30j119
1433f94L56N88n71L4K83l46K08L21k44K39j99l42P92k15o62P17J07r58Q14N01
1453G29j328O24J051j565m0J634j344o78J926q76j204J638p1j654J322O45j727
1470i18Q08Q79j442L20J228j143l15J265o15m57P34K5o75N92j46j62K78k9k60
1489c3K23l22J74K75n78n4O98p37r0R39p53n26J167Q2j365J149K46j509J079R87
$$ plain form
1362 45 1539 -881 -659 1464 -233 -1119 1178 226 -1541 732 389 -1385 101 785 -1242 -515 857
1379 857 -588 -587 590 -126 -422 687 290 -305 314 434 183 170 72 51 158 -269 342 243 -591 -10 442
1400 442 -622 -437 724 -417 -833 909 -131 -1062 671 77 -1319 367 829 -1069 -1 1046
1416 1046 -955 -338 1427 -551 -589 1082 179 -862 993 452 -885 358 877 -428 195 425 -694
1433 -694 -338 250 -321 -287 -4 -350 -142 179 -65 174 -25 -367 425 210 -452 265 372 -586 228 729
1453 729 -599 25 1076 -489 -529 1105 -239 -917 1009 133 -1071 567 496 -1158 164 809 -918
1470 -918 -110 769 -673 -353 875 -268 -583 682 67 -390 344 369 -306 286 140 -22 256 227 -33
1489 -33 190 -132 42 317 -261 -315 383 -354 -444 495 -258 -784 383 465 -900 249 495 -1014 65 1052
1509A052j696K94J346j412j74J861j054q79J511n65j197J700k02j330Q29K49q04
1526d71M42O92j171K11M37m07K14K78o83M1M68k52L39R1p55P04K31o61M85N92
1546H25j230K66J056r66q8R67j118m39J821o14j375J311j49j276J382L42j593
1563h78N10R37j200L71J009j009l23J067n33l24R50l30n91O02J6l51M71l50l29
1582b85L31J2j50L73l25l12N47k81l84Q30l91p85J123n5q53P82J42j128Q01P60
1602G52j196L62Q84j261N0J412j014o25J250l26q31J082j04j125Q51L00j161P53
1620E3N04j043J45N93o18Q5N76o34K22L60m59K08J59l07K13L36n43J83P07j071
1640c31K02P22p40j28R70p41m54J005l21q20J258k26j178R57K40j274Q52N71j269
$$ plain form
1509 1052 -644 -350 996 -416 -590 1271 217 -662 849 284 -913 787 585 -745 84 333 -471
1526 -471 -29 663 -508 -297 140 -267 -53 225 -458 -417 51 -201 138 229 -526 178 409 -252 233 825
1546 825 -405 -139 917 -49 -137 830 -288 -727 1094 480 -895 416 267 -1009 373 715 -878
1563 -878 -368 569 -631 -260 749 -260 -583 484 -49 -373 577 247 -344 258 274 -77 394 44 -285
1582 -285 46 58 -92 281 -44 -356 191 -90 -474 356 -35 -820 303 248 -605 177 319 -809 -8 752
1602 752 -444 -82 802 -459 -409 1003 -11 -636 614 288 -543 539 435 -690 161 461 -700 53
1620 53 557 -486 -341 252 -366 -281 295 -339 -117 243 -216 -8 151 -156 57 393 -150 33 740 -331
1640 -331 -129 593 -147 -275 695 -46 -500 505 184 -636 622 396 -782 175 415 -859 -7 564 -705
1659g05L41J017r22j83J026n21m65Q15l35m52R70k46o70N39Q1n35N99k66l19N22
1679B91j23n23L73r1k29M72k3o18N04J13q17O98L65r71O29N35r59L13Q36j217
1699d42J51R84o64n00J098l49o98R22o9q75P50R7j020P77K20p59J60N81p05J5
1719c26P25p25J65L81l64K8M04l25j66N26l30K1L14m03j37O94m45l10P43l85l46
1740b61O56k87n04N56j33n73N93K47q16L51M90q04L05Q31j099MQ50n20j07P81
1760E60m04o25P43m7m51L94J16o05K72K31k70K53J02m34J88K52l98J47k2l13J51
1781a60L23l03J21J50l89K79L19m47m8N66o40p8Q45n66l52P65j54m99P44j15p64
1802d03M86L68q69L70L10q50M17O90p92q5O40m90p3L70n8l57M77k23j44L80j6
$$ plain form
1659 -705 -364 653 -269 -452 574 53 -412 403 68 -384 586 340 -330 209 290 -245 354 88 -231 291
1679 291 168 -355 18 -73 -302 170 147 -471 33 146 -671 27 392 -579 50 585 -374 -61 775 -442
1699 -442 -291 693 29 -471 627 278 -420 502 433 -442 308 405 -615 162 382 -377 -217 364 -341 -326
1719 -326 399 -326 -161 220 -144 -116 288 -37 -203 323 -7 14 328 -75 -212 482 37 -273 470 85 -261
1740 -261 395 108 -396 160 27 -546 47 294 -522 -171 319 -485 -180 651 -448 -444 406 -114 -221 560
1760 560 156 -469 274 227 -224 170 286 -319 -47 184 -86 167 269 -165 23 275 -123 24 2 -311 -160
1781 -160 163 -140 -19 131 -258 21 340 -107 -155 411 -229 -307 538 -28 -380 385 231 -268 476 361 -403
1802 -403 83 451 -418 -48 262 -588 -171 519 -273 -358 282 -208 -281 89 31 -326 151 -72 -216 164 148
1823A48l41L59j33j53K99j64k83M59r8m15N02j89l06L34K95o48L34K31n29K17
1843h1K40m97K63N74p46n2N81l34k15N40k52j77K94K6m51M70J15m00L00J06l93
1864h9K5L46l88Q5L10m13l0J50r6O7Oj31L8K48j91k6K88l10Q8K82k24j71M62k83
1888D3l74Q11m01m02O54K4o35M76j9m75L81J75m89M4L42m73J35N13m28k36M43
1909A09k91q9L89J5l83L09Qj37J98kk51J00J43NJ37m4k24J28J4l06L77K9m35J97
1933dL05o27K21L52n13J66K82k95k20N68k58k52N34o3m91M82R2m50K17K12n17
1954b59K43K59k94k3M92m76p7L34j75j90K04j49oJ68j04k39L08m7j61K08j29J
1976a12K76l43J30K66j79l66N20j5j77J21R5l46K66Q4l62J46L18m18J00J73l04
$$ plain form
1823 148 -193 166 33 -120 179 15 -268 191 93 -322 180 -9 -315 19 314 -334 0 231 -298 -81
1843 -81 159 -338 -75 499 -247 -299 282 -52 -267 273 21 -156 138 164 -287 183 298 -102 198 304 -89
1864 -89 -64 282 -106 -21 289 -124 -154 -4 -100 -33 -27 -158 -120 128 -63 -89 199 -111 -23 259 35 -136 326 43
1888 43 -331 480 79 -323 331 355 -280 196 177 -298 83 258 -231 -187 155 -318 -183 330 -98 -334 109
1909 109 -182 -271 118 133 -250 59 67 -70 128 126 -125 -25 118 123 260 216 -8 120 134 -172 205 234 -201 -4
1933 -4 301 -326 -105 247 -266 -100 182 -113 -333 235 -23 -275 259 196 -295 187 279 -171 46 258 -259
1954 -259 -16 243 -51 -74 418 -58 -135 199 24 -166 38 -111 -117 51 -53 -292 16 -31 -192 16 -113 -112
1976 -112 164 -179 -49 217 38 -328 192 177 0 121 216 -130 136 220 -142 4 322 -96 4 177 -127
1997a27j61L96j27l62O63j72l65L55q5k07Q5J47n6j7K93l33J45J25j70N9P7j95
2019c2J28J17l32L5P4j21j7J01k67K95J91l29Q9No1j20L36j87k76N30j0m25K74
2042bK31n35L37K59m12J38J65k77Q9L94m58O2J68j89J6K10j07l72M55k96k1Q2
2064f3J59j30J49N6l73K68j21l5J3L4j25L19K95n60K59O8k44L5J37l98J64L23
2086B30l68q2K62p5j97L12p3l03M62k61l18L49l0j71J66L23l65O5J78k08M13k21
2108H8k13K88J42l50L6J9j23J32J15k98Q9M0j25m2J91J9j68J24j14p4M49j43k21
2131a39K93j68j95M25o8l05L16N8l05ML40k46o4L62k45j03K26k00k0J92l8k83
2153a63J60K9k72L14Q1j78J3l6j64K25J30n3P2j31j75K95j1j89K02j26l2K6J53
$$ plain form
1997 -127 -288 108 -19 -381 282 110 -255 100 15 -192 -107 40 -16 -33 260 -73 72 197 27 86 163 -32
2019 -32 96 213 -119 -84 -10 -131 -148 -47 -314 -19 172 -157 -68 -63 -124 -244 92 -95 -371 159 149 -276 -2
2042 -2 229 -306 31 290 -122 16 181 -96 -7 387 -71 -9 159 -30 -14 196 89 -283 172 -124 -145 -63
2064 -63 96 -34 115 171 -202 66 -55 -90 -77 -43 -168 151 446 -114 145 213 -31 4 141 -257 -93 230
2086 230 -138 -220 42 -33 -230 82 9 -294 168 -93 -411 -62 -92 -263 -97 226 -139 -74 104 -104 309 88
2108 88 -125 163 305 -45 -9 10 -113 19 134 -164 -75 -35 -160 -202 -11 8 -160 -36 -150 -224 225 82 -139
2131 -139 154 -14 -209 216 148 -157 159 217 -88 -84 256 10 -54 308 63 -40 186 -14 -34 158 120 -163
2153 -163 -3 26 -246 68 149 -29 -16 -52 -216 9 139 86 158 27 -148 147 136 -53 149 23 -9 17 170
2176A70k29N5K18l07M4J15j80n1L08j88q3K89j10k39L54r7l27J95J30k30K60j13
2198a6r6k9L05j05j57K06m2j29J48k3J2L7r4j0jo6o3P4q6o5M00k06j80J18Q3l89
2224c74L99P0j57L9K18l42J13K77m38K38K95m09N7J82k63jK87j67j91K43k94J17
2246a01J21o7j45K83j11k15L65j21j29J89o9q1J66kj76K3J76J7j82N5p4L8K00
2269A60j37j23L24l47N9L58j67l29K50Nk24K42j94j05K98j7j91J94M0m45L36K88
2291B75l98K50Rj87n9M00k36k12K09r7J47NK6k50rj8K77j07K9j09K9J87l04J55
2315A2l1o6R3J2M9j85K15m2q9K35k91J98k5k00J45K36k69l4K13k85q2K18O1l93
2339c05L59n8k82K84J07k75P0J05m9J37R4k21J02J05j47o9M5L8r8J55j33J1J32
$$ plain form
2176 170 -59 -4 214 -93 -49 66 -114 -165 143 -45 -128 161 51 -188 166 69 -258 -63 67 -163 97 -16
2198 -16 -112 -141 164 59 -98 108 66 -63 85 62 74 111 17 7 6 -60 -123 -49 -135 -200 200 -6 -186 -68 15 -374
2224 -374 25 95 -62 -23 195 -147 -34 243 -195 43 338 -71 -14 168 -95 -96 191 24 -167 76 -218 -101
2246 -101 20 -47 -192 91 -20 -235 130 9 -120 69 0 -81 85 83 -93 -70 106 123 -59 -4 -78 -40 160
2269 160 23 -100 224 -123 -64 294 127 -202 48 53 -171 71 -123 -228 70 53 -138 56 96 -349 -13 275
2291 275 -123 127 136 -51 -110 290 54 -158 51 -46 101 106 132 -118 -127 -145 132 25 54 -55 -26 161 -143 12
2315 12 -19 -85 8 20 69 -116 99 57 -32 203 -88 110 85 -115 30 266 -3 -37 176 -109 -191 27 88 -305
2339 -305 54 -4 -286 -2 105 -170 -100 5 -44 93 187 -34 68 173 26 -43 2 40 -58 97 -36 -25 107
2362A07j45J34O7j64m4K03p3l23L46j15j44K23j55j58J88N1j97K62J44k86j62
2383b41M12k64J83M8o0j2j41M0J1J91o9r8J12K7j64P9M5l03K89q5k81J96J26n1
2407a0n1J7m9J57Pk10J32J17j28J26r4j56J21K40k02j35K71j69k7J06M5p0mo6
2431c2q9J21J27k92R8J66j90J2J41o7p6J58k09J31N5N5k51K68k53N5J90r9j97
2454a78M06k97N0J20q4j17K05J05m21J73K21k64j70K82j40J2J00mj69K36p9O1
2476D8R0r2L1K32l08PO4j24N8P9R1j87l4P2p3L4m2K6J12r9j19J19k3mJ15n5j87
2503a69J07RQ7j26J77r6J47J9p7k17K09j34j56N12l66N1L4L2l4J18p9k29K08J41
2527A68k57J92m9o9pL3M8m7o0J6J5K9j22rJ41m5O2m3J40j65N7L7j69kQ3N4j14
$$ plain form
2362 107 -38 96 163 -1 -45 158 85 -238 108 -7 -151 72 -83 -241 -53 -2 -199 63 207 -79 -241
2383 -241 171 -93 90 138 78 66 -75 -35 -24 167 98 0 112 139 -25 54 99 -204 85 0 -281 -85 41 -10
2407 -10 -61 -44 -93 64 71 -139 -7 110 -18 108 14 -142 -21 219 17 -118 153 -16 -43 63 108 38 34 -32
2431 -32 -121 0 127 -165 -67 99 -91 -79 62 -5 -81 77 -132 -1 54 109 -142 126 -127 -72 118 19 -178
2454 -178 228 -69 -19 101 17 -100 105 210 -211 -38 183 -81 -251 31 -109 -97 3 -1 -170 66 -13 48
2476 48 138 46 77 309 1 8 72 -52 6 85 176 -11 -45 27 -46 -12 -54 -28 84 -15 -134 -15 -38 -42 73 18 -169
2503 -169 -62 -53 34 -92 85 -11 136 155 78 -139 70 -64 -220 292 -74 -23 11 43 9 127 48 -181 27 168
2527 168 -89 103 54 -15 -22 11 59 12 -48 -32 -17 12 -110 -119 22 -23 39 -4 136 -29 28 65 -104 -106 -23 31 -83
2554h3J57j24R7L6k74J48J3r0p5K43j01O7J16k25q4K22K1r9J73p8%o4J99k17K6
2579DO6O4o6Lk07K07J29l57J93N6k45J0K67j97J05N8j41l6J03p9Q3J4N2j52J9
2604d7J40l9J0L3k27K50j22m6J88l5o7l3mk9l8K64k06m9K16k22j20J77o5m9Q3
2629c7j7j2J02o4m0oJ98j85J04J57j87j28J26J05k04J43m1n1P4J1M8p7j54NJ30
2654@kj61K09Kj93K22j82P4j3n0O7R5j29p6J71K2kj86R9J40j71J46k3l8j22J62
2680F1j41Q0l3j66P4N6J27L7k33J22L7Ml3J69k03k7L6k2J61p4J33k00J40j24q7
2705a06n3K99k42k1J22j81K80p0pqok7k6L9l7k11L60j78K0J85j78J06j07J47j08
2730hK05k36O3n8P5J3r0K24k56Mm1M0O9j9j41L3N5p5J50r4m3M9J90j79J64J22
$$ plain form
2554 -83 74 -50 47 83 -191 -43 -30 -120 -195 48 -53 14 130 -95 -179 43 64 -35 138 60 60 -4 195 -22 4
2579 4 70 134 68 71 -136 71 200 -157 36 92 -153 -143 124 -73 32 90 -51 -87 16 -63 20 34 86 -66 -47
2604 -47 93 54 64 97 -130 120 -2 -48 140 105 38 5 1 -28 -66 198 -8 -57 159 -63 -183 -6 -71 -120 -37
2629 -37 -54 -66 36 -28 -68 -74 124 -61 43 200 13 -115 11 116 -88 55 14 -37 37 48 96 19 -135 -130 0
2654 0 -2 -163 46 48 -145 77 -105 -31 -44 -94 -27 68 -61 -137 34 56 54 -132 -33 107 -64 82 59 21 -101 61
2680 61 -80 0 -33 -199 -125 -69 58 95 -138 -16 21 25 -8 161 -42 -69 -33 -55 106 32 165 -35 105 -19 -106
2705 -106 -159 140 -102 -123 -1 -182 98 28 21 13 7 -20 -46 -7 -44 -255 105 -73 -53 132 -46 60 -47 100 -8
2730 -8 197 -39 24 -34 41 54 -36 188 -68 -64 -105 -65 4 -15 -156 -123 -68 -143 7 -87 -130 -81 109 -70 94 216
2756B16j79m5K8j46K01J8K39m79J70J77k22K91l42m0M2K58l06L2J56k4q2n5J57
2779F5k49J61R4j46JJ03j4l9O8l09M63r3j81j3L07j35q5K15j49j47Q5m5LP0j91
2804a61J51q6J13k7j01R8l8%J80j79%J85l61K65j79J08K2M8N6o4r2O7N8r9pL15
2830B72j74On9M9n4l4p9N3k7R8j25P6k3J35l3Q1j39m3J93j10J17k37J00j57L62
2855B48k02J34j51Q0k54M0J99J54k27RK3rk5r4J7J22j11k6N8p3j1J17j9l7l8P8
2881Bj89J86J31q0m5O4M4j96Q0Pj14K16m2N0l9p4J03j11ppJ7J10l19J51J03j26
2907h5J18j02N0j09L25j78K6K10j68j0j1j48O8O6j14oJ64o1j41J63p2N7Q0j05
2931A7o3J2Q3j03J46M9l26O2K52j79j23J09l0J65p7N0j50J99Mk2O2j26J48j30
$$ plain form
2756 216 37 -8 20 -126 75 93 332 -147 23 200 -22 269 -73 -113 -71 187 -119 -87 69 45 -37 -92 65
2779 65 -184 -23 71 -75 -74 29 15 -24 44 -265 198 105 -76 -89 218 83 -2 213 64 -83 2 -43 -40 30 -161
2804 -161 -10 -96 17 -10 -111 -13 -51 -51 129 -50 -50 135 -226 39 -140 -32 -10 38 94 30 -62 5 63 -36 -43 272
2830 272 98 104 45 94 40 6 -73 -20 -47 51 -74 2 -21 114 81 162 23 -20 173 63 180 -57 43 -114 248
2855 248 46 180 29 109 -145 -105 94 248 21 30 53 44 19 -75 -58 64 -47 -73 -15 -88 -99 18 -1 -38 -76 2
2881 2 -187 -1 130 50 5 69 113 -83 -3 4 -110 106 64 114 75 1 104 -7 -14 -21 -4 106 -213 -62 41 -85
2907 -85 33 -69 -19 -128 197 19 45 255 87 77 66 -82 -14 52 -62 -68 96 35 -106 57 -15 42 122 17
2931 17 -46 -34 49 -54 92 141 -185 -123 129 -50 -173 -64 -94 71 -6 44 -106 93 97 75 137 11 159 29
2955B9k9p1J51L0j09Q5k3K3m9M1n2J09o7j09m1J63J62l73J38nJ15K7k33J45k34
2980a77K81q0j43R3n4J03PL5M1J1M2j54j04M8j9J86k21O6m3RN4J59r6q6m5P9Q9
3007H1O3m4j12R2o3j1J41q3j9Rj42K11j80J9O0n9rK07p5o7NJ15k05K9J24j61K7
3034d7J28j38J68l2m4r9K11k40K06J3k64J36J9J00m5r9j1M4K3n5J36j83J35o9
3058gK5O9pj7k2j14L3R2p3N7J9l1p8nr0J70N6k4n6R8j51Q8n2N4J36j63j15J08
3086@j11L5Q7O4k5K0j32K37l01J03j58J76q6K4J37j9j47J94n0o8L8q0M7l5M0j37
3112a47K63rj40J7J16l72K35J45k27K20q0r5J08j1N6J11m4n8j80K08k71J37lO5
3136D4j11K55K5K5j98o8J46r3k4j21MJ6J92j34J28k56J46k2O4m2J5n5R8j95K55
$$ plain form
2955 29 0 -71 80 110 1 86 63 86 37 78 26 135 68 -41 -82 81 243 -130 8 3 118 145 -88 57 -177
2980 -177 104 24 -119 -26 -80 23 30 65 106 117 159 5 -99 -51 -70 116 -105 -39 -82 -73 -19 140 44 -42 -87 -8 81
3007 81 144 100 -12 80 17 6 147 64 45 54 -88 123 -57 -38 22 -37 -46 161 86 19 24 139 -66 -37 87 -74 -47
3034 -47 81 -57 111 79 35 -64 147 -93 113 126 -138 -2 17 117 72 -27 -38 6 29 -26 110 -73 62 -7
3058 -7 18 87 80 63 41 -73 -40 52 -21 36 55 24 -54 -59 -149 21 77 53 -3 95 -56 32 -20 34 170 7 -108 0
3086 0 -111 -76 11 75 50 70 -62 175 -126 -23 -181 -5 -91 -67 70 51 -96 98 48 -20 18 -62 -15 -50 -10 -147
3112 -147 116 107 -33 -16 100 -272 -37 108 -119 101 21 -74 34 23 79 190 146 88 -92 116 -155 -18 -21 44
3136 44 -67 188 213 238 40 -28 118 25 1 -120 -116 -100 92 -42 86 -170 -24 -46 18 -24 -9 -64 34 -161 94
3161I4k16RK49j52M1J9Qj75K64j8j14J2J39j34q0J1J1J16l3r4N7o3q7L84j8l60
3187a30K8J34M9j65M6P0R0q2r9K26j33L5J31j71j01K89k85r3J80N0k06K11r3l0
3211d9M1lK3M8M9j30r2J15Jj74L37k5k71J21N0N6m7K2j99J95k2j25J39m6n7N6
3237A3K0n6K9J31k03Q8Q3j09KQ1j13%j08N8N5N5j3j0J16j03N7jk6j02K1M8n7J52
3265A08j34K15k43J11j25N2K2m6J18k84J33J12L4o0j06J19j43R6O8n1k6J24J06
3288B00k88J81r7J58j98J19l6j63J18k6N6%o8J09k8l3JP9P6r1p1j18J17j10o4
3313a77J83j75K22kL5n9q1m1J66o9n5J16k4P3j23l1M7k00P2J00j5Q0k4O0j40j97
3339b59J10K52r6O3r1l3M7M1n7j25K34j00P8N5l8o0p3J28Nm2j18l7L0O3O4n9j62
$$ plain form
3161 94 -122 -113 136 -16 25 44 52 -123 141 123 9 21 160 26 -54 -43 -32 84 51 -43 14 -49 -136 248 230 -130
3187 -130 -102 32 81 -84 -38 32 122 40 -59 167 34 69 200 29 -72 217 -68 -161 19 69 -137 74 -19 -49
3211 -49 -8 -11 12 60 109 -21 -113 2 3 -171 166 141 -130 -9 41 97 50 72 -127 68 46 -79 60 14 -43 13
3237 13 33 -23 6 137 -66 22 105 -4 -2 79 -34 -34 -142 -84 -29 26 13 3 119 16 73 72 46 -56 -35 13 -44 108
3265 108 -26 189 -54 57 -68 -16 6 -40 78 -206 -73 39 73 13 -93 26 -117 -21 47 -4 -30 94 200
3288 200 -88 93 -4 154 -44 75 39 -124 -6 -32 24 24 -44 65 37 4 5 84 160 69 -2 -120 -3 -113 -177
3313 -177 6 -169 53 51 86 27 -54 -95 71 2 -53 63 39 112 -11 -42 5 -195 -123 -23 -38 42 18 78 -62 -259
3339 -259 -149 103 7 70 -21 -54 -7 34 -23 -148 86 -14 64 119 81 21 -52 76 81 39 -79 -116 -86 -23 41 -18 -180
3366a80P3J99p0J07l11M2J8K22j27o1J41j80J73J7n7j85J28PJ49n6o4K35k63l1
3390g4O4O6j78K38j47J09J7r0P9j74j5O7Q5j92K54j30k8O7j03R7%l7j49K50n6
3415B0p1N5J51k88P6K18k15K5K04r3p6P0o0j7P5j29J5K06r6j23N6J23l13K74k5
3440F2j08L9P4J5J15j90L9j0k7J19Lk15J61n8l1O2j18J39k0Q6j07R3q9k01J03
3465f4P9q5J02q6O2NJ14l04K56r9k9M2p4J23r4J8k3Q1j80J94o1L0r0L7J15o2k8
3492b1K4Q4p0m2J9k1p0n3J93n2J19j51Q9j06J44j70n3N5O9J34j37J77j35PJ67
3517B00k29J93n1j42J8J7Oj74K94j23k2j3P8j12j2J38Kj50R2m4J09l5Q9p3O3j79
3543f0m0J09J18j53m5Q7J08n1n7q8l8K12k35O9J49o0q1J02m3PO2j13lP0q1J28
$$ plain form
3366 -180 -107 92 22 129 -182 -140 -122 100 -27 -88 53 -127 46 63 6 -179 -51 -44 105 49 -15 220 -43 -74
3390 -74 -10 56 -122 116 -31 78 95 5 84 -90 -105 -38 47 -145 109 -21 -49 18 -85 12 12 -25 -174 76 20
3415 20 -51 4 155 -133 -57 161 -54 -29 175 82 6 76 16 -1 74 -55 -40 166 70 -53 3 126 -187 87 62
3440 62 -46 -7 67 82 197 7 46 36 9 128 131 -84 77 19 -12 50 -68 71 51 137 30 123 34 -167 -64
3465 -64 15 -70 32 -54 8 13 127 -177 79 -20 -49 -7 -81 42 -52 -34 -57 24 -156 38 -23 7 -83 -46 69 7 -21
3492 -21 3 87 17 -25 -6 -27 -97 -150 43 -9 110 -41 48 -58 86 -84 -137 -82 -13 121 -16 161 26 33 200
3517 200 -29 164 113 -29 -11 6 12 -162 132 9 -13 -26 52 -60 -72 66 68 -82 10 -34 75 40 129 56 119 -60
3543 -60 -100 9 127 -26 -71 16 124 73 16 -72 -110 102 -133 -64 85 25 -56 46 3 10 72 -41 -44 26 -55 73
3569G3j52J8R0j7O0j75K73q2j16J28m5J9k19J23M2K2n4j25j3P8RR1L5q8N0j00
3595g5NN0L6k34K52J00j60O9J86j97J08k14lP7N9K1j11P8l8J32k23m2K31q5o1
3620c9J02L4M4j18L7k94K19k5p0O5k2N8k4J47o3k7M3j7k7l4K6j11J96r2jj68J79
3647A8O0j9N9K7Mj83J47j88Q0K9K9J9r1J9R0r9r4J25j72K12k27K19r9J31jj98
3673a03J64Pj76J92J05q8j66J62n1O0rj00Q3j55J80j69O3l1Q6j14j2R7j3P1m9
3698C4r9J46K5j66R2N0R0l17Q1o3J20K29l32J49j32J2OJ13j64J09Kj38j9J31K6
3723a5l3qJ95k93J56N2JM5p0p5Nj1J08k07K14RL1m9j79L44k24P5j05oj09P9OQ0
$$ plain form
3569 73 -79 -61 29 12 72 -103 170 88 -28 100 55 74 -145 -22 20 42 -12 -137 -150 -72 -63 28 63 -25 25 -75
3595 -75 -70 -20 16 -218 34 134 -26 43 229 32 140 -74 -77 0 59 80 -31 47 9 141 -82 -124 107 22 -39
3620 -39 63 97 141 23 60 -234 -15 -40 -110 -45 -67 -9 -33 114 51 24 67 50 23 -11 15 -96 100 8 7 -161 18
3647 18 78 59 118 145 149 -34 113 -75 5 34 63 82 -9 10 100 1 -93 32 -140 72 -155 64 -35 96 95 -103
3673 -103 61 68 -108 84 189 101 -65 97 46 106 97 -3 80 -75 105 -64 -1 -32 54 -60 -72 25 12 83 34
3698 34 -65 81 106 -60 32 82 172 -145 -64 -127 -7 222 -110 39 -93 -81 -75 38 -126 -17 -15 -153 -172 -41 -15
3723 -15 -48 -56 139 -154 2 54 55 100 30 -45 -40 -51 57 -150 64 73 104 55 -124 220 -4 71 -34 -40 -149 -70 -64 16
$$ [...]
8191g1
##END NTUPLES=NMR FID
##END=
