##TITLE=1H_Pr Bzt
 CDCl3
 8 sc, 
 25.08.2022
##JCAMPDX= 6.0         $$ Bruker NMR JCAMP-DX V2.0
##DATA TYPE= NMR FID
##DATA CLASS= NTUPLES
##ORIGIN= UXNMR, Bruker Analytische Messtechnik GmbH
##OWNER= root
$$ XWIN-NMR		Version 3.5
$$ Thu Aug 25 09:43:30 2022 Russian Standard Time (UT+4h)  she@DPX200
##.OBSERVE FREQUENCY= 200.1313499994
##.OBSERVE NUCLEUS= ^1H
##.DELAY= (6, 6)
##.ACQUISITION MODE= SIMULTANEOUS
##.ACQUISITION SCHEME= undefined
##.AVERAGES= 8
##.DIGITISER RES= 18
##SPECTROMETER/DATA SYSTEM= spect
##.PULSE SEQUENCE= zg30
##.SOLVENT NAME= CDCl3
##.SHIFT REFERENCE= (INTERNAL, CDCl3, 0, 15.7039)
##AUDIT TRAIL= $$ (NUMBER, WHEN, WHO, WHERE, WHAT)
$$ ##TITLE= Audit trail, XWIN-NMR		Version 3.5
$$ ##JCAMPDX= 5.01
$$ ##ORIGIN= Bruker BioSpin GmbH
$$ ##OWNER= she
$$ F:/spectra/data/she/nmr/H-F/1/audita.txt
$$ ##AUDIT TRAIL=  $$ (NUMBER, WHEN, WHO, WHERE, WHAT)
(   1,<2022-08-25 09:41:38.35 +0400>,<she>,<DPX200>,
      <created by zg, POWCHK disabled, PULCHK disabled
       configuration hash MD5:
       00 E9 B6 7A A2 85 ED C7 34 08 36 98 17 FE 4E 26
       data hash MD5: 16K
       4A 39 49 32 65 00 94 32 AA 48 77 D4 8D 43 33 28>)
$$ ##END=
$$ 
$$ hash MD5
$$ 17 86 08 50 1C D1 D5 EC A2 15 D1 16 4A C1 AE 3F
##$RELAX= 
##$RELAX= 
##$RELAX= 
##$RELAX= 
##$RELAX= 
##$RELAX= 
$$ Bruker specific parameters
$$ --------------------------
##$DU= <F:/spectra>
##$EXPNO= 1
##$NAME= <H-F>
##$PROCNO= 1
##$TYPE= <nmr>
##$USER= <she>
##$AMP= (0..31)
100 100 100 100 100 100 100 100 100 100 100 100 100 100 100 100 100 100 
100 100 100 100 100 100 100 100 100 100 100 100 100 100 
##$AQSEQ= 0
##$AQ_mod= 1
##$AUNM= <au_zg>
##$AUTOPOS= <>
##$BF1= 200.13
##$BF2= 200.13
##$BF3= 200.13
##$BF4= 200.13
##$BF5= 200.13
##$BF6= 200.13
##$BF7= 200.13
##$BF8= 200.13
##$BYTORDA= 1
##$CFDGTYP= 0
##$CFRGTYP= 5
##$CHEMSTR= <none>
##$CNST= (0..31)
1 1 145 1 1 1 1 1 1 1 1 1 1 1 1 1 1 1 1 1 1 1 1 1 1 1 1 1 1 1 1 1 
##$CPDPRG= <>
##$CPDPRG1= <>
##$CPDPRG2= <>
##$CPDPRG3= <>
##$CPDPRG4= <mlev>
##$CPDPRG5= <mlev>
##$CPDPRG6= <mlev>
##$CPDPRG7= <mlev>
##$CPDPRG8= <mlev>
##$CPDPRGB= <>
##$CPDPRGT= <>
##$D= (0..31)
0 1.2 0 0 0 0 0 0 0 0.06 0 0.03 0 0 0 0 0.0002 0 0 0 0 0 0 0 0 0 0 0 0 
0 0 0 
##$DATE= 1661406097
##$DBL= (0..7)
120 120 120 120 120 120 120 120 
##$DBP= (0..7)
150 150 150 150 150 150 150 150 
##$DBP07= 0
##$DBPNAM0= <>
##$DBPNAM1= <>
##$DBPNAM2= <>
##$DBPNAM3= <>
##$DBPNAM4= <>
##$DBPNAM5= <>
##$DBPNAM6= <>
##$DBPNAM7= <>
##$DBPOAL= (0..7)
0.5 0.5 0.5 0.5 0.5 0.5 0.5 0.5 
##$DBPOFFS= (0..7)
0 0 0 0 0 0 0 0 
##$DE= 6
##$DECBNUC= <off>
##$DECIM= 32
##$DECNUC= <off>
##$DECSTAT= 4
##$DIGMOD= 1
##$DIGTYP= 9
##$DL= (0..7)
0 120 120 120 120 120 120 120 
##$DP= (0..7)
150 150 150 150 150 150 150 150 
##$DP07= 0
##$DPNAME0= <>
##$DPNAME1= <>
##$DPNAME2= <>
##$DPNAME3= <>
##$DPNAME4= <>
##$DPNAME5= <>
##$DPNAME6= <>
##$DPNAME7= <>
##$DPOAL= (0..7)
0.5 0.5 0.5 0.5 0.5 0.5 0.5 0.5 
##$DPOFFS= (0..7)
0 0 0 0 0 0 0 0 
##$DQDMODE= 0
##$DR= 18
##$DS= 0
##$DSLIST= <SSSSSSSSSSSSSSS>
$$ [...]
##$SUBNAM2= <"">
##$SUBNAM3= <"">
##$SUBNAM4= <"">
##$SUBNAM5= <"">
##$SUBNAM6= <"">
##$SUBNAM7= <"">
##$SUBNAM8= <"">
##$SUBNAM9= <"">
##$SW= 18.0517283424941
##$SWIBOX= (0..15)
0 0 2 0 0 0 0 0 0 0 0 0 0 0 0 0 
##$SW_h= 3612.71676300578
##$TD= 16384
##$TD0= 1
##$TE= 0
##$TE2= 300
##$TE3= 300
##$TEG= 300
##$TL= (0..7)
0 120 120 120 120 120 120 120 
##$TP= (0..7)
150 150 150 150 150 150 150 150 
##$TP07= 0
##$TPNAME0= <>
##$TPNAME1= <>
##$TPNAME2= <>
##$TPNAME3= <>
##$TPNAME4= <>
##$TPNAME5= <>
##$TPNAME6= <>
##$TPNAME7= <>
##$TPOAL= (0..7)
0.5 0.5 0.5 0.5 0.5 0.5 0.5 0.5 
##$TPOFFS= (0..7)
0 0 0 0 0 0 0 0 
##$TUNHIN= 0
##$TUNHOUT= 0
##$TUNXOUT= 0
##$USERA1= <user>
##$USERA2= <user>
##$USERA3= <user>
##$USERA4= <user>
##$USERA5= <user>
##$V9= 5
##$VALIST= <valist>
##$VCLIST= <CCCCCCCCCCCCCCC>
##$VD= 0
##$VDLIST= <DDDDDDDDDDDDDDD>
##$VPLIST= <PPPPPPPPPPPPPPP>
##$VTLIST= <TTTTTTTTTTTTTTT>
##$WBST= 1024
##$WBSW= 4
##$XGAIN= (0..3)
0 0 0 0 
##$XL= 0
##$YL= 0
##$YMAX_a= 453060
##$YMIN_a= -209679
##$ZGOPTNS= <>
##$ZL1= 120
##$ZL2= 120
##$ZL3= 120
##$ZL4= 120
##$ABSF1= 10
##$ABSF2= 0
##$ABSG= 5
##$ABSL= 3
##$ALPHA= 0
##$AQORDER= 0
##$ASSFAC= 0
##$ASSFACI= 0
##$ASSFACX= 0
##$ASSWID= 0
##$AUNMP= <proc_1d>
##$AZFE= 0.1
##$AZFW= 0.1
##$BCFW= 1
##$BC_mod= 2
##$BYTORDP= 1
##$COROFFS= 0
##$CY= 11.3945322036743
##$DATMOD= 1
##$DC= 2
##$DFILT= <>
##$DTYPP= 0
##$F1P= 2.36226072786647
##$F2P= -0.459571619588291
##$FCOR= 0.5
##$FTSIZE= 0
##$FT_mod= 4
##$GAMMA= 1
##$GB= 0.15
##$INTBC= 1
##$INTSCL= 1
##$ISEN= 128
##$LB= 0.24
##$LEV0= 0
##$LPBIN= 0
##$MAXI= 10000
##$MC2= 0
##$MEAN= 0
##$ME_mod= 0
##$MI= 1.114404
##$NCOEF= 0
##$NC_proc= 0
##$NLEV= 6
##$NOISF1= 3.799351
##$NOISF2= 2.8
##$NSP= 1
##$NTH_PI= 0
##$NZP= 0
##$OFFSET= 15.70392
##$PC= 1
##$PHC0= -18036.1
##$PHC1= 9.80069
##$PH_mod= 1
##$PKNL= yes
##$PPARMOD= 0
##$PSCAL= 0
##$PSIGN= 0
##$REVERSE= no
##$SF= 200.130013532006
##$SI= 16384
##$SIGF1= 3
##$SIGF2= 2
##$SINO= 400
##$SIOLD= 16384
##$SREGLST= <1H.CDCl3>
##$SSB= 0
##$STSI= 0
##$STSR= 0
##$SW_p= 3612.71676300578
##$SYMM= 0
##$S_DEV= 0
##$TDeff= 0
##$TDoff= 0
##$TI= <>
##$TILT= no
##$TM1= 0
##$TM2= 0
##$TOPLEV= 0
##$USERP1= <user>
##$USERP2= <user>
##$USERP3= <user>
##$USERP4= <user>
##$USERP5= <user>
##$WDW= 1
##$XDIM= 8192
##$YMAX_p= 0
##$YMIN_p= 0
$$ End of Bruker specific parameters
$$ ---------------------------------
##NTUPLES= NMR FID
##VAR_NAME=  TIME,          FID/REAL,        FID/IMAG
##SYMBOL=    X,             R,               I
##VAR_TYPE=  INDEPENDENT,   DEPENDENT,       DEPENDENT
##VAR_FORM=  AFFN,          ASDF,            ASDF
##VAR_DIM=   8192,          8192,            8192
##UNITS=     SECONDS,       ARBITRARY UNITS, ARBITRARY UNITS
##FACTOR=    0.0002768,     1,               1
##FIRST=     0,             0,               0
##LAST=      2.2672688,     0,               0
##MIN=       0,             -209679,         0
##MAX=       2.2672688,     453060,          0
$$ Real data points
##PAGE= N=1
##DATA TABLE= (X++(R..R)), XYDATA
$$ [...]
2055F4j177J570K5k217N92J802j094o68K016J74j724J34J257j132j114J745J174
$$ 64 -1113 457 482 -1735 -1143 659 -435 -1103 913 1087 -637 -503 754 -378 -1492 253 1427
2072A427j950N36K115j202j889J045R90k324LK266m38j268J437O16k046q77J546
$$ 1427 -523 13 2128 926 -963 82 1072 -1252 -1249 1017 579 -689 748 1364 -682 -1559 -13
2089a3n7j658J487J708j218q97J398n83k166R41J561j344j58L013K26j960N58
$$ -13 -70 -1728 -241 1467 249 -648 750 167 -1999 -1058 503 -841 -999 2014 2240 280 838
2106H38R86j791j438J550N65j917P80J932j260j774J188K53j957L11K441l70q52
$$ 838 1824 33 -1405 145 710 -1207 -427 1505 245 -1529 -341 -88 -2045 -1734 707 337 -515
2123e15J492J125k053n54J546j002j556J361J245j785l71J728m77j941R70J502
$$ -515 977 2102 49 -505 1041 39 -1517 -156 1089 -696 -1067 661 184 -1757 -787 715
2139G15p49k62K503J43j673M28R79k020j494J090rj438N70J887j177q38J046K97
$$ 715 -34 -296 2207 2350 677 1105 2084 64 -1430 -340 -349 -1787 -1217 670 -507 -1345 -299 -2
2157bj686O12J546m84l72J540R67j583k12J127j157j194R19P66j060j7J330j021
$$ -2 -1688 -1076 470 -14 -386 1154 2121 538 326 1453 296 -898 21 787 -273 -290 1040 19
2175A9j082K81R45j509n8J950M8n75L79J206j496r36R28j35j157K10J812q12r53
$$ 19 -1063 -782 163 -1346 -1404 546 594 19 398 1604 108 -828 100 -35 -1192 -982 830 18 -935
2194i35J093J66q62M03J424j94p01R81J5j398q42N90j006q11O85O73j06L76J549
$$ -935 158 324 -538 -135 1289 1095 394 1375 1390 -8 -850 -260 -1266 -2077 -1392 -719 -825 -449 1100
2213A100K7o26N09L97j241o11P83m42q24L37N07p09K7Q09M86n73O53P57o77n74
$$ 1100 1127 501 1010 1407 166 -445 338 -104 -928 -591 -84 -793 -766 43 529 -44 609 1366 689 115
2233A15M72l48j154Q4L41l79J33O30O80l13K27M82k09n90K99K01o79l42L77o3
$$ 115 587 239 -915 -831 -490 -869 -736 -106 574 261 488 970 761 171 470 671 -8 -350 27 -36
2253c6o62M27M73n35o5O25j16o46J49J77o83n41L78J39J75P20J044N43L29K50
$$ -36 -698 -271 202 -333 -398 227 111 -535 -386 -209 -892 -1433 -1055 -916 -741 -21 1023 1566 1895 2145
2273B145N09p70n50m49r84j480n0n02l18M56N73N03N0Q16O06L23j09L23n07l74
$$ 2145 2654 1884 1334 885 -99 -1579 -1629 -2131 -2449 -1993 -1420 -917 -867 -51 555 878 769 1092 585 211
2293B11O3k11k92j42Q1P44L14K77M43j48m50j82m49o80m28j71n52o0J60J34J71
$$ 211 274 63 -229 -371 -290 454 768 1045 1488 1340 890 708 259 -421 -849 -1020 -1572 -1632 -1472 -1338 -1167
2314a167Q05N06K99K48J50k2j51k02j09m50k19r3j7M77J59N60N90k4m04j16l45
$$ -1167 -362 144 443 691 841 819 668 466 357 -93 -312 -405 -422 55 214 774 1364 1340 936 820 475
2335D75j028m75m95m88k2O6M69O45Q64R77L07M42K99k02j44l05j128m44o13l50
$$ 475 -553 -1028 -1523 -2011 -2033 -1967 -1498 -853 11 988 1295 1737 2036 1834 1690 1385 257 -187 -800 -1150
2355a150o3K67j02O13K73J70M08k07jl6k12k95k77K25q7Q7O05L07K54J94M23l62
$$ -1150 -1213 -946 -1048 -435 -162 8 416 209 208 172 -40 -335 -612 -387 -474 -387 218 525 779 973 1396 1034
2377A034K30l27n39n50o37n19m4m60M10N63K98M90M60N86J02j76N5m76o61l3k76
$$ 1034 1264 937 398 -152 -789 -1308 -1352 -1812 -1402 -839 -541 -51 409 995 1097 921 976 500 -161 -194 -470
2398d70m21K13N02K95J32R80M48j76l5r1r56o86n08m91p72k06Q16p1L98P64P59
$$ -470 -891 -678 -176 119 251 1231 1679 1503 1468 1377 421 -265 -773 -1264 -2036 -2242 -1426 -1497 -1099 -335 424
2419D24L9K35O72n1k62k52l5p55p2R1K86m05M28J18k9k06L53j32o86m02j57n80
$$ 424 463 698 1370 1319 1057 805 770 15 -57 34 320 -85 343 461 432 226 579 447 -239 -641 -798 -1378
2441a378m14N04J27m3M83R96N07p4P32O9m45q2K5o92m58j21M6o59l06R63J19l25
$$ -1378 -1792 -1288 -1161 -1204 -721 275 782 708 1440 1509 1064 982 1007 315 -143 -264 -218 -877 -1183 -220 -101 -426
2463d26O95M33l40k91M11m46j029k09L45j96%J019M49k7P6Q91q83l42M61j52j046
$$ -426 269 702 362 71 482 36 -993 -1202 -857 -1053 -1053 -34 415 388 464 1355 472 130 591 439 -607
2484f07j2O61l38n34M57M65o86L31J346m87l71K89L65j231l49P04o72m16P28Q51
$$ -607 -619 42 -296 -830 -373 92 -594 -263 1083 596 225 514 879 -352 -701 3 -669 -1085 -357 494
2504D94k10l63J367l54o14j52M35p83o30N12K48j119K98L34j68n46J149L60m57
$$ 494 284 -79 1288 934 320 168 603 -180 -810 -298 -50 -1169 -871 -537 -705 -1251 -102 258 -199
2523a99Q30R02j24p09N01r8j252n10O94p38m82Q67P59q95j86R92m35r03M83R24
$$ -199 631 1533 1409 700 1201 1103 -149 -659 35 -703 -1185 -318 441 -454 -640 352 -83 -986 -503 421
2543D21p62K38O39J9p15J89M20q20k59Q38L27p40J81P04p53q50R49K59o27O6J542
$$ 421 -341 -103 536 555 -160 29 449 -371 -630 208 535 -205 -24 680 -73 -923 26 285 -342 -276 1266
2564A266m64o52N41q5j107n59Q32m20o58J133P34p79r3K77j8j091P29R98n95P9
$$ 1266 802 150 691 606 -501 -1060 -228 -648 -1306 -173 561 -218 -311 -34 -52 -1143 -414 584 -11 68
2584F8J127j62q31K23M48q84q53P98K66o07P02Q41q76l34K01J42j167m9Q61l61
$$ 68 1195 1033 202 425 873 -11 -864 -66 200 -407 295 1136 260 -74 127 269 -898 -947 -86 -447
2604d47n29Q59M88p99j93J046l36n56R83M02j09m53R28m23j415J77O59p66k42
$$ -447 -976 -117 371 -428 -621 425 89 -467 516 918 809 356 1284 861 -554 -377 282 -484 -726
2623g26P01J31q27M75N62o26m97R61P00m97N36Q04n77j340K72m43j479j57J324
$$ -726 -25 106 -721 -246 316 -310 -807 154 854 357 893 1697 1120 -220 52 -391 -1870 -2027 -703
2642g03P0o58J298R12p02J28O61j27p24Q06M13j052l31Q95n42j173k8N29o25m86
$$ -703 -633 -1291 7 919 217 345 1006 879 155 961 1374 322 -9 886 344 -829 -857 -328 -953 -1439
2662a439J163K40m47J47R86n35l72J015J27q43M41O82o76o34K95r6q49k05O81
$$ -1439 -276 -36 -483 -336 650 115 -257 758 885 42 483 1165 489 -145 150 54 -795 -1000 -319
2681c19k23l86R94J07l79QO22K44q27N87P91p14j1N19n88r41Rj09r36j21R95J88
$$ -319 -542 -928 66 173 -206 -198 424 668 -159 428 1219 505 494 1013 425 -516 -507 -616 -1552 -1673 -678 -490
2703d90J35N01J013m80n31O93l17n73l28N69m50r12R81M65o79J90Q70j75q6M12
$$ -490 -355 146 1159 679 148 841 524 -49 -377 192 -258 -1170 -189 276 -403 -213 657 482 396 808
2723H08K18o56k19J28l57n43K98J50l79J22L74K8k35K08K22n59J9L88K12k92O7
$$ 808 1026 370 151 279 -78 -621 -323 -173 -552 -430 -56 -28 -263 -55 167 -392 -373 15 227 -65 2
2744BK35k75p4J48J56k65K80P27k77k03K48j69l78j88Jk82l08L79J87k29j18M34
$$ 2 237 -38 -112 36 192 -73 207 934 657 454 702 533 155 -33 -32 -314 -622 -243 -56 -285 -403 31
2766C1k75M0m2K5l69J92L79k9Q7L15O20k97P9K31j68r8k92J0m07m86k08j49l93
$$ 31 -244 -204 -246 -221 -590 -398 -19 -48 39 354 974 677 756 987 819 721 429 439 32 -454 -662 -811 -1204
2789a204P3L74N7N79M74M63j24jK4m25L9k50n03J44k3pR5ML48j45K47j03N6k03
$$ -1204 -1131 -757 -700 -121 353 816 692 691 715 290 329 79 -424 -280 -303 -310 -215 -211 137 -8 239 136 192 -11
2813a1l14J37l8k3N8Q4K87j75M16J18l74J66l24J5J0k64m3R4j63R6Q9J03j96R0
$$ -11 -325 -188 -226 -249 -191 -107 180 5 421 539 165 331 7 22 32 -232 -275 -181 -344 -248 -159 -56 -252 -162
2837a62n4J02j78N47j40K13j45k92jp5R9Mr9P0J77M55O8o1K50m15m00J19j70m24
$$ -162 -216 -114 -292 255 115 328 183 -109 -110 -185 -86 -82 -181 -111 66 521 589 528 778 363 -37 82 -88 -512
2861e12k87j35K77nK04K16K25J43J65K26l56Q4o4k76J80l3q2K92nJ23L12p2l25
$$ -512 -799 -934 -657 -662 -458 -242 -17 126 291 517 161 245 181 -95 85 52 -30 262 257 380 692 620 295
2884B95k07K13m27j77L3l06M6j52M95lJ4J19M15k04k60K12n1l31K47q6qK55l21
$$ 295 88 301 -126 -303 -270 -576 -530 -682 -187 -190 -176 -57 358 154 -106 106 55 -276 -29 -115 -123 132 -189
2907a89M37k28J85q1P3P3o2Q4k21P7j89J62l99j71M24j10m40M99j8KQ8O05m31
$$ -189 248 20 205 124 197 270 208 292 71 148 -41 121 -278 -449 -25 -135 -575 -76 -94 -92 -4 601 170
2930A70l65N69j80k09rJ0Qj57L62j11j70L44p7K23m59K45L08n40l12J90J3j76
$$ 170 -195 374 194 -15 -24 -14 -6 -163 199 88 -82 262 185 408 -51 194 502 -38 -350 -160 -147 -323
2952c23K65K7K92k79M85j72n4l03l6K14m85p6K80o26K40Q33k92J19q7K31O8k20
$$ -323 -58 -31 261 -18 467 295 241 -62 -98 116 -369 -445 -165 -791 -551 282 -10 109 22 253 321 101
2974A01K59l7k51L7M32m08n0q9Q0l97Q9K90j10k60N28R7n65K20O66l03l30M40
$$ 101 360 323 72 109 541 133 83 -6 74 -323 -234 56 -54 -314 214 311 -254 -34 632 329 -1 439
2996D39%n41j67K39l29k83q4O83n57J38J006j81k37L1L59j53l58L77o5k82K07
$$ 439 439 -102 -269 -30 -359 -642 -726 -43 -600 -462 544 363 126 157 516 363 5 382 317 35 242
3017B42L39p59r3M35l76o77R0M54o09J65P16M21l14N37N15l21l46K43J05r11K8
$$ 242 581 -178 -271 164 -212 -889 -799 -345 -954 -789 -73 348 34 571 1086 765 419 662 767 -144 -116
3038a16J9m44k49L29J26m69M52M17L60o14N66M01k26L7J95k78m54N33k31r23q6
$$ -116 -97 -541 -790 -461 -335 -804 -352 65 425 -189 377 778 552 589 784 506 52 585 354 -569 -655
3059f55J0n31n64N15P27K35M35O62J85k31K28O1p07l43K67P4q72O52K54n25l12
$$ -655 -645 -1176 -1740 -1225 -498 -263 172 834 1019 788 1016 1077 370 27 294 368 -504 148 402 -123 -435
3080d35j93P1n76K93P02l2K0Q89p8m07j11M01l64l92N81r4p2k18M28m08m85J38
$$ -435 -628 -557 -1133 -840 -138 -170 -150 739 661 254 143 544 180 -212 369 275 203 -15 413 5 -480 -342
3102c42K12P3m62P62K11m63L04J56m55r5J99o3m17J83M23l19r5J07M29l46j29
$$ -342 -130 -57 -519 243 454 -9 295 451 -4 -99 100 37 -380 -197 226 -93 -188 -81 348 2 -127
3123a27K34L26m74J91J43q53%K37k42j5M50M63J48pL66K12n91m40N72p33J5K92
$$ -127 107 433 -41 150 293 -560 -560 -323 -565 -580 -130 333 481 474 840 1052 461 21 593 -140 -125 167
3145A67l48l98Q1k18k8l90M43P5L84P29N03P8l71L07Pj025j29K85m73m91K30L90
$$ 167 -181 -579 -498 -716 -744 -1134 -691 -616 -232 497 1000 1078 707 1014 1021 -4 -133 152 -321 -812 -582 -192
3167a92o24R2N11l4k78N13N25l73M07K55J76o68L23j9k63j32j04k46n37M0q6o39
$$ -192 -816 -724 -213 -247 -525 -12 513 140 547 802 978 310 633 614 351 219 115 -131 -668 -628 -714 -1353
3189a353k8L83K66j62Q47Q62J09k53K97mj58p44J21o7k28J44J33m11q6K72k82
$$ -1353 -1381 -998 -732 -894 -47 815 924 671 968 964 806 62 183 116 -112 32 165 -246 -332 -60 -342
3210c42k67K83M5o4J05N11p8o9J12L35m36l86L14k97j53n0Q41l12mK36K66n15
$$ -342 -609 -326 -281 -345 -240 271 193 124 236 571 135 -251 63 -234 -387 -437 404 92 88 324 590 75
3232G5O4j70Lk86k44L95k94K88M96j94oK63n4m03l54J75j03p6L2N54k43n1M81
$$ 75 139 -31 -28 -314 -558 -163 -457 -169 327 133 127 390 336 -67 -421 -246 -349 -425 -393 161 -82 -133 348
3255C48j5Pm49K3m14QK19j4M2N13M28k52J23j56m84k32K7l3p9k48Q00L5k34P4
$$ 348 333 340 -109 -86 -500 -492 -273 -287 -245 268 696 444 567 411 -73 -305 -278 -311 -390 -638 162 197 -37 37
3279C7J72m7k71k44K12m18L15M1P6o9K21M72k14o6J39l10k07m4j02q2M41K32j92
$$ 37 209 162 -109 -353 -141 -559 -244 -203 -127 -196 25 497 283 217 356 46 -161 -205 -307 -389 52 284 92
3302I2L80Q4l58J14n45p1r1j25J89n8n8O16J08j97L12l08j35o1k58J29L4L59P8
$$ 92 472 556 198 312 -233 -304 -395 -520 -331 -389 -447 169 277 80 392 84 -51 -112 -370 -241 -207 152 230
3325B30K76j31k75J38j23j25k84J01k9R8J1K83j07L46p2J3k62k92L00l68J93j09
$$ 230 506 375 100 238 115 -10 -294 -193 -222 -124 -113 170 63 409 337 350 88 -204 96 -272 -79 -188
3347a88q4L43k15J10J78J10q3k17j20L7l6ok90L12J69J31m4O2N5J41r8Q5j47k5
$$ -188 -272 71 -144 -34 144 254 171 -46 -166 -129 -165 -171 -461 -149 20 151 107 169 224 365 267 352 205 180
3371A80k87O5l05k5J86k14K10l14N24J59l44J07O0j97M4J82l09K84R4j34L52k78
$$ 180 -107 -42 -347 -372 -186 -400 -190 -504 20 179 -165 -58 2 -195 -151 31 -278 6 100 -34 318 40
3393D0L53k36p7L60l06J04K00k91j12oq9m19Nr3J37k3K96k6M29j04K72J20n38
$$ 40 393 157 80 440 134 238 438 147 35 29 -60 -479 -474 -567 -430 -453 -157 -183 246 142 414 534 -4
3416dm0L1J5j86R9k4K01k89N75J60K8k57O2k41q3k57j65l07J16Q7K83L17Q2qq7
$$ -4 -44 -13 2 -184 -85 -109 92 -197 378 538 566 309 371 130 47 -210 -375 -682 -566 -479 -196 121 203 195 108
3441A08j83K20J31l75J14j94K31N6O0m3k08J06L21k60R6r6j93N4k60J31k78J67
$$ 108 -75 145 276 -99 15 -179 52 108 168 125 -83 23 344 84 180 84 -109 -55 -315 -184 -462 -295
3463b95J6P1J41J01J57l0J03J32J22j46l37%j46k37J40K4R6k43P1j33J51J88L75
$$ -295 -279 -208 -67 34 191 161 264 396 518 372 35 35 -111 -348 -208 -184 -88 -331 -260 -393 -242 -54 321
3486C21k73M68k09k25l40k84K83o1L8M33M9J68L91L67j62n58r6l77m10j68l36
$$ 321 48 516 307 82 -258 -542 -259 -320 -282 151 200 368 759 1126 964 406 310 -67 -477 -645 -981
3507i81jR6J48L11M7R7M88l77L18L36J17j10o9L02Q8m46l07L69m87j40Q0j35m76
$$ -981 -982 -886 -738 -427 -380 -283 205 -172 146 482 599 489 420 722 810 364 57 426 -61 -201 -121 -256 -732
3530g32L84K93r2o3L58l77L4L61M18m12j25N17j65k46K43r5l72o37K44j1o91M88
$$ -732 -348 -55 -147 -210 148 -229 -195 166 584 172 47 564 399 153 396 301 -71 -708 -464 -475 -1166 -678
3552f78M04J52M13M57O17l59K62o4n97q69j44j9m32l80M07K58r3M80J69l82J4
$$ -678 -274 -122 291 748 1365 1006 1268 1204 607 -262 -406 -425 -857 -1237 -830 -572 -665 -185 -16 -398 -384
3573c84M43m1j09O37O91k32j38O8l20q55l34l2n12o7N11K13K70N01L96Rn09p8
$$ -384 59 18 -91 546 1237 1005 867 935 615 -240 -574 -606 -1118 -1185 -674 -461 -191 310 706 715 206 128
3595A28k4l20L9L40J31J8J07J71k96n6k30k16l09j25k22j44M9P33L95l24P57L72
$$ 128 104 -216 -177 163 294 312 419 590 294 238 8 -208 -517 -642 -864 -1008 -959 -226 169 -155 602 974
3617I74r1m83L8l66o38k3Q2M4L01O25J64N9k0K16p78n76j07j8l75M13K64J66j01
$$ 974 883 400 438 72 -566 -589 -507 -463 -162 463 627 686 666 882 104 -472 -579 -597 -972 -559 -295 -129 -230
3640b30L28K33l81k46M77m22n6M29L22n59K02N94r3n68K9J16o48k12L20K9k26
$$ -230 98 331 -50 -296 181 -241 -297 132 454 -105 97 691 598 30 59 175 -473 -685 -365 -336 -562
3661e62M94M72J05l1N90j96p64k03k65k93l51J43N86j52N20N30L3l72J60k13l39
$$ -562 -68 404 509 478 1068 872 108 -95 -360 -653 -1004 -861 -275 -427 93 623 656 284 444 231 -108
3682a08j12K12n2J87M19M57m09j86J65n73o71l88L49l47J61M94P54l99L78M48
$$ -108 -220 -8 -60 127 546 1003 594 408 573 0 -671 -1059 -710 -1057 -896 -402 352 -47 331 779
3702G79j31l70O2j25n53K53o6Nr8K87J47l00j00j0j22k35J26L99r3q8P56j60M8
$$ 779 648 278 340 215 -338 -85 -151 -146 -244 43 190 -110 -210 -220 -342 -577 -451 -52 -145 -233 523 363 411
3725D11K98m4k17m83M4l95L5j21L21q8m1M58R0k66j13J97j83k4l6J98jJ91L27
$$ 411 709 665 448 -35 9 -386 -351 -472 -151 -239 -280 178 268 2 -111 86 -97 -121 -157 41 40 231 558
3748E58j56p0k49K48l79k99K52k78J91k7K66k03J83J8J7k43J31r6J61mJ2K60k20
$$ 558 402 332 83 331 -48 -347 -95 -373 -182 -209 57 -146 37 55 72 -171 -40 -136 25 21 33 293 73
3771G3K15j18O5Pj25j36k33M3j87J59j38L23J00J96J02J06k25k73O3J35l18J18
$$ 73 288 170 235 242 117 -19 -252 -209 -396 -237 -375 -52 48 244 346 452 227 -46 17 152 -166 -48
3793d8q6j53J98mP4k7J48q8r6l7k01K60k09J76K3K40m2k00L05m26K03L64N1j06
$$ -48 -134 -287 -89 -93 -19 -46 102 14 -82 -119 -320 -60 -269 -93 -70 170 128 -72 233 -193 10 374 425 319
3817C19m81K50j51J15n0j23K14j68L00j35j56j05K87l93r3O5J15k28R1J80K31
$$ 319 -162 88 -63 52 2 -121 93 -75 225 90 -66 -171 116 -277 -370 -305 -190 -418 -327 -147 84
3838H4qj1J22N8k3j77L66M0kL3k11k29Q0m44p2RL2K1j19L67N18l39K29j23k54
$$ 84 76 65 187 245 222 45 411 451 449 482 271 42 122 -322 -394 -385 -353 -332 -451 -84 434 95 324 201 -53
3863e3j23j96MJ66J1R8M9K01J93l02M16j89n4J4n7j98k20M57k40k67M24r7j27
$$ -53 -176 -372 -368 -202 -191 -93 -44 157 350 48 464 275 221 235 178 -20 -240 217 -23 -290 134 37 -90
3886i0K94n79K06m7n4J50L96k31J08J43l74k3j92K7J73k6L2L63K3M1p0J76p70
$$ -90 204 -375 -169 -216 -270 -120 276 45 153 296 -78 -101 -293 -266 -93 -119 -87 276 299 340 270 446 -324
3909c24k4j2j94pK19K59L42MN02j44J48p5m14j60k45p7qk0j47M18k82K93J31l45
$$ -324 -348 -360 -554 -561 -342 -83 259 263 765 621 769 694 280 120 -125 -202 -210 -230 -377 41 -241 52 183 -162
3933a62J82m4j89J90K2J23M8K51q5O2j94mk39J00r5k69K63J9k15J52K14j83N9
$$ -162 20 -24 -213 -23 -1 122 170 421 336 398 204 200 -39 61 -34 -303 -40 -21 -236 -84 130 -53 6
3956FJ1J30l66J59JO1j62L50j67J34J17k27Q9m25J71J34k84Q1L4O1M03R1M33l62
$$ 6 17 147 -219 -60 -59 2 -160 190 23 157 274 47 136 -289 -118 16 -268 -187 -153 -92 311 402 835 473
3980D73K2L1l13o96j15k54J78L07J82K79K86j00k2k64l99Q7N6k20J56K18K94L08
$$ 473 495 526 213 -483 -598 -852 -674 -367 -185 94 380 280 258 -6 -405 -318 -262 -482 -326 -108 186 494
4002D94j54J54j69o7m22k78j11M31J48j10J17K97j58J1q6m01k31P9O4L8L33M12
$$ 494 340 494 325 258 -164 -442 -553 -122 26 -84 33 330 172 183 97 -304 -535 -456 -392 -354 -21 391
4024C91l7M04k66M32p53k64k53n11M41k25L92j20K55M11M18l51l15l1M1m90J53
$$ 391 354 758 492 924 171 -93 -346 -857 -416 -641 -249 -369 -114 297 715 364 49 18 59 -431 -278
4045b78j5L65J56L63N0l02J53k79q54k2k11k33K74L60O61O9L3O70k88k40l34j34
$$ -278 -293 72 228 591 641 339 492 213 -641 -663 -874 -1107 -833 -473 188 257 290 960 672 432 98 -36
4067c6l8l54K82J78k72L21L15l18k87p9L60n21k23M40K77R8J19M57l6j04k06n0
$$ -36 -74 -428 -146 32 -240 81 396 78 -209 -288 72 -449 -672 -232 45 143 262 719 683 579 373 323
4089C23o37J92j75o36Q7M97K25j37K40M41k24j03N56j62m85M0J12n2l22O15J93
$$ 323 -314 -122 -297 -933 -846 -349 -124 -261 -21 420 196 93 649 487 2 42 154 102 -220 395 588
4110E88k06L9R6o89l58qL5k01J07P67j85K40K9M07k49m83K43l05J3K72J51k26
$$ 588 382 421 517 -172 -530 -538 -503 -704 -597 170 -15 225 254 661 412 -71 172 -133 -120 152 303 77
4132G7k44K96J3k50P6J53k68l91M90p9n4J22K0K26j95J64L58l95r8J56k70j81
$$ 77 -167 129 142 -108 -32 121 -147 -538 -48 -127 -181 -59 -39 187 -8 156 514 119 21 177 -93 -274
4154b74J86k5j51J53K00r1j12k9R3l66j27N27q2l5K67N40j64k75K76j35k93L4
$$ -274 -88 -113 -264 -111 89 -2 -114 -143 -50 -416 -543 -16 -98 -133 134 674 510 235 511 376 83 117
4176A17J8k29l60M47J51n87K68j4r1L6N1K24l7%L66j10q8kK00k74k72N30k55l83
$$ 117 135 -94 -454 -7 144 -443 -175 -189 -280 -244 -193 31 -6 -6 360 250 162 160 360 86 -186 344 89 -294
4200b94K00J71k81K37R0j33l24J94N39n67K47l8M7j86j83M27k70pQ4J98k43J65
$$ -294 -94 77 -204 33 123 -10 -334 -140 399 -168 79 41 88 -98 -281 146 -124 -131 -47 151 -92 73
4222G3J90k37k80J37K2L6m4P1J22k9k21J69PJ9n1k46K82K6J11j06K4J71l29K04
$$ 73 263 26 -254 -117 -95 -59 -103 -32 90 61 -160 9 16 35 -16 -262 20 46 157 51 75 246 -83 121
4246A21k49J83j96K80Q1l39j9R0p4n0J19LN0nJ68k1L1l89K10J66o5j23lP5K9J50
$$ 121 -128 55 -141 139 220 -119 -138 -48 -122 -172 -53 -50 0 -5 163 142 173 -216 -6 160 95 -28 -31 44 73 223
4272B23k11J37r3q7Qj85K69L06j96j53Oj42l76N76k80p0J43j82M96n0K37r6j02
$$ 223 12 149 56 -31 -23 -208 61 367 171 18 24 -118 -494 82 -198 -268 -125 -307 189 139 376 280 178
4295A78q2J13L7j61j06j62J07K0L1q4Q9L08j04l77k09J52J6p5j44L5L64j29M41
$$ 178 96 209 246 85 -21 -183 -76 -56 -25 -109 -20 288 184 -193 -402 -250 -234 -309 -453 -418 -54 -183 258
4318B58j56p6ol4Rp8q3L1L32j0K1j4m7q0J64k40Rk81k3J8J96J25M5J24j17k76
$$ 258 102 26 20 -14 -5 -83 -166 -135 197 187 208 194 147 67 231 -9 0 -281 -304 -286 -90 35 80 204 87 -189
4344a89K3o0L1OK52J7O8J64p3P2K9m37q5n7n0j12K43L67lJ53j73P7j62P5k00j33
$$ -189 -166 -226 -195 -189 63 80 148 312 239 311 340 -97 -182 -239 -289 -401 -158 209 206 359 186 263 101 176 -24 -157
4370a57l1o2K81k8J32n8J32M3l90N6j94j88O8N20O8k08K12Mj39K71o1l94k04K83
$$ -157 -188 -250 31 3 135 77 209 252 -138 -82 -276 -464 -396 124 192 -16 196 200 61 332 271 -123 -327 -44
4394d4J69r3Q8m4k6q9L41j44j05j10L1j83K29k34J81J44k0j19J22j6l7k49j8m7
$$ -44 125 32 120 76 50 -39 302 158 53 -57 -26 -209 20 -214 -33 111 91 -28 94 78 41 -208 -226 -273
4418b73j05J35k2K77K02j74L29k97L27l35o3p4j43NmK12o6J29m3n3L3J47n15K8
$$ -273 -378 -243 -265 12 214 40 369 72 399 64 1 -73 -216 -211 -215 -3 -69 60 17 -36 -3 144 -371 -343
4442c43M58m77L34k08M57N1p7P8k65R7K2k81m1P9M4P4m6O9K96J25l90J85k33M1
$$ -343 115 -362 -28 -236 221 272 195 273 8 105 127 -154 -195 -116 -72 2 -44 25 321 446 56 241 8 49
4466D9j43L8j4K43K4n1k3k9L3j42k27J0k02L11L4j6J71R6k7J25k81L7M2j05R8
$$ 49 -94 -56 -70 173 197 146 123 94 127 -15 -242 -232 -434 -123 -89 -105 66 162 135 260 -21 16 58 -47 51
4491E1jk3K15o4L00j70k63Q3m69j52O0K88j11Q2K28j40J29K67j7k48k23J85p1
$$ 51 50 27 242 178 478 308 45 128 -341 -493 -433 -145 -256 -174 54 -86 43 310 293 45 -178 7 -64
4514f4j54J11j43L43j05j68K48J4j41J16k37j33N4L73O5k2K93j9k93L26l87j45
$$ -64 -218 -107 -250 93 -12 -180 68 82 -59 57 -180 -313 -259 114 179 157 450 431 138 464 77 -68
4536f8r8J29l08j44L39P9j38J40J82j32q7O7L28j23J06p6n8j5j61K11l9m69P2
$$ -68 -166 -37 -345 -489 -150 -71 -209 -69 113 -19 -106 -39 289 166 272 196 138 123 -38 173 134 -335 -263
4559b63n0K12k99L31J3k24N70k60K7j45K62j62j33M15k10R0k92M28r2k85j09J95
$$ -263 -313 -101 -400 -69 -56 -280 290 30 57 -88 174 12 -121 294 84 174 -118 310 218 -67 -176 19
4581A9n2n8J20j84l51L70J48R6k00K72K05p8j40L62m10j45K71j16j77M7J65J54
$$ 19 -33 -91 29 -155 -506 -136 12 108 -92 180 385 307 167 529 119 -26 245 129 -48 -1 164 318
4603C18n26J92L8l58J32j31M27k34K31P4l18j34L08j0k46J97J80L7R7J69j24l99
$$ 318 -208 -16 22 -336 -204 -335 92 -142 89 163 -155 -289 19 9 -237 -40 140 177 274 443 319 -80
4625h0N81l87k3n23L23j30l1L14l0k6j88k5K68l48L59L78n9k25M7K79o18k65N34
$$ -80 501 114 91 -432 -109 -239 -270 44 14 -12 -200 -225 43 -305 54 432 373 148 195 474 -144 -409 125
4648A25K9k31L88Kk76j80M75l51l07K85k44n6J8M06Rj9j65n1k20QJ56L88l20R6
$$ 125 154 -77 311 313 37 -143 332 -19 -326 -41 -285 -341 -323 83 92 73 -92 -143 -363 -355 -199 189 -131 -35
4672c5M20K2l51o4J77l03P8K31k12Q9P4J84l22p7K23l60j5L5M21j63o0O0K1j87
$$ -35 385 407 56 -8 169 -134 -56 175 -37 52 126 310 -12 -89 134 -226 -241 -206 215 52 -8 52 73 -114
4696a14J14k5L37j07j5K02m88j50K22j10n3P9J6Kj20P2Oj40K24M7k91p5L35K56
$$ -114 0 -25 312 205 190 392 -96 -246 -24 -134 -187 -108 -92 -90 -210 -138 -132 -272 -48 -1 -292 -367 -32 224
4720B24j38K3P4j32K30j02O1o06M48J79j02L1k40Om57L35n0L1l59L51K12j08J96
$$ 224 86 109 183 51 281 179 240 -366 82 261 159 190 -50 -44 -501 -166 -216 -185 -544 -193 19 -89 107
4743A07R2j17j64j9J80j75R4L41j29o5J97J45m58r8J86m2l33K03K02k41k09Q2
$$ 107 199 82 -82 -101 79 -96 -2 339 210 145 342 487 29 -69 117 75 -258 -55 147 -94 -303 -221
4765b21J27k7J17P7j9j51rL20k74l4Q7m7O5K44k4j26K12k49k07l6J41O8j11J34
$$ -221 -94 -121 -4 73 54 -97 -106 214 -60 -94 -7 -54 11 255 231 105 317 68 -139 -175 -34 34 -77 57
4789E7k66J39P5j17L68o41K28J22K10l1o9J94k43q8J20k47J95j79N3K17j33j21
$$ 57 -209 -70 5 -112 256 -385 -157 -35 175 144 75 269 26 -62 58 -189 6 -173 -120 97 -36 -157
4811a57R9J09Jo2K1j81K75k21L8L6l6n8o0j59R5M39j41J00L5j16J78k27K48n88
$$ -157 -58 51 52 -10 11 -170 105 -116 -78 -42 -78 -136 -196 -355 -260 179 38 138 173 57 235 8 256 -332
4835c32N26R3l57j24K09P0k20L52l96Q6r0L66j10k59RK07O6l5P6J9k56j33L17
$$ -332 194 287 -70 -194 15 85 -135 217 -179 -93 -183 183 73 -186 -177 30 96 61 137 156 -100 -233 84
4858H4j7ok65L14k55K39k38J78J26m02J96LR8j80J6J47r3J27J95j9r6RR7k94k86
$$ 84 67 61 -204 110 -145 94 -144 34 160 -242 -46 -43 55 -125 -109 38 -55 72 267 248 152 161 258 -36 -322
4883c22J62r8M73l32O5p6K30K1m4j3j38J52j5j13j22j57K71K03j6k64J27J58j54
$$ -322 -160 -258 215 -117 -52 -128 102 123 79 66 -72 80 65 -48 -170 -327 -56 147 131 -133 -6 152 -2
4906bk17p7K29q9J34k0J57J33J53j15P6k77r2J15k11J07j81K47P1p7J31q5l2j11
$$ -2 -219 -296 -67 -156 -22 -42 115 248 401 286 362 85 -7 108 -103 4 -177 70 141 64 195 110 78 -33
4930c3k12J85l01K81k78J71K69LJ63m3j3J2k51K10l37K87j61J1nJ57P7j24J64
$$ -33 -245 -60 -361 -80 -358 -187 82 85 248 205 192 204 -47 163 -174 113 -48 -37 -42 115 192 68 232
4953B32k30k46Q3j83n9j21M34j64R1j18O91rk10J88p5k95M6r2n0J9p1P3n5Q8J32
$$ 232 2 -244 -161 -344 -403 -524 -90 -254 -163 -281 410 401 191 379 304 9 55 -37 -87 -68 -139 -66 -121 -33 99
4978I9j33j24r4R0L7K88Q0k25K06N3k65J48j61j10pk1j44P3J26lJ95j61K56j86
$$ 99 -34 -158 -252 -162 -125 163 243 18 224 277 12 160 -1 -111 -118 -139 -283 -210 -84 -87 108 -53 203 17
5002A7J46N0k35j21Q9k60J5L27m2k45L81j64j0o1L1J08j27j91K64m4lM63m03J94
$$ 17 163 213 -22 -143 -54 -314 -299 28 -14 -259 122 -42 -52 -113 -82 26 -101 -292 -28 -72 -75 388 -15 179
5026A79Nj67l81M2K66l28m22M34K71j29L79n3j78J8l0O4K93k65K48qk06K0K50
$$ 179 184 17 -364 -322 -56 -384 -806 -372 -101 -230 149 96 -82 -64 -94 -30 263 -2 246 238 32 52 302
5049C02l34l7m2K05q1l24K21k23j26K54K46j55k18L83j57j5J40J50j37r7M40k73
$$ 302 -32 -69 -111 94 13 -311 -90 -313 -439 -185 61 -94 -312 71 -86 -101 39 189 52 -45 395 122
5071A22j2K11J83l00N1Q8l48l16K51Q5n01K46M46k37q8J85r5l67M17J28p8j12
$$ 122 110 321 504 204 255 343 -5 -321 -70 15 -486 -240 206 -31 -119 66 -29 -396 21 149 71 -41
5093d1J56k8l9k95N78l01R0k65L49j27j77K23j02p6j54K94j96k05L18N3o8J29
$$ -41 115 87 48 -247 331 30 120 -145 204 77 -100 123 21 -55 -209 85 -111 -316 2 55 -13 116
5115A16q8k10l5LJ17N6q0K10l7n8j7L50n97K39K96j79k01M36j92P5l54K11O3l45
$$ 116 28 -182 -217 -214 -97 -41 -121 89 52 -6 -23 327 -270 -31 265 86 -115 321 129 204 -150 61 124 -221
5139b21q8J33q5M9K97K42n16J9J82j95j42M20j4j19J09L42o19R5J45q1k88r2N08
$$ -221 -309 -176 -261 -212 85 327 -189 -170 12 -183 -325 95 81 -38 71 413 -206 -111 34 -47 -335 -427 81
5162H1K70m56K67L4n40m7N08k5l34K42K82r8K75l4O7n23m7R1J35l15j1l00K00
$$ 81 351 -105 162 196 -344 -391 117 92 -242 0 282 184 459 425 492 -31 -78 13 148 -167 -178 -478 -278
5185b78k16P7L59k61L16J47j27L52n1K9j94k60L00m18J06J07J83j81k65K94r7
$$ -278 -494 -417 -58 -319 -3 144 17 369 318 347 153 -107 193 -225 -119 -12 171 -10 -275 19 -78
5206g8k8N7q6k62N01L48k58J87k93J9l05K36l50l02J48J81J66l9J38K17kk6j70
$$ -78 -106 -49 -135 -397 104 452 194 381 88 107 -198 38 -312 -614 -466 -285 -119 -158 -20 197 195 169 -1
5229aK43k36J29j90Q0o0%N4j75p8L75j29l34j38N21l10q3K81J75k28L28K00J88
$$ -1 242 6 135 -55 25 -35 -35 19 -156 -234 141 12 -322 -460 61 -249 -332 -51 124 -104 224 424 612
5252F12k06n2m86k26l4n8K65k64L75l9R4J38J15P1j30j16n8J14j00K10j25k93
$$ 612 406 354 -132 -358 -392 -450 -185 -449 -74 -113 -19 119 234 305 175 59 1 115 15 225 100 -193
5274a93L30O6j40k27j8K82l70J07J92l5j09R6J24J2J3K6o5j20q1J12l75M04Oj07
$$ -193 137 203 63 -164 -182 100 -270 -163 29 -6 -115 -19 105 117 130 156 91 -29 -110 2 -373 31 37 -70
5298g0J44N9J48k1n09J28O9l08M00O2n0J3j18J48k82Q3J57k45nk2L22l86K57J15
$$ -70 74 133 281 260 -249 -121 -52 -360 40 102 52 65 -53 95 -187 -104 53 -192 -197 -219 103 -283 -26 89
5322H9L5n4K99j28l04n1q0J31rR1p0j37k70O58j21k25K88j92J05r5J31j5n4o7
$$ 89 124 70 369 241 -63 -114 -194 -63 -72 19 -51 -188 -458 200 79 -146 142 -50 55 -40 91 76 22 -45
5346d5L4j17M00K6j47l04K10L1J8l22O2P7k52K05J06m2J09R6j43J54j31J40j43
$$ -45 -11 -128 272 298 151 -153 57 88 106 -216 -154 -77 -329 -124 -18 -60 49 145 2 156 25 165 22
5369B2k18K44J50m5Q8n2j13k04K05k14k68J08Q4J40N2j09L10o0P8r8j03l05N35
$$ 22 -196 48 198 153 241 189 76 -128 77 -137 -405 -297 -213 -73 -21 -130 180 120 198 100 -3 -308 227
5392B27j95q9k23K43MR9M5j73M81k26nl4j87K3j27j3j75J03R0j3l3K53k3j35j57
$$ 227 32 -57 -280 -37 -33 66 111 -62 419 193 188 154 -33 -10 -137 -150 -325 -222 -132 -145 -178 75 52 -83 -240
5417b40L7N8r5J94m7L48k3k6K5o2J19j88j68J38l13Mj49L90J9n0Q7r1L6k06j4
$$ -240 -203 -145 -240 -46 -93 255 232 206 231 169 288 100 -68 70 -243 -239 -388 2 21 -29 58 -33 3 -203 -217
5442b17N1k86K24J23N2m5J89K61q4k07o5J37p3L5l6n1k70L50J15l44m7l1J05P8
$$ -217 -166 -452 -228 -105 -53 -98 91 352 268 61 -4 133 60 95 59 8 -262 88 203 -141 -188 -219 -114 -36
5466c6j46M2p1P3K49P4Q1J63l8J46k28k07j74j04J46k97l3M26P6j91jJ30J92k07
$$ -36 -182 -140 -211 -138 111 185 266 429 391 537 309 102 -72 -176 -30 -327 -360 66 142 -49 -50 80 272 65
5490F5P6k65m8J23J39ML13m62L56k80R7k04j17J00L2j86K38m75N25K97j39r7J6
$$ 65 141 -124 -172 -49 90 94 407 -55 301 21 118 -86 -203 -103 -71 -257 -19 -494 31 328 189 92 108
5513A08j30k79J64j23N1Mn0M3J09K61k5j05jq7J38k05n2L62R5k76J66m9l77M24
$$ 108 -22 -301 -137 -260 -209 -205 -255 -212 -103 158 133 28 27 -60 78 -127 -179 183 278 2 168 119 -258 166
5537A66P2k67q9n6L0k76L11M2M6P2m7K9j3j23J33j89J60K21l6k18K91Q7j94k00
$$ 166 238 -29 -118 -174 -144 -420 -109 -67 -21 51 4 33 20 -103 30 -159 1 222 186 -32 259 346 152 -48
5561d8N9j03O6k22K12p3M6k99L68k39K07Q1K1n5J31K98j62k80q9J04j58k25N13
$$ -48 11 -92 -26 -248 -36 -109 -63 -362 6 -233 -26 55 76 21 152 450 288 8 -81 23 -135 -360 153
5584A53k84k89L36M37m70J92J85j45Q1k2j99l0J09K81k65k67L80k24k47p7N19
$$ 153 -131 -420 -84 353 -117 75 260 115 196 174 -25 -55 54 335 70 -197 183 -41 -288 -365 154
5605A54j72j20Q7K7l1j12M66lj52n5J38k48l25J91K10l75J77J23J30j04M49k80
$$ 154 -18 -138 -51 -24 -55 -167 299 296 144 89 227 -21 -346 -155 55 -320 -143 -20 110 6 455 175
5627A75p8j50m1R4lK38J7l11L39N8k60l18Q3p0j36L3M04j79P8J62n5%P0J52j58
$$ 175 97 -53 -94 0 -3 235 252 -59 280 338 78 -240 -157 -227 -363 -330 74 -105 -27 135 80 80 150 302 144
5652A44m70M20o4m31M8L25N1l55L74J5k25K17K1N5j86n2L02l06j06L19N7r6j98
$$ 144 -326 94 30 -401 -353 -28 23 -332 42 57 -168 49 70 125 -61 -113 189 -117 -223 96 153 57 -141
5675a41Q4m65K7K01m0p2K49M40j52j74J60L04m69Q3J27k77n6o7J42m4K3J08J37
$$ -141 -57 -522 -495 -294 -334 -406 -157 283 131 -43 117 421 -48 35 162 -115 -171 -238 -96 -140 -117 -9 128
5698A28n0p7K3q9j57M06qj42o6M6Ml06J12P9J7J38j82J52J07j20L94l11N4K48
$$ 128 78 1 24 -65 -222 184 176 34 -32 14 18 -288 -176 -97 -80 58 -124 28 135 15 409 98 152 400
5722D00j76j8J64j99l75l2j00r9j36K42J38j15K34K82p6pj54K26K71l79J75l17
$$ 400 224 206 370 171 -204 -236 -336 -435 -571 -329 -191 -306 -72 210 134 127 -27 199 470 91 266 -51
5744e1l45L25k0k43J69J39j7j46J86M4J96j54K61j72K4N1J6k97JR1J04n95K77
$$ -51 -396 -71 -91 -334 -165 -26 -43 -189 -3 41 237 83 344 172 196 247 263 -34 -33 58 162 -433 -156
5767a56k44K81j02L94J23k44L56O5q9J30m3j54l17L8j25m07K05J28O2J6j91K11
$$ -156 -400 -119 -221 173 296 52 408 473 384 514 471 317 0 38 -87 -494 -289 -161 -99 -83 -274 -63
5789f3L00j83l86K59m7L15l5rJ26J8k2k41j4j19j7L0k98L26k39O1O6L61J7QJ16
$$ -63 237 54 -332 -73 -120 195 160 151 277 295 273 32 18 -101 -118 -88 -386 -60 -299 -238 -172 189 206 214 330
5814C30L4k99k48M93l12p0o9n8L70o5J31L6l09j12m2K0P3j69L21R8k78K52J61
$$ 330 364 65 -183 310 -2 -72 -141 -199 171 106 237 273 -36 -148 -190 -170 -97 -266 55 153 -125 127 288
5837B88k20k0k16j62j31K23K55j21j60M81k51L07j0j25m2q5k43J03J30o7L4P5
$$ 288 68 48 -168 -330 -461 -238 17 -104 -264 217 -34 273 263 138 96 11 -232 -129 1 -66 -32 43
5859D3n1o1J1J33k47m2J61l28J24J91J14Q5J66J19n24M74ol20p8J23j01K74k60
$$ 43 -8 -69 -58 75 -172 -214 -53 -381 -257 -66 48 133 299 418 -106 368 362 42 -36 87 -14 260 0
5882@R6j57J93k67J68j87j18N4R7j10J10o5J20J47LN2l1%j99l8Q4j23L5J84N1
$$ 0 96 -61 132 -135 33 -154 -272 -218 -121 -231 -121 -186 -66 81 84 136 105 105 -94 -132 -48 -171 -136 48 99
5907I9l3L3j09M5J30k27m6o6J19j0P7j36M4K36j61o0o2J98k11O2R5J9K3r1N0L2
$$ 99 66 99 -10 35 165 -62 -108 -174 -55 -65 12 -124 -80 156 -5 -65 -127 71 -140 -78 17 36 59 -32 18 50
5933E0J60k20O1j69J61n5o7QK28k55J37j60Q3o5K70j76j26n3J04L40j09j75j72
$$ 50 210 -10 51 -118 43 -12 -79 -71 157 -98 39 -121 -38 -103 167 -9 -135 -188 -84 256 147 -28 -200
5956b00M44j02J62j49R6m48J81q8jK41m47K71P8r2j46L37j44J59j03R1j0j12j4
$$ -200 244 142 304 155 251 -197 -16 -104 -105 136 -311 -40 38 -54 -200 137 -7 152 49 140 130 18 4
5979Dj8K5J29O9j91P8O6l17J22j8L2l3j29N5J28q6M4Q6J69J5j31k18Q3J97j95
$$ 4 -14 11 140 209 18 96 162 -155 -33 -51 -19 -52 -181 -126 2 -84 -40 46 215 230 99 -119 -36 161 -34
6004c4j32Q9O0Q7J16j65j04J54nk6K00j98j32j14J34J86j01L04l71l6P1Q7p0k89
$$ -34 -166 -77 -17 70 186 21 -83 71 66 40 240 42 -90 -204 -70 116 15 319 -52 -88 -17 70 0 -289
6028b89J92N4p0J1M5P7m5K4J86k01r5k04K33J6j90L91o9j80Q0N60k01k19m9p7
$$ -289 -97 -43 -113 -102 -57 20 -25 -1 185 -16 -111 -315 -82 -66 -256 135 66 -114 -34 526 325 106 57 -20
6052b0J0j87j6J44j08K08O4j70j75L6L14j57R5j5J27l68M02J1o7k25M23l49J6
$$ -20 -10 -197 -213 -69 -177 31 95 -75 -250 -214 100 -57 38 23 150 -218 184 195 128 -97 326 -23 -7
6075gr5j49K42NJ3j91K7J03K72l02%J25k9j66L21l9k23k59N25J32l95R6J29k52
$$ -7 -102 -251 -9 -4 9 -182 -155 -52 220 -82 -82 43 14 -152 169 130 -93 -352 173 305 -90 6 135 -117
6099a17P7K19k43N1K23j47j1o9J80M1l89j42J07N9j75K11Q8r8K19J53j00lK32
$$ -117 -40 179 -64 -13 210 63 52 -17 163 204 -185 -327 -220 -161 -336 -125 -37 -135 84 237 137 134 366
6122C66l19L2o1O7j66K22Ml7n61K43J33r0j17L13N6R6j92L37k28m22N36Q7l28
$$ 366 47 79 18 85 -81 141 145 108 -453 -210 -77 -167 -284 29 85 181 -11 326 98 -324 212 299 -29
6145b9r3M02o12L03j39Nk66L31J29j68K70J64k92K22k34Q4o2l1O7n0J4j82Q4j50
$$ -29 -122 280 -332 -29 -168 -163 -429 -98 31 -137 133 297 5 227 -7 77 15 -16 51 1 15 -167 -83 -233
6169b33M7j91L23J31N4R3J15k01J31Q4l03n4q0Q9j52Q8k3L2k93m6N05n80K13L10
$$ -233 -186 -377 -54 77 131 224 339 138 269 353 50 -4 -84 5 -147 -59 -82 -50 -343 -389 116 -464 -251 59
6193E9k6j07M64Qj38J71k1k85r7j85J86j29j66L35J16m50L06m8O3l93K45J65l49
$$ 59 33 -74 390 398 260 431 410 125 28 -157 29 -100 -266 69 185 -265 41 -7 56 -337 -92 73 -276
6216b76k5K53j02R2J38J7M9P5p4k3j94O%k32J52Q4O3k41K26j99J13L5J97k32M8
$$ -276 -301 -48 -150 -58 80 97 146 221 147 124 -70 -64 -64 -296 -144 -60 3 -238 -12 -211 -98 -63 134 -98 -50
6241e0j37K93J71j20N4J17J4M0j89k02j33q4K30j31j74K82K2k67J84j5O2Q7K15
$$ -50 -187 106 277 157 211 328 342 382 193 -9 -142 -226 4 -127 -301 -19 3 -264 -80 -95 -33 54 269
6264B69k05j21L37n1L1j79J38o3k32N9n9j10j77J90K13k47J69J60K4k65M79j55
$$ 269 64 -57 280 229 260 81 219 156 -76 -17 -76 -186 -363 -173 40 -207 -38 122 146 -119 360 205
6286B05k34J62R2m77j7L29r0k45R9J18M7j74K37k2J9j13L74m02K18J12l06K01
$$ 205 -29 133 225 -252 -269 60 -30 -275 -176 -58 -11 -185 52 30 49 -64 310 -92 126 238 -68 133
6308A33R6j89rP9j51J37k75k4M6J30j6P5k0O3jJ1j9j70L31k4j01l09L68j19r8
$$ 133 229 40 31 110 -41 96 -179 -203 -157 -27 -43 32 12 75 74 85 66 -104 227 203 102 -207 161 42 -56
6333e6Lj31k8P3P7j09Rj94R6L90j43p8n0O4o1j37N09q9j53M9o9J08J93k46j06
$$ -56 -53 -184 -212 -139 -62 -171 -162 -356 -260 130 -13 -91 -141 -77 -138 -275 234 145 -8 41 -28 80 273 27 -79
6358g9P9J06j71L9m3Q2k0j30K69j55R4O3j84J10j61J69L4k07J21l8l7j02Q4J98
$$ -79 0 106 -65 -26 -69 13 -7 -137 132 -23 71 134 -50 60 -101 68 102 -105 16 -22 -59 -161 -77 121
6382A21p8P2j72o6K49l04K30j97Q4J3p7J82qK83l02j15n6N9n1j12M14j14j21Q4
$$ 121 43 115 -57 -123 126 -178 52 -145 -61 -48 -125 57 49 332 30 -85 -141 -82 -133 -245 169 55 -66 18
6406A8j21J43J23k07j00r8n3L57o8L6J1r0K5J79PQ5l5l43K26P1O4j86K9j39n4
$$ 18 -103 40 163 -44 -144 -242 -295 62 -6 30 41 -49 -24 155 162 247 212 -131 95 166 230 44 73 -66 -120
6431a20J80N8j24j51m1J02k08M08j75J46l75K54P6J37k9k7j01k14J9K46Lj84J33
$$ -120 60 118 -6 -157 -198 -96 -304 104 -71 75 -300 -46 30 167 138 111 10 -204 -185 61 64 -120 13
6454A3k2L6k03L77n8j56k21J10P3K41k44Q6J39o5k37N9L25k72J84j02oj85k64
$$ 13 -9 27 -176 201 143 -13 -234 -124 -51 190 -54 32 171 106 -131 -72 253 -19 165 63 57 -128 -392
6477c92J99J18j49L40j54J66k5k21R3J57j09N4J06p3l66pMM35j92K1J2j52J53
$$ -392 -193 -75 -224 116 -38 128 103 -118 -25 132 23 77 183 110 -256 -263 -259 176 -16 5 17 -135 18
6500A8j60K08J27j83J60n2j01J44pj34k81J44l7k97N67k98J76n6J19l2L29p2l
$$ 18 -142 66 193 10 170 118 17 161 154 20 -261 -117 -154 -451 116 -182 -6 -62 57 25 354 282 279
6523B79j05j06j17J20Q2q1k82L69l60M2K10j05J0K5l2K9n4j54L28p3q2J43Kk19
$$ 279 174 68 -49 71 153 72 -210 159 -201 -159 51 -54 -44 -19 -51 -22 -76 -230 98 25 -57 86 88 -131
6547a31J65j48j15L64j87j14k5K89m7J81j21j40K62k50K90K0m54K21k93j36N33
$$ -131 34 -114 -229 135 -52 -166 -191 98 51 232 111 -29 233 -17 273 293 -161 60 -233 -369 164
6568A64J3k04k83L98l41J62j5L36q4k43J81K51l64J66j74j14j73J40L6j01m3L10
$$ 164 177 -27 -310 88 -253 -91 -106 230 146 -97 84 335 -29 137 -37 -151 -324 -184 -148 -249 -292 18
6590A8j04n8K26L8j3o7L23l26l3QP7J09k94k5J87k29M7J58j47J5J63j50N5M9Q7
$$ 18 -86 -144 82 120 107 40 363 37 4 12 89 198 -96 -121 66 -163 -116 42 -105 -90 73 -77 -22 27 114
6615A14k33R2J18q6m22M53K18l32K6L40j26k32L91o6J37l67o4K10j00k43J87l44
$$ 114 -119 -27 91 5 -417 36 254 -78 -52 288 162 -70 321 255 392 25 -39 171 71 -172 15 -329
6637c29K03J35j57j52O1L57q3j12K44N5L3j29J90n69J53J45O3M7j34p6k7l2K6
$$ -329 -126 9 -148 -300 -239 118 35 -77 167 222 255 126 316 -253 -100 45 108 155 21 -55 -82 -114 -88
6660h8J26j69L7Q9m5J14j09M88j76m3j05Qo0j20R3n0m73L56N5k8J59N9m10J19
$$ -88 38 -131 -94 -5 -50 64 -45 443 267 224 119 127 67 -53 40 -10 -483 -127 -72 -100 59 118 -292 -173
6684a73K03J80q7j08L74l32M1j63K00n8j55P1nk02J2K17j86j21J76m7K9J81J02
$$ -173 30 210 123 15 389 57 98 -65 135 77 -78 -7 -12 -214 -202 15 -171 -292 -116 -163 -134 47 149
6707A49Q3k91J92L7j73r6O1K8J47j0j32j76PK06j23Q3j60j04K84j6J19m2j12k19
$$ 149 232 -59 133 170 -3 -99 -38 -10 137 127 -5 -181 -174 32 -91 -8 -168 -272 12 -4 115 73 -39 -258
6731b58L45kj50j5J31k24J36K61n3l45M8j11R4K43N3k50O3O1k7k40K16j9J30N0
$$ -258 87 85 -65 -80 51 -173 -37 224 171 -174 -126 -237 -143 100 153 -97 -34 27 0 -240 -24 -43 87 137
6755A37j04Q8q3J25k42K4L1J08k45O1k08L23l13L65jJ8k87K59j68K50k76J8K19
$$ 137 33 121 38 163 -79 -55 -24 84 -161 -100 -308 15 -298 67 66 84 -203 56 -112 138 -138 -120 99
6778I9k57J2q7J45O9k16L50r2N2j12J77l8qP8m7l0M3n7M2k16nJ96j67J34n6J47
$$ 99 -158 -146 -233 -88 -19 -235 115 23 75 -37 140 102 94 172 125 95 138 81 123 -93 -98 98 -69 65 9 156
6804A56l19L8K43l19L73%N3j50n6j3j09K23Oj64R7O4j99L23n21L29l3J36l94M14
$$ 156 -163 -125 118 -201 172 172 225 75 19 6 -103 120 126 -38 59 123 -76 247 -274 55 22 158 -236 178
6828A78j69J11j33k8J86l17L04k03R4M9j04J65K5j23L09m39J19M6n9j39L07n6
$$ 178 9 120 -13 -41 145 -172 132 -71 23 72 -32 133 158 35 344 -95 24 70 11 -128 179 123
6850A23l16J17O3Q8l2j11J50M8l50J56R7j52J06J37l41K95k46N6J27M8j21K62
$$ 123 -193 -76 -13 75 43 -68 82 130 -220 -64 33 -119 -13 124 -217 78 -168 -112 15 63 -58 204
6872B04o4j5j05M8L6J05j23j80J43K9K4q7l08lM64k12mL3j36O2k5Q3K67l65K66
$$ 204 140 125 20 68 104 209 86 -94 49 78 102 15 -293 -296 168 -44 -48 -15 -151 -89 -114 -31 236 -129 137
6897A37k14M3j03J48J12j58q2O2J79k58j61M81l45nJ34%m0J09L9j8M8lr8J57Q8
$$ 137 -77 -34 -137 11 123 -35 -117 -55 124 -134 -295 186 -159 -164 -30 -30 -70 39 78 60 108 105 7 164 252
6922B52l20K88j80j60J24K64k06j99J98o7J25j30rj08K1K12J9J6Q9j14k22J34
$$ 252 -68 220 40 -120 4 268 62 -137 61 -6 119 -11 -20 -128 -107 105 124 140 229 115 -107 27
6944B7J91j0q3k65J72N1J97k57k30K17N0j14M4k5K7o0K92l38M6J69j33J09l94
$$ 27 218 208 125 -140 32 83 280 23 -207 10 60 -54 -10 -35 -8 -68 224 -114 -68 101 -32 77 -317
6967c17K52K0Q0j77J31o5Q2k4K1J78l69K75Q4k54j24L7J98p2r6K95q6q0j38K48
$$ -317 -65 -45 35 -142 -11 -76 6 -18 3 181 -188 87 171 -83 -207 -170 28 -44 -140 155 69 -11 -149 99
6991I9n43L22Rq3M97q5k68K30k33O6K11l60J17QJ66K0J5j94M2J60K3j95Q6Mn7
$$ 99 -444 -122 -113 -196 301 216 -52 178 -55 11 222 -138 -21 -13 153 173 188 -6 36 196 219 24 110 114 57
7016E7l28J67m9NN0K83k19M2m9j62K38l2L71j14k88K7J18j28q2K94l75N8q6K33
$$ 57 -271 -104 -153 -148 -98 185 -34 8 -41 -203 35 3 374 260 -28 -1 117 -11 -93 201 -174 -116 -202 31
7040C1O0k05J9J72q9n1K09l60K34k96M93k25k7K06k36j31L41j10o8m0j3m5m46
$$ 31 91 -114 -95 77 -12 -63 146 -214 20 -276 217 -8 -35 171 -65 -196 145 35 -33 -73 -86 -131 -577
7063e77L35L35j12N1O9p3j20K24l63L15M2j91L8j1k3J57K4O0K2k11j59K11ok49
$$ -577 -242 93 -19 32 101 28 -92 132 -231 84 126 -65 -27 -38 -61 96 120 180 202 -9 -168 43 37 -212
7087b12L2R8K51k43P2Qk6n6R7L36l40k15L32l24K53J36l00L42k84L25k21k00K39
$$ -212 -180 -82 169 -74 -2 6 -20 -76 21 357 17 -198 134 -190 63 199 -101 241 -43 282 61 -139 100
7110A00J87n39L16j20J35j66K88k38L58l19K52k63ol5J53j91n5R8j09J88r3n9
$$ 100 287 -252 64 -56 79 -87 201 -37 321 2 254 -9 -15 -50 103 -88 -143 -45 -154 34 -59 -118
7132a18J8J9J49M9k01q0M34k12k29L16k24p6L5J77j91N1L67j93j97Q1K27M1l23
$$ -118 -100 -81 68 117 -84 -164 270 58 -171 145 -79 -155 -120 57 -134 -83 284 91 -106 -25 202 243 -80
7155h0J43J79j76r4J96j96j67L3J12N6j09K64r5N2j55J90p3L5N5J52l74L78k12
$$ -80 63 242 66 -28 168 -28 -195 -162 -50 6 -103 161 66 118 -37 153 80 115 170 322 -52 326 114
7178A14L4k65K63o9j3k27l36M49J79j59J62l88J08K45j89p9J08K92l27n8M57l38
$$ 114 148 -117 146 77 64 -163 -499 -50 129 -30 132 -256 -148 97 -92 -171 -63 229 -98 -156 301 -37
7200c7k65L72j78o3K35k0n0j07J59j18J00j4k49L24n4j40K08l5J15K6o4N8n8k91
$$ -37 -302 70 -108 -171 64 44 -6 -113 46 -72 28 14 -235 89 35 -105 103 68 183 209 145 203 145 -146
7224a46K8N9mJ38k32J30j12J39k63K63j63OL8q2J22K0p8J14J64K2j49l79M64p4
$$ -146 -118 -59 -63 75 -157 -27 -139 0 -263 0 -163 -157 -119 -201 -79 -59 -137 -23 141 163 14 -365 99 25
7248B5O4k78J06J0L6J35k73L07j87jJ53j45J21m9k6n1P2J67M0k35R1j80K1k28
$$ 25 89 -189 -83 -73 -37 98 -175 132 -55 -56 97 -48 73 24 -2 -53 19 186 226 -9 82 -98 -77 -305
7272c05K63OL9rPJ59l60J41K05k8l47K48jj12L2M1j20K7r9K23k81L17M3J71j67
$$ -305 -42 -36 3 -6 1 160 -200 -59 146 118 -229 19 18 -94 -62 -21 -141 -114 -213 10 -271 46 89 260 93
7297I3j68m2M9M1J32k81J96k11L14j15j4rJ68j21K08k04q5m9j59K40j72J50L3
$$ 93 -75 -117 -68 -27 105 -176 20 -191 123 8 -6 -15 153 32 240 36 -49 -98 -257 -17 -189 -39 -6
7320fM3p2M8J28j37n9j4L4K59m23L60l59%K27L0Q8l55L23l0p1j18j86j7M67l27
$$ -6 37 -35 13 141 4 -55 -69 -35 224 -199 161 -198 -198 29 59 147 -208 115 85 14 -104 -290 -307 160 -167
7345a67Q9P1J50k70r9L61r6j28L07k7k63M0J07l2j74j8o4L16l80J78J52Q1k2Q8
$$ -167 -78 -7 143 -127 -226 135 39 -89 218 191 -72 -32 75 43 -131 -149 -213 103 -277 -99 53 134 112 200
7369B00l55J18k1LN4Q9jk10L04k03O6j22L5J1K4k5Q5jj1N1k91K54k09K7q6K66
$$ 200 -155 -37 -58 -55 -1 88 87 -123 181 -22 44 -78 -43 -32 -8 -33 52 51 40 91 -200 54 -155 -128 -214 52
7395E2j0j77m1J68J42j19J58j27K4q4K25k26l7p0P1N7K7K6j2j37k1J55K42m51
$$ 52 42 -135 -176 -8 134 15 173 46 70 -14 211 -15 -52 -122 -51 6 33 59 47 -90 -111 44 286 -165
7419a65J19r9m3K14j0m2j5K07q6k43N3j3J98K05l8O2l14L8l4j52K7J69j26J30
$$ -165 -46 -145 -188 26 16 -26 -41 166 80 -163 -110 -123 75 280 242 304 -10 28 -6 -158 -131 38 -88 42
7443D2K22j72l26L22k57J24J79J4k31N4qK73j51j74J06j31J70k67M91m17QQ4L9
$$ 42 264 92 -234 88 -169 -45 134 148 -83 -29 -37 236 85 -89 17 -114 56 -211 280 -137 -129 -45 -6
7466fN9k98K26M9r4K52j02Ok09R9N5J51k78J80j78J46P6o5j01K76k20j12K33j68
$$ -6 53 -245 -19 30 -64 188 86 92 -117 -18 37 188 -90 90 -88 58 134 69 -32 244 24 -88 145 -23
7490b3L1k03K90k96K11o1J8j36L24r0qj61J64p4k44K68Q2o2j22K0MJ8j16L42j76
$$ -23 8 -195 95 -201 10 -51 -33 -169 155 65 57 -104 60 -14 -258 10 92 30 -92 -72 -68 -50 -166 176 0
7515@J4k23K41Q6j58N4J56k71j36K18o0j3J21J56q6J33k48M3k7m2jO1j17K90k16
$$ 0 14 -209 32 118 -40 14 170 -101 -237 -19 -79 -92 29 185 99 232 -16 27 0 -42 -43 18 -99 191 -25
7540b5Jk1J35M8j01P9k80R9K1k09K02n2j10M09j61j17K35J15k12rK2R2l62J79
$$ -25 -24 -45 90 138 37 116 -164 -65 -44 -253 -51 -103 -213 196 35 -82 153 268 56 47 69 161 -201 -22
7564b2K29l89K49N7j88J97J8L9l66m6L81l00K3m3N21l19J11J73j63j34j06j43
$$ -22 207 -182 67 124 -64 133 151 190 -176 -222 159 -141 -118 -161 360 41 152 325 162 28 -78 -221
7586b21K09l7Q7J80j2o7o0l96L51N8j74J00P2o4j55K66l68N27j97J26j33j02l37
$$ -221 -12 -49 38 218 206 139 79 -317 34 92 -82 18 90 26 -129 137 -231 296 99 225 92 -10 -347
7609c47K42Q4n2j2K71l16J37J34l8j72jM64m75K57k40q3J59R1j52J58k10L7L12
$$ -347 -105 -21 -73 -85 186 -130 7 141 103 -69 -70 394 -81 176 -64 -147 12 103 -49 109 -101 -64 248
7632B48m50M0Lm1J92L8Pq2j1J4MJ63j02N1L2j02J21p1O8j45n0N0j46K3K00k47
$$ 248 -202 -162 -159 -200 -8 30 37 -45 -56 -42 -38 125 23 74 106 4 125 54 122 -23 -73 -23 -169 -146 54 -193
7658a93J71K30J22l70J37j79j99M47n7l59L40l9N2J3q1J99l97j26J96J74k24L2
$$ -193 -22 208 330 -40 97 -82 -281 166 109 -250 90 51 103 116 35 234 -163 -289 -93 81 -143 -111
7680a11J73JR8l44J94j37J9J10J26j92L06r3p3r3k10L62j92K18j17Q2O6k78J33
$$ -111 62 63 161 -183 11 -126 -107 3 129 -63 243 150 77 -16 -226 136 -56 162 45 127 193 -85 48
7703D8j76O3K25j43m25L57j41Q0K53p8l4J68k63J13p5j90K32r3J4R4k7j17J75
$$ 48 -128 -65 160 17 -408 -51 -192 -112 141 63 29 197 -66 47 -28 -218 14 -79 -65 29 2 -115 60
7726F0o2K42r8J58l94J27M1J21j59J81M0l47J91j50o4j46O0K48L8n9R5j03J03
$$ 60 -2 240 142 300 -94 33 74 195 36 217 257 -90 101 -49 -113 -259 -199 49 87 28 123 20 123
7749A23l41M57l77K6M6j32J52P2J45j25l9j29J28j36Q7J16P8j58K50m3m63Q2j64
$$ 123 -218 239 -138 -112 -66 -198 -46 26 171 46 7 -122 6 -130 -43 73 151 -7 243 200 -263 -181 -345
7772c45J80K74K2p7N8j40P7j85J94pP2J15j85l77J91n7j3L31k40pJ58n8K32k67
$$ -345 -165 109 131 54 112 -28 49 -136 58 51 123 238 53 -324 -133 -190 -203 128 -112 -119 39 -19 213 -54
7796e4j39J75j31M18j79l29K04nM4R6r5k33L31k52N5k6NJ64k04K93n6r4r8K19
$$ -54 -193 -18 -149 269 90 -239 -35 -40 4 100 5 -228 103 -149 -94 -120 -115 49 -155 138 82 -12 -110 109
7820A09l41O6J31o5m7J22M1O8j25L46l89j37L79k71J23O9r9j31P9MQ4J64l03K36
$$ 109 -232 -166 -35 -100 -147 -25 16 84 -41 305 -84 -221 158 -113 10 79 -20 -151 -72 -68 16 180 -123 113
7844A13O9k23P3m2j4K71j03O8j31LM1K9k20Q4O7j78M1L3R5J40k46J32k03O8k89
$$ 113 182 -41 32 -10 -24 247 144 212 81 84 125 154 -66 18 85 -93 -52 -19 76 216 -30 102 -101 -33 -322
7869c22K53J16J4j30o9r6K51k96K39J00j45J17k03O0l3K63j42J02j41m6J43J54
$$ -322 -69 47 61 -69 -138 -234 17 -279 -40 60 -85 32 -171 -111 -144 119 -23 79 -62 -108 35 189
7891A89Ok9q1k90K89j94k9J19j71mK80k65K7J10J93j23jJ07j64J04l02L59k91
$$ 189 195 166 85 -205 84 -110 -139 -20 -191 -195 85 -180 -153 -43 150 27 26 133 -31 73 -229 130 -161
7914a61R0K75j71J45j30P8k32J85k45KlJ39K56l12R2J2l6J77j43L5K06k64J22
$$ -161 -71 204 33 178 48 126 -106 79 -166 -164 -167 -28 228 -84 8 20 -16 161 18 53 259 -5 117
7937A17m3J2k01R9j1J46lo6j29L52n56Q3J91j0k89K67j03J22Pl7K02l00Q1j99
$$ 117 74 86 -115 -16 -27 119 116 50 -79 273 -283 -200 -9 -19 -308 -41 -144 -22 -15 -52 150 -150 -69 -268
7961b68L57j15PO8K8k22K4J71j77r4J77j71K89j10j8Q9K8Q8l25K02M3k02J06o0
$$ -268 89 -26 -19 49 77 -145 -121 50 -127 -221 -44 -215 74 -36 -54 35 63 151 -174 28 71 -131 -25 -85
7985h5L18k57n9K10j08m5j12J43j52M9L23n24L44j91Q4J14m3r6M9j28R9M9K8j73
$$ -85 233 -24 -83 127 19 -26 -138 5 -147 -98 225 -299 45 -146 -62 52 9 -87 -38 -166 -67 -18 10 -163
8009a63K99p7nj02r8N7k7J14J2o7j35L16q1k18J13L33j87j8k10J83P9j1m18K54
$$ -163 136 59 54 -48 -146 -89 -116 -2 10 -57 -192 124 43 -175 -62 271 84 66 -144 39 118 107 -311 -57
8033e7J81k08L2n9N7p2K71O5j63K4M4J9l0k7l6J6N9j83Kl0K29l21J79N3k6J11
$$ -57 124 -84 -52 -111 -54 -126 145 210 47 71 115 134 104 77 41 57 116 -67 -65 -95 134 -187 -8 45 19 130
8059A30k87p6L23k42K64j01K12m35K14J93M8m00J42J45l24LJ12J28J00j37J54
$$ 130 -157 -233 90 -152 112 11 223 -212 2 195 243 -157 -15 130 -194 -191 -79 49 149 12 166
8080A66Q1k97P4K1l5j46l5K35k57Q6J15l22K98J07k13O6J66n9j32m2K4J57J46
$$ 166 247 -50 24 45 10 -136 -171 64 -193 -107 8 -314 -16 91 -122 -56 110 51 -81 -123 -99 58 204
8103B04J2k35n5J21j00j24K81N0Rl3l19K13J76j06n5j45j1K24k29K10K5n0k09
$$ 204 216 -19 -74 47 -53 -177 104 154 163 130 -189 24 200 94 39 -106 -117 107 -122 88 113 63 -146
8126a46K69j38q7P3j18N2J72J07l4j94p7L4K36k31N4N0K13k47J7j06J14k21K45
$$ -146 123 -15 -102 -29 -147 -95 77 184 150 -44 -121 -87 149 -82 -28 22 235 -12 5 -101 13 -208 37
8149C7j20J58J64j56j8J84j25n2j37O6O5k01K75Q6j67j96J57K0J02N2k86Q4J36
$$ 37 -83 75 239 83 65 249 124 72 -65 1 66 -135 140 226 59 -137 20 40 142 194 -92 -8 128
8172A28l43K15k8K7NQR4n6j01K43k05M4j88J90M6k18J14l2m5
$$ 128 -215 0 -28 -1 4 12 106 50 -51 192 -13 31 -157 33 79 -139 -25 -57 -102
8191a02
$$ Imaginary data points
##PAGE= N=2
##DATA TABLE= (X++(I..I)), XYDATA
0@%%%%%%%%%%%qQqJ6j6J6k4L2l3M1n5O3p2Q8j04J20j36J58j82K07k38K70l06L47
$$ 0 0 0 0 0 0 0 0 0 0 0 0 -8 0 -8 8 -8 8 -16 16 -17 24 -31 32 -40 48 -56 64 -72 86 -96 111 -127 143 -163 184
35A84l92M40m92N50o14O85p64Q47r37J037j146J266j397J541j698J870k061K272
$$ 184 -208 232 -260 290 -324 361 -403 444 -493 544 -602 664 -733 808 -890 980 -1081 1191
53A191k507K768l059L392l772M211m726N338o083P010q200R796j2061J5549k1679
$$ 1191 -1316 1452 -1607 1785 -1987 2224 -2502 2836 -3247 3763 -4437 5359 -6702 8847 -12832
68a2832L5617j26288J0300K38846M1532P6066J15773J1j85031q2396q197j22868
$$ -12832 22785 -103503 -93203 145643 187175 263241 379014 379025 193994 111598 103401 -19467
80a9467j54842N6172R7455l9576k3325J15770K6997j17532n2998M7424l8886p1300
$$ -19467 -174309 -118137 -20682 -60258 -83583 32187 59184 -58348 -111346 -63922 -102808 -174108
92a74108N2350J06103K4044K4319P6983L5271l7974k9102k1369m5571l4093m820
$$ -174108 -121758 -15655 8389 32708 109691 144962 106988 77886 56517 10946 -23147 -27967
104b7967j0488O712M2787J3619k3814J7168K4692n1526n0754L3677J3343n6625
$$ -27967 -38455 -31743 11044 24663 849 18017 42709 -8817 -59571 -25894 -12551 -69176
116f9176Q086Q2188M029m4287M0581M8959n5064n1636L1350m35o1491M13N8571
$$ -69176 -61090 21098 25127 -19160 21421 70380 15316 -36320 -4970 -5405 -66896 -66483 -7912
129g912J2997n91N5406M7756r110j1779m906m6212o3635l5863l2288l2284J5975
$$ -7912 5085 4494 59900 107656 98546 86767 81861 35649 -27986 -63849 -96137 -128421 -112446
142a12446M4555K5473L6933O3901K3223k5989n612L100m7718m8835J5090J8649
$$ -112446 -67891 -42418 -5485 58416 81639 55650 50038 53138 5420 -43415 -28325 -9676
154i676k3346Q336N4507J2067k7517J3289K6656k8180l0592J7416L154l4605r118
$$ -9676 -33022 -24686 29821 41888 14371 27660 54316 26136 -4456 12960 16114 -18491 -27609
167b7609J4511j4253k0193J0413Q389r330P847J9950J276M426K4951J0561k602
$$ -27609 -13098 -27351 -47544 -37131 -28742 -38072 -30225 -10275 -8999 -4573 20378 30939 28337
180B8337J7898J7565j5329j5757N592j5271l9960j1473J1803j2696j3039K3277
$$ 28337 46235 63800 48471 32714 38306 23035 -16925 -28398 -16595 -29291 -42330 -19053
192a9053K1036j3955r026J3262p964k8390j041K0281M638O797L3671K9048L629
$$ -19053 1983 -11972 -20998 -7736 -15700 -44090 -45131 -24850 -20212 -13415 20256 49304 52933
205E2933L660N624j5993k6897j5067j5216k0153m282P538p02M976J7153P456n048
$$ 52933 56593 62217 46224 19327 4260 -10956 -31109 -35391 -27853 -28555 -23579 -6426 1030 -4018
219d018O944R861q273r032Q819J288j4602j800R708m064r225P885J0756l058L66
$$ -4018 2926 12787 4514 -4518 4301 5589 -9013 -10813 -1105 -5169 -14394 -6509 4247 1189 1555
234A555J2306N123n377J045M092o034q945l198m589q550l620J175j293J084P712
$$ 1555 13861 18984 13607 14652 18744 12710 3765 567 -4022 -12572 -16192 -15017 -16310 -15226 -7514
249g514M956Q22N537N152l507m572K844l62o947Q52P353m23k598O253M676n144
$$ -7514 -2558 -1736 3801 8953 5446 874 3718 3356 -3591 -2739 4614 4191 1593 7846 12522 7378
265G378l495J945l528q126k298M04l102j791K425K816K411L981L874L077L230
$$ 7378 3883 5828 2300 -5826 -8124 -7720 -10822 -12613 -10188 -7372 -4961 -980 2894 5971 9201
280I201K072j355j095p13l332m835j593n53k615j670J492K039r30m72K781J481
$$ 9201 11273 9918 8823 8110 4778 -57 -1650 -2203 -4818 -6488 -4996 -2957 -3887 -4359 -1578 -97
296i7k089m96L644O24j739P42K515o11k673Q21J562j286o57J754J692L74p08j07
$$ -97 -2186 -2682 962 1586 -153 589 3104 2493 -180 641 2203 917 260 2014 3706 4080 3372 3265
314C265j76k295l316k261m89r64r67K067M074J890J498L309J519j666k767k430
$$ 3265 3089 794 -2522 -4783 -5272 -6236 -7203 -5136 -1062 828 2326 5635 7154 5488 2721 291
330B91k369l900k376J197K086L364L114M830M041n59k984k486l918n413l285M44
$$ 291 -2078 -5978 -8354 -7157 -5071 -1707 1407 6237 10278 9719 6735 4249 331 -5082 -8367 -7923
346g923K556L409N251N454K282r35m165o311n994n984m517J512O090N407P048
$$ -7923 -5367 -1958 3293 8747 11029 10094 5929 -382 -6376 -12360 -16877 -15365 -9275 -3868 3180
361C180R530N133k469n348n047j0151j1515m497J506L258Q149J4230J2063O629
$$ 3180 12710 17843 15374 10026 4979 -5172 -16687 -21184 -19678 -16420 -8271 5959 18022 24651
375B4651K616j848j0510j4595j1993r799n862L019J1088J0865J1837J1161L353
$$ 24651 27267 25419 14909 314 -11679 -21478 -27340 -24321 -13233 -2368 9469 20630 23983
388B3983p053j0500j1012j5499j2163P35Q416Q434J5919K0714J1048n27r60o117
$$ 23983 16930 6430 -4582 -20081 -32244 -31509 -23093 -14659 1260 21974 33022 32495 31535 25418
402B5418j9417j7397o069m635l758R540J5699O972M142P169k939j3733q141l889
$$ 25418 6001 -11396 -17465 -22100 -25858 -16318 -619 6353 10495 17664 14725 992 -7149 -11038
416a1038q253j661J3080J2148O828J1666R999o290j3872q731j4967k1836q231
$$ -11038 -19291 -20952 -7872 4276 11104 22770 32769 26479 12607 3876 -11091 -32927 -41158
429d1158N581M460R505K4715K2945Q304O645O756j0757k2455j2911j0460j7258
$$ -41158 -35577 -31117 -21612 3103 26048 34352 40997 47753 36996 14541 1630 -8830 -26088
442b6088o680J0451P777K270J1885J1234o468r044k1p725j2842M802J4997O697
$$ -26088 -32768 -22317 -14540 -12270 -385 10849 4381 -4663 -4684 -12409 -25251 -20449 -5452 1245
456A245J1065K3377J1047p070l226n203k4682k5472p422p915j2852N661J9406
$$ 1245 12310 35687 46734 39664 36438 31235 6553 -18919 -26341 -34256 -47108 -41447 -22041
469b2041P844M096J7754J0141q514k440P559n670r434Q416R779m978M86J0722
$$ -22041 -14197 -10101 7653 17794 9280 6840 14399 8729 -705 7711 17490 12512 12998 23720
483B3720m582j6797m481m636j9954j2428O605K264j266J7924K5338P188M713J4552
$$ 23720 19138 2341 -2140 -6776 -26730 -39158 -32553 -30289 -31555 -13631 11707 18895 23608 38160
497C8160k958k3549j3314m798j8321j1106J7046J8062N275J6874K2190n785j9539
$$ 38160 35202 11653 -1661 -6459 -24780 -35886 -18840 -778 4497 21371 43561 37776 18237
510A8237q048j3907k9618j1815J1958N189M243K4650K1979l665l147O030j1734
$$ 18237 10189 -3718 -33336 -45151 -33193 -28004 -23761 889 22868 19203 16056 22086 10352
523A0352k1264L67Q148o373K591K1063P326r364L477N762j7904j7025L152m601
$$ 10352 -10912 -10545 -2397 -8770 -6179 14884 22210 12846 16323 22085 4181 -12844 -9692 -14293
537a4293j7156K450J6563J91O07K2314J5845o860K422J0340j3798k2248n62j600
$$ -14293 -31449 -28999 -12436 -12245 -11638 10676 26521 19661 22083 32423 18625 -3623 -4185 -5785
551e785j7397j478J8526K938o251J2084Q429j6221q789J0535j744q081J6684K1403
$$ -5785 -23182 -24660 -6134 -3196 -9447 2637 11066 -5155 -13944 -3409 -5153 -13234 3450 24853
565B4853j154Q42J3582q080k7234j0655l961k1253j2809J5079R794l619J4541
$$ 24853 23699 24541 38123 30043 2809 -7846 -11807 -33060 -45869 -30790 -20996 -24615 -10074
578a0074K3291j426n271J5277N689j4238N78J2742j0281j6827L147j409k1438
$$ -10074 13217 11791 6520 21797 27486 13248 13826 26568 16287 -540 2607 1198 -20240
591b0240p035J2788l029q424J4958J3618q478r48J5975p18j0567J1856J4776p489
$$ -20240 -27275 -14487 -17516 -25940 -10982 2636 -5842 -6790 9185 8467 -2100 9756 24532 17043
605A7043k712J2604n627k1890m982O23j8528j0799J3873N148o833J1414J8598
$$ 17043 14331 26935 21308 -582 -5564 -4941 -23469 -34268 -20395 -15247 -22080 -10666 7932
618G932l922m754J4344L862j2703K722J2536p947j2057P322O28j7522l902J0438
$$ 7932 4010 -744 13600 17462 4759 7481 20017 12070 13 7335 7963 -9559 -13461 -3023
632c023n116q661J2319J0084r923o76J2493l951j1747P898R341q566r20J3421
$$ -3023 -8139 -16800 -4481 5603 -4320 -4996 7497 3546 -8201 -303 9038 472 -448 12973
646A2973j591j3220K378M031j3378o457J0869K086p093R023J1977o029n479Q185
$$ 12973 11382 -1838 540 4571 -8807 -15264 -4395 -2309 -9402 -379 11598 5569 90 8275
660H275j949j3028R16Q547n896m538J0934L982q608J656Q556n223p349P234L284
$$ 8275 6326 -6702 -5786 2761 -3135 -7673 3261 7243 -1365 291 8847 3624 -3725 3509 6793
675F793j0042j266O360n361q076N816N025n344J388J0883m68o413L747K984q198
$$ 6793 -3249 -4515 1845 -3516 -11592 -5776 -751 -6095 -4707 6176 5708 -705 3042 6026 -2172
690b172l057P599K98m698N753O395o464m693M188l205q888K072O461k905r45Q495
$$ -2172 -5229 2370 2668 -2030 3723 10118 3654 -1039 3149 -56 -8944 -6872 -411 -3316 -4261 4234
706D234K400o333N62L346n437n559M492J313m316J579N645j494l315M092K523
$$ 4234 6634 301 863 4209 -1228 -6787 -2295 -982 -5298 -3719 1926 432 -2883 1209 3732
721C732m064P25M642j020l620K304J390m610j628L100n80l117K913L213k685j652
$$ 3732 -332 393 5035 4015 395 2699 4089 -521 -2149 951 371 -2746 167 3380 695 -957
737i57K150j359n337n4K509k638l34M962K760q63K163L360j747k814P90j144m007
$$ -957 1193 -166 -5503 -5557 -3048 -5686 -6020 -1058 1702 839 3002 6362 4615 1801 2591 1447 -2560
754b560m14J947m16j73L258K336r14N74J266k115l606j088j069k925p52J553P79
$$ -2560 -2974 -1027 -1443 -1616 1642 3978 3064 3638 4904 2789 -817 -1905 -2974 -5899 -6651 -5098 -4319
771d319N37K911K540o9N89R52j58j531J50J031K6j08J012O0j882k232j641k695
$$ -4319 -3782 -871 1669 1600 2189 3141 2983 1452 1602 2633 2659 2551 3563 3623 1741 -491 -2132 -4827
789d827k696o7J103J914L147M133L249J273K44j094l544l746l057k020n06J710
$$ -4827 -7523 -7590 -6487 -4573 -1426 2707 5956 7229 7473 6379 2835 -911 -3968 -5988 -6494 -4784
805d784L659L526L869K815J38k188l951n232n083l922j960P35L467N386O351N126
$$ -4784 -1125 2401 6270 9085 9223 7035 3084 -2148 -7231 -11153 -13113 -12378 -8911 -3525 2826 7952
821G952L527J040k137m558n418n055l237m54K236M383N061M526L000m71l033m816
$$ 7952 11479 12519 10382 5824 406 -4649 -7886 -8340 -6104 -1721 3340 7866 10866 10395 7362 2546
837B546n701n404l425R2K556M068N442M421K262k31j530m082m146k931p17J043
$$ 2546 -3155 -8559 -11984 -11892 -9336 -5268 174 4595 6857 6626 5096 1014 -3132 -6063 -6780 -5737
853e737L588N437M745L665J752j589m663o278n859n169l131N36L729N225N587
$$ -5737 -2149 3288 8033 11698 13450 11861 7198 920 -4939 -10108 -13239 -12703 -8974 -3749 1838
868A838N077K810j203l214m594o530n143j566J416L095O061P435N140K372R80
$$ 1838 6915 9725 8522 5308 714 -5816 -10959 -12525 -11109 -8014 -1953 5482 10622 12994 13974
883A3974k536n930n761l867l580j859K201L958K654L031L518L04k675k210k103
$$ 13974 11438 5508 -253 -4120 -7700 -9559 -7358 -3400 -746 2285 5803 6107 3432 1222 -881
898h81m838l101R36R88N29M457N529J807J465K825o42m283k436j120l983k765
$$ -881 -5719 -8820 -7884 -6896 -6367 -1910 3619 5426 6891 9716 9074 4791 2355 1235 -2748 -5513
914e513J624J256j116J445L271q73k596J351J84k902M37M862J314L56M546K691
$$ -5513 -3889 -2633 -3749 -2304 967 94 -2502 -1151 -967 -3869 -3432 1430 2744 3100 7646 10337
930A0337l048k621J94m569p145j185J255l490L66O217K800r38M102M702k498j783
$$ 10337 7289 4668 4862 293 -6852 -8037 -6782 -10272 -9906 -3689 -889 -1827 2275 6977 4479 2696
946B696M161p80m607L02K348m174l282L104M37n265N31M227l149k763M449K253
$$ 2696 6857 6077 1470 1772 4120 -54 -3336 -232 205 -5060 -4529 -302 -3451 -6214 -1765 488
962D88l327K218P027j44k739L984J509o805l833K051m674o805L244L885l358R57
$$ 488 -2839 -621 6406 6262 3523 7507 9016 2211 -1622 429 -4245 -11050 -7806 -3921 -7279 -6322
978f322P835O95m076L789M192m393j453P292L14m976K142L361p365n919K792k217
$$ -6322 1513 2208 -1868 1921 6113 1720 267 7559 7873 2897 5039 8400 1035 -4884 -2092 -4309
994d309p760K225O991j632j034P463L063n670J032N649l133l987O459L363o010
$$ -4309 -12069 -9844 -2853 -4485 -5519 1944 5007 -663 369 6018 2885 -1102 5357 8720 2710
1009B710p98M197o096q759J892J102o186J262J0155K363j834O762M895o755l595
$$ 2710 1912 6109 13 -8746 -6854 -5752 -11938 -10676 -521 1842 8 6770 11665 4910 1315
1024A315M869k519p488L318N571n471l278O503q81p710K213N830m981l272O139
$$ 1315 6184 3665 -3823 -505 5066 -405 -3683 2820 1939 -5771 -3558 2272 -2709 -5981 158
1039A58J47q610Q9N888l156k555R774N897k960K784O986m491p542K923J205p561
$$ 158 305 -8305 -8216 -2328 -5484 -8039 1735 7632 4672 7456 14442 9951 2409 5332 6537 -1024
1055a024j177O595k770p728J677J227q893l208P593J719k337P978Q909l050k410
$$ -1024 -2201 4394 1624 -6104 -4427 -3200 -12093 -15301 -7708 -5989 -8326 -348 8561 5511 3101
1070C101M751j998q904J221O290k581j436Q918K603p513o58K316q345q564K828
$$ 3101 7852 5854 -3050 -1829 4461 1880 444 9362 11965 4452 3794 6110 -2235 -10799 -7971
1085g971J068o590J878R207j75k791P688N468m728K32P055j912p356J925J357
$$ -7971 -6903 -13493 -11615 -2408 -2583 -5374 2314 7782 3054 3286 10341 8429 1073 2998 4355
1100D355q469m000N164k74l772N919Q774k524j610N079j652r879j412K432n274
$$ 4355 -4114 -8114 -2950 -3224 -6996 -1077 7697 5173 3563 8642 6990 -2889 -4301 -1869 -7143
1115g143l491O507L225m589J968O280k587l661O174M620l406J094O656l279p684
$$ -7143 -10634 -4127 -902 -5491 -3523 2757 170 -3491 2683 7303 3897 4991 11647 8368 684
1130F84P96k10q500k177O830N28k442N795M634n351l711L437k567p172K477N259
$$ 684 1480 1270 -7230 -9407 -2577 -2049 -4491 1304 5938 587 -3124 313 -2254 -9426 -6949 -1690
1146a690k625k51P605K528l883L507N859k530k927M103j58q218k544P12o423o213
$$ -1690 -4315 -4566 3039 5567 1684 5191 11050 8520 5593 9696 9538 1320 -1224 -512 -6935 -13148
1162a3148L678K748k589L079P881N74k626L253J821n815k179L808j175l404M387
$$ -13148 -9470 -6722 -9311 -6232 1649 2223 -403 2850 4671 -1144 -3323 485 -690 -4094 293
1177B93M931j686R4N930J66m470J223J692o285m995J034l704o948k62L855j230
$$ 293 5224 3538 3632 9562 9728 5258 6481 8173 1888 -3107 -2073 -5777 -12725 -12987 -9132 -10362
1193a0362M66P773M878p42L023M289k802m468J122o40m833J85M392m49j109L820
$$ -10362 -9896 -2123 2755 2013 5036 9325 6523 2055 3177 2537 -2296 -2111 2281 1832 723 4543
1209D543K176l287r37K107k595m462n4J41m507k578J972p45k024L638M924J201
$$ 4543 6719 3432 2495 4602 2007 -2455 -2509 -2368 -6875 -9453 -7481 -8226 -10250 -6612 -1688 -487
1225d87K787N396K120j507P45J61m121l736K1j996l764j38K143r52k82L183J135
$$ -487 2300 7696 9816 8309 9054 9215 5094 1358 1379 -617 -4381 -4519 -2376 -3328 -3610 -427 708
1242G08j586K32J525l039k474M63l0j901J847L994K191J693M011K618r97j444
$$ 708 -878 -646 879 -2160 -4634 -4171 -4201 -6102 -4255 -261 1930 3623 7634 10252 9255 7811
1258G811q05l701m718k194j939k552m93K520J745J330K724K424J70o00M80q35
$$ 7811 7006 3305 -1413 -3607 -5546 -8098 -8591 -6071 -4326 -2996 -272 2152 2322 1722 2202 1367
1274A367k264p83M06o92j91K030J369M34K059J435jk64K32r97k140j808j341k683
$$ 1367 -897 -1680 -1274 -1966 -2157 -127 1242 1676 3735 5170 5169 4905 5137 4140 2000 192 -1149 -3832
1292c832k122q02o34o8Q45K272J925K219K700J887O50j0j90j201j705j421p25
$$ -3832 -5954 -6756 -7390 -7458 -6613 -4341 -2416 -197 2503 4390 5040 5030 4840 3639 1934 513 -212
1309b12n81O05J357J176Q98M90M29j210k390k178k593k527j233k32P34J667L145
$$ -212 -793 -188 1169 2345 3243 3733 4162 2952 562 -1616 -4209 -6736 -7969 -8201 -7467 -5800 -2655
1326b655K862K145J874J444M00o49j084j033j391j180r38j32n33K69J61N83K54
$$ -2655 207 2352 4226 5670 6070 5421 4337 3304 1913 733 -205 -337 -870 -601 -440 143 397
1343C97o5l85n4n23o58q67j066j09m31J49R69R00J190J725J633J212O22K1l19
$$ 397 332 -53 -107 -630 -1288 -2155 -3221 -3330 -3761 -3612 -2643 -1743 -553 1172 2805 4017 4639 4660 4341
1362D341j343j213j566j208j483o83M74J54N64J312J104P6L51P2m83j041n19%
$$ 4341 2998 1785 219 -989 -2472 -3155 -2681 -2527 -1963 -651 453 529 880 952 469 -572 -1091 -1091
1380a091l47j60J049N32J48R47R97j09Q2N56l41j183o25n25j551j225K41P4p97
$$ -1091 -1438 -1598 -549 -17 131 1078 2075 1966 2048 2604 2263 1080 455 -70 -1621 -2846 -2605 -2531 -3328
1399c328J007J620K89K75J501Q77n55j85L22o18q44K68K83j274L6J285k52m89
$$ -3328 -2321 -701 -412 -137 1364 2241 1686 1501 1823 1205 361 629 912 -362 -326 959 707 218
1417B18N69R47j293r37N39j373k280k87R61l82L38K490J640l29J721J526j195
$$ 218 787 1734 441 -496 43 -1330 -3610 -3897 -2936 -3318 -2980 -490 1150 821 2542 4068 2873
1434B873j042N10l73k147m1J191j175j093J451L45k186k02J484p86q99J473J015
$$ 2873 1831 2341 1968 -179 -220 971 -204 -1297 154 499 -1687 -1889 -405 -1191 -2090 -617 398
1451C98j422J59K236n29j613J486J316j886p76K006r04k480J122J891k294k51
$$ 398 -1024 -865 1371 842 -771 715 2031 145 -631 1375 471 -2009 -887 1004 -1290 -1541
1467a541K945L60j868J009J748k787j688K019K76k473J440L372j720j317K380
$$ -1541 1404 1764 -104 905 2653 -134 -1822 197 473 -2000 -560 2812 1092 -225 2155
1482B155k30m278r9K022j950j511L363K009k241N32K942k112k943K430J394k601
$$ 2155 1925 -2353 -2452 -430 -2380 -3891 -528 1481 -760 -228 2714 602 -2341 89 1483 -1118
1498a118M15M196o62k985K000Q61l825j242L269n52k951K353K892l005j795L236
$$ -1118 -703 3493 2831 -154 1846 2707 -1118 -2360 909 357 -2594 -241 2651 -354 -2149 1087
1514A087p08l493J513L221k629j703L572l0l747Q56L956j925j315M779J498l478
$$ 1087 379 -3114 -1601 1620 -1009 -2712 860 830 -2917 -2061 1895 -30 -1345 3434 4932 1454
1530A454M51K415l644m095K197J229l569P86N053p57k798L075J267m778j291L313
$$ 1454 1905 4320 676 -3419 -1222 7 -3562 -2776 2277 1520 -1278 1797 3064 -1714 -3005 308
1546C08j274l367L512L478l286r82L955q89l821K076L834k635r03M642n57n132
$$ 308 -966 -4333 -821 2657 -629 -1611 2344 1455 -2366 -290 3544 909 6 4648 4091 -1041
1562a041L19J856m103k462M087J342k668K339M047k495k842L000L41m136P81M206
$$ -1041 -722 1134 -2969 -5431 -1344 -2 -2670 -331 3716 1221 -1621 1379 1720 -2416 -1635 2571
1578B571j505k839L435J205m527m37L727j243k702M004K444l675j513K443k594
$$ 2571 1066 -1773 1662 2867 -1660 -2097 1630 387 -2315 1689 4133 458 -1055 1388 -1206
1593a206m658K006K592j729N15N421J089k819J725J994m102k262K680J50l094
$$ -1206 -5864 -3858 -1266 -2995 -2480 2941 4030 1211 2936 4930 828 -1434 1246 1396 -1698
1608a698J271L006k737k400K923o3l442J028L959j530j931K752P58m514o64K691
$$ -1698 -427 2579 -158 -2558 365 302 -3140 -2112 1847 317 -1614 1138 1896 -2618 -3282 -591
1624e91j353j700L574L061j699O99L429j384l468P00J180l404j431L192n13k770
$$ -591 -1944 -3644 -70 2991 1292 1991 5420 4036 568 1268 2448 -956 -2387 805 292 -2478
1640b478J112J806k561j640L274N09j884J632K782k003j583J569k5l150P03K704
$$ -2478 -1366 440 -2121 -3761 -487 22 -1862 -230 2552 549 -1034 535 510 -2640 -1937 767
1656G67q4m48L038J524k889o21J408k131k988J358Q48k293Q1K439o51k065J688
$$ 767 683 235 3273 4797 1908 1287 2695 564 -2424 -1066 -218 -2511 -2430 9 -642 -2707 -1019
1673a019J576j457j17K863l0j886N50R50k182j822K128j1r40J475K604p36q51
$$ -1019 557 -900 -1017 1846 1816 -70 480 1430 -752 -2574 -446 -457 -1397 78 2682 1946 1095
1690A095J260n48k578j30J020j381j402K015J005j593J11J654m55j100J427J140
$$ 1095 2355 1807 -771 -901 119 -1262 -2664 -649 356 -1237 -1126 528 73 -1027 400 1540
1706A540j061k51J335l24j947L62Q75j748l72J721K90j092R69J444j604j074R28
$$ 1540 479 228 1563 1239 -708 -346 529 -1219 -1591 130 420 -672 297 1741 137 -937 -9
1723ij72j259L97J311n48o52J729O13j128K35J260p43r06J017O9j228j048Q29
$$ -9 -181 -1440 -1043 268 -280 -932 797 1410 282 517 1777 1034 128 1145 1214 -14 -1062 -233
1741b33r21j149Q36J034p60L81J542J33r34N78L04r34j83O88l20o16O33J020o38
$$ -233 -1154 -2303 -1467 -433 -1193 -812 730 863 -71 507 811 -123 -306 382 62 -554 79 1099 461
1760D61l15R25P8q94K40O76p43r79M01o8r69J02M98k41j71O88L25l14N4L63J62
$$ 461 146 1071 1149 255 495 1171 428 -551 -150 -218 -1187 -1085 -587 -828 -999 -311 14 -300 -246 117 279
1781B79l93K09O47p72J16P07k53j83O5L55m56k29L83L0m82J44k28L8o20J60K19
$$ 279 -114 95 742 -30 86 793 540 357 422 777 321 92 475 505 23 167 -61 -23 -643 -483 -264
1802b64n71K79N07r9%J78r9K26K17l54m9m19j9K07n6M22j93J88N9n9M01J14m51
$$ -264 -835 -556 -49 -148 -148 30 -69 157 374 20 -29 -448 -467 -260 -316 106 -87 101 160 101 502 616 165
1825A65M83l25K49l0J79n66l38R3k80j79k15r8J65j92M91J62K38K24K13j69K92
$$ 165 648 323 572 542 721 155 -183 -90 -370 -549 -764 -862 -697 -889 -398 -236 2 226 439 270 562
1846E62j83l4j59m4k39J68j7J64j43K93mL06O7m53k19o2k19j41K3J06J7J24k21
$$ 562 379 345 186 142 -97 71 54 218 75 368 364 670 737 284 65 3 -216 -357 -334 -228 -211 -87 -308
1869c08J91j42K10p9k91O2o3J06j54K84K73K88k2P34k04n9K24R3q07K07k47m03
$$ -308 -117 -259 -49 -128 -419 -357 -420 -314 -468 -184 89 377 355 1089 885 826 1050 1143 336 543 296 -107
1891a07m59j32k10j75J1L26l0J85P80K58J35M55J51k19o48k3j74o50R8J46k3n43
$$ -107 -566 -698 -908 -1083 -1072 -746 -776 -591 189 447 582 1037 1188 969 321 298 124 -526 -428 -282 -305 -848
1913h48O81n7k19J82R17l76k60K52J98l18r6M09l53l51L98L63k74lN73j93q80
$$ -848 -167 -224 -443 -261 656 280 20 272 470 152 56 465 112 -239 159 522 248 245 818 625 -255
1934b55J63K76q17m80L23J3n22K00J277l95j96L87L79l35K34M81K34p07M59L16
$$ -255 -92 184 -633 -1113 -790 -777 -1299 -1099 178 -217 -413 -26 353 18 252 733 967 260 719 1035
1954A035j366L06P47l52m78N97O50q38n36L43m78j507J88O79p96m5J437M78k54
$$ 1035 -331 -25 722 370 -108 489 1139 301 -235 108 -370 -1877 -1689 -1010 -1806 -1851 -414 64 -190
1973a90P13J038m46p97O68q5j147J29J063p82p82R27nj088K71J163p4o15J007
$$ -190 523 1561 1115 318 986 901 -246 -117 946 164 -618 309 304 -784 -513 650 576 -39 968
1992I68N62j676m04M89n55j432Q91J119q11k97J610L52j571N77J179n65n86J633
$$ 968 1530 -146 -550 -61 -616 -2048 -1157 -38 -849 -1146 464 816 -755 -178 1001 436 -150 1483
2010A483L32j421L75M96j276j682R41N97j420Q87K215n91j554J106rj973k48J582
$$ 1483 1815 394 769 1265 -11 -1693 -752 -155 -1575 -688 1527 936 -618 488 479 -1494 -1742 -160
2028a60n4r61K137J177j574k01J121r10j812P28R55j079n73J722m3j765L87J397
$$ -160 -214 -1175 962 2139 565 364 1485 575 -1237 -509 446 -633 -1206 516 473 -1292 -905 492
2046D92j177m43K059N64j403L99J635j892j370J444n6j691O21K424j298q77J458
$$ 492 -685 -1128 931 1495 92 491 2126 234 -1136 308 252 -1439 -818 1606 308 -569 889
2063H89J16k312l05J754q91r91J662J338j629k00K017j142j887J078J372j138
$$ 889 1005 -1307 -1612 142 -749 -1740 -78 1260 -369 -569 1448 306 -1581 -503 869 -269
2079b69k03K319L2k018O44Q31k140j056J729L54j461J631J938j638j338J233j88
$$ -269 -472 1847 1879 -139 505 1336 -804 -1860 -131 223 -1238 393 2331 693 -645 588 400
2096D00k434M99K343j344r51J696P65k123j63J910r63j061K266J314j671K92J575
$$ 400 -2034 -1535 808 -536 -1487 209 974 -1149 -1312 598 -365 -1426 840 2154 483 775 2350
2113B350j533k242R56Q40j728K37K056q7k107J071R41k050l81K049K52j286J303
$$ 2350 817 -1425 -469 371 -1357 -1120 936 849 -1258 -187 754 -1296 -1677 372 624 -662 641
2130F41J878j670j025R47l51k599L93J643r69l37J765O15j514M21J496p52r76
$$ 641 2519 849 -176 771 420 -2179 -1786 -143 -1112 -1449 316 931 -583 -162 1334 582 -394
2147c94J838M56j311j23J330j344j679O72L43j690j20K044k98r65J059P75j604
$$ -394 1444 1900 589 466 1796 452 -1227 -555 -212 -1902 -2022 22 -276 -1241 -182 593 -1011
2164a011k93J369K66r73J447J070r37n55J225o07j256j30R16r70n90J554Q9r81
$$ -1011 -1304 65 331 -642 805 1875 938 383 1608 1001 -255 -385 531 -439 -1029 525 614 -367
2182c67k9J120j079q02J277O75j066L64J167p29j799P90L12j191m42J671k2l28
$$ -367 -396 724 -355 -1157 120 795 -271 93 1260 531 -1268 -478 -166 -1357 -1799 -128 -150 -478
2200d78J198J129j036k72R20n88j087L47L07p88p01P04j95q17L42J042L17m06
$$ -478 720 1849 813 541 1461 873 -214 133 440 -348 -1049 -345 -540 -1357 -1015 27 344 -62
2218f2J176N11q23j30k7j058o52M80J89o54K89J226m0j43N33K49p94k06M57k65
$$ -62 1114 1625 802 672 645 -413 -1065 -585 -396 -1050 -761 465 425 282 815 1064 270 64 521 256
2238B56r00M49k4n40k47O93Q6j49L02R85m01k16N19R2j304K57J01l38q1N08M48
$$ 256 -644 -195 -219 -759 -1006 -313 -227 -376 -74 911 510 294 813 905 -399 -142 -41 -379 -460 48 496
2259D96m87Q48qm79m19j79m21p75j48J51m7l54J115O92P22M62O69O16j99K80n72
$$ 496 9 857 849 370 -49 -228 -649 -1424 -1572 -1421 -1468 -1822 -707 -15 707 1169 1838 2454 2255 2535 1963
2280A963j045q53k98j095m36On1L74J41Q87O15n9J24K24k27m32j22j80l51K15
$$ 1963 918 65 -233 -1328 -1764 -1758 -1809 -1435 -1294 -407 208 149 273 497 270 -162 -284 -464 -815 -600
2300f00M60M4K58M89O60N0K55k99j69l57n84l06q09m86P7l6j98O77M11L33K91
$$ -600 -140 -96 162 651 1311 1361 1616 1317 1148 791 207 -99 -908 -1394 -1317 -1353 -1551 -874 -463 -130 161
2321A61R7K97l54J24m54m24j01K92j15L61N00N83M09K80N3j62k57p21o44j013
$$ 161 258 555 201 325 -129 -553 -654 -362 -477 -116 384 967 1376 1656 1709 1547 1290 569 -75 -1088
2341a088m91n66k11K82L38P10O84J074O52K65J17j65k08m26q35L3n60l89L0K68
$$ -1088 -1579 -2145 -2356 -2074 -1736 -1026 -342 732 1384 1649 1766 1601 1393 967 132 165 -395 -784 -754 -486
2361d86J5K72L29J70N5l44J17l11l33l37Ll79M77M58K17M18Q59K92k12q8J68n20
$$ -486 -471 -199 130 300 355 11 128 -183 -516 -853 -850 -1229 -752 -294 -77 341 1200 1492 1280 1192 1360 840
2383H40m94n63l53p18k06pJ69K79O42M59L11M57m3p6l85m67n37j79n47M85L79
$$ 840 346 -217 -570 -1288 -1494 -1501 -1332 -1053 -411 48 359 816 773 697 312 -155 -692 -871 -1418 -933 -554
2404e54J34Q20O54P98k44M73q6p00o13l13p48p48l32j96k5n6Q51L69m7O49N57
$$ -554 -420 400 1054 1852 1608 2081 1995 1295 682 369 -379 -1127 -1459 -1655 -1680 -1736 -885 -516 -563 86 643
2425F43j82r2j38l2m25j43P13k8m01P78M83l11K1K47l6r81J19k76p60n42Q4j71
$$ 643 461 369 231 199 -226 -369 344 316 -85 693 1176 865 886 1133 1097 116 235 -41 -801 -1343 -1259 -1430
2447a430l29M52O30J53K90J205K49l12J25N7m21o14l0j30o12L05O45m48L9O57
$$ -1430 -1759 -1307 -677 -524 -234 971 1220 908 1033 1090 669 55 25 -105 -717 -412 233 -215 -176 481
2467D81M08o67K4K70n99n06K79k27q63L51P19O9k91J049M03k98J79K34n89n12
$$ 481 889 222 246 516 -83 -589 -310 -537 -1400 -1049 -330 -261 -552 497 900 602 781 1015 426 -86
2487h6r9K59o61k11Q76L96o62K81Q54p58l14N30j92r58M63L00j77o11N51L65p39
$$ -86 -185 74 -587 -798 78 474 -188 93 947 189 -125 405 213 -745 -282 18 -159 -770 -219 146 -593
2508e93K35R64O4k67R44K96j292l19K06r17r70P10K12o36K52J380m2n83M94Q82
$$ -593 -358 606 670 403 1347 1643 351 32 238 -679 -1649 -939 -727 -1363 -1111 269 227 -356 138 1020
2528A020o57k91J136k12r28M65K02j235n14Q91j79p79M98J141m50l88O79p1j063
$$ 1020 363 72 1208 996 68 533 735 -500 -1014 -123 -302 -1081 -583 558 108 -280 399 328 -735
2547g35m7P74k62l61J041N43r17j37O65o82j110P96K75n32P2J409k81o96N37N66
$$ -735 -782 -8 -270 -631 410 953 36 -101 564 -118 -1228 -432 -157 -689 -617 792 511 -185 352 918
2567I18j172o8P89K26q86N76N26j204n43N67l07o85M78R63l99p11J218R2q61J70
$$ 918 -254 -322 467 693 -193 383 909 -295 -838 -271 -578 -1263 -785 178 -221 -932 286 378 -483 -313
2587c13Q29q36j90R11N81p33k12R87p41j058R80M03n24m0J042r7j135L60l0j053
$$ -313 516 -320 -510 401 982 249 37 1024 283 -775 205 608 84 44 1086 989 -146 214 184 -869
2607h69n91J059Jp04R76P94o14m10P96k43o81K54J275k63q02J101p3j293j0L64
$$ -869 -1460 -401 -400 -1104 -128 666 52 -358 438 195 -486 -232 1043 780 -22 1079 1006 -287 -297 67
2627F7j036n72Q40P35n05L60J365k29r18O77L91q49j38O08m84j028K09N2j035
$$ 67 -969 -1541 -701 34 -471 -111 1254 1025 107 784 1175 326 188 796 312 -716 -507 -455 -1490
2646a490m21J128J46m2M70J259j38n71R08j78r99J77Q16r43n11J196n29j030L9
$$ -1490 -1911 -783 -637 -679 -209 1050 912 341 1249 1071 72 249 1065 122 -389 807 278 -752 -713
2665g13N84q71n92Q46M83k76K66J087n8o67M75L24j104J04N24q3o91N41R1r35
$$ -713 -129 -1000 -1592 -746 -263 -539 -273 814 756 89 564 888 -216 -112 412 329 -362 179 270 -665
2685f65m42M81J43r09P08Q79k24N0J193j42n28L70L55o58n61P0n1r79j38O32m66
$$ -665 -1107 -626 -483 -1392 -684 195 -29 21 1214 1072 544 914 1269 611 50 120 69 -910 -1048 -416 -882
2706h82j09P14N54J05J39P54n14r33K76k34p25l7N37k10L1O40L79j98j24M62l50
$$ -882 -991 -277 277 382 521 1275 761 -172 104 -130 -855 -892 -355 -565 -534 106 485 287 163 625 275
2727B75m87M99L77n86k53K98k1k53k78O40n25j39M90K27l17J42R2m55l26J43J79
$$ 275 -212 287 664 78 -175 123 102 -151 -429 211 -314 -453 37 264 -53 89 181 -274 -600 -457 -278
2748b78k95L2M69J48m26P98P1j75j56M06j9j25k69j5k35K19k02L29n01K66K01
$$ -278 -573 -541 -72 76 -350 448 519 344 188 594 575 450 181 166 -69 150 -52 277 -224 42 243
2769B43o00J10K64m36k17k29K78p0K4N32J48K72J70N88m53L05l02N1p02P8n3n39
$$ 243 -357 -247 17 -419 -636 -865 -587 -657 -633 -101 47 319 489 1077 624 929 627 678 -24 54 1 -538
2791e38n13K90J33k31M67J75M06q0N34j17m5l18J9l18k50J14J25N3J30J4J6J62
$$ -538 -1051 -761 -628 -859 -392 -217 189 109 643 526 481 163 182 -136 -386 -272 -147 -94 36 50 66 228
2813B28j93K83j17m06j6j65K10j68J72J19j26L11L51k76ml3j10J92j70j2l18L57
$$ 228 35 318 201 -205 -221 -386 -176 -344 -172 -53 -179 132 483 207 203 170 60 252 82 70 -248 109
2835A09k24k85Q6K51j37p1M2J64J88l9k1j68P2r8N3J1k54K41O6K04j75N03J98
$$ 109 -115 -400 -314 -63 -200 -271 -229 -65 123 84 63 -105 -33 -131 -78 -67 -321 -80 -14 190 15 518 716
2858G16m8M4k60n9k01l93j83p8j76L02k02m9L27L1K69J0M0q6j75P2k52K14M4q2
$$ 716 668 712 452 393 192 -201 -384 -462 -638 -336 -538 -587 -260 -229 40 50 90 4 -171 -99 -351 -137 -93 -175
2882a75K62K57n7K40J89k42j75j56m99O5J37k03J5K67r0J77r9R0J25j63L51m36
$$ -175 87 344 287 527 716 474 299 143 -356 -291 -154 -357 -342 -75 -165 12 -87 3 128 -35 316 -120
2904a20o3K2J63k48j45L12J11K1l69M66J9n7M17j90k30j46KQ2j49mj59j54J31
$$ -120 -183 -161 2 -246 -391 -79 32 53 -316 150 169 112 529 339 109 -37 -35 47 -102 -106 -265 -419 -288
2927b88M60l43%p3L30P7l18J5K71j65m0J34o9l63K68k8J3l5L39N6q7k13M89n82
$$ -288 172 -171 -171 -244 86 163 -155 -140 131 -34 -74 60 -9 -372 -104 -132 -119 -154 185 241 154 -59 430 -152
2951a52r4L15r4k03J70M72l61j08M05j23l04J58K96l89j90K32k85j20n6n3J52
$$ -152 -246 69 -25 -228 -58 414 53 -55 350 227 -77 81 377 -12 -202 30 -255 -375 -431 -484 -332
2972c32l02P37o8K0L0M84k99j47L54J07m97k9M11k78l98K67M0n31N4K02j77ON47
$$ -332 -634 103 35 55 85 569 270 123 477 584 87 58 469 191 -207 60 100 -431 -377 -175 -352 -346 201
2995B01J37j71n3K89r6l73PL46l50n38M73j60l72J92M28l10N4M62J66k26J94L03
$$ 201 338 167 114 403 307 -66 -59 287 -63 -601 -128 -288 -660 -468 -40 -350 -296 166 332 106 300 603
3017F03m62j25N52m0r7j72L65o74n60K32q8r65K42P50K9K01O36L56l56J14K57
$$ 603 141 16 568 528 431 259 624 -50 -610 -378 -466 -1431 -1189 -439 -410 -209 427 783 427 541 798
3038G98l10m46q6K32q51P8P23o3p18J63L14o71M3J005M9k36P37N37j21n19J37
$$ 798 488 42 -44 188 -663 -585 138 75 -643 -480 -166 -837 -794 211 260 24 761 1298 1177 658 795
3059G95m22j125K51P0o77m2L79m8M9J43O87J35l03R82J95p77L56K48l87q21O44
$$ 795 373 -752 -501 -431 -1108 -1150 -771 -819 -770 -627 60 195 -108 874 1069 292 648 896 509 -312 332
3080C32l49j59m09R98m57p29L85j39k42K10P31K09n71M08N62m40j50J68j86l41
$$ 332 -17 -176 -585 413 -44 -773 -388 -527 -769 -559 172 381 -190 218 780 340 190 358 172 -169
3100a69K12K88n51j29N96q3q46K27O00q5n51Q84L09m66J57O31q48n67N1M50o24
$$ -169 43 331 -220 -349 247 164 -682 -455 145 60 -491 393 702 236 393 1024 176 -391 -340 110 -514
3121e14J3N70K77j63L43K61p63l66M14k62m84L32J96k64l97J096m97l07O20L04
$$ -514 -501 69 346 183 526 787 24 -342 72 -190 -674 -342 -146 -410 -807 289 -208 -515 105 409
3141D09R2L5L78J73p55J44p8o52m18K03j60k62Q6N18l53J03M76K29k1K35N94M9
$$ 409 501 536 914 1087 332 476 398 -254 -672 -469 -629 -891 -805 -287 -640 -537 -61 168 147 382 976 1025
3163A025m59L6L58q67m28k03j10j37J16K66j15J5M74J20l36n1O80m60O7P83N33
$$ 1025 566 602 960 93 -335 -538 -648 -785 -669 -403 -518 -503 -29 91 -245 -296 384 -76 -9 774 1307
3184A307o79K15k7l53p26r9p0o16p2M31j20Q1M39L61k07O7P70Q4k84K08J9l28
$$ 1307 628 843 816 463 -263 -362 -432 -1048 -1120 -689 -809 -728 -289 72 -135 -68 702 786 502 710 729 401
3206D01j78J60k20l37L07J17k0m16M9k14m20L13P53n38K07J90M82j63o70K90m57
$$ 401 223 383 163 -174 133 250 230 -186 -137 -351 -771 -458 295 -243 -36 154 636 473 -197 93 -364
3227c64k48J83N28m85N61N38k69j05L07k14o58l93M21j27J25J62N81k44J58k7
$$ -364 -612 -429 99 -386 175 713 444 339 646 432 -226 -619 -198 -325 -200 -38 543 299 457 430
3247D30ro22j67J74l01K40J19K06j11R1K53k64m9j34j20j29l83O16r5NO39R1K4
$$ 430 421 -201 -368 -194 -495 -255 -136 70 -41 50 303 39 -10 -144 -264 -393 -776 -160 -255 -250 389 480 504
3270E04L3j02j12n94J95j92j04j77N52o4j44P26J47l89k23n5k35j67P0K54l3J74
$$ 504 537 435 323 -271 -76 -268 -372 -549 3 -61 -205 521 668 279 56 1 -234 -401 -331 -77 -110 64
3292F4R8K22j8k32o3k07o4j00Q0K1K91j15J13L65Pk48k21N5l9k33N4K6N3OJ03
$$ 64 162 384 366 134 71 -136 -200 -300 -220 -199 92 -23 90 455 462 214 -7 48 9 -224 -170 -144 -91 -85 18
3317A8p4N82n51r3J70q4k43r9L16l13L41K95N0n5j01q6k10j02j59j0L19n9K63
$$ 18 -56 526 -25 -118 52 -32 -275 -374 -58 -371 -30 265 315 260 159 73 -137 -239 -398 -408 -89 -148 115
3340A15K42N9l4l46J62j13j4L3k27q8j36r7M38m6L30k79r2J70j75j41K4j10q4
$$ 115 357 416 382 36 198 85 71 104 -123 -211 -347 -444 -6 -52 278 -1 -93 77 -98 -239 -215 -325 -409
3363d09R2R9R9R8O4K13K38J82j78k18J95l08q9l02K9J20N0J6J33L2k22K9k85J39
$$ -409 -317 -218 -119 -21 43 256 494 676 498 280 475 167 78 -224 -195 -75 -25 -9 124 156 -66 -37 -322 -183
3387a83j91J59J1j03q3o2M12J18K6j55L27j93r1P8L30N3Q9K6j01j58m09j60j97
$$ -183 -374 -215 -204 -307 -390 -452 -40 78 104 -51 276 83 -8 70 400 453 542 568 467 309 -100 -260 -457
3410d57j15Q6K47P5K28K42j26J11j81r2j93j12O2k59L63K03k0K94K19n0j33n5
$$ -457 -572 -486 -239 -164 64 306 180 291 110 18 -175 -287 -225 -484 -121 82 62 356 575 525 392 337
3432C37k17Pk94J53j56k4N4O5nj18K04j22J46J29j79j14n8J74j2j00J04K21n0
$$ 337 120 127 -167 -14 -170 -194 -140 -75 -80 -198 6 -116 30 159 -20 -134 -192 -18 -30 -130 -26 195 145
3455A45J14m9J09k29L50k20n34N3J9k29O1K69l57K85K90J5j74L51j7n1O6J53J63
$$ 145 259 210 319 90 440 220 -314 -261 -242 -471 -410 -141 -498 -213 77 92 -82 269 252 201 267 420 583
3478E83k32l77K36l99j99M6J56m22M60J20L20j19m1L37n49l64oJ02k31J99L18
$$ 583 351 -26 210 -189 -388 -342 -186 -608 -148 -28 292 173 132 469 -80 -444 -450 -348 -579 -380 -62
3499f2o3L77L49P11n60Q6J35l86m86k8m36k76m8J79j88K4J44M54J2k21L62Ok03
$$ -62 -125 252 601 1312 752 838 973 587 101 73 -363 -639 -687 -508 -696 -672 -528 -74 -62 -283 79 85 -118
3522a18N26J48j45K12qj64m02P5j34m92J9M26j72j00J23N14n99op2L66k53L88
$$ -118 408 556 411 623 615 451 49 124 -10 -502 -483 -57 -229 -329 -206 308 -291 -297 -369 -3 -256 132
3544A32N06K63l34L70j09j045l69j22m78l72N51J52L24K28R36K55J29k31J45l35
$$ 132 638 901 567 937 828 -217 -586 -708 -1186 -1558 -1007 -855 -531 -303 633 888 1017 786 931 596
3564E96k98M76n54l23n1O6m98j38J25l7l34J14M29K67J36L87K20J58J02J89j94
$$ 596 298 774 220 -103 -154 -88 -586 -724 -599 -636 -970 -856 -427 -160 -24 363 583 741 843 1032 838
3585H38p62o4k51o09L0J22j84M45M90M02k94J02K8n67k76J03K93k13O09O46J07
$$ 838 76 12 -239 -848 -818 -696 -880 -435 55 457 163 265 293 -274 -550 -447 -154 -367 242 888 995
3606I95j81q1on93p20q5j44l46L67N56J18J56N65J39o16K25j00n10o95O32Mk1
$$ 995 814 733 727 134 -586 -671 -815 -1161 -794 -238 -120 36 601 740 124 349 249 -261 -956 -324 -320 -341
3628c41L40N89j20N6L99K0n84l58R8k17n31R7L61k45K71M10k4m05R6O2m20o4M28
$$ -341 -1 588 468 524 923 943 359 1 99 -118 -649 -552 -191 -436 -165 245 221 -184 -88 -26 -446 -510 -82
3651h2J40L4K40N63l86q8n6j81p67j47J17n6J48O65M13m48O84J53j92p00j87p1
$$ -82 58 92 332 895 509 421 365 184 -583 -730 -613 -669 -521 144 557 109 793 946 754 54 -133 -204
3673b04p07k1P13k22K0L84O1J1j28J90r4m78M73J40J32J05J56J43j0J66r1o94
$$ -204 -911 -932 -219 -441 -421 -37 24 35 -93 97 3 -475 -2 138 270 375 531 674 664 830 739 45
3695D5l63P5l83j84L9K39M3L45L62L2L29j71J33l69l13j32O68o10M36J24P4j92
$$ 45 -318 -243 -626 -810 -771 -532 -489 -144 218 250 579 408 541 172 -141 -273 395 -215 221 345 419 227
3717B27l76L07p40L5Q0n9kN30M06J4k2K81l79J9j34j43k40p3J47j44J55M46m55
$$ 227 -149 158 -582 -547 -467 -526 -528 2 408 422 400 681 302 321 187 44 -196 -269 -122 -266 -111 335 -120
3740a20j72L30k63L07m40K69k8j52ML04K13o9N3L3L22m87M8K0n23JK39nJ69P9
$$ -120 -292 38 -225 82 -358 -89 -117 -269 -265 39 252 183 236 269 591 104 152 172 -351 -350 -111 -116 53 132
3764A32J13k2l63l3q0p5J8j7O7M85J23qk18L8j42O2n16K53J31l23J09Q6M92j64
$$ 132 245 223 -140 -173 -253 -328 -310 -327 -260 225 348 340 122 160 18 80 -436 -183 -52 -375 -266 -180 312 148
3788A48J32j79J41n5o1L3k22J52R9l27O9j80J84L01l28M52k64l02J45Mk7J6J0
$$ 148 280 101 242 187 126 159 -63 89 188 -139 -70 -250 -66 235 -93 359 95 -207 -62 -58 -85 -69 -59
3811e9m26M25j06J84k04O0K55K20n29J02P5l9J20J21J7p6K17L2l60J59n4j92j80
$$ -59 -485 -60 -166 18 -186 -126 129 349 -180 -78 -3 -42 78 199 216 140 357 389 29 188 134 -58 -238
3834b38J0m4p7Q4J67j39K42l53N6K6J07L41n60M82K34j38J95J77L9j98l27r4m40
$$ -238 -228 -272 -349 -265 -98 -237 5 -348 -292 -266 -159 182 -378 104 338 200 395 572 611 413 86 -8 -448
3857d48q6J97m2M05L78r8r3J56k13k40k44m3r5J44J34J52Q2L13N3r5L3O0m90q0
$$ -448 -534 -337 -379 26 404 306 213 369 156 -84 -328 -371 -466 -322 -188 -36 46 359 412 317 350 410 -80 -160
3881a60N2K56n7J1J21r9r8k08JL8j91K70J51n3lM1j42L14j31m07M2J10l5K94p4
$$ -160 -108 148 91 102 223 124 26 -182 -181 -143 -334 -64 87 34 31 72 -70 244 113 -294 -252 -142 -177 117 43
3906D3J13K7N69o0p58mk23J90m32j25J2M29L40K14K73j54oJ9k57j41j95j24O5
$$ 43 156 183 752 692 -66 -70 -293 -103 -535 -660 -648 -219 121 335 608 454 448 467 210 69 -126 -250 -185
3929a85Q8K11j71k38L93p7n6rJ68l31l34K40J31L58k66K82K03q3j27R6j70j51
$$ -185 -97 114 -57 -295 98 21 -35 -44 124 -207 -541 -301 -170 188 -78 204 407 324 197 293 123 -28
3951b8M4m58M00m2K34j65L52k70P6l49M1m7J83m39L52J79J9j2o5K31l27j79j37
$$ -28 16 -442 -42 -84 150 -15 337 67 143 -206 -165 -212 -29 -468 -116 63 82 70 5 236 -91 -270 -407
3974d07l20L69P0J15J15R3N38J38k0j39j6o36q6k25Rj67P08k80K56J21L38l32
$$ -407 -727 -358 -288 -173 -58 35 573 711 691 552 536 -100 -186 -411 -402 -569 139 -141 115 236 574 242
3996B42m01k0j94j06M4Q9Q0J02J80N99j11m01J94j81r8k42N5j60J22N36L11j88
$$ 242 -159 -179 -373 -479 -435 -346 -266 -164 16 615 504 103 297 116 18 -224 -169 -329 -207 329 640 452
4018D52l35k62J58j69m54Q9j18M75L69M38J82kj6l28o16p9j64m69J39N76J10K37
$$ 452 117 -145 13 -156 -610 -521 -639 -164 205 643 825 823 807 479 -137 -216 -380 -849 -710 -134 -24 213
4040B13K50j81j35j97p0k85l37M76M20j0L41M31j82p5j93j98n25j83k46n7k31
$$ 213 463 282 147 -50 -120 -405 -742 -266 154 144 485 916 734 659 466 268 -257 -440 -686 -743 -974
4061i74N19K05J94K68K98Rk85J14J6p26K73K7l8J06J78J93j8k56j12l0p60jK15
$$ -974 -455 -250 -56 212 510 519 234 348 364 -362 -89 -62 -100 6 184 377 359 103 -9 -39 -799 -800 -585
4084e85J5K90N88M26k43L74Q3n05n58n3j46k59K0J48J13k02M28M27m43m3M9K01
$$ -585 -570 -280 308 734 491 865 948 443 -115 -168 -314 -573 -553 -405 -292 -494 -66 361 -82 -125 -76 125
4106A25n13M40J88L8k68L30K90l12J17J89m30m36L08k37l40J00K86k39K51M30
$$ 125 -388 52 240 278 10 340 630 318 435 624 194 -242 66 -171 -511 -411 -125 -364 -113 317
4126C17R9l42J07k8l55l4O9K8p4Q7N26J82m23r1J63l29m19L48n99L62J32O56l02
$$ 317 416 74 181 153 -202 -236 -167 -139 -213 -126 400 582 159 68 231 -98 -517 -169 -768 -406 -274 382 80
4149H0l7K71J32m29j05M84m01j85M38j96J23q7N31o43n52P39n32m6j92N05j86
$$ 80 43 314 446 17 -88 396 -5 -190 248 52 175 88 619 -24 -576 163 -369 -415 -607 -102 -288
4170b88L5L59P4k80L08J88J15j37K53j45l66k69J13N5l80J77N0j35K9K43k84K4
$$ -288 -253 106 180 -100 208 396 511 374 627 482 116 -153 -40 15 -365 -188 -138 -273 -244 -1 -285 -261
4192b61R7K76k03K8M65l08j44J54J58l24n5J53J66m35K97p1m2Q9J87l92L02l26
$$ -261 -164 112 -91 -63 402 94 -50 104 262 -62 -117 36 202 -233 64 -7 -49 40 227 -165 137 -189
4214a89M23k66j44K92J08k77j02K23m66N34k78K10l03L0L14j38j91j83L63J53
$$ -189 234 -32 -176 116 224 -53 -155 68 -398 136 -142 68 -235 -205 109 -29 -220 -403 -40 113
4234A13k52L20L4j05p9O6j43j63J20J42k05K09K51k57J25J27j59k13M2j03N5j43
$$ 113 -139 181 215 110 31 97 -46 -209 -89 53 -152 57 308 51 176 303 144 -69 -27 -130 -75 -218
4256b18J16l4j34L10J7l28J07jL32j56j6l1p1kJ61L5K27m53K76lj84K9L34l55
$$ -218 -102 -136 -270 40 57 -271 -164 -165 167 11 -5 -36 -107 -109 52 87 314 -139 137 134 -50 -21 313 -42
4280d2M0J64k2K7q3M4k25rj52K31l15m6K24k46K09K24p8k9K12j74K02k34n3Q9
$$ -42 -2 162 140 167 84 128 -97 -106 -258 -27 -342 -388 -164 -410 -201 23 -55 -84 128 -46 156 -78 -131 -42
4304d2O8L03q4l21K64K47l52P2k33J8n13K19O0J31LK70j35J1j06J04N8j96J24
$$ -42 26 329 245 -76 188 435 83 155 -78 -60 -573 -354 -294 -163 -160 110 -25 -14 -120 -16 42 -154 -30
4327c0m0K49r0l4J74K17l6l05Lj6l6p3r9J72n6J61M0M8m04J08k65L9J04J0k53
$$ -30 -70 179 89 55 229 446 410 105 108 92 56 -17 -116 56 0 161 201 249 -155 -47 -312 -273 -169 -159 -412
4352d12L98K61k81K12J94j77k54k27j18l6j2L67k13K92K29K1k36o2J74k67O1j
$$ -412 -14 247 -34 178 372 195 -59 -286 -404 -440 -452 -85 -298 -6 223 244 8 -54 120 -147 -86 -87
4374h7L9L8L9K19J38j34m4j37j91k11l2M4L71q7J28K3J28j51k1m45J36J48m0j22
$$ -87 -48 -10 29 248 386 252 208 71 -120 -331 -363 -319 52 -35 93 116 244 93 72 -373 -237 -89 -129 -251
4398b51K75k1K1J27L9J37j77P4m22J73J66j95M3J03J12J59k77m8K20k58q5j99
$$ -251 24 3 24 151 190 327 150 224 -198 -25 141 -54 -11 92 204 363 86 38 258 0 -85 -284
4420b84j10J55j15L09k21P7L39O5j35Q2l5k63L81n87L27J26j42j15M77k24O7J11
$$ -284 -394 -239 -354 -45 -266 -189 150 215 80 162 127 -136 245 -342 -15 111 -31 -146 331 107 174 285
4442B85k22l28J21j47J67j29K02K52k31K15M0j74q1j89J17l80K60M8j52M63J4
$$ 285 63 -265 -144 -291 -124 -253 -51 201 -30 185 225 51 -30 -219 -102 -482 -222 -174 -326 137 151
4463A51o2j26K18qj96m6Q4k36K17K32P2k55J57j0k65K71l87k1p1j16J50K89k37
$$ 151 89 -37 181 173 -23 -69 15 -221 -4 228 300 45 202 192 -73 198 -189 -210 -281 -397 -247 42 -195
4486a95N7J94N8k55P9q9r1K41M9R5J9K46p6n4k14j52j55M5l0J46k92J17M46lJ
$$ -195 -138 56 114 -141 -62 -151 -242 -1 48 143 162 408 332 278 64 -88 -243 -198 -228 -82 -374 -257 189 186 187
4511A87M2P5o33J30K56k16P4M05l94K89j70K69j81l91L7p0K7j39J71L04M3l6J37
$$ 187 229 304 -329 -199 57 -159 -85 320 -74 215 45 314 133 -258 -221 -291 -264 -403 -232 72 115 79 216
4534B16rj69J99m2l92J4L61j93m43M94k65j6K07J3k21m0K98p0R0j49K55K14k97
$$ 216 207 38 237 195 -197 -183 178 -15 -458 36 -229 -245 -38 -25 -246 -286 12 -58 32 -117 138 352 55
4557E5j94O23k67l34J47N5m94J18L47m2k05M74m6k18L1J7k46J33l4J73k6j19N96
$$ 55 -139 484 217 -117 30 85 -409 -291 56 14 -191 283 237 19 50 67 -179 -46 -80 93 67 -52 544
4580E44m64qK25l31j66l12L66Oj65K49M4P7j45L9J48k04r7L20jJ26J90l32l57
$$ 544 80 72 297 -34 -200 -512 -146 -140 -305 -56 -12 65 -80 -41 107 -97 -194 126 125 251 441 109 -248
4603b48L28K28k87j73Q1n0k0j7L32n44j44K96J32j94K44m2L17n11N28r0l06K06
$$ -248 80 308 21 -152 -71 -121 -141 -158 174 -370 -514 -218 -86 -280 -36 -78 239 -272 256 166 -140 66
4625F6J95J04q3P4J17k48k38L8m7k11qQ8K01l18M35M4m18M80j48k45l02K62K25
$$ 66 261 365 282 356 473 225 -13 25 -22 -233 -241 -153 48 -270 165 209 -209 271 123 -122 -424 -162 63
4648F3M4j11L88n4l79Q0J96l75%L45J00l92M45l15L4l91L16k34o6L23K4j47k22
$$ 63 107 -4 384 330 -49 31 227 -148 -148 197 297 -95 350 35 69 -322 -6 -240 -306 17 41 -106 -328
4671c28N35j28j58p5o0K98k26K67K06l23nK17k07p1K04l6j23%K94j86l66J80o4
$$ -328 207 79 -79 -154 -214 84 -142 125 331 8 3 220 13 -58 146 110 -13 -13 281 95 -271 -91 -155
4694a55j02k47M31K3p6M35j17j41J4L02p3j92J9J03k44n3J41m7j95K17M2j16l43
$$ -155 -257 -504 -73 -50 -126 309 192 51 65 367 294 102 121 224 -20 -73 68 21 -174 43 85 -31 -374
4717c74M22j85R1j71J41j04k2L95r5lR1J24lM5N3j9o45J27L53q7j84J31k02k59
$$ -374 48 -137 -46 -217 -76 -180 -202 193 98 95 186 310 307 352 405 386 -259 -132 221 134 -50 81 -121 -380
4741c80J33N22l27l47L92J2m2J3Q4J43k17j12J78QO9L02K68m54K31J3m38J21j65
$$ -380 -247 275 -52 -399 -7 5 -37 -24 60 203 -14 -126 52 60 129 431 699 245 476 489 51 172 7
4764Gp7r1p2K13j28K2K6k5N8k02K63P8K22k3p9k24J24j09J26j62q7L60n70N16
$$ 7 -70 -161 -233 -20 -148 -126 -100 -125 -67 -269 -6 72 294 271 192 -32 92 -17 109 -53 -140 220 -350 166
4788A66J18j7l47K40p2j26J55k13J13j67J94O2j32P9j46j04N2L87j89j43K8O4
$$ 166 284 267 -80 160 88 -38 117 -96 17 -150 44 106 -26 53 -93 -197 -145 242 53 -90 -62 2
4810BM4k22R2L51j30j91J48j90L2J58J38j65r9K8m1Kk37K5J25K32k30J53m5J99
$$ 2 46 -176 -84 267 137 -54 94 -96 -64 94 232 67 -32 -4 -45 -43 -280 -255 -130 102 -128 25 -20 179
4834A79n8l3k36O9J6K60l00J50k38K88N7p7l0j1j56k06M43j14J41k42M8J87J18
$$ 179 121 88 -148 -79 -63 197 -103 47 -191 97 154 77 47 36 -120 -326 117 3 144 -98 -50 137 255
4857B55O5m44K59j09j32j26J23PJ42Ok0N2O5k65p8R7o0q5K0o0PM04j02J4R3M4
$$ 255 320 -124 135 26 -106 -232 -109 -102 40 46 26 78 143 -122 -200 -103 -163 -248 -228 -288 -281 123 21 35 128 172
4883A72j31j90j47J27j38K33p5J17L42k09l7K34j86l5p2Rp9n8J83J20k42L0m9
$$ 172 41 -149 -296 -169 -307 -74 -149 -32 310 101 64 298 112 77 5 14 -65 -123 60 180 -62 -32 -81
4906h1L54l48j00J02j12kk0k0L27p0L06J04j43j76P6l4j33j03k83L03o2K72j51
$$ -81 273 -75 -175 -73 -185 -187 -207 -227 100 30 336 440 297 121 197 163 30 -73 -356 -53 -115 157 6
4929FK17K03r5k76j19k1j6Q6l8r8J12O1j5p9p0M27p1l65o4L5K71j9K5L90j58J38
$$ 6 223 426 331 55 -64 -85 -101 -15 -53 -151 -39 22 7 -72 -142 285 214 -151 -215 -180 91 72 97 487 329 467
4955D67l50m9J18m2m00k26J19J08J88j6J12J3K16j75K23j8O0o6k43k16R8L14k99
$$ 467 117 68 186 144 -256 -482 -363 -255 -67 -83 29 42 258 83 306 288 348 282 39 -177 -79 235 -64
4978f4l2J86jMj45j44Q1j93K11K69j72J38M5j45J05O4m03J0n0J04j29K27NL58
$$ -64 -96 90 89 93 -52 -196 -115 -308 -97 172 0 138 183 38 143 207 -196 -186 -236 -132 -261 -34 -29 329
5002C29l70J06M83k98k44l6k8K54l07K59j62RK8K9j94j23J70l6k02J02j2L85k28
$$ 329 -41 65 548 250 6 -30 -58 196 -111 148 -14 -5 23 52 -142 -265 -95 -131 -333 -231 -243 142 -86
5025h6K05K99k04N8K31k97l09kL33l65k07J89M2k65L3K78N2n6N7R0k12L21k81
$$ -86 119 418 214 272 503 206 -103 -105 228 -137 -344 -155 -113 -378 -345 -67 -15 -71 -14 76 -136 185 -96
5048i6J10j09N06j68p3M8J33j78m14J56J59k94O4M5J64j66J38l00k5K77j24N0
$$ -96 14 -95 411 243 170 218 351 173 -241 -85 74 -220 -156 -111 53 -113 25 -275 -300 -23 -147 -97
5070i7k46J96K20N7j37P1K64l40L17J26l45j10K23r3m10L34j41R2l2O1P9M5O0
$$ -97 -343 -147 73 130 -7 64 328 -12 305 431 86 -24 199 106 -304 30 -111 -19 -51 10 89 134 194
5093A94j00j67l85J47N73l71N7Q2J60N0J37l28R8k06j85J05J25K05j64j99K00
$$ 194 94 -73 -458 -311 262 -109 -52 30 190 240 377 49 147 -59 -244 -139 -14 191 27 -172 28
5114B8N7j80j19K41K23m10K28J09q7l23K21K37l51k83M42J22j01j54K42r7J44
$$ 28 85 -95 -214 27 250 -160 68 177 90 -233 -12 225 -126 -409 33 155 54 -100 142 45 189
5135A89NK14l02j49J20L1l61L66k38j24J67p3p2J11q0L43r2KK00k20o8J06J80
$$ 189 194 408 106 -43 77 108 -253 113 -125 -249 -82 -155 -227 -116 -196 147 55 57 257 37 -31 75 255
5158B55j75j19J64J98n17J75J38m65p6L79k05n2L18p4r3j14J8M59m3m02O75q7
$$ 255 80 -39 125 323 -194 -19 119 -346 -422 -43 -248 -300 18 -56 -149 -263 -245 214 171 -231 444 357
5180C57N3o8j08q7j14R7m42j3L0K36q6L62p3O6j70K12j5l07o6P7J59j60K03J46
$$ 357 410 342 234 147 33 130 -312 -325 -295 -59 -145 217 144 210 40 252 237 -70 -136 -59 100 -60 143 289
5204B89j47l48J13j34R6O5J12j19j32K42J51j29k9M09j74Rj22o4j85k95J8K90
$$ 289 142 -206 -93 -227 -131 -66 46 -73 -205 37 188 59 30 439 265 274 152 88 -97 -392 -374 -84
5226h4m08K70J41J21J35J45k04l16K24L12l54m6J55J38j32j72K02j52n10M65l61
$$ -84 -492 -222 -81 40 175 320 116 -200 24 336 -18 -64 91 229 97 -75 127 -25 -535 -70 -431
5247d31M1O4K04M35j13J37j50O6j07K90l74l56K61k79J57k87K77ok45N37p5j57
$$ -431 -390 -326 -122 313 200 337 187 253 146 436 62 -294 -33 -312 -155 -442 -165 -171 -416 121 46 -111
5269a11k6N2J08m5K75k11n2o1M65K39n31j1q2j10j96Q5on1J97Q6K41q7Q1J02k15
$$ -111 -137 -85 23 -22 253 42 -10 -71 394 633 102 91 9 -101 -297 -212 -218 -269 -72 14 255 168 249 351 136
5294A36m5J06j98j76O5J32j30J9J03j91L13R5p0j74K2m7O2n7M7K42n10M36m0n21
$$ 136 91 197 -1 -177 -112 20 -110 -91 12 -179 134 229 159 -15 7 -40 22 -35 12 254 -256 180 140 -381
5318c81L63j86J59J01l57K10J26n0K94l30L14k17J83l9k62j59J85J2p7K23j29
$$ -381 -18 -204 -45 56 -301 -91 35 -15 279 -51 263 46 229 190 -72 -231 -46 -34 -111 112 -17
5339a7J92k05m0K11j82jo4J18k20K71m6K3o6K37j5m08K34j23k5n9J44r6R1K20
$$ -17 175 -30 -70 141 -41 -42 -106 12 -208 63 17 40 -26 211 196 -212 22 -101 -126 -185 -41 -137 -46 174
5363A74J1j9k80K80O5N3l25J20k83K76n0R8K5j06J08P5j41J3j81K01k41Jj8j2
$$ 174 185 166 -114 166 231 284 -41 79 -204 72 22 120 145 39 147 222 81 94 -87 114 -127 -126 -144 -156
5387a56J53J89p1l59K62j43J65l5k89J73o5p1q5M74J16o9J04K4n4j39Q5j4j72
$$ -156 -3 186 115 -244 18 -125 40 5 -284 -111 -176 -247 -332 142 258 189 293 317 263 124 209 195 23
5410B3j5l38K68p9K01Q1k0j33k73J20j87J30J59k46j6J83J35L67l91K32r9o7j68
$$ 23 8 -330 -62 -141 60 141 121 -12 -285 -165 -352 -222 -63 -309 -325 -142 -7 360 -31 201 102 35 -133
5433a33L06Nj53N7qK9j23K40j65k36J04j44k47M37J6o6p8J76J64j65J68j10K43
$$ -133 173 178 25 82 74 103 -20 220 55 -181 -77 -221 -468 -31 -15 -81 -159 17 181 16 184 74 317
5456C17m60j3J67o6J40k12M49l90K2J29L3m70J95o5L9LL65j92l5M75k20P8j21
$$ 317 -143 -156 11 -55 85 -127 322 -68 -46 83 116 -354 -159 -224 -185 -182 183 -9 -44 431 211 289 168
$$ [...]
8191B
##END NTUPLES=NMR FID
##END=
