##TITLE=1H_Pr Bzt-u
 CDCl3
 8 sc, 
 2.09.2022
##JCAMPDX= 6.0         $$ Bruker NMR JCAMP-DX V2.0
##DATA TYPE= NMR FID
##DATA CLASS= NTUPLES
##ORIGIN= UXNMR, Bruker Analytische Messtechnik GmbH
##OWNER= root
$$ XWIN-NMR		Version 3.5
$$ Fri Sep  2 16:31:28 2022 Russian Standard Time (UT+4h)  she@DPX200
##.OBSERVE FREQUENCY= 200.1313499994
##.OBSERVE NUCLEUS= ^1H
##.DELAY= (6, 6)
##.ACQUISITION MODE= SIMULTANEOUS
##.ACQUISITION SCHEME= undefined
##.AVERAGES= 8
##.DIGITISER RES= 18
##SPECTROMETER/DATA SYSTEM= spect
##.PULSE SEQUENCE= zg30
##.SOLVENT NAME= CDCl3
##.SHIFT REFERENCE= (INTERNAL, CDCl3, 0, 15.7039)
##AUDIT TRAIL= $$ (NUMBER, WHEN, WHO, WHERE, WHAT)
$$ ##TITLE= Audit trail, XWIN-NMR		Version 3.5
$$ ##JCAMPDX= 5.01
$$ ##ORIGIN= Bruker BioSpin GmbH
$$ ##OWNER= she
$$ F:/spectra/data/she/nmr/H-F/1/audita.txt
$$ ##AUDIT TRAIL=  $$ (NUMBER, WHEN, WHO, WHERE, WHAT)
(   1,<2022-09-02 16:30:29.20 +0400>,<she>,<DPX200>,
      <created by zg, POWCHK disabled, PULCHK disabled
       configuration hash MD5:
       00 E9 B6 7A A2 85 ED C7 34 08 36 98 17 FE 4E 26
       data hash MD5: 16K
       9C 6C 01 A4 1B AF 15 80 93 BA 3D 14 C5 83 A9 6E>)
$$ ##END=
$$ 
$$ hash MD5
$$ 88 3B B3 99 DF FB B6 B0 BF 9E 46 F0 60 71 41 B9
##$RELAX= 
##$RELAX= 
##$RELAX= 
##$RELAX= 
##$RELAX= 
##$RELAX= 
$$ Bruker specific parameters
$$ --------------------------
##$DU= <F:/spectra>
##$EXPNO= 1
##$NAME= <H-F>
##$PROCNO= 1
##$TYPE= <nmr>
##$USER= <she>
##$AMP= (0..31)
100 100 100 100 100 100 100 100 100 100 100 100 100 100 100 100 100 100 
100 100 100 100 100 100 100 100 100 100 100 100 100 100 
##$AQSEQ= 0
##$AQ_mod= 1
##$AUNM= <au_zg>
##$AUTOPOS= <>
##$BF1= 200.13
##$BF2= 200.13
##$BF3= 200.13
##$BF4= 200.13
##$BF5= 200.13
##$BF6= 200.13
##$BF7= 200.13
##$BF8= 200.13
##$BYTORDA= 1
##$CFDGTYP= 0
##$CFRGTYP= 5
##$CHEMSTR= <none>
##$CNST= (0..31)
1 1 145 1 1 1 1 1 1 1 1 1 1 1 1 1 1 1 1 1 1 1 1 1 1 1 1 1 1 1 1 1 
##$CPDPRG= <>
##$CPDPRG1= <>
##$CPDPRG2= <>
##$CPDPRG3= <>
##$CPDPRG4= <mlev>
##$CPDPRG5= <mlev>
##$CPDPRG6= <mlev>
##$CPDPRG7= <mlev>
##$CPDPRG8= <mlev>
##$CPDPRGB= <>
##$CPDPRGT= <>
##$D= (0..31)
0 1.2 0 0 0 0 0 0 0 0.06 0 0.03 0 0 0 0 0.0002 0 0 0 0 0 0 0 0 0 0 0 0 
0 0 0 
##$DATE= 1662121828
##$DBL= (0..7)
120 120 120 120 120 120 120 120 
##$DBP= (0..7)
150 150 150 150 150 150 150 150 
##$DBP07= 0
##$DBPNAM0= <>
##$DBPNAM1= <>
##$DBPNAM2= <>
##$DBPNAM3= <>
##$DBPNAM4= <>
##$DBPNAM5= <>
##$DBPNAM6= <>
##$DBPNAM7= <>
##$DBPOAL= (0..7)
0.5 0.5 0.5 0.5 0.5 0.5 0.5 0.5 
##$DBPOFFS= (0..7)
0 0 0 0 0 0 0 0 
##$DE= 6
##$DECBNUC= <off>
##$DECIM= 32
##$DECNUC= <off>
##$DECSTAT= 4
##$DIGMOD= 1
##$DIGTYP= 9
##$DL= (0..7)
0 120 120 120 120 120 120 120 
##$DP= (0..7)
150 150 150 150 150 150 150 150 
##$DP07= 0
##$DPNAME0= <>
##$DPNAME1= <>
##$DPNAME2= <>
##$DPNAME3= <>
##$DPNAME4= <>
##$DPNAME5= <>
##$DPNAME6= <>
##$DPNAME7= <>
##$DPOAL= (0..7)
0.5 0.5 0.5 0.5 0.5 0.5 0.5 0.5 
##$DPOFFS= (0..7)
0 0 0 0 0 0 0 0 
##$DQDMODE= 0
##$DR= 18
##$DS= 0
##$DSLIST= <SSSSSSSSSSSSSSS>
$$ [...]
##$SUBNAM2= <"">
##$SUBNAM3= <"">
##$SUBNAM4= <"">
##$SUBNAM5= <"">
##$SUBNAM6= <"">
##$SUBNAM7= <"">
##$SUBNAM8= <"">
##$SUBNAM9= <"">
##$SW= 18.0517283424941
##$SWIBOX= (0..15)
0 0 2 0 0 0 0 0 0 0 0 0 0 0 0 0 
##$SW_h= 3612.71676300578
##$TD= 16384
##$TD0= 1
##$TE= 0
##$TE2= 300
##$TE3= 300
##$TEG= 300
##$TL= (0..7)
0 120 120 120 120 120 120 120 
##$TP= (0..7)
150 150 150 150 150 150 150 150 
##$TP07= 0
##$TPNAME0= <>
##$TPNAME1= <>
##$TPNAME2= <>
##$TPNAME3= <>
##$TPNAME4= <>
##$TPNAME5= <>
##$TPNAME6= <>
##$TPNAME7= <>
##$TPOAL= (0..7)
0.5 0.5 0.5 0.5 0.5 0.5 0.5 0.5 
##$TPOFFS= (0..7)
0 0 0 0 0 0 0 0 
##$TUNHIN= 0
##$TUNHOUT= 0
##$TUNXOUT= 0
##$USERA1= <user>
##$USERA2= <user>
##$USERA3= <user>
##$USERA4= <user>
##$USERA5= <user>
##$V9= 5
##$VALIST= <valist>
##$VCLIST= <CCCCCCCCCCCCCCC>
##$VD= 0
##$VDLIST= <DDDDDDDDDDDDDDD>
##$VPLIST= <PPPPPPPPPPPPPPP>
##$VTLIST= <TTTTTTTTTTTTTTT>
##$WBST= 1024
##$WBSW= 4
##$XGAIN= (0..3)
0 0 0 0 
##$XL= 0
##$YL= 0
##$YMAX_a= 170680
##$YMIN_a= -102772
##$ZGOPTNS= <>
##$ZL1= 120
##$ZL2= 120
##$ZL3= 120
##$ZL4= 120
##$ABSF1= 10
##$ABSF2= 0
##$ABSG= 5
##$ABSL= 3
##$ALPHA= 0
##$AQORDER= 0
##$ASSFAC= 0
##$ASSFACI= 0
##$ASSFACX= 0
##$ASSWID= 0
##$AUNMP= <proc_1d>
##$AZFE= 0.1
##$AZFW= 0.1
##$BCFW= 1
##$BC_mod= 2
##$BYTORDP= 1
##$COROFFS= 0
##$CY= 11.3945322036743
##$DATMOD= 1
##$DC= 2
##$DFILT= <>
##$DTYPP= 0
##$F1P= 2.36226072786647
##$F2P= -0.459571619588291
##$FCOR= 0.5
##$FTSIZE= 0
##$FT_mod= 4
##$GAMMA= 1
##$GB= 0.15
##$INTBC= 1
##$INTSCL= 1
##$ISEN= 128
##$LB= 0.24
##$LEV0= 0
##$LPBIN= 0
##$MAXI= 10000
##$MC2= 0
##$MEAN= 0
##$ME_mod= 0
##$MI= 1.114404
##$NCOEF= 0
##$NC_proc= 0
##$NLEV= 6
##$NOISF1= 3.799351
##$NOISF2= 2.8
##$NSP= 1
##$NTH_PI= 0
##$NZP= 0
##$OFFSET= 15.70392
##$PC= 1
##$PHC0= -18031.38
##$PHC1= 4.400689
##$PH_mod= 1
##$PKNL= yes
##$PPARMOD= 0
##$PSCAL= 0
##$PSIGN= 0
##$REVERSE= no
##$SF= 200.130013532006
##$SI= 16384
##$SIGF1= 3
##$SIGF2= 2
##$SINO= 400
##$SIOLD= 16384
##$SREGLST= <1H.CDCl3>
##$SSB= 0
##$STSI= 0
##$STSR= 0
##$SW_p= 3612.71676300578
##$SYMM= 0
##$S_DEV= 0
##$TDeff= 0
##$TDoff= 0
##$TI= <>
##$TILT= no
##$TM1= 0
##$TM2= 0
##$TOPLEV= 0
##$USERP1= <user>
##$USERP2= <user>
##$USERP3= <user>
##$USERP4= <user>
##$USERP5= <user>
##$WDW= 1
##$XDIM= 8192
##$YMAX_p= 0
##$YMIN_p= 0
$$ End of Bruker specific parameters
$$ ---------------------------------
##NTUPLES= NMR FID
##VAR_NAME=  TIME,          FID/REAL,        FID/IMAG
##SYMBOL=    X,             R,               I
##VAR_TYPE=  INDEPENDENT,   DEPENDENT,       DEPENDENT
##VAR_FORM=  AFFN,          ASDF,            ASDF
##VAR_DIM=   8192,          8192,            8192
##UNITS=     SECONDS,       ARBITRARY UNITS, ARBITRARY UNITS
##FACTOR=    0.0002768,     1,               1
##FIRST=     0,             0,               0
##LAST=      2.2672688,     0,               0
##MIN=       0,             -102772,         0
##MAX=       2.2672688,     170680,          0
$$ Real data points
##PAGE= N=1
##DATA TABLE= (X++(R..R)), XYDATA
0 0 0 0 0 0 0 0 0 0 0 0 0 0 0 0 -2 8 -8 8 -8 10 -16 16 -22 24 -28 32 -40 42 -50 58 -66 74 -87 98 -112 126
36 126 -138 158 -177 195 -218 242 -268 298 -330 363 -400 441 -486 537 -591 650 -718 793 -876
55 -876 969 -1076 1200 -1343 1512 -1716 1966 -2283 2699 -3270 4110 -5476 8079 -14906 77814
70 77814 170680 128142 104697 39109 -12706 -62796 -85228 -98295 -82071 -58148 -26970 -6831
82 -6831 10885 11970 5923 -6179 -12538 -15090 -5176 12978 39016 60472 74321 72709 54723 20447
96 20447 -20544 -60729 -90125 -102772 -92725 -63499 -21903 21181 58799 80457 81687 65856
108 65856 39431 6967 -21415 -36649 -37778 -29428 -11234 8917 21094 22799 16737 457 -20578
121 -20578 -36869 -43560 -41697 -28196 -5093 18837 37718 49022 48270 34768 13978 -8594 -28071
134 -28071 -39184 -38822 -27066 -8902 11880 29095 38198 36119 24407 6307 -13705 -30291 -38875
147 -38875 -37217 -26602 -10374 7464 23142 30890 30944 23680 11710 -2482 -13294 -18089 -18692 -13928
161 -13928 -5450 2388 6244 7120 4018 -3519 -10615 -14408 -14628 -10270 -323 12088 23092 30892 33727
176 33727 29389 18736 4419 -10787 -25003 -33576 -36196 -32401 -24310 -12639 -967 8777 15245
189 15245 17953 17593 14820 11294 8037 5969 4907 3786 3388 1490 -2330 -6335 -10356 -14504 -16181
204 -16181 -14732 -11030 -5822 1629 8832 13997 16717 18113 15190 10658 5068 -758 -5956 -9928 -12012
219 -12012 -12867 -12413 -10338 -8011 -5522 -2705 51 2336 5055 7413 8538 9238 8941 8080 5924 3779
235 3779 919 -1309 -3316 -4362 -5040 -4587 -4094 -3862 -2481 -1184 -957 -55 1128 1304 1509 1977 1985 1018
253 1018 -147 -965 -1859 -3407 -3536 -3147 -2647 -1120 967 2340 3433 4563 4552 3773 2524 1643 292
270 292 -454 -772 -1145 -1003 -723 -432 -685 -751 -950 -1705 -2178 -2403 -2364 -2205 -1496 -1072 -652 64 841 1076 1571
291 1571 1915 1802 1433 1268 489 -320 -583 -575 -873 217 1016 1874 3173 3674 3037 2108 573 -1766 -3281
310 -3281 -4432 -4610 -4219 -2593 -589 1074 2280 2214 1032 -820 -2726 -4312 -4809 -3650 -1288 1932
326 1932 5038 7904 8611 7420 4829 484 -3484 -6402 -7733 -7252 -4068 330 4394 7432 8879 7152
342 7152 3338 -1614 -6560 -10347 -11447 -9511 -5254 296 5801 9244 10015 7896 3310 -2612 -7880
357 -7880 -10973 -10749 -7489 -1343 5896 11909 15335 15033 10988 3853 -4069 -11004 -15273 -15351 -11295 -4364
373 -4364 3561 10176 13558 12821 8385 1149 -6375 -12290 -15127 -13092 -7539 309 8215 14118 16085
388 16085 13065 6421 -2799 -11649 -17638 -18778 -14858 -6641 4085 14255 21324 23561 20800 12691
402 12691 1641 -8784 -16588 -20420 -18722 -12724 -4531 3170 8721 10283 7618 1885 -4846 -10286
416 -10286 -12301 -9802 -3019 6130 15484 21946 23654 19375 9980 -2456 -14956 -25278 -30125 -27591
430 -27591 -19908 -7548 6112 17597 24740 26221 22197 13901 3589 -4927 -10674 -12480 -10204 -5347
444 -5347 -431 2221 2977 -787 -6958 -13279 -17758 -18523 -14364 -5087 6565 18550 28295 33039 31218
459 31218 23385 10814 -3646 -16839 -26220 -29451 -26819 -19717 -9455 504 8679 12818 13028 9943
473 9943 5027 999 -1325 -848 1107 4921 8429 9450 7674 3215 -3771 -11974 -17792 -20557 -19556
488 -19556 -14172 -4816 5592 14252 20890 22919 20240 14046 5602 -3098 -10021 -13294 -13333 -10595 -5675
503 -5675 -627 3516 5145 4274 1761 -1980 -5716 -7386 -6970 -4669 -1329 3213 6625 8105 7611 5678
519 5678 2644 -667 -2960 -3555 -2940 -749 2459 4511 4933 4677 2109 -1951 -5814 -8571 -10183 -9900
535 -9900 -7299 -2861 1696 6092 9986 11980 11065 9516 6505 2403 -1604 -5231 -7743 -10474 -11476
550 -11476 -10958 -9972 -8580 -5326 -1419 2563 6843 10790 13616 15269 15295 13498 9893 4590 -81 -5266
566 -5266 -10191 -13490 -14819 -15707 -14702 -12267 -8722 -4782 100 5110 9468 13076 15997 17217 15673
581 15673 12754 8459 2376 -5095 -10570 -15493 -18361 -18241 -15068 -10050 -4147 2506 8125 11880 13938
596 13938 13949 12288 8893 5851 3015 378 -1998 -3519 -5178 -7112 -9071 -10343 -11481 -11666 -9584 -6204
612 -6204 -1580 3885 9674 14052 15513 15247 12508 7083 763 -4184 -8662 -10725 -10229 -7466 -4254 -892
628 -892 2397 3903 3157 1845 261 -1848 -2966 -2172 -416 1318 3797 5065 5103 3367 825 -2381
644 -2381 -5057 -6676 -7016 -5492 -2889 715 4225 5940 6694 6003 3491 452 -2643 -3845 -4487 -3503
660 -3503 -956 1603 3731 5153 5352 3623 791 -2003 -4436 -6703 -7205 -5758 -3715 -1206 1629 3542
676 3542 4119 3388 2586 1296 -294 -734 -659 -275 1211 2593 3250 3100 2312 689 -1375 -3334 -4316 -4501
694 -4501 -3853 -2073 154 1636 3088 3554 3146 2048 269 -1352 -2459 -3386 -3362 -2585 -1566 -361 797
711 797 1611 1969 1894 1562 1311 630 619 442 442 176 558 363 227 63 22 110 -209 -390 -275 -899 -857 -902 -1027
734 -1027 -918 -650 -448 -55 -4 5 -184 -565 -671 -1190 -1424 -1111 107 1071 2620 3561 4009 3626 2707 1468
754 1468 -185 -2100 -3279 -3622 -3555 -2924 -1197 667 1804 2547 2402 1458 536 -1390 -2331 -2720 -2423 -1102
772 -1102 -177 1287 2229 2265 1749 438 -780 -2472 -2602 -2402 -1341 771 2521 4063 4910 4645 3122
789 3122 1050 -1362 -3378 -4872 -5156 -4031 -2181 -46 1873 2934 2808 1976 409 -1376 -3161 -3856
805 -3856 -3345 -1764 166 2148 4025 4213 3639 2566 577 -1750 -2939 -3775 -2770 -1732 329 2469
821 2469 3689 3935 3313 2003 -490 -2513 -4011 -4218 -3421 -2103 -532 1166 2122 2518 1910 755 -959
838 -959 -2179 -2502 -2144 -1333 134 1641 3167 3744 3360 2669 988 -467 -1838 -2251 -2388 -1667 -443 454
856 454 1626 1718 1165 419 -706 -1794 -2247 -2429 -2005 -987 -47 599 1246 945 967 262 -225 -651 -679 -488
876 -488 -54 732 928 1128 1435 691 634 234 -80 -343 -134 219 459 649 227 -115 -757 -923 -1482 -1837 -2020
897 -2020 -1310 -1244 -449 -298 -73 -299 -70 178 198 830 1350 2384 2857 3450 3164 1781 776 -1014 -2674
916 -2674 -4054 -4291 -4273 -3174 -1520 530 2051 2993 3210 2904 2025 943 123 -583 -736 -178 107 -74
934 -74 -655 -1600 -2685 -4009 -4685 -4930 -3752 -1518 1643 4221 6867 8923 9201 7575 4836 1421 -1973
951 -1973 -5529 -7363 -7825 -7178 -5358 -2981 -1023 320 1111 1335 1198 684 1059 1821 3057 4255 5393
968 5393 5355 4209 2485 -568 -4207 -7121 -8797 -8974 -7325 -4194 -93 3778 7436 9189 9092 7796
984 7796 4577 1611 -1406 -3752 -4735 -4502 -3538 -2065 -844 -892 -982 -1633 -2748 -3533 -3504 -2332 -294 2299
1002 2299 5443 7435 8154 7169 5186 2027 -1915 -5083 -6423 -6681 -5622 -2748 111 2236 4082 4258
1018 4258 3504 1049 -801 -2870 -3716 -3604 -2263 -239 1814 3571 4049 3041 1669 -369 -2593 -3828
1034 -3828 -4451 -3738 -1981 76 2116 3420 3728 3281 1944 -99 -1740 -2438 -2683 -1562 158 2028
1050 2028 3668 4096 3782 2382 -43 -2640 -4522 -6139 -6320 -5191 -3000 -1125 1299 3291 4374 3864
1066 3864 3265 2360 984 -31 -382 -228 291 613 1094 741 -94 -950 -2554 -3277 -3843 -3111 -2062 -278
1084 -278 1852 3725 4243 4623 3947 2093 12 -1704 -3179 -4200 -4270 -3481 -2292 -1251 394 1219 1580
1101 1580 1865 1883 1579 1114 1053 1326 1413 1557 1545 1222 157 -576 -1071 -2034 -2911 -2728 -2397 -2036 -859 124
1121 124 1115 1502 1548 1668 1035 458 3 -137 -863 -900 -370 -368 68 267 485 181 299 269 221 -210 51 212
1143 212 384 511 678 853 500 299 -148 -733 -712 -873 -1220 -1035 -376 -495 -128 -199 117 134 -11 -28 -7 202
1165 202 190 405 285 533 1023 1091 1371 890 772 539 139 30 -218 -697 -882 -873 -981 -732 -524 -178 -75
1186 -75 -431 -71 -175 -305 -435 -357 -182 -191 57 411 499 412 659 736 680 581 624 420 328 466 532 72 -185 -379
1210 -379 -655 -1141 -937 -828 -628 -445 45 425 743 1005 761 771 135 -209 -425 -790 -858 -909 -986 -681 -334
1231 -334 -126 340 477 526 822 1048 1453 1511 1287 1305 1006 93 -339 -868 -1284 -1774 -1888 -1728 -1296 -925 -745
1252 -745 119 206 393 521 617 265 314 229 394 366 397 306 707 152 -284 -333 -875 -1100 -698 -389 147 681 1198
1275 1198 1311 1538 1089 167 -466 -938 -1386 -1911 -1352 -1200 -691 -21 326 576 712 300 25 -25 -196 62
1295 62 443 1039 1158 1440 1020 895 150 -780 -982 -1319 -1430 -1116 -608 484 1015 1253 1420 896 386 -474
1315 -474 -1154 -1644 -1639 -1421 -792 -52 685 861 1181 778 52 -176 -790 -1003 -923 -359 488 1364 1571 2137 1592
1336 1592 940 253 -627 -1203 -1456 -1770 -1292 -371 62 534 570 744 -315 -683 -1198 -1528 -1386 -940 -330 442
1356 442 1158 1549 1760 1017 545 -134 -735 -1020 -1114 -587 -116 624 1119 1443 1448 1076 -219 -740 -1343 -1699 -1654
1377 -1654 -1080 -515 450 937 944 762 247 -407 -1151 -1316 -1368 -1018 -379 519 1138 1301 1568 1445 1149 292 -318
1398 -318 -644 -1070 -753 -410 429 744 879 635 451 -26 -792 -1131 -1369 -1283 -759 -300 568 1044 1205 1091
1418 1091 479 4 -505 -1117 -1195 -1113 -672 -165 548 977 1448 1091 1417 481 34 -157 -348 -272 29 131 481
1439 481 559 266 45 -698 -1082 -1438 -1633 -1502 -1150 -517 310 960 1128 1529 1195 770 357 6 -103 -248
1459 -248 -201 -187 37 290 513 360 209 88 -461 -316 -520 -217 -209 284 449 766 533 216 -16 -571 -1022
1480 -1022 -1047 -1102 -1021 -894 -439 32 528 693 864 659 421 340 424 282 223 452 426 251 392 -40 -152 -98
1502 -98 -408 -625 -613 -684 -570 -266 -96 -120 35 98 437 38 -97 -301 -81 -198 -135 352 301 508 362 502
1524 502 307 25 24 152 -131 -59 130 215 289 266 358 95 46 20 -19 -515 -430 -392 -424 -674 -426 -247 -338 -306 -439
1549 -439 -131 -243 -59 275 182 759 756 525 585 876 572 293 72 271 -125 -282 -430 -286 -270 -402 -134 -474
1571 -474 -280 -276 -293 -100 -133 -6 51 127 -190 113 -122 -80 267 -163 -15 -49 98 174 -92 114 424 426 341 412
1595 412 444 230 99 -279 -300 -186 -388 -350 -174 -191 -54 -133 -205 -248 -283 -243 -410 -91 8 -153 154 307 -60
1618 -60 393 342 206 219 207 156 234 73 409 120 67 -27 151 -198 -160 -147 -275 -350 -205 -254 -620 -343 -205 33
1642 33 -53 -146 -137 -135 -73 168 107 96 60 370 132 365 423 399 345 258 392 164 206 -99 116 -43 19 -231 -256 -265 -393
1669 -393 -346 -426 -351 -316 -647 -346 -526 -236 51 21 -143 211 217 351 318 599 475 459 224 522 40 64 241
1692 241 -185 -214 -211 -203 -166 -294 -237 -185 11 -126 231 168 -133 107 -133 -204 -272 -157 -264 -206 -133 72 -157 305
1716 305 134 14 339 226 623 473 238 314 326 208 284 -147 -269 -388 -225 -320 -343 -222 -79 -57 64 -80
1738 -80 -152 91 139 224 -66 -31 214 -61 -27 16 205 214 44 92 216 434 91 301 80 314 -211 75 -37
1761 -37 -177 -121 -154 -175 -489 -262 -727 -445 -270 -233 -105 -178 69 173 201 392 228 187 261 263 151 -90 219 117
1785 117 -78 152 340 61 199 134 254 244 191 73 -13 -289 -77 -239 -286 -342 -74 -428 -166 -382 -384 -197 -355
1808 -355 152 -39 58 373 669 363 563 347 97 172 54 206 -53 -237 -93 -364 1 -89 40 -91 327
1829 327 -137 -50 20 1 -228 -61 -37 -224 -210 -236 -219 -306 -238 -252 -82 -45 80 1 591 332 511 599 810 601
1853 601 229 150 -179 -484 -591 -696 -439 -700 -414 -313 -386 49 -345 136 170 56 394 292 350 272 150 309
1875 309 -18 -58 -496 -393 -367 -435 -202 -3 295 294 788 731 979 545 409 202 -199 -231 -492 -631 -638 -865 -491
1898 -491 -507 -464 -135 -82 -74 37 -55 389 692 612 608 559 674 184 292 -208 -268 -486 -485 -469 -115 -127 -18 273 364
1923 364 516 218 40 -264 -234 -565 -421 -280 -342 -9 3 130 -188 89 11 -260 -128 54 64 313 328 255
1945 255 350 117 116 176 174 92 82 131 -148 63 214 62 64 291 -74 -265 -282 -864 -706 -476 -261 -285 -291 10 256
1970 256 561 354 678 592 525 405 446 484 191 -201 -3 -95 -334 -642 -100 -355 -222 -23 200 195 468 161
1992 161 392 314 206 66 -578 -392 -283 -547 -404 -674 -713 -179 -70 134 272 389 480 839 761 551 394
2013 394 486 -87 -171 -307 -452 -327 -416 -630 -293 -454 -280 -40 -79 69 126 -117 -184 272 28 -10 274 -77
2035 -77 -103 -105 -203 -246 255 -158 42 165 187 323 133 63 326 299 51 221 232 -61 -125 50 -178 -61 -278 -365
2059 -365 -503 -749 -514 -499 -462 -144 109 3 467 315 385 474 423 112 131 41 -145 -78 -315 8 -100 -81 -195
2082 -195 116 -153 175 -169 55 311 408 108 202 146 -63 47 -223 -551 -503 -322 -704 -554 -390 184 250 637
2104 637 1052 1008 987 847 677 304 202 -116 -350 -486 -705 -346 -569 -523 -616 -356 -78 85 395 638 770
2125 770 893 670 571 140 209 -441 -675 -844 -930 -982 -975 -392 -149 431 423 995 1058 1329 1147 1030 773 347 54
2148 54 -350 -986 -954 -1093 -1284 -820 -714 -757 -561 76 236 561 1138 1021 1026 895 709 304 67 -341 -721 -772
2170 -772 -910 -791 -341 -289 -120 319 816 759 770 751 733 523 397 -308 -32 -549 -659 -720 -888 -544 -578 -432
2192 -432 -364 86 80 305 234 735 413 562 294 401 151 38 -108 -130 -118 -395 4 2 282 258 100 -16 -283
2215 -283 -212 -407 -135 -544 -497 -445 -257 -330 -64 -87 324 199 -5 362 722 326 274 165 -92 221 -224 -238
2237 -238 -304 -441 -552 -284 -100 -10 -39 397 647 762 684 592 280 174 -318 -581 -612 -837 -635 -953 -679 -578
2259 -578 -30 -92 195 517 818 699 940 1168 854 586 335 102 115 -380 -608 -766 -821 -634 -584 -101 -199 156
2281 156 247 568 712 735 556 63 -29 -6 -491 -378 -494 -527 -553 -368 -335 -117 48 -22 -20 389 575 599 692 525
2305 525 540 165 246 -258 -138 -254 -679 -464 -461 -462 -277 -165 -32 261 318 151 323 177 81 84 55 48 343 -118
2329 -118 -166 -188 -305 -400 -52 -103 164 150 302 548 587 737 756 527 128 -128 -204 -515 -674 -780 -789 -522 -444 -253
2353 -253 -163 225 -395 295 449 340 536 383 421 214 510 407 -154 63 -335 -437 -529 -599 -415 -20 -134
2374 -134 411 610 640 553 579 251 86 -114 -217 -240 -471 -559 -437 -469 -671 -245 -704 -276 -51 35 144 455
2396 455 888 857 718 918 297 509 -173 -327 -680 -721 -821 -972 -133 -213 -163 310 158 124 245 222 67 -37
2418 -37 19 -221 -64 74 49 -307 -217 -96 -395 -385 -433 -263 31 292 481 492 924 513 649 310 -98 -283
2440 -283 -48 -259 -311 -162 -93 -171 -15 81 -7 -461 -356 -367 -501 -20 -108 115 292 122 420 462 308 372 221
2463 221 166 -15 -268 -90 -149 187 -23 118 -94 -82 -69 -296 -254 -106 13 -179 64 2 -150 64 182 -68
2485 -68 -499 -314 -517 -277 -207 36 117 528 744 423 393 330 -60 -40 -238 -304 -362 -55 4 -209 -239 -92 -270
2508 -270 -141 -139 39 -114 -11 42 336 373 217 62 -282 -435 -195 -352 -704 -202 -204 79 459 829 935 1004
2530 1004 1035 637 206 -118 -323 -416 -510 -815 -662 -379 -666 -181 -105 41 289 34 602 194 190 423 292 491
2552 491 255 -66 -347 -460 -939 -635 -765 -673 -293 62 483 647 649 880 714 360 200 -262 -238 -509 -625
2573 -625 -702 -326 -295 -58 -117 -12 -212 -170 -103 -23 29 234 345 320 135 289 -179 -217 -310 -191 -103 50 104 639
2597 639 814 845 437 679 99 -182 -579 -905 -1091 -1189 -708 -704 -290 301 563 771 836 843 762 429 380 254 -121
2620 -121 -300 -432 -578 -772 -1047 -1011 -895 -775 -226 -2 654 1222 1898 2076 1804 1623 832 135 -514 -1465
2640 -1465 -2225 -2226 -2130 -1670 -1381 -492 -56 662 761 1290 1648 1617 1262 1200 1195 694 309 -68 -600 -996 -1321 -1650
2662 -1650 -2050 -1525 -1109 -655 394 1245 1816 2098 2074 1770 1318 383 100 -785 -1496 -1669 -1774 -1444 -1044 -602
2682 -602 -266 -139 300 422 662 969 867 1059 1079 1433 1181 659 233 -39 -1122 -1499 -1827 -1556 -1392 -713
2702 -713 -322 381 999 1354 996 753 568 -22 -184 -409 -349 -520 -178 -6 463 136 352 155 -94 82
2722 82 -213 -171 104 250 449 650 743 708 108 176 -174 -369 -557 -400 -219 -122 322 360 559 351 7 -529
2744 -529 -881 -985 -563 -623 -310 119 326 508 1005 987 800 458 452 -4 -218 -395 -227 -252 -114 -9 -314 -405
2766 -405 -300 -222 -173 -222 -186 24 103 442 827 815 613 551 193 -71 -616 -875 -876 -883 -501 -94 -97 330 494 557 522
2791 522 548 387 455 368 101 46 -150 -152 55 -530 -364 -777 -658 -330 -494 -466 60 146 322 595 552 371 434
2814 434 655 56 188 -129 -148 -163 -120 107 33 32 113 120 66 272 172 358 175 -172 23 -36 -92 -22 -116 -191 -216
2839 -216 -348 -462 -370 -108 25 10 350 435 399 466 260 542 284 382 -103 -71 -219 -115 -180 -168 -230 -195 -67 -159
2863 -159 -138 50 -7 339 302 91 264 59 80 -136 -62 135 -191 -63 -285 -237 -89 -5 -63 -18 522 278 332
2886 332 68 389 201 169 99 -302 -219 -317 -353 -483 -193 -279 -184 -251 -117 -128 154 -82 204 174 212 68 -31 321
2910 321 165 246 114 141 48 -242 -130 8 -40 44 50 7 327 -140 46 131 268 -54 -193 -107 -57 -126 29 -422
2934 -422 -136 -156 -202 -264 -235 -294 58 -103 65 -172 -16 0 235 174 184 164 450 283 157 3 28 -215 -352
2957 -352 -224 -278 -171 -436 29 -48 406 47 338 375 -42 -83 -289 -83 -153 -108 -61 66 35 18 220 -61 -20
2980 -20 39 156 38 328 343 361 433 452 352 -177 -468 -677 -937 -883 -708 -452 -170 276 501 909 670 452
3002 452 264 249 54 -326 -420 -369 -367 -397 -114 -184 -607 -209 -24 3 23 288 751 1050 1038 1221 891 660 72
3025 72 -637 -958 -1339 -1439 -1247 -1082 -771 -318 483 598 803 1049 1006 998 602 426 346 391 36 -414 -417 -645 -1040
3048 -1040 -830 -1045 -888 -593 -174 200 824 1480 1489 1656 1410 899 232 -400 -1155 -1540 -1601 -1527 -1184 -869 -641
3069 -641 -90 202 521 462 626 829 658 771 743 509 475 274 193 -177 -709 -1094 -976 -1098 -839 -472 -137
3090 -137 242 483 721 838 520 591 -41 -348 -643 -738 -306 -402 -73 113 368 357 162 15 339 88 -163
3111 -163 -167 -406 -230 70 -33 265 -204 177 168 110 257 356 445 196 418 323 68 -79 -694 -646 -787 -1011 -1140
3134 -1140 -602 -465 -186 306 605 1008 1186 1170 1236 1135 660 372 -32 -546 -429 -955 -1420 -1328 -1404 -1000 -625
3155 -625 -147 166 992 1130 1363 1381 1252 1063 444 -107 -254 -836 -1214 -1296 -1431 -1034 -1010 -720 -543 -227 595
3176 595 674 954 1231 1504 1536 1382 964 400 -201 -872 -1089 -1773 -1566 -1454 -1059 -530 -93 525 659 1099 1130
3197 1130 729 859 828 631 432 247 299 -129 -208 -373 -635 -933 -1011 -877 -869 16 263 515 895 1133 1268 688
3219 688 552 280 -234 -569 -897 -631 -691 -704 184 293 372 136 48 -213 -376 -454 70 81 142 566 717 916
3241 916 747 276 124 -458 -558 -711 -754 -241 -254 -70 130 398 375 152 -62 -542 -688 -763 -475 -443 362 471
3263 471 715 641 648 253 44 -409 -491 -420 -943 -407 96 492 199 824 354 357 -152 -88 -396 -365 -266 -202 222 343
3287 343 223 158 -48 -318 -537 -769 -633 -539 -72 -101 232 668 644 663 379 441 -221 -503 -500 -462 -263 -267 76 194
3311 194 466 158 295 35 -75 -370 -242 -299 -45 -27 180 345 188 177 -164 -57 -173 -246 -317 23 -240 137
3333 137 266 283 248 253 327 105 91 52 -332 -389 -255 57 270 -62 309 -109 -2 -7 -168 -376 -241 -350 -278 -70
3357 -70 209 -32 133 102 70 -65 -127 -120 -315 -91 17 -28 51 163 257 409 252 124 141 -155 -253 -300 -154 -175
3381 -175 -144 -132 102 155 157 -63 147 -232 22 -48 -321 -31 324 183 354 89 133 -55 203 29 -234 42
3403 42 -161 304 245 181 164 195 141 -83 -151 -172 -275 -219 -407 -271 -265 -154 141 246 583 53 290 358 10 50
3427 50 -52 19 155 111 170 33 -42 13 -206 -233 -254 -294 -126 190 141 311 218 162 198 -5 -78 -368 -549 -199 -552
3452 -552 -456 -135 38 201 -39 -47 -82 126 -214 -122 408 313 291 288 40 198 -15 -266 -135 -266 -298 -76 -79 -24
3476 -24 79 58 269 69 97 -22 54 -188 -20 -112 58 186 264 275 119 202 -16 64 -252 -328 28 144 -249
3499 -249 38 111 215 47 -202 -29 -257 -170 115 92 238 513 477 652 402 131 -500 -657 -728 -1060 -839 -356
3521 -356 -379 119 461 543 822 438 493 202 225 394 220 206 275 -44 -195 -205 -752 -868 -1280 -955 -656 -510
3543 -510 14 654 1084 1363 1270 1136 660 124 -344 -737 -1147 -1074 -1134 -862 -637 -271 63 118 465 324 156
3564 156 254 118 428 727 732 817 606 181 -272 -760 -1351 -1642 -1843 -1245 -669 -100 220 852 1301 1091 1095 553
3586 553 146 -376 -476 -352 -298 -67 -275 59 -187 -126 -400 -259 -978 -486 -162 -170 173 719 1033 966 973 268
3608 268 -14 -557 -911 -886 -856 -638 -321 293 387 610 373 429 187 -243 -399 -492 -527 34 263 628 598 1111
3630 1111 820 449 154 -274 -362 -678 -426 -427 27 168 179 313 -13 -132 -208 -745 -419 -327 -53 364 628 970
3652 970 990 666 321 -220 -630 -874 -902 -892 -666 -142 2 305 709 914 736 332 250 38 -98 -138 -68 129
3674 129 -32 -26 -78 -324 -506 -650 -918 -999 -627 -307 184 466 1205 1113 1245 1113 521 303 -116 -572 -463 -666
3696 -666 -623 -228 -317 70 146 14 12 129 116 -97 64 27 246 239 137 494 39 123 -330 -491 -572 -600 -412 -179
3720 -179 -288 35 146 423 451 628 307 307 -69 -60 3 76 112 43 147 -46 264 -149 85 -229 -150 -2 -85 -60
3744 -60 -178 109 420 402 212 168 86 179 -147 47 -34 -109 -348 213 -86 152 217 26 -100 -50 56 -10 -18 89
3768 89 325 166 344 55 180 -32 -44 -247 -121 -171 -213 -413 87 -217 -89 300 -1 -98 42 97 -26 91
3790 91 -16 14 -112 98 133 178 89 -7 166 -22 -126 -172 -200 -74 -187 -5 263 112 49 -162 102 15 -1 -249
3814 -249 -21 -157 -164 113 181 257 281 141 287 177 -103 91 100 -177 327 -66 -179 -321 47 -21 -142 -117 -320
3837 -320 74 -128 -169 19 192 370 133 65 47 -260 -293 -136 -169 -16 212 -76 295 19 288 -11 129 72
3859 72 72 134 46 140 116 89 51 -1 8 -225 -292 -206 -260 -208 -131 33 343 308 283 94 117 105 -357 -117 -271 91 212
3886 212 192 135 202 359 181 -162 329 38 -273 -3 118 220 183 189 68 154 -17 -466 -374 -251 -603 -430 -18
3909 -18 37 228 612 491 346 84 40 0 -201 -6 -63 234 255 171 259 79 148 -129 -347 -406 -528 -250 -120
3932 -120 -17 188 548 418 555 186 -217 -338 -775 -608 -695 -376 -360 360 324 121 357 112 214 -5 -259
3953 -259 -41 -83 184 150 393 400 87 247 -299 -402 -744 -749 -639 -386 -210 237 554 776 487 512 -18 52 -437
3976 -437 -485 -287 -200 125 104 335 389 188 -66 12 -489 -181 -439 -166 51 42 364 690 474 212 -45 -207
3998 -207 -431 -654 -655 -158 -440 -22 230 234 232 117 77 -359 -146 -446 -162 34 6 381 542 777 499 210 -140
4021 -140 -134 -370 -395 -374 -418 -10 58 116 43 169 172 -22 -206 -171 18 6 254 391 335 478 309 149 -242 -552
4045 -552 -532 -547 -622 -247 -159 76 207 567 331 668 232 139 206 71 -81 -103 -51 207 -254 -335 -197 -265 -501
4068 -501 -533 -415 -154 -5 -153 386 623 672 453 423 89 -146 -209 -8 -339 -339 -314 -461 -172 -89 154 210 276
4091 276 51 171 180 190 187 272 259 24 182 -4 -271 -151 -383 -184 -137 -111 -81 87 113 98 8 376 300 232 207
4116 207 16 247 71 8 -309 -179 172 -14 -15 -185 -106 -249 31 -54 39 -181 -46 220 201 56 -40 209 165
4139 165 -19 85 255 -137 87 -216 29 -9 -199 -390 23 155 19 30 88 198 155 -97 95 279 52
4160 52 -260 88 85 -234 -43 -128 -18 -52 -136 -310 -205 -180 -49 -2 57 290 412 263 327 466 177 -161 -194 -17
4184 -17 -113 53 67 -131 -50 191 -284 -13 5 112 75 173 32 226 53 -128 235 87 -165 28 25 -56 184
4207 184 -277 -24 23 10 -139 258 9 282 116 115 59 -21 -7 91 40 56 59 -43 -84 -94 -180 -154 -304 -42 133
4232 133 64 -82 98 -13 187 101 112 164 27 -126 -205 50 52 -286 -19 -4 62 -17 68 244 -109 -40 134 6
4256 6 219 -226 -95 -119 -91 62 -23 94 5 149 -175 69 26 -56 -158 -295 -69 -64 11 61 -96 88 93 33 -291
4281 -291 -129 94 105 -85 293 -280 56 -103 -45 -31 -2 -57 -225 -151 -99 66 145 82 265 166 249 -34 -234 -112
4305 -112 5 123 -102 44 187 241 108 99 117 308 135 -251 -56 -352 -72 248 211 106 163 -8 9 -164
4327 -164 81 -89 -9 -94 103 50 -117 216 331 14 -137 -282 -84 170 -118 -165 -103 269 258 539 606 -47
4349 -47 -87 -148 41 -165 -349 -240 138 213 37 -13 56 203 98 35 -300 16 -235 -185 126 509 232 5 9
4372 9 25 102 257 -106 -168 -77 73 12 142 -24 105 168 33 0 34 -61 82 9 147 -103 185 78 174 38
4396 38 -211 -209 -15 -11 -102 109 -79 435 160 86 -15 -29 -244 49 -114 -284 -67 -105 -112 -7 -109 227 -114 -232
4420 -232 -179 -89 -32 -73 363 47 -20 158 272 64 14 -88 -195 -194 26 -181 21 -87 206 216 308 147 -96
4443 -96 119 46 121 -10 140 -125 119 73 -69 12 -95 -91 -74 -243 99 -260 -46 171 202 202 309 65 112 -145
4467 -145 -80 89 23 -137 -167 241 279 227 68 143 -1 -59 -76 -1 6 5 230 15 174 159 -14 8 9 -250 -266 -387
4493 -387 -72 215 -30 290 108 -291 179 1 -141 -152 -272 111 -9 65 135 205 57 -96 53 -114 61
4514 61 -124 -302 -72 180 173 53 310 203 -81 -167 -132 -36 -20 37 274 -55 101 207 140 -40 -55 176 -92
4537 -92 -76 -218 125 -40 93 -93 37 332 63 77 -182 -111 -192 -288 -210 -217 -184 -331 -73 -117 -39 -74 18 -105 20
4562 20 -59 77 -17 279 154 99 -126 -7 -29 -202 -95 -179 -77 -46 -222 -112 37 -102 -178 106 18 -33 82
4585 82 44 -114 -170 10 103 -138 128 -191 -60 126 -147 -102 -127 334 57 144 -17 275 185 132 65 73 97 -165
4609 -165 -301 50 -140 -54 -2 -132 132 -209 82 -22 -328 -246 -146 -161 -108 157 96 47 171 56 75 53 -1
4632 -1 -95 -113 99 186 115 -199 -273 -17 -36 -12 84 8 -54 38 0 -54 51 70 50 -49 96 -268 12 -117 59 74
4658 74 132 13 -81 4 -109 -8 177 301 86 70 -157 95 110 117 58 8 -143 114 -197 -225 -81 -140 -119 126
4682 126 -126 -101 108 -116 113 181 -77 -14 -2 -65 199 101 -111 233 -73 268 99 -125 85 0 281 79
4704 79 -184 12 -246 -22 -203 -209 108 17 14 88 -17 -227 -62 -92 -91 54 -107 -57 501 109 11 -38 -68 -79 16
4729 16 123 38 89 -54 -45 48 -64 -129 72 39 -283 47 -5 -28 -6 -4 -41 -15 175 -107 -147 -211 -49 149 -194 23
4755 23 2 263 -6 -13 86 -27 87 -35 28 -62 -16 83 -124 -52 -294 -21 -98 -233 -95 -52 -156 184 -65 -37
4779 -37 -66 99 -40 36 -149 -13 -292 -267 -267 -140 229 -29 -59 212 250 103 -7 -202 89 262 134 -48 3
4802 3 49 260 -60 -262 -135 -271 -137 -551 -81 159 -1 -109 22 -39 377 76 8 -188 -76 3 -153 -222
4824 -222 16 -25 113 -112 75 395 53 38 103 224 108 48 211 123 314 218 275 -239 -225 -152 -106 -176 -202 -218
4848 -218 -256 -1 253 43 194 -145 87 226 -88 30 -143 168 -134 -5 263 -36 -26 332 -148 -166 -343
4869 -343 113 55 -40 27 10 128 151 333 182 -32 63 12 81 -67 -165 -24 60 215 46 161 78 55 -16 -7 193
4894 193 -148 305 49 120 -250 -160 -371 -92 56 -368 -242 37 91 -60 -140 91 152 159 233 79 -234 150 -134
4917 -134 -201 -94 33 -143 179 243 107 182 372 -140 232 -36 -93 -120 -176 -96 6 -57 -148 89 -194 -190 -229 -12
4941 -12 46 5 -117 4 12 74 63 43 2 -139 -167 -180 -291 -196 9 93 106 222 73 352 -53 -15 -112 44 -72
4966 -72 -64 -286 -153 -246 -228 47 -18 172 -322 -38 -49 -115 94 126 182 105 262 174 328 73 -28 -349 -257 -188 -183
4991 -183 -417 3 32 -138 228 183 56 235 148 -20 -213 98 -10 279 68 31 -288 8 6 26 210 -75
5013 -75 -153 85 39 232 103 261 409 144 220 -72 174 -184 -122 -91 -103 -224 -3 153 -86 -341 61 227
5035 227 -120 -120 -15 -20 -87 13 -109 -27 21 -49 -85 94 156 -14 137 21 -123 170 103 28 260 1 86 243
5059 243 -25 38 -50 -114 -405 -147 187 -20 85 119 7 31 -245 -195 -248 -128 -67 8 268 9 8 76 46 104 -128
5084 -128 35 -118 280 160 66 -90 187 76 -99 316 32 -52 -31 136 204 140 222 46 -185 112 -129 197
5106 197 -32 -112 108 -149 -199 -82 61 44 94 355 71 200 126 277 -103 -208 6 -172 -178 134 -32 80
5128 80 -89 65 107 -107 -279 115 28 6 87 -220 187 -153 127 -147 202 61 42 107 168 92 73 -120 145
5151 145 -29 -88 51 51 -62 -92 -92 61 -9 -24 -112 39 -147 131 16 25 237 52 26 53 -130 64 -71 -265
5175 -265 -150 17 71 -87 200 70 262 132 143 203 168 -86 -118 143 320 -271 -129 -269 238 -215 -35 179
5197 179 267 61 -31 221 74 -41 64 156 -66 56 129 -95 -53 -165 -516 -47 -88 -38 95 171 26 236 210
5220 210 13 -40 -19 -300 -105 -171 -40 -276 -55 -18 -138 113 -52 -51 -70 33 122 -136 271 12 190 37 21
5243 21 64 -251 -284 -290 -129 -486 -238 180 146 96 169 174 166 -102 120 -114 -314 -174 -136 -281 -130 195 247 112 -69
5268 -69 -144 44 -472 -242 -158 95 44 154 377 -18 151 -5 -209 -210 -458 -238 -294 4 288 224 313 148 69
5291 69 131 62 -272 -293 -320 -64 60 -65 46 84 173 78 -154 -160 -177 -128 197 -51 -183 252 30 368 205 -30
5315 -30 -188 -170 -238 -328 -337 -175 268 -87 224 228 148 194 -66 -197 -158 -225 -256 204 -198 240 -71 129 -156 201
5339 201 -52 -90 -123 -383 185 263 -98 40 404 228 21 190 92 -194 -97 -272 -427 -26 -102 270 10 281
5361 281 386 126 305 -119 -157 -14 -49 225 86 103 56 119 109 -129 6 78 -344 39 -46 94 -23 148 58
5384 58 -148 148 8 -190 67 31 -174 39 -148 -83 67 -45 23 71 61 -11 -69 -39 -64 -82 -23 181 85 -42
5408 -42 46 -104 -140 24 -270 -1 -131 -83 -17 16 154 169 73 -83 133 359 -51 40 -148 -26 -143 97 44
5431 44 120 -104 322 292 -203 296 49 -54 -154 -110 -3 -135 203 192 212 -13 267 78 -153 104 -165 113
5453 113 107 -5 111 28 198 94 -26 160 -93 -248 -146 87 17 -20 -20 147 -84 359 119 388 7 -68 13
5476 13 -2 -112 -213 -116 2 14 -58 78 -59 67 118 -35 -55 86 175 111 421 267 195 65 -153 -291 -163
5499 -163 -75 -145 -42 -240 183 74 95 30 124 367 165 -58 -19 -25 -131 -251 -77 206 118 -110 74 -127 -301
5522 -301 86 -169 -52 22 71 262 -3 29 211 -43 138 -162 -260 -291 -87 -126 -27 75 -111 -5 288 -67
5544 -67 36 79 25 -177 -179 -42 142 4 -40 79 27 -16 15 -213 -304 -189 -36 56 -152 -112 -110 86 307 112 158
5569 158 55 -9 151 178 -85 52 -282 -245 -63 -117 -123 -99 45 218 59 9 114 31 -252 184 39 84 38 -176
5593 -176 9 -76 -242 69 -110 -157 -282 89 -123 261 96 101 -101 226 341 22 -107 -344 -195 -190 -151 -239 -208
5616 -208 -32 -106 175 90 206 320 65 -78 -22 -62 64 201 -168 247 -103 -242 -180 -102 -139 -147 -233 247 17
5639 17 336 240 132 221 166 15 -116 -284 -76 -384 -59 -234 15 -161 334 -20 -138 392 7 173 -70
5660 -70 50 -2 22 -278 111 93 -60 -141 -248 -249 -138 -28 -19 20 245 74 409 -49 136 361 -184 -147 -111 -191
5684 -191 -208 33 -116 -87 -94 223 -108 -177 70 61 -71 60 66 114 -23 -133 -11 24 42 -24 -96 39 -243 88 76
5709 76 109 387 227 36 178 -178 -82 -71 -121 -151 -487 -101 -254 174 38 70 264 404 210 27 -35 75 -423
5732 -423 -6 -146 -46 -52 111 -14 20 -173 86 -109 -182 23 57 204 168 77 -234 -125 89 -75 -321 -203
5754 -203 98 -311 -106 110 120 -62 5 131 251 358 319 186 15 166 83 -32 0 98 -179 -138 -112 -76 125
5777 125 -137 51 10 408 271 167 -72 152 155 74 181 56 64 82 -121 -116 -177 -313 113 6 316 161 20
5800 20 363 326 319 221 99 -49 -229 232 -188 -155 139 149 51 51 26 -183 -32 -135 -1 -3 -80 7 122 231 60
5825 60 174 -28 -151 54 -524 -123 109 60 91 269 -96 -259 196 167 -31 -194 -101 -443 18 207 21 107
5847 107 -75 56 -174 -378 -152 -320 -148 -211 322 281 1 329 120 185 -41 131 -94 -162 95 -131 -22
5868 -22 24 -97 39 -24 -130 45 -47 -200 -45 -271 -489 125 131 32 168 -35 47 -36 -115 -125 -364 -257 24 84
5892 84 213 13 179 242 47 -119 152 -15 -303 -251 -4 -1 109 126 39 -126 34 123 -199 -235 -6 -240 55
5915 55 -295 90 101 327 112 21 -9 -240 -370 102 -99 -37 -66 244 -127 265 90 -125 165 94 -21 -206
5937 -206 -153 95 68 149 67 -63 35 -19 221 -118 13 37 139 -64 34 -95 195 195 246 -84 30 91 96 -88 41
5962 41 -236 -23 143 22 40 99 -243 -144 -114 19 176 147 31 17 -117 114 -202 113 -123 266 -58 -3 57
5985 57 -135 -196 -292 -258 -117 -220 76 72 179 44 10 110 3 -1 16 -68 47 -98 23 313 119 17 -173 -55
6009 -55 98 -136 -287 -74 123 -95 277 227 -102 -155 112 -81 7 -104 174 -282 88 60 -85 460 24 -5
6031 -5 -54 -30 -157 15 -86 0 -96 -100 175 68 349 119 -146 -30 -88 -92 -116 -90 -13 4 -231 -93 -25 130 146 25
6057 25 -35 -6 58 53 34 -46 63 175 -122 75 -366 71 -124 -123 -74 -398 -48 -234 124 47 195 43 139 131 -185
6082 -185 -10 38 -107 -11 -133 -222 -167 -241 -68 406 86 319 -25 -80 83 134 -80 92 71 -220 121 5 -241
6105 -241 -292 -153 194 -59 -68 -32 222 20 190 170 259 120 -187 170 -9 -261 -237 -346 -25 -246 32 -84
6127 -84 294 5 245 384 352 158 143 -69 -45 119 -241 92 -151 -23 -260 -49 -185 -156 -98 -273 74 -21
6149 -21 241 372 99 202 249 208 198 149 -86 -150 -97 -546 -171 -149 -157 151 243 307 278 69 380 93 79 167 -182
6174 -182 96 -401 -188 -308 -144 -332 -227 -21 -126 -147 63 119 178 349 242 418 230 237 62 -59 -231 -264
6196 -264 -92 -18 -456 -22 159 -6 43 -47 204 174 -87 154 -55 200 157 66 210 268 -62 -9 -73 -73 -71 -7 35
6221 35 163 14 172 42 -65 42 -225 -107 -261 -4 -118 73 242 -8 230 183 149 165 -151 -40 17 -97
6243 -97 -79 -72 -52 102 -213 140 256 32 541 66 40 123 121 159 -61 150 172 -152 -248 -135 -91 -314 -182 366
6267 366 -288 -236 240 83 109 218 405 100 142 -118 -315 98 -106 -328 -275 -276 8 -97 53 -77 63 -130
6289 -130 -78 205 216 -24 107 182 3 -217 -197 -48 -234 -146 -125 -243 -231 158 -332 -129 117 142 293 112 175
6312 175 140 80 218 -133 19 237 97 -12 -13 42 59 -200 -85 -29 181 142 -20 -88 24 68 241 149 -141 -28
6336 -28 -24 -178 -213 28 -166 -67 122 214 235 77 246 123 248 207 -52 18 -116 -155 -94 76 7 -78 -79 107 -190
6361 -190 0 177 198 81 20 180 158 154 189 28 200 40 15 0 21 63 -122 -57 -111 -171 -68 126 100 115 314
6386 314 -20 -196 -247 209 63 -51 64 195 -215 -12 -83 -128 -177 79 112 -27 185 -24 102 65 128 -14
6408 -14 75 -147 100 80 243 -21 -65 -2 23 72 191 113 -64 179 -13 -129 60 245 -49 12 122 80 -39
6431 -39 261 -84 -231 -75 -150 -51 -77 -74 157 21 278 102 88 -128 198 198 45 -9 178 140 210 69 47 -70
6455 -70 144 -81 77 -61 -103 -34 -35 -44 4 108 289 300 176 -79 89 31 20 99 89 -40 26 210 -100 107 110
6480 110 10 284 66 -5 -13 -55 66 74 64 124 -163 -254 -146 -205 -240 -154 153 198 130 -143 -20 60 143 -85 103
6505 103 17 -116 -261 35 -4 -325 -183 -254 123 5 -261 167 93 -116 55 -52 -102 10 -358 -128 113 -332
6527 -332 120 -362 -280 128 97 -194 -33 -115 128 -55 139 108 18 115 127 128 -115 -156 174 71 -260 -271 -90 -18
6551 -18 -320 129 190 78 238 308 -97 -118 -200 -3 -192 -17 -126 14 68 7 -245 53 304 141 -52 89
6573 89 51 18 133 166 129 -70 -121 81 -126 -52 -9 105 -220 53 140 21 -112 165 41 77 194 -99 -153 -32
6597 -32 23 -30 16 -261 61 -3 171 233 103 -125 -36 91 14 -70 50 -107 61 55 -294 -183 -135 13 102 180 -15
6622 -15 136 278 346 81 186 -74 8 -80 -116 -2 32 -23 -24 67 271 335 269 335 -177 271 67 -51 176 -4
6646 -4 -41 40 -141 -141 -167 -116 -304 -262 -222 -15 -41 219 127 235 102 453 -85 118 84 -96 -55 -55 -32 -31 -146 11
6672 11 76 -25 96 -14 305 47 324 292 160 225 -186 -79 96 32 -111 -394 -240 -275 -33 -15 -108 198 218
6695 218 173 401 370 138 -12 -179 101 175 -123 -99 26 -176 -75 -83 -99 194 -6 -203 18 -166 136 279
6717 279 -70 30 -44 -134 52 22 -13 128 -168 -155 -80 45 -122 112 205 118 -224 -97 -128 -207 93 -103 -42 151
6741 151 214 22 135 -246 16 -159 1 -65 -184 -106 -133 -194 -85 11 153 -7 154 177 110 137 232 54 -102
6764 -102 -61 86 -2 158 -104 -28 -129 114 -145 -110 83 -80 102 175 95 69 515 131 -122 119 0 -1 2 -63
6788 -63 -163 -214 7 -147 -185 71 102 16 10 -86 15 303 143 58 291 218 107 123 -186 122 -98 79 32 104
6812 104 -135 33 -144 120 234 181 264 -119 117 -64 -342 -17 301 -64 80 120 293 -418 95 -63 62
6833 62 -219 -35 25 89 270 140 68 -79 59 353 236 25 -104 59 40 -157 38 -60 180 118 -94 59
6855 59 32 239 -22 -124 110 31 125 -103 -121 124 84 -36 -74 71 -131 -49 39 145 85 150 139 -144 106 -104
6879 -104 -31 -108 -303 -4 18 -132 70 45 69 -70 39 -191 -25 -47 -11 32 -10 -65 107 6 117 6 101 39
6903 39 -286 130 51 -127 -149 -210 54 66 21 150 179 -157 100 -289 85 -7 -148 153 140 -108 -28 210 -50
6926 -50 -52 19 -183 -58 144 -313 63 -34 127 154 -242 259 9 -127 14 -83 230 -103 2 24 -175 154 66
6949 66 90 240 -186 -109 40 342 206 43 20 -68 -67 175 -164 34 231 147 129 106 159 -129 -33 -112 -200 22 49
6974 49 23 -87 62 -53 -204 -250 -219 -265 140 89 -188 90 88 -223 163 104 33 -176 -20 125 111 -152 81 -17
6998 -17 -223 107 91 -7 -253 -7 -270 101 -229 204 92 90 90 -82 289 107 -72 -130 -170 -170 -31 11 22 -217
7022 -217 -216 -199 -60 -96 358 140 263 -60 3 -121 91 20 -64 -63 -55 -73 -5 -66 -100 29 -231 -28 9 -75 65 -106
7048 -106 183 83 -144 86 -198 -6 -384 -201 -182 53 125 97 203 166 141 126 132 36 -40 36 38 77 -17 -134 4
7073 4 251 -99 -289 -490 18 -99 -13 -65 -61 -154 14 292 152 99 -23 165 143 -74 226 181 -207 -98 146
7096 146 -32 -58 160 -33 -24 -236 140 -28 84 294 14 -9 18 101 -69 -9 -59 83 -287 -221 1 41 -67
7119 -67 -36 164 136 -97 174 -31 -3 99 122 116 117 166 308 -96 -124 -66 -184 54 -19 -170 -51 -48 -85 -110 157 -196
7145 -196 182 -109 298 196 -7 -30 97 74 4 -19 19 13 -60 81 63 -131 -118 -69 36 -80 122 74 238 190
7169 190 -60 73 7 -207 -274 -180 -122 -249 12 182 -219 99 -230 60 244 -19 57 285 16 -13 -133 -26
7191 -26 179 19 -37 -93 -87 32 -100 -104 -134 -88 -20 38 102 48 180 -58 -27 43 29 141 -10 6 -13 -3 60 20 239
7218 239 148 -51 146 -15 29 161 2 -168 175 35 96 85 -19 71 53 -148 -4 -145 66 61 -158 31 28
7241 28 64 -64 -74 261 103 -109 -62 -35 -72 195 127 267 85 12 110 25 19 37 -202 -257 -131 149 56 -92 28
7266 28 -274 -94 136 174 -5 -265 -93 30 -250 -57 149 -118 -105 96 18 -79 -26 118 -21 77 92 253 -56
7289 -56 -90 169 -33 -160 -98 -147 116 -42 3 -191 -22 102 -15 14 93 171 -59 -170 150 117 82 72 50 208
7313 208 58 -466 -31 96 -4 82 108 -47 45 37 271 -3 -232 111 19 177 187 28 129 -154 -16 191
7335 191 -18 -54 -334 -70 -216 134 -47 137 -68 26 306 -68 -226 0 -9 100 -180 -60 207 66 128 -231
7357 -231 40 -121 -170 -81 -9 -43 124 46 81 123 -5 -8 196 -96 -39 -107 154 -124 -113 73 118 75 -46 137 154
7382 154 117 10 167 -222 46 -173 150 -56 167 -128 170 -158 -74 -44 108 105 -158 0 62 -147 -97 -243
7404 -243 -155 -71 90 -79 -61 -33 28 -163 -88 8 -114 91 191 -4 -46 0 -27 -71 -23 0 -41 174 -34 147 25
7429 25 27 128 -164 22 -23 -242 -60 -77 38 -165 172 118 200 -123 21 -35 116 315 -55 74 -99 149 88
7452 88 43 -177 -46 60 -71 -89 -72 163 97 -347 251 -144 -127 -74 82 -113 177 73 32 -21 172 96 170 165
7476 165 -32 12 -481 -20 -177 -117 319 -80 111 -11 -27 -188 -209 -99 -115 -263 -235 -20 -9 123 12 171
7498 171 -152 -18 93 -339 -220 -137 110 -61 66 -106 157 -149 145 202 -72 -33 -147 388 173 192 -27
7519 -27 -195 61 -58 -193 -8 115 -74 -67 -54 -215 83 -100 147 -27 206 -58 -167 -65 -142 215 13 71
7541 71 -97 113 -252 -159 -88 -70 -60 6 71 -202 -169 266 -63 -93 11 134 48 -160 -246 -49 -56 83 108 104 28 -160
7567 -160 -7 -113 19 65 73 -151 -23 98 -45 -59 -55 347 51 98 -10 -133 181 61 24 -153 9 27 -125
7590 -125 -270 -66 80 27 -80 -91 -59 -19 -213 -165 141 138 -96 -2 104 71 -30 38 93 -14 22 221 57 -191
7614 -191 -4 119 -8 112 216 239 -152 -58 21 289 54 -130 146 129 122 205 61 -152 129 96 58 42 223
7637 223 245 64 -185 47 16 59 174 -79 -76 159 7 -56 -247 -177 96 5 -272 115 -1 59 5 68 39 8
7661 8 -115 75 -155 -134 -105 73 162 -189 -131 -327 113 100 -38 121 40 147 95 62 -153 159 -50 84 -53
7684 -53 -45 -190 150 -58 -43 -10 -194 -27 17 59 206 -40 35 104 -145 -82 146 -120 27 32 20 154 115 163 -72
7709 -72 21 -51 39 -31 -216 77 -177 223 192 -140 -13 -317 -119 52 -94 -205 -57 70 209 69 122 -53
7731 -53 27 -26 91 -33 248 150 134 -33 -123 -34 -273 129 -68 -246 -49 95 -188 146 0 3 146 224 148 -197
7755 -197 -93 -188 -228 -100 -250 -121 -183 22 194 494 -10 -82 158 -130 -59 111 -90 139 -42 -82 90 -288
7777 -288 -168 41 -76 116 -44 97 -195 107 -145 31 99 -120 -152 -58 -284 -147 142 -40 -80 228 -31
7798 -31 -12 -96 141 -73 338 -11 108 -153 -13 -54 -344 -22 52 143 179 262 24 -91 -146 -129 -67 204 118 134
7822 134 -95 40 140 -7 -143 151 -209 165 139 111 -43 -11 -117 201 -139 143 103 -97 -201 -55 -12 181
7844 181 -194 -50 110 61 94 27 32 -95 54 80 283 -186 -113 18 38 -179 125 -40 -136 12 -61 54 -121
7867 -121 -105 -47 192 -108 89 -65 -65 -50 85 54 -34 -39 -59 114 -305 116 26 -10 -301 -5 -19 -38 102 43 62
7892 62 57 -13 -65 153 251 -22 -42 -32 -82 -63 28 257 54 -56 -136 -145 -306 98 -69 127 140 -295 4 -122 -42
7917 -42 95 -148 -249 -152 -105 -155 -109 98 29 146 291 163 102 -212 -36 41 11 56 -132 292 -16 242 -138
7940 -138 89 -65 -84 -28 -186 91 106 -109 41 50 -26 114 179 -71 -60 97 37 -48 119 -184 5 124 -19
7963 -19 -123 -296 -120 -43 53 -161 -44 -144 -6 -221 204 53 96 -127 1 74 99 65 66 -149 -27 -40 55 117
7987 117 27 -208 -140 123 79 -94 -199 67 199 19 155 -192 -17 51 -134 124 26 -124 -53 -95 -67 35 15
8010 15 77 -209 52 -55 103 -81 71 66 156 26 -111 -53 246 -27 -47 -57 -54 -112 -37 148 8 -63 7 44 -153
8035 -153 267 -201 -176 -33 57 60 147 21 -176 -88 -20 -21 -107 -239 -41 -116 -33 279 -145 55 152 154 83 -63 289
8060 289 1 119 2 32 311 40 -3 -59 -204 -170 -61 -35 27 166 -29 -113 184 69 -52 101 -5 136
8082 136 298 163 194 237 25 63 63 15 -47 18 330 337 -46 128 2 75 58 164 -62 78 -48 -13 146 191 -63
8107 -63 -16 40 98 69 14 59 61 86 184 -190 89 -20 130 9 -285 -50 14 -25 36 -161 33 -42 108 137 50 124
8133 124 -116 -106 21 -153 -37 -203 64 -153 12 24 -235 -66 -130 -49 -54 81 32 -110 192 249 -7 -160 -401
8156 -401 -204 -152 -75 -40 -147 178 146 -59 -17 -17 -144 -65 46 357 39 236 203 -108 -193 -32 -116 -86 -40 -105 161
8181 161 -84 87 241 -169 272 -83 23 34 262 -90
8191i0
$$ Imaginary data points
##PAGE= N=2
##DATA TABLE= (X++(I..I)), XYDATA
0 0 0 0 0 0 0 0 0 0 0 0 0 0 0 0 0 0 0 -2 8 -8 8 -8 8 -11 16 -16 17 -24 24 -31 32 -40 42 -49 55 -62 70 -78 88
39 88 -97 108 -121 133 -147 163 -180 200 -221 244 -267 294 -325 357 -394 435 -483 536 -597 668
59 668 -751 849 -974 1129 -1330 1606 -2004 2640 -3830 6794 -30549 -25350 56514 100918 132555
74 132555 132430 113925 68373 23122 -18966 -46433 -59426 -50284 -33008 -13196 -687 3401 -7167
87 -7167 -24416 -42129 -50254 -47811 -29274 1725 38978 71237 92435 94916 76899 41384 -2510
100 -2510 -45396 -78805 -95939 -91167 -68281 -35007 2301 35809 55503 58609 48933 29955 4781
113 4781 -14719 -22751 -21512 -11265 6913 24049 32050 31094 20702 55 -23438 -40896 -50029
126 -50029 -48676 -34276 -10923 12940 33138 44680 43882 31354 11763 -9517 -27470 -37556 -35829
139 -35829 -23855 -5446 14131 30426 38955 36762 25252 8037 -10797 -27132 -35576 -34581 -26287
152 -26287 -12408 4167 17924 25096 25530 20725 10001 -1319 -8935 -12240 -12123 -6093 1639 6544
166 6544 8510 6844 126 -10047 -18915 -24192 -25243 -19634 -7949 6475 20430 32097 38142 36652
180 36652 28852 16184 1689 -12190 -22724 -28128 -28739 -24358 -17583 -9701 -2767 2413 5148 6875
194 6875 7011 6675 7790 9254 10054 11167 11304 8616 4071 -778 -6798 -12949 -16621 -17107 -15673 -11701
210 -11701 -5241 1810 7647 12849 15525 15369 13827 10788 6492 2201 -1625 -5035 -7734 -9117 -9999
225 -9999 -10180 -9584 -8253 -6586 -3996 -1216 1820 4257 6301 7408 7672 7066 5629 3450 1975 796
241 796 -873 -1673 -1812 -2266 -2383 -1989 -2030 -1623 -1378 -291 646 1104 2382 2392 1678 1121 -455 -2056 -3205
260 -3205 -4012 -4623 -4348 -2852 -1479 155 1557 2928 3417 3349 2902 2103 1346 996 509 612 809 992 1245
279 1245 987 861 354 -435 -638 -1402 -2013 -2183 -2256 -2444 -1876 -1601 -952 -199 674 1210 1271 1344 556 -495 -1001
300 -1001 -1508 -2165 -1828 -499 758 2216 3978 5147 4653 3755 2314 91 -2088 -3028 -3501 -3130 -1522
317 -1522 486 2096 2934 2632 730 -1890 -4599 -6529 -7402 -6064 -3378 144 4246 7647 8644 7888
333 7888 5187 829 -3312 -6556 -7670 -6730 -3342 1070 5624 9116 10106 8766 4486 -705 -6000 -9772
349 -9772 -10873 -9187 -5146 607 5821 9114 9572 6809 1936 -4635 -9949 -13041 -13052 -8971 -2175 5196
365 5196 11924 15926 15693 11501 4928 -3207 -9932 -13925 -13543 -9676 -2557 4852 10930 13941 12769 7574
381 7574 -152 -7309 -13231 -15688 -13009 -6781 1094 9601 15033 16735 12800 5333 -4407 -13594 -19774
396 -19774 -21173 -17509 -9198 1819 12658 20330 23475 21199 14211 4697 -5055 -12055 -15204 -13282
410 -13282 -8069 -823 5240 8848 8163 3788 -3727 -11220 -16921 -18189 -13937 -5746 6013 17233 25412
425 25412 28066 24470 15026 2178 -11516 -22851 -29022 -28521 -22412 -11844 755 11301 18488 20783
439 20783 18047 11829 4483 -1496 -4649 -4656 -794 3980 7811 8694 6138 -654 -9952 -18632 -25490 -27920
455 -27920 -24066 -14547 -1717 12360 24677 32080 33220 27904 18003 5306 -7371 -17142 -21626 -21500
469 -21500 -16828 -9851 -2297 3054 5391 5143 2607 -1137 -3183 -3054 -1007 3536 9569 14500 15879
484 15879 13823 8477 -228 -10066 -17792 -22781 -23393 -19104 -10323 -843 8650 16315 19764 18368 13610
499 13610 7410 462 -5394 -7952 -7899 -5489 -1590 2043 4622 4821 3111 209 -3656 -6970 -8406 -7927
515 -7927 -5870 -2450 1443 4383 5099 5118 3524 537 -1822 -2672 -2717 -1317 1606 4920 6769 7578 7083
532 7083 4050 -349 -4623 -8202 -11054 -11609 -9727 -6136 -2397 2447 6705 9608 11087 11309 10069 7371
548 7371 4329 1119 -2661 -5915 -8696 -10914 -12186 -12971 -11926 -9575 -6298 -1495 3711 8652 12806
563 12806 15443 16878 15682 12978 9168 4001 -1419 -5835 -9584 -12941 -15018 -15242 -14392 -12944 -9063
578 -9063 -4552 733 6149 11702 15744 17808 18063 15248 9947 3112 -3546 -9673 -14846 -17048 -16498 -13908
594 -13908 -9738 -4268 404 4403 7453 9132 9477 8944 9037 8651 7395 6163 4682 2011 -1831 -5380
610 -5380 -9417 -13307 -15321 -14674 -12084 -7789 -1918 4483 9609 12676 13999 12389 8499 3940 -587
625 -587 -4290 -6280 -6056 -4610 -2531 -54 2058 2148 1220 -204 -2074 -3597 -3919 -2709 -572 1893 4523
642 4523 6292 6024 4680 1834 -1453 -5191 -6953 -7449 -6180 -3823 -70 3278 5285 5886 5114 2718
658 2718 -541 -2714 -4168 -4604 -3367 -442 2476 4924 6644 6661 5285 2288 -618 -3536 -5851 -6352
674 -6352 -5663 -4064 -1975 368 1721 1614 1618 629 -897 -1760 -1646 -946 84 1742 3164 4106 4003 3214
692 3214 1618 -348 -2090 -3362 -3814 -3606 -1874 -334 1122 2517 3351 3286 2249 1021 -468 -1832
708 -1832 -2815 -2949 -2571 -2002 -1312 -458 138 498 664 869 564 429 472 243 196 439 611 712 600 900 798
729 798 824 943 627 377 -113 -376 -495 -584 -639 -565 77 -83 100 28 -625 -1099 -1896 -2605 -3031 -2474 -1519 -27
751 -27 1360 2639 4074 4590 3915 2719 1083 -891 -2320 -3059 -3084 -2303 -1092 398 1793 2650 2390 1028
769 1028 173 -1387 -2274 -2799 -2186 -1094 52 1273 1959 2238 1242 -237 -2009 -3131 -3871 -3649 -2024
786 -2024 133 2412 4234 5510 5270 4134 2155 -269 -2452 -3556 -3810 -2940 -1487 303 2152 2822
802 2822 2439 1270 -295 -2320 -3430 -4266 -3767 -2189 -85 1509 3289 4086 3362 1930 77 -1839
818 -1839 -2837 -3625 -2953 -1209 802 2833 3848 4348 3777 2033 -31 -1840 -2961 -3330 -2650 -1273 252
835 252 1356 1926 1864 1113 -388 -1994 -2993 -3393 -2842 -2120 -34 1428 2701 3261 3106 2373 826 -291
853 -291 -1405 -2030 -1680 -786 518 1265 2216 1983 1792 811 -139 -1168 -1912 -2171 -1697 -1097 -194 332 592
872 592 761 488 -191 -824 -1043 -1178 -940 -317 177 656 1084 788 627 483 336 -71 212 407 906 1090
892 1090 1057 1192 672 293 -359 -811 -898 -1280 -1081 -1065 -966 -1343 -1431 -1225 -1813 -1840 -1156 -518 749 2231 3177
913 3177 4169 4183 3467 2200 425 -1716 -3053 -3689 -3771 -3257 -2009 -293 949 1558 2048 1878 1314 779
931 779 791 616 1233 2201 2248 2033 1038 -857 -2928 -5202 -6609 -7575 -6860 -4971 -1338 1777 5291 8012
949 8012 9529 9004 7191 4523 1037 -1662 -3825 -4986 -5056 -4214 -2945 -1823 -1531 -1421 -1887 -2393 -2394 -1504
967 -1504 154 2123 4958 6590 7676 7141 5175 1979 -2266 -5892 -8680 -9906 -8992 -6600 -2694 862
983 862 4386 6978 7693 7183 5459 3091 488 -740 -1437 -1058 -342 438 805 143 -1428 -3091 -5085
1000 -5085 -6249 -6301 -4907 -2772 756 3904 6641 7740 7521 5789 2792 -173 -2932 -4845 -5399 -4122
1016 -4122 -2307 270 1867 3583 3495 2262 617 -1113 -2940 -3727 -3253 -1663 123 2014 3709 4358
1032 4358 3418 2074 -134 -2375 -4224 -4104 -3552 -2457 -416 1754 2850 3372 2580 880 -725 -2771
1048 -2771 -3001 -2515 -1440 642 2917 4709 5590 5256 4035 1471 -1199 -3708 -5104 -5967 -5141 -3540
1064 -3540 -2016 -170 1362 1896 1912 1556 822 183 161 679 1371 1607 2372 2792 2114 765 -533 -2278
1082 -2278 -3898 -4579 -3731 -3171 -1141 967 2699 4069 4695 4413 3176 1283 -321 -1905 -3169 -3538
1098 -3538 -3355 -2585 -1997 -905 -130 -43 137 295 219 162 722 1066 1559 2326 2569 2516 2058 1028 181 -937
1118 -937 -2181 -2401 -2455 -1822 -1290 -375 342 757 1393 1261 572 4 162 -367 -378 -584 -226 -581 -276 77
1138 77 -37 148 -162 -343 -405 -217 11 291 274 810 985 924 932 636 482 242 11 -361 -424 -777 -709 -337 -357
1161 -357 -321 -424 -268 -111 -434 -630 -505 -582 -286 -36 -42 299 942 915 1226 1272 1174 546 383 296 -14 -303 -558
1184 -558 -330 -574 -226 -102 -171 -329 -401 -499 -784 -561 -460 -899 -752 -462 -466 -106 -311 -20 328 348 335 699
1206 699 831 866 893 733 518 61 -113 -422 -890 -727 -894 -553 -540 -371 296 452 750 900 761 558 260
1227 260 -82 -539 -697 -962 -1138 -1036 -709 -819 -771 -435 -278 -22 597 1118 1509 1876 1959 1893 1403 559 402
1248 402 -552 -990 -1328 -1591 -1129 -1103 -615 -559 -195 82 -110 -184 -288 -66 -17 349 647 307 765 629 86
1269 86 64 -291 -904 -795 -960 -507 31 1028 1048 1609 1687 1326 817 447 -254 -1020 -1311 -1312 -973 -718 -294 -414
1291 -414 123 36 -455 -604 -624 -416 -45 220 790 1370 1692 1516 1182 669 -44 -1005 -1239 -1131 -887 -390 416
1312 416 928 1414 1336 1035 314 -519 -943 -1277 -1474 -1052 -647 120 560 847 681 300 -436 -941 -1260 -1534
1332 -1534 -1456 -596 585 1210 1856 1934 1633 1247 594 -307 -856 -1078 -1025 -456 125 788 833 932 599 -187 -934
1353 -934 -1436 -1851 -1872 -1576 -738 249 948 1234 1409 845 403 -231 -904 -1403 -1037 -665 284 968 1644 1870
1373 1870 1539 1071 153 -431 -1012 -1453 -1343 -814 -23 745 895 1029 671 304 -489 -1106 -1976 -1505 -1556 -678
1393 -678 -126 630 1297 1300 1118 880 274 -246 -731 -823 -367 304 370 1029 1281 780 956 -442 -863 -1278 -1546
1414 -1546 -1332 -864 -42 665 894 1070 911 602 135 -553 -1232 -1359 -1241 -1046 -481 221 600 605 808 620
1434 620 340 -100 -145 -61 -14 438 870 1041 1270 1040 271 -233 -803 -1437 -1593 -1795 -1317 -769 -229 107 427
1455 427 944 739 527 404 -54 -260 -204 -9 35 412 546 583 532 -203 -128 -492 -679 -337 -282 -87 563 780
1477 780 1032 883 788 286 -339 -666 -1004 -1092 -964 -625 -712 -349 -90 297 227 142 -105 -62 -36 117 258 625
1499 625 346 790 785 652 375 42 -271 -626 -500 -366 -398 -398 -100 55 171 -123 -297 -289 -603 -352 -512 -320
1521 -320 31 150 135 114 222 171 119 -68 92 -279 -41 -16 100 176 151 403 508 460 302 288 248 -111 -117 -1
1545 -1 -329 -420 -233 -76 -472 -253 -516 -453 -560 -558 -156 -219 -73 331 547 798 756 750 533 469 363 0 -63 -87
1569 -87 118 -161 89 -231 -56 -206 -152 9 -358 -176 -317 -200 -185 -72 -109 -27 50 35 -118 -336 -376 -168 -40
1592 -40 -137 196 250 269 405 469 557 346 202 56 191 160 140 -39 -186 -220 -176 -459 -258 -106 -81 -304 -22 -164
1616 -164 -200 -61 -187 -147 3 356 -21 182 12 8 221 104 117 335 348 481 417 686 -32 213 -313 -245 -137
1639 -137 -391 132 -303 -190 -365 -170 -400 -261 -294 -319 -403 -316 -137 -10 -73 237 11 288 11 322 -110 -9
1661 -9 231 321 177 54 422 247 51 213 233 178 13 -86 -144 -243 -400 -253 -400 -406 -250 -243 -502 -115 -238 -265
1685 -265 -51 19 31 409 558 453 340 186 247 89 38 -186 178 -88 -263 -188 -79 248 107 53 -17 275
1707 275 156 -73 -32 -358 -277 -266 -240 -541 -312 -483 -311 -540 -48 -65 59 364 177 440 577 476 588 394
1729 394 338 347 83 -36 -151 -290 -384 -291 -137 -60 -365 -16 -144 -114 58 115 -93 -121 -128 -90 -280 -33 -2 -61 215
1754 215 -1 -20 -8 355 303 388 404 453 284 401 164 403 51 -8 -151 -381 -325 -350 -432 -489 -462 -28 -363 -102
1778 -102 -72 -18 268 128 261 144 199 287 23 -57 -151 -114 218 -104 514 162 203 221 526 265 289 224 -124 -125
1802 -125 -268 -95 -251 -476 -358 -203 -525 -500 -478 -164 -95 -47 33 -110 261 444 353 491 401 267 205 -62 -55
1825 -55 -204 -86 127 315 -59 90 96 119 98 -127 -11 -60 -112 179 116 -150 -284 -227 -404 -217 -785 -449 -688
1848 -688 -393 -367 87 163 603 713 643 789 908 365 532 278 -123 -91 -490 -137 -551 -292 -301 -275 -118 -259
1870 -259 -168 204 130 554 33 307 328 -19 -196 -27 -326 -234 -410 -342 -535 -174 -91 103 515 543 874 745
1892 745 611 495 431 103 58 -1 -210 -482 -553 -518 -547 -765 -459 -189 -327 -266 219 333 468 636 518 494 269
1915 269 60 -189 -272 -225 -398 -172 -163 67 180 -7 369 533 25 1 57 57 -95 17 -373 -196 -210 -522 -167
1938 -167 92 -292 -314 -206 -330 -359 -93 101 13 123 231 130 -86 149 134 -15 114 536 331 392 392 533
1960 533 650 402 323 -21 -131 -247 -784 -561 -568 -446 -346 -409 -122 -184 168 340 68 343 268 247 226 471 47
1983 47 334 -140 -193 -303 -596 -466 -135 -231 20 149 157 317 405 537 332 365 57 -180 -276 -326 -647 -560 -513 -597
2007 -597 -807 -245 -1 180 374 153 711 491 469 616 365 278 212 -32 247 -175 89 -111 -238 -279 -437
2028 -437 90 -89 -151 -39 -110 202 47 107 72 44 -198 -175 -229 -174 -269 -252 -211 -305 37 60 198 395 322 388 454
2053 454 445 426 428 27 220 208 -108 -144 -35 -165 -379 -376 -549 -722 -514 -564 -450 7 84 328 201 163 299 200
2077 200 274 -10 -172 -219 120 -58 -63 -9 -95 -131 -103 -95 168 182 157 483 419 439 133 161 -245 -425 -798 -829 -891 -802
2103 -802 -902 -434 -355 188 403 582 785 1033 955 792 476 513 108 -42 -301 -802 -618 -800 -737 -480 -472 -305
2125 -305 14 198 884 862 913 712 552 460 -30 -359 -833 -1094 -1199 -1390 -854 -799 -516 290 440 664 856
2146 856 1034 1042 1121 1191 790 285 95 -162 -347 -960 -1274 -1174 -1055 -658 -691 -280 408 438 663 746 1144 957
2168 957 883 128 -193 -342 -550 -707 -985 -565 -418 -403 94 140 351 548 800 604 374 614 470 599 92
2189 92 -197 -433 -511 -622 -719 -697 -697 -591 14 -147 -76 324 397 329 329 291 314 34 -35 -99 -214 -220 -27 123 170 466
2215 466 460 486 121 14 -258 -140 -402 -545 -457 -632 -780 -557 -345 -71 -38 -183 438 151 201 461 579 189
2237 189 237 -244 -203 -296 -332 -567 -512 -322 -466 137 499 580 563 1071 908 751 787 373 67 -401 -160 -794 -949
2260 -949 -860 -1142 -890 -729 -497 -17 48 361 624 715 951 842 853 343 218 182 -136 -520 -605 -549 -692 -465
2282 -465 -243 -130 -38 542 474 810 459 533 50 -18 72 -233 -204 -443 -507 -601 -628 -527 -221 -357 -26 86 373
2305 373 590 651 1046 604 637 575 344 75 -39 -630 -404 -615 -534 -311 -311 -156 101 -70 335 70 -137 216
2327 216 247 116 217 141 -69 -412 -447 -336 -643 -565 -428 -380 -367 50 450 592 973 721 716 893 321 165 -246
2350 -246 -352 -307 -514 -774 -559 -455 -349 -366 -499 -285 4 49 255 213 596 444 652 459 115 36 -346 -344
2372 -344 -753 -652 -490 -346 -218 58 458 450 568 560 595 395 255 18 -273 -312 -345 -313 -273 -396 -885 -532 -648
2395 -648 -562 -273 67 167 468 976 1026 1089 845 578 370 48 -180 -714 -541 -423 -502 -280 47 62 135 168
2417 168 361 339 274 56 311 120 84 580 14 -24 -65 -354 -428 -460 -646 -230 -226 42 300 536 488 395 513 364
2441 364 202 107 172 -204 -241 -122 18 24 -88 -69 -89 -654 -551 -526 -437 -386 -205 131 -6 242 659 580 500 285
2465 285 353 393 39 -28 -87 118 76 50 220 384 -234 -166 -178 -112 77 -328 215 215 191 247 230 17 -148 -279 -399
2490 -399 -565 -391 -401 -87 8 337 381 410 358 71 351 -27 -140 -382 -267 -122 -152 140 -135 203 114 -38
2512 -38 155 182 89 1 44 428 424 33 104 -262 -317 -511 -1052 -956 -687 -489 -245 81 307 702 873 999 899
2535 899 812 383 196 -73 -241 -373 -241 -665 -402 -481 -174 -391 -222 -117 29 22 296 404 527 329 158
2556 158 179 -313 -433 -530 -703 -944 -650 -269 -140 2 525 1077 895 881 438 96 350 -57 -255 -260 -53 -67
2578 -67 -425 -280 -284 -263 -307 -199 -257 -267 -22 89 297 315 66 171 -52 -371 -426 -441 -450 -159 205 704 672 874
2602 874 1023 882 523 111 -305 -976 -1357 -1261 -1182 -715 -350 -307 239 139 793 675 765 540 708 417 186
2623 186 482 341 -283 -476 -885 -1275 -1616 -1344 -1226 -501 113 685 1446 1696 2220 2153 1811 1075 379 -443
2643 -443 -1314 -1572 -1977 -1979 -1802 -1382 -840 -590 -136 252 523 855 1068 1374 1549 1586 1470 1076 324 -418 -1068
2664 -1068 -1705 -2032 -2411 -2010 -1321 -678 156 1067 1752 2077 2072 1874 1155 674 -162 -633 -754 -1214 -1278 -1174 -952
2685 -952 -978 -1062 -600 -346 -108 98 466 1028 1253 1421 1601 1373 976 103 -354 -906 -1760 -1359 -1324 -987 -628
2706 -628 -43 360 624 866 589 278 -8 -87 -361 -576 -216 137 -27 158 158 60 -110 -476 -531 -198 -221 7
2728 7 36 505 630 670 653 282 280 -213 -530 -678 -556 24 128 267 497 572 408 195 -197 -588 -622 -902 -887
2751 -887 -879 -535 -19 345 588 712 748 699 456 92 98 193 -40 -178 299 173 -45 -248 -287 -600 -729 -603 -507
2774 -507 -307 60 277 470 853 738 588 214 19 5 -351 -453 -492 -600 -490 -150 -154 357 201 311 338 338
2796 338 325 540 464 406 460 379 346 82 -333 -363 -663 -581 -641 -589 -299 -207 229 100 389 340 436 179 82 100 -34
2821 -34 -95 -327 -236 -173 -182 -35 121 -4 242 29 217 56 379 355 124 307 -97 240 -77 -136 -238 -304 -308 -369
2845 -369 -236 -580 -184 -208 -154 95 180 211 215 414 186 360 -40 164 32 -184 24 -46 -120 -130 -157 -119 -37 -160
2869 -160 -72 170 63 113 265 92 259 -41 -27 -277 -140 -135 -303 -222 -392 -197 193 77 -101 178 468 314
2891 314 422 323 190 86 49 -103 -417 -178 27 -496 -306 -230 -173 -232 28 -154 -2 -82 -35 75 180 -51
2913 -51 -33 75 -242 -60 -138 -87 -222 -68 187 -227 -58 63 167 96 35 268 70 252 316 143 25 -118
2935 -118 -121 -12 -25 140 -359 -322 19 14 -108 -84 -102 -26 -47 -352 79 3 217 342 299 332 372 412 166 31 -296
2960 -296 -413 -218 -280 -83 -136 259 330 255 116 223 -70 -150 -30 -283 73 -209 -234 -8 -66 -252 -286 -155 -125
2983 -125 -265 15 183 -22 292 560 1007 532 416 365 -116 -576 -648 -696 -846 -429 -372 7 379 653 562 583
3005 583 396 500 225 -2 -170 -175 70 -38 -207 -271 -226 -431 -876 -685 -389 6 634 752 1258 1441 1418 1126
3027 1126 633 26 -660 -739 -1439 -1405 -1516 -1104 -654 -189 172 286 686 693 903 813 891 866 673 468 168 -35
3049 -35 -360 -777 -1146 -1326 -1445 -1102 -944 -527 117 859 1686 1370 1704 1482 749 496 -244 -543 -1109 -943
3069 -943 -1173 -1215 -787 -565 -308 -121 237 -91 179 364 655 1005 919 1058 798 365 267 -16 -511 -793 -820
3090 -820 -977 -755 -458 -87 144 381 364 237 211 -111 -147 -577 -95 -464 -218 -61 123 329 383 216 127 136
3112 136 -221 -54 -225 -350 -41 -220 -130 -91 -93 -139 -93 425 71 457 408 744 799 710 734 329 -133 -367 -930
3135 -930 -1103 -1135 -1074 -945 -609 -550 -57 471 683 1042 1272 1334 1396 1198 660 502 222 -528 -934 -1369 -1562 -1583
3157 -1583 -1155 -889 -316 285 653 1002 1257 1083 1382 1095 827 484 124 -585 -744 -598 -1188 -1062 -1092 -1100 -605
3178 -605 -828 106 636 1054 1601 1778 1854 1377 1254 618 -97 -624 -1173 -1102 -1301 -1162 -946 -541 -217 -140 70
3199 70 142 482 822 553 641 558 692 772 521 579 -51 -285 -769 -726 -947 -934 -725 -178 127 680 765 945 1199
3222 1199 550 419 -468 -499 -528 -420 -335 -406 -40 31 31 -46 -411 -417 -589 -590 -160 -65 58 595 551 603 466 396 323
3247 323 -182 -222 -526 -410 -213 84 429 474 343 15 30 -244 -621 -510 -377 -513 -34 43 345 886 553
3268 553 541 259 38 -93 -438 -470 -327 -178 -17 402 554 477 512 205 -235 -308 -221 -350 20 -13 331 458
3290 458 566 404 -181 -349 -513 -605 -902 -453 -466 -79 243 276 475 634 336 170 237 -107 -286 -330 -399 108
3312 108 114 258 308 424 60 -92 -164 -252 -398 -189 -187 6 67 37 184 112 -39 -84 -513 -310 -286 -264 -399 -297
3336 -297 116 255 416 514 470 315 -144 50 44 -240 -94 41 225 54 134 121 107 92 -100 -343 -252 -536 33
3359 33 -44 36 -169 188 267 78 -153 -152 -96 -364 -225 48 -185 -87 36 340 99 254 206 -21 22 -246 30
3382 30 -113 -158 -31 138 214 -120 2 124 240 -34 -84 -155 -32 -84 -52 -114 106 -133 24 -125 38 30 -116
3405 -116 15 -131 162 58 150 146 431 315 242 -2 -47 -293 -485 -334 -317 -341 36 -58 -92 9 288 15 121
3428 121 -28 264 -16 133 52 145 325 185 123 -49 -132 -393 -256 -92 -45 -50 107 353 322 606 224 118 45
3451 45 -316 -61 -392 -221 -390 -128 -337 -53 -247 -269 -132 -143 -200 46 82 136 413 298 317 138 329 -8
3473 -8 -86 -185 2 -155 93 265 372 379 174 50 -80 -40 -285 -326 -325 -67 -126 2 64 -20 25 113 389 -133 -91
3498 -91 8 -132 235 194 215 223 -23 -262 -239 -325 -362 -155 -96 456 299 594 988 707 579 455 -114 -480 -567 -825
3522 -825 -1149 -638 -209 -271 21 160 177 319 438 347 167 408 515 525 463 478 139 -300 -482 -898 -1375 -1254
3544 -1254 -1236 -702 -419 60 920 1195 1220 913 950 447 55 -288 -596 -742 -803 -557 -249 -391 -556 -544 -533 -583
3566 -583 -187 -111 416 690 931 1439 1529 1316 598 341 -553 -1034 -1429 -1693 -1297 -1049 -418 87 622 799 857
3587 857 555 448 428 77 -272 -97 -44 108 380 415 144 -238 -573 -704 -763 -942 -607 -175 216 704 1226
3608 1226 998 962 721 246 -267 -563 -656 -645 -380 12 242 410 670 497 210 -293 -694 -619 -1035 -551 -160
3629 -160 208 378 719 855 777 371 154 -195 -396 -273 -350 129 142 350 291 195 -68 -355 -363 -763 -605 -532 -157
3652 -157 197 982 1025 1076 958 563 252 -280 -589 -866 -1227 -862 -587 -295 223 271 598 333 312 256 -75 447
3674 447 322 338 824 521 447 365 -176 -451 -780 -1107 -1146 -989 -787 -405 151 699 898 965 1092 653 293 -50
3696 -50 -499 -465 -350 -231 -227 -239 -230 -119 -334 7 -287 -227 23 39 125 614 348 641 553 549 181 6 -408 -530
3720 -530 -568 -786 -287 -84 -38 415 203 215 334 152 38 9 -68 -74 -105 -148 303 240 208 -12 -40 -199 -73 -266
3744 -266 -583 -114 -297 -304 91 -206 89 239 59 10 37 100 73 -259 -156 -81 13 121 -62 197 7 153 -95
3767 -95 -106 -346 -137 38 23 148 326 431 31 117 89 9 -402 -257 -337 -224 -54 -103 -219 -180 -67 -55 236
3790 236 89 -7 79 218 68 59 57 361 204 55 395 -102 134 -248 105 174 -124 243 -88 82 204 100
3812 100 44 -1 10 -111 -210 -213 -145 -25 -265 56 144 -145 30 43 113 110 27 175 -84 -4 -1 301 81 245 -345
3837 -345 -185 -103 16 51 -205 -65 -102 -169 306 0 -39 45 -453 -282 -202 -205 -220 230 430 213 122 -38 185 -39
3861 -39 129 -50 64 -139 199 298 60 283 42 -68 -204 -236 -510 -304 -395 132 -56 59 68 270 136 178
3883 178 3 -134 -261 -214 -189 73 302 415 205 175 28 -117 -204 -259 -91 -133 161 305 410 509 400 288
3905 288 61 22 -294 -813 -493 -206 -322 198 245 336 -45 223 139 -185 -143 -254 -23 -284 169 78 413 152
3927 152 78 98 -96 -401 -596 -430 -77 -27 67 572 573 520 455 213 -44 -296 -465 -476 -580 23 -58 12 5 123
3951 123 274 102 -130 -61 -203 -240 40 139 480 534 485 397 83 -154 -438 -539 -643 -367 -311 104 535 438 532
3974 532 329 379 25 -35 -434 -575 -390 -47 225 -47 218 320 336 36 -152 -56 -390 -400 35 2 324 158
3996 158 608 488 204 66 -116 -326 -275 -505 -355 -135 -31 232 490 296 316 -32 -329 -283 -516 -366 -372 91
4018 91 334 604 377 504 212 31 -37 -232 -352 -220 -139 6 208 183 -25 -232 -113 -139 -174 -246 -325 -108 94
4041 94 583 272 873 334 355 101 -389 -632 -636 -479 -655 -175 -12 -31 306 627 277 461 311 277 -11 57
4063 57 343 124 250 30 -33 -251 -516 -276 -617 -800 -491 -308 180 113 493 432 358 60 331 274 4 -39
4085 -39 -290 -351 -399 -357 -219 -20 22 -65 -39 259 -101 74 142 317 338 170 283 269 243 -124 -40 -186 -332 -241
4109 -241 -296 -50 -136 82 -68 -12 219 93 156 150 238 103 -25 237 59 -22 113 175 -155 -13 -123 -319 -35
4132 -35 -78 -42 -149 -48 -49 -6 -29 76 103 -171 41 79 -63 -13 321 120 -131 -74 40 -112 -8 -299 -142 -74
4156 -74 88 147 15 46 228 60 144 -67 193 284 175 33 -309 -206 -45 -172 -357 -333 -33 -38 -392 80 175
4179 175 115 241 220 37 157 338 2 5 176 24 94 -142 329 -75 -55 244 -144 -88 -239 -153 138 252 423
4202 423 55 6 35 30 -214 -193 -36 -188 -186 22 -110 -400 -46 -63 40 275 18 179 23 126 89 36 163
4225 163 -29 44 158 -168 -156 -55 -9 35 -255 -208 -309 -244 -199 121 65 149 -5 -159 -105 44 198 104 90 13
4249 13 39 213 112 175 -83 101 -101 -29 293 252 3 -77 -353 7 -255 -159 -103 -5 -89 -107 -61 -36 -180 -281
4273 -281 -187 -151 -379 -153 132 167 -32 -38 -1 -62 145 76 -71 -159 4 174 -62 -18 26 138 127 -11 -210 -261
4297 -261 -147 -113 -144 -274 100 117 240 236 230 -125 -22 -126 -165 -23 36 167 -18 382 224 159 77 -299 -273 3
4321 3 -80 248 292 48 167 156 -1 66 -100 -302 -267 -117 -55 -92 -2 134 -24 215 353 -59 -159 -170 -266 84
4345 84 -272 70 -89 65 250 334 318 47 39 -13 -311 -261 102 51 277 -128 19 -54 -118 -215 -202 33 -182 -92
4369 -92 -51 -39 41 340 149 -51 -182 -142 -209 -96 95 -93 -244 109 411 134 120 -4 -38 -113 4 20 72 -115
4393 -115 111 29 422 167 -150 -111 -179 -138 -125 -46 -121 -242 230 78 228 -68 123 -96 40 -191 -228 -85 86
4416 86 88 94 -64 -151 248 -92 -99 -65 -84 -40 -26 -93 -125 -181 64 -73 -7 -156 -221 -131 -101 -232 178 91 19 50 363
4443 363 19 -104 -53 -117 43 69 290 -40 389 -14 117 -42 -155 -195 -64 -223 -188 17 64 -93 53 -95
4465 -95 104 338 125 -249 -117 -36 47 162 198 199 40 -113 -1 -53 -60 -44 -52 -188 78 60 179 282 294 255 90
4490 90 137 -81 -337 -242 -85 -191 -75 -97 48 162 -133 85 44 175 -173 -89 -203 103 76 191 390 237
4512 237 236 152 -130 -140 -219 -363 -93 -117 27 -169 -137 -38 74 17 -133 211 109 46 206 306 133 105 237 -188
4536 -188 285 -121 -184 -257 -403 -294 -124 -82 -22 272 246 14 188 88 38 92 -54 -57 -135 -126 -92 -175 270 46 -65
4561 -65 -53 68 -116 -54 98 124 223 98 -5 326 40 157 -19 -158 -301 -156 -45 2 -43 6 -142 75 109
4584 109 -148 -4 -43 38 -143 50 -199 48 285 -199 -54 -255 -166 -153 50 -70 50 -86 392 137 241
4605 241 -7 114 164 51 10 71 -191 13 -91 -16 -69 -209 29 -213 3 -77 -33 86 335 -195 -154 -23 -28
4628 -28 -29 75 97 -128 67 -93 167 -143 34 94 -34 -7 -7 88 -277 -51 24 -83 -113 -11 -117 133 -110 -215
4652 -215 19 -11 -9 -47 167 -39 12 -121 -137 -51 -11 -116 43 -26 -153 97 276 65 234 286 151 213 288 56
4676 56 170 216 -133 -84 45 -170 -44 -325 124 -175 -131 38 -121 196 67 -20 130 286 -27 23 10 35 18
4699 18 319 -40 -196 143 7 -116 -5 -138 -179 -199 -96 175 9 197 190 111 66 205 -119 -39 -57 25 -160
4722 -160 -61 -53 225 -359 -33 272 8 -32 -67 167 -37 90 -238 -115 266 37 -116 -58 71 -118 151 126
4744 126 -15 8 -109 38 -55 -179 225 31 17 78 -25 -114 -117 -101 142 25 -150 96 138 -68 -128 51 -20 229
4768 229 45 83 127 200 75 189 36 -63 -123 83 -138 -269 91 162 224 8 -78 -19 -275 -176 18 -174 -246 14
4792 14 -40 -114 87 102 25 22 -146 127 171 62 32 28 46 126 299 -45 -75 -201 -89 45 -229 -68 -46 -56 25 311
4818 311 105 75 293 93 137 -208 -53 -73 129 129 57 25 8 254 -34 46 -75 14 -7 -23 19 73 342 52 108
4843 108 293 66 108 -113 -217 54 -124 -207 -4 -188 -30 -202 44 28 -100 13 -117 118 -58 99 233
4864 233 -13 147 271 99 -190 105 90 -148 47 -196 -188 175 42 124 -193 315 144 -44 -78 -159 -283 -30
4886 -30 -59 -319 -74 -73 283 144 72 104 181 -210 178 41 47 79 -148 145 4 274 -13 -13 64 -163 -19 -261
4910 -261 -321 1 -46 150 90 -126 119 79 130 -196 -207 -53 -273 -97 9 339 133 171 170 137 43 161 155 -52
4934 -52 95 -51 -157 149 211 36 -33 62 186 -282 -190 -242 -56 135 384 62 56 13 24 -89 19 -244 -254 -365
4958 -365 -199 35 225 98 141 66 113 -95 -10 -133 46 -147 -51 174 -3 -73 -118 86 -149 -185 16 -264 -230
4981 -230 106 124 37 221 264 458 372 123 -56 28 -64 -90 -259 -365 -45 17 -119 38 68 31 154 463 370 271
5005 271 55 217 75 83 -178 1 -120 -184 -229 -156 9 -170 92 120 -24 43 153 245 63 101 -153 -68 -116 -111
5029 -111 1 10 80 -96 -78 -121 -39 164 -21 -204 12 3 -210 -92 -92 -19 -44 122 31 -65 17 98 -148 -275 -258 -110
5055 -110 344 68 20 84 107 102 26 -36 -89 -11 65 62 181 16 -235 -19 208 194 -338 -115 -70 54 -188 -23 234
5080 234 101 -26 -172 236 -1 144 -75 46 -94 16 241 -124 140 -83 193 -27 -90 -52 -272 -82 -11
5101 -11 121 35 -117 99 135 63 -24 86 -140 -129 -103 -237 24 -1 -261 -27 68 159 25 -119 -177 -136 97 321
5125 321 -1 -122 142 -4 183 221 -139 126 7 -59 -28 -18 -69 278 2 -50 122 -346 204 -105 -180 -131 85
5148 85 377 110 242 247 -49 -144 -9 165 -58 75 5 -342 7 42 -105 109 241 73 54 -88 -264 -15
5170 -15 -101 -10 37 267 -126 24 -200 -350 -147 -250 -228 1 115 -261 281 303 368 148 198 -135 140 24 65
5193 65 7 78 -114 68 -142 10 -95 -113 -10 -122 31 313 -120 159 88 110 -5 -12 93 -308 -59 -367 -80
5216 -80 -181 95 194 138 170 346 351 208 45 186 72 -142 -260 77 -168 118 -28 -223 92 122 -21 -43 -109
5239 -109 137 43 150 324 432 334 43 57 -109 -380 -233 -173 -442 -98 -24 191 156 383 394 292 66 65 175
5262 175 -154 -216 169 -322 52 -172 -25 17 -193 13 -83 -47 -77 -132 215 104 69 216 345 143 244 -241
5284 -241 -408 -282 -85 -155 -74 11 253 205 330 383 47 -22 -324 177 -252 -245 -159 -235 167 104 232 103 33 -322
5308 -322 -209 -89 -440 -66 -239 179 95 332 133 331 -30 1 38 63 -296 -151 -81 -130 39 45 254 182 -194
5331 -194 -162 -193 -234 3 4 3 83 99 186 -57 77 -201 -164 -358 -261 -225 15 146 198 74 13 325 385 -30 99
5356 99 -185 -4 -144 -97 105 65 34 164 47 -4 -88 -99 -256 93 -34 -22 91 -1 221 -27 18 -158 139
5379 139 -1 -199 -107 -187 35 -143 191 115 166 119 201 -143 -125 142 127 132 -288 89 68 48 173 204 -45 -232
5403 -232 -211 36 -272 -152 -59 -232 67 168 -36 -70 -38 -204 -253 -89 -260 -210 -60 175 146 -44 -77 -97 11
5426 11 -196 -103 140 -294 -255 -10 87 -60 219 123 173 16 15 10 -150 207 71 -117 -12 87 19 95 202 -106
5450 -106 69 213 -75 -56 -133 -23 181 -31 41 -119 192 -14 -81 -207 -115 -257 -76 -79 -309 12 50 210 -222
5473 -222 138 343 232 15 253 -57 -183 38 -162 -210 -239 -42 -38 11 -144 106 -210 121 109 137 86 190 113
5496 113 0 -56 88 -7 -370 -379 -206 -117 -201 29 -60 221 96 185 -17 43 63 358 89 1 92 165 70 64 83 2
5522 2 48 -94 -459 -100 -333 -209 -72 259 129 200 49 183 15 204 127 -186 78 52 -97 -106 -112 140 -22
5545 -22 90 -205 -85 155 8 -112 2 42 183 103 86 72 -4 -142 -1 -69 56 -224 -195 115 -1 -28 -90
5568 -90 -14 -99 -79 144 3 84 273 193 250 70 -72 -321 -103 -183 -350 153 -98 221 -100 -55 32 51 24 -122
5592 -122 77 42 40 44 123 -169 -245 -209 -184 60 -154 -5 70 100 221 90 162 412 376 26 118 13 -115 -118 -140 -77
5618 -77 -346 -116 39 100 -251 73 202 -212 109 -80 93 -104 -13 135 -188 -121 83 -120 -215 -230 -247 -182 -275
5641 -275 187 199 101 382 370 325 525 168 -13 -381 -105 -286 -158 -165 -209 206 -6 362 2 -160 56 145 34
5664 34 99 -95 109 35 73 55 -261 34 -148 -371 -113 -153 26 130 112 406 93 382 302 -229 -355 -373 -314
5687 -314 -176 -165 -108 15 51 141 45 78 99 65 -112 -142 47 167 110 -6 75 124 135 17 -101 2 -91 -177 -163
5712 -163 -31 303 206 393 380 -16 -113 -347 -312 -161 -402 -359 81 -136 -104 112 -52 131 -79 131 -24 69
5734 69 -46 179 -206 -181 -59 -319 -171 80 -160 -39 145 165 145 158 382 59 152 5 308 -65 -91 6 -196
5757 -196 -161 -133 -230 -102 -141 -312 50 -30 63 155 67 152 390 171 260 -23 -105 -176 -311 -434 -332 -186 -46 33
5781 33 -159 15 -204 185 102 338 169 290 86 40 115 -227 -337 -346 -32 -21 -82 -315 -327 -204 46 99 234
5804 234 100 78 -6 -38 -175 6 -147 -212 81 46 40 173 -5 16 -55 -76 36 -160 -56 167 71 320 295 57
5828 57 165 -3 -143 -185 -188 -87 -55 70 130 90 184 346 192 16 -194 -156 24 95 -195 -160 -7 176 300 51
5852 51 -79 83 -107 -58 -258 -234 134 102 102 57 193 -88 45 -168 24 -192 -155 -162 -206 19 224 80 -15 71
5876 71 -45 31 0 -279 -116 78 -57 4 -92 -19 -39 102 -268 -259 260 -240 -411 -281 -27 -7 138 -38 212
5899 212 300 -15 6 -202 63 -79 50 89 242 -164 -65 197 220 51 138 173 -247 113 34 50 39 354 214
5922 214 100 -58 121 -161 -92 48 -178 -99 -100 96 -104 145 -19 -79 32 -32 -55 99 -85 295 -213 -97
5944 -97 182 -29 -44 114 196 -93 -163 -59 -181 -272 -12 81 8 20 103 19 54 149 51 -52 -13 21 -165 -135 62
5969 62 7 135 75 -237 -83 -189 33 176 -277 -141 109 227 -5 131 69 -16 -134 37 -46 -75 -92 86 97
5992 97 94 -1 28 -146 -14 166 111 -8 17 288 -66 -172 -154 141 -16 -267 264 136 2 -146 -52 -117 -97 28
6016 28 35 311 -88 -98 51 -115 -205 177 -104 5 105 66 -233 328 237 152 144 121 10 -36 -51 -276 -1 88 -190
6041 -190 -61 -42 215 -100 31 3 -121 -141 29 51 23 -212 5 -156 -38 182 -87 -159 -7 -72 -245 -124
6063 -124 -130 95 136 0 132 139 18 -183 -147 -119 -193 -223 -177 -109 -128 -147 2 156 -1 146 -153 133 184 -91 93
6088 93 -15 123 -264 -134 -183 -15 65 72 -50 271 59 252 -135 227 358 76 71 -58 -22 -11 -184 -234 -56
6111 -56 -124 88 97 221 208 264 368 378 241 88 139 104 -94 -37 -108 -359 -366 -30 -247 -68 -107 139 -83 -26 289
6136 289 318 7 424 -43 73 256 -32 -449 -187 -181 -119 -108 -137 -7 150 220 -92 130 166 331 360 278 -183
6159 -183 -62 88 -180 -227 36 -198 -325 -102 -12 38 283 -3 232 48 176 86 49 -8 4 -220 158 170 -198
6182 -198 -229 -339 -330 -88 -190 -85 -5 -43 87 109 334 26 108 60 -142 -264 -286 -248 -45 -273 -127 81 135 -104
6206 -104 0 -29 28 -279 -44 64 0 16 322 199 284 -49 -427 36 135 -88 -32 -38 46 401 145 258 131
6229 131 27 92 89 -157 -198 119 -11 -18 145 247 207 165 -23 25 -164 -219 -312 -89 25 -109 -186 106 149 -138
6253 -138 41 -94 78 239 401 88 106 257 161 414 259 -144 -365 -191 -110 -426 -146 0 -35 95 128 229
6275 229 290 125 200 154 34 246 -9 -206 -16 302 -56 -196 -215 -129 -131 -203 68 96 359 -3 75 244 139
6298 139 85 74 90 -143 -238 -10 -312 -320 -143 126 260 159 46 -102 -233 184 -9 148 177 193 -7 89 141
6321 141 33 140 -276 174 -66 -153 -51 -101 -78 14 79 380 57 -16 40 105 23 -101 -210 64 -59 -217 -82
6344 -82 -109 78 -25 -120 58 83 116 17 84 -84 -39 56 300 194 -51 -28 -191 73 -167 30 50 170 11 -19
6368 -19 -32 -72 -6 184 -186 -51 -136 -100 -168 -61 35 -165 -101 20 -241 -74 -101 -168 127 -82 39 -200 -30 -134
6392 -134 -260 -18 -67 134 -266 -54 125 -161 42 -183 -90 -63 115 392 -72 211 18 171 -148 4 -74
6413 -74 -162 -171 169 66 -161 165 141 1 4 9 194 20 55 -10 -99 97 51 -206 -7 -253 133 92 146 160 -123
6438 -123 -205 -74 -212 84 -153 30 -177 40 249 -261 -100 275 73 -128 165 390 319 160 159 38 100 -49
6460 -49 -12 -17 -112 -204 -33 139 -49 -203 32 31 -62 93 -20 163 -71 -121 46 -29 -150 -105 -59 -41 182 66 -14
6485 -14 63 -15 178 113 -28 77 61 1 -53 -92 -178 -258 -52 -131 -179 -26 47 -74 27 -104 86 62 -120 136 171
6510 171 -236 -8 -41 -27 264 76 57 -39 128 -20 -134 272 -7 214 219 89 -116 -147 139 309 -372 -7
6532 -7 -41 -296 42 -215 321 -187 -54 41 210 373 -138 228 42 -12 116 -50 -251 -199 -282 -70 127 -252
6554 -252 -66 219 -46 116 120 200 308 158 115 -70 70 60 -30 -83 39 -5 -161 -42 -38 163 -27 -11 204 52
6578 52 1 86 139 221 169 121 288 0 -45 32 -253 208 -145 -29 -36 32 111 223 124 -210 316 -119 -125 -57 80 -67
6604 -67 358 18 54 92 -21 -171 42 -40 -16 -102 -58 77 106 -344 -100 -91 -161 -36 -46 78 233 387 104 126
6628 126 433 120 -131 -124 -228 -196 -444 -144 9 -127 -98 -14 -107 17 51 227 317 340 14 110 131 2 266 78
6652 78 -122 -202 -111 -381 -227 -118 65 161 -227 176 193 106 465 305 196 77 171 -162 -166 -153 -302 -208 -81 -80
6676 -80 -127 109 -123 369 54 248 174 352 267 49 -81 66 -21 -166 -156 -260 -36 -416 -105 68 -197 -104
6698 -104 289 169 174 42 -80 -34 130 -148 234 164 51 194 -133 31 -84 -18 -18 172 -89 239 98 -83
6720 -83 212 286 90 99 49 -62 246 56 -10 -227 -97 -6 222 6 104 241 -179 88 63 -153 -24 113 -108
6743 -108 101 63 163 125 11 242 -25 -214 -7 83 -171 84 -221 -73 -159 -241 -42 -14 37 -37 161 47 -151
6766 -151 -83 82 -253 28 218 40 117 -53 9 -24 -27 200 -102 140 181 13 93 149 -143 432 3 97 119 94
6790 94 81 13 -107 -191 152 -214 138 8 -100 -320 -8 92 73 27 -204 -96 -19 -69 29 29 -190 -107 -278 60
6814 60 93 -188 -200 132 81 135 75 242 -176 43 -13 -246 11 14 208 21 90 -174 -188 127 -37 -78 -98 83
6838 83 -175 -233 156 51 82 -75 -184 56 55 -88 113 10 -97 28 243 -50 49 0 -11 61 -48 119 -291
6861 -291 145 29 190 -30 117 1 -74 -60 29 58 -161 -111 13 -17 -208 76 -38 44 88 -34 -347 -82 -253
6884 -253 -32 41 185 -200 -4 24 3 40 -71 -65 -153 42 -307 -13 -60 241 143 2 102 -71 32 -56 62
6907 62 142 20 66 -6 -107 217 -98 15 -33 -125 -49 -31 54 -148 -66 -24 151 275 -244 -78 74 -330 -74 -215
6931 -215 129 -267 -151 -47 -243 76 -11 17 -45 -37 36 -184 -164 -99 21 -95 180 11 11 -125 269 -37 79
6954 79 246 -8 -141 -2 247 -3 97 59 -168 -53 121 -38 121 341 -99 55 81 -59 360 -27 97
6975 97 -263 -208 -21 -64 -150 191 177 216 76 -75 254 62 -98 -64 38 79 321 154 213 195 82 -76 93
6998 93 50 -54 -180 -25 -4 -168 206 99 97 62 -25 263 48 176 152 -116 -35 121 177 -42 377 -44 -250
7021 -250 -102 -233 -279 -247 -49 134 97 0 38 179 137 -77 -28 -165 199 -134 -118 -36 -40 -9 -161 -162 -149 -74 33
7046 33 -177 75 -196 -13 251 26 129 226 146 -140 -247 -235 -228 -155 -10 -75 -40 42 29 83 63 36 -43 121 58
7071 58 51 254 -66 238 143 -223 -50 0 -58 -10 13 -216 -238 -58 155 294 11 -90 128 50 -151 2 94 -7
7095 -7 -219 -65 -205 204 17 -156 6 -223 -126 2 -114 -146 -94 126 30 16 196 52 24 145 137 27 -184
7118 -184 81 -215 -216 -30 79 -49 -90 -53 125 -193 -57 -191 -56 326 71 334 380 318 91 -136 -125 107
7140 107 -219 -235 -235 -210 -278 -102 -59 -110 54 169 -151 -8 61 22 93 60 310 169 -81 99 -88 64 -46 -295
7164 -295 -46 19 33 -83 -126 -36 284 342 51 108 -43 358 -18 -41 -252 -141 333 -36 92 71 -134 -128 -73 -10
7188 -10 17 -130 58 104 222 145 -92 73 248 -318 150 -274 -150 42 15 -119 -265 34 -316 111 24 246
7210 246 198 50 79 -32 -64 -4 34 55 37 119 -77 26 -94 -264 17 -190 143 136 221 -92 160 -22 105 1
7234 1 32 -150 -86 -47 -52 118 165 33 -115 36 53 -155 -225 -209 84 -45 184 -7 -147 57 220 276 99 103 369
7259 369 124 -96 44 14 52 45 -63 -169 108 -92 37 154 -236 -90 69 -104 30 261 239 183 -226 24
7281 24 -330 -74 -199 -122 62 -267 260 -139 -1 127 69 215 64 -81 79 176 151 -135 23 -2 -224 -18
7303 -18 -94 -249 -25 -32 44 -11 5 282 -12 -14 -364 183 -220 62 156 -61 -284 -149 111 -73 -141 -109 58 6
7327 6 -16 13 244 132 -176 -97 -177 4 97 54 28 76 13 232 -222 39 45 37 -166 -114 -123 27 -155 36 40 -18 48
7354 48 176 -19 -19 260 -4 -95 89 133 351 -4 -6 76 76 36 86 123 -91 -133 75 141 -66 -50 -135 -2 108 -134
7380 -134 -93 -56 109 115 -252 -126 -111 -129 -136 -157 248 140 254 -137 -47 89 -86 -55 -99 -5 -159 274 76 -18 39
7405 39 120 -26 166 153 -119 41 -155 -28 -81 111 131 233 -67 254 316 -185 108 10 -219 -58 57 -99
7427 -99 294 107 122 72 -105 -65 -79 -139 -81 -53 -60 75 -4 126 59 52 32 -331 -208 25 -95 -96 -40 -109 116 -91
7453 -91 293 165 -86 124 -139 37 -78 143 -242 -81 -21 130 241 105 -19 -120 82 -106 -52 -111 -121 -44
7475 -44 114 148 -37 -63 78 116 -444 -23 39 -154 54 287 -114 -137 22 -8 -59 -209 27 116 46 -122 -16
7498 -16 503 122 -35 -35 183 -226 -77 59 -197 31 75 158 -71 -108 -178 -201 -153 -25 111 -141 152 155 69 -154
7522 -154 -169 -11 -81 -118 -180 -70 -54 -206 -142 43 -131 -10 127 207 339 -119 81 -65 83 -235 -18 -112 84
7545 84 -174 -146 -25 0 -27 -79 182 55 69 49 36 101 30 28 -37 240 -53 -141 170 2 194 -52 125 -134 -82
7570 -82 -244 -56 -157 -246 118 -191 -28 0 157 86 32 52 -35 -46 -9 -82 58 -50 44 -139 199 24 -104 -232
7594 -232 -60 50 -117 97 189 45 75 -296 3 -140 145 -42 202 83 -125 -30 -81 -56 -92 -253 -154 40
7616 40 -151 -41 202 9 69 84 89 175 173 32 -1 -74 61 30 66 -86 2 50 -79 -25 93 258 103 61 238
7641 238 102 -10 43 -137 -63 -24 -94 56 161 -38 -8 211 54 -209 -59 -19 35 131 -78 -11 -172 -3 -279
7664 -279 -68 -231 -34 29 152 213 98 -114 10 -96 -119 269 -65 -42 -104 328 7 -14 -26 30 147 139 -32
7687 -32 330 273 -22 -75 -17 -263 -56 251 -47 46 79 -102 4 -147 -15 38 -141 104 137 43 -66 154 -3
7710 -3 -119 -103 -129 -12 13 19 119 7 -24 42 137 124 115 349 103 116 146 -18 279 55 71 -61 15 229 203 -45
7736 -45 -10 10 -23 -85 51 14 23 35 215 4 191 -37 40 266 166 45 101 141 150 142 -98 -83 7 120 -295 -13
7762 -13 -155 206 -55 5 198 276 -32 34 -41 39 93 -442 -75 -169 103 82 -187 -95 75 120 -284 -133 36 139
7786 139 11 -177 69 278 31 132 139 219 -37 39 81 -47 -51 -179 55 -198 -214 -115 -133 265 -30 56 112 -51
7810 -51 76 -127 -182 118 -17 -55 55 116 -183 87 21 -1 -125 35 54 -242 -3 127 -150 -142 18 -32 -93 -160
7834 -160 64 111 19 33 162 -102 -164 117 -206 91 77 86 -35 -138 102 -195 118 95 -124 -14 -54 -167 274
7857 274 -185 -141 -27 -171 126 49 35 -135 -262 124 74 72 158 -93 77 67 -8 -40 -96 45 -116 158 10 105
7881 105 91 129 -31 196 -142 -67 -10 -32 -46 -322 116 -15 -129 105 13 209 0 -128 -108 -173 283 25 -230
7904 -230 -234 10 376 -41 -20 65 -145 30 41 58 86 181 7 -102 165 -65 199 143 -10 127 -10 -77 -74 -164
7928 -164 24 224 -46 156 176 105 -394 -92 -194 -83 -8 -60 217 40 201 286 -253 38 46 -87 -213 319
7950 319 20 21 18 -14 295 144 -125 -174 73 73 255 -310 -89 -236 193 9 -41 -178 -40 -97 -31 -71 -256 70
7974 70 -94 327 -56 119 130 -75 1 -142 -263 69 -53 -138 88 -13 212 35 -96 -60 98 -131 23 -41
7996 -41 -175 180 157 29 -212 -104 337 -71 63 147 95 36 125 -43 -54 220 150 121 -106 -70 -29 71 -248 -113
8020 -113 -62 43 -82 96 -293 45 112 -48 -90 8 -99 -19 -27 -31 127 369 -61 -92 0 124 63 -229 -164 -273
8044 -273 92 102 -50 48 93 219 157 -107 -228 -101 -144 91 119 -272 296 22 -60 238 154 90 39 136 -125 -266
8068 -266 30 -63 321 243 86 107 -104 65 -121 -22 -120 -113 135 16 82 -25 183 -106 196 -208 -14 -58 -178
8091 -178 147 76 -55 61 83 228 234 149 -23 229 -59 -177 -139 -33 -104 -347 -80 75 -34 76 -176 114
8113 114 201 68 11 101 26 -81 137 -169 -57 -60 211 -183 -345 229 35 103 -166 238 -246 -84 250 -98
8135 -98 10 -26 -60 187 152 32 -2 41 -83 29 95 -5 -157 20 -40 -161 -152 -98 -116 372 -325 -108 -92 -161 54
8160 54 29 -65 15 113 -50 -112 169 -78 -71 -61 91 34 130 269 63 95 158 -444 -5 226 -82 32 -79 -149 30
8185 30 -139 -342 -133 -95 -180 -34
8191c4
##END NTUPLES=NMR FID
##END=
