##TITLE=1H_Pr Bzt-nE
 CDCl3
 8 sc, 
 4.05.2022
##JCAMPDX= 6.0         $$ Bruker NMR JCAMP-DX V2.0
##DATA TYPE= NMR FID
##DATA CLASS= NTUPLES
##ORIGIN= UXNMR, Bruker Analytische Messtechnik GmbH
##OWNER= root
$$ XWIN-NMR		Version 3.5
$$ Wed May  4 16:02:15 2022 Russian Standard Time (UT+4h)  she@DPX200
##.OBSERVE FREQUENCY= 200.13135
##.OBSERVE NUCLEUS= ^1H
##.DELAY= (6, 6)
##.ACQUISITION MODE= SIMULTANEOUS
##.ACQUISITION SCHEME= undefined
##.AVERAGES= 8
##.DIGITISER RES= 18
##SPECTROMETER/DATA SYSTEM= spect
##.PULSE SEQUENCE= zg30
##.SOLVENT NAME= CDCl3
##.SHIFT REFERENCE= (INTERNAL, CDCl3, 0, 15.7039)
##AUDIT TRAIL= $$ (NUMBER, WHEN, WHO, WHERE, WHAT)
$$ ##TITLE= Audit trail, XWIN-NMR		Version 3.5
$$ ##JCAMPDX= 5.01
$$ ##ORIGIN= Bruker BioSpin GmbH
$$ ##OWNER= she
$$ F:/spectra/data/she/nmr/H-F/1/audita.txt
$$ ##AUDIT TRAIL=  $$ (NUMBER, WHEN, WHO, WHERE, WHAT)
(   1,<2022-05-04 16:00:16.09 +0400>,<she>,<DPX200>,
      <created by zg, POWCHK disabled, PULCHK disabled
       configuration hash MD5:
       00 E9 B6 7A A2 85 ED C7 34 08 36 98 17 FE 4E 26
       data hash MD5: 16K
       7E CA 95 47 40 5B 75 1C F1 BB 4A 37 C1 E5 C2 76>)
$$ ##END=
$$ 
$$ hash MD5
$$ D1 CB 49 94 57 22 57 23 58 56 6E 72 3D D9 BA 17
##$RELAX= 
##$RELAX= 
##$RELAX= 
##$RELAX= 
##$RELAX= 
##$RELAX= 
$$ Bruker specific parameters
$$ --------------------------
##$DU= <F:/spectra>
##$EXPNO= 1
##$NAME= <H-F>
##$PROCNO= 1
##$TYPE= <nmr>
##$USER= <she>
##$AMP= (0..31)
100 100 100 100 100 100 100 100 100 100 100 100 100 100 100 100 100 100 
100 100 100 100 100 100 100 100 100 100 100 100 100 100 
##$AQSEQ= 0
##$AQ_mod= 1
##$AUNM= <au_zg>
##$AUTOPOS= <>
##$BF1= 200.13
##$BF2= 200.13
##$BF3= 200.13
##$BF4= 200.13
##$BF5= 200.13
##$BF6= 200.13
##$BF7= 200.13
##$BF8= 200.13
##$BYTORDA= 1
##$CFDGTYP= 0
##$CFRGTYP= 5
##$CHEMSTR= <none>
##$CNST= (0..31)
1 1 145 1 1 1 1 1 1 1 1 1 1 1 1 1 1 1 1 1 1 1 1 1 1 1 1 1 1 1 1 1 
##$CPDPRG= <>
##$CPDPRG1= <>
##$CPDPRG2= <>
##$CPDPRG3= <>
##$CPDPRG4= <mlev>
##$CPDPRG5= <mlev>
##$CPDPRG6= <mlev>
##$CPDPRG7= <mlev>
##$CPDPRG8= <mlev>
##$CPDPRGB= <>
##$CPDPRGT= <>
##$D= (0..31)
0 1.2 0 0 0 0 0 0 0 0.06 0 0.03 0 0 0 0 0.0002 0 0 0 0 0 0 0 0 0 0 0 0 
0 0 0 
##$DATE= 1651665615
##$DBL= (0..7)
120 120 120 120 120 120 120 120 
##$DBP= (0..7)
150 150 150 150 150 150 150 150 
##$DBP07= 0
##$DBPNAM0= <>
##$DBPNAM1= <>
##$DBPNAM2= <>
##$DBPNAM3= <>
##$DBPNAM4= <>
##$DBPNAM5= <>
##$DBPNAM6= <>
##$DBPNAM7= <>
##$DBPOAL= (0..7)
0.5 0.5 0.5 0.5 0.5 0.5 0.5 0.5 
##$DBPOFFS= (0..7)
0 0 0 0 0 0 0 0 
##$DE= 6
##$DECBNUC= <off>
##$DECIM= 32
##$DECNUC= <off>
##$DECSTAT= 4
##$DIGMOD= 1
##$DIGTYP= 9
##$DL= (0..7)
0 120 120 120 120 120 120 120 
##$DP= (0..7)
150 150 150 150 150 150 150 150 
##$DP07= 0
##$DPNAME0= <>
##$DPNAME1= <>
##$DPNAME2= <>
##$DPNAME3= <>
##$DPNAME4= <>
##$DPNAME5= <>
##$DPNAME6= <>
##$DPNAME7= <>
##$DPOAL= (0..7)
0.5 0.5 0.5 0.5 0.5 0.5 0.5 0.5 
##$DPOFFS= (0..7)
0 0 0 0 0 0 0 0 
##$DQDMODE= 0
##$DR= 18
##$DS= 0
##$DSLIST= <SSSSSSSSSSSSSSS>
$$ [...]
##$SUBNAM2= <"">
##$SUBNAM3= <"">
##$SUBNAM4= <"">
##$SUBNAM5= <"">
##$SUBNAM6= <"">
##$SUBNAM7= <"">
##$SUBNAM8= <"">
##$SUBNAM9= <"">
##$SW= 18.05172834244
##$SWIBOX= (0..15)
0 0 2 0 0 0 0 0 0 0 0 0 0 0 0 0 
##$SW_h= 3612.71676300578
##$TD= 16384
##$TD0= 1
##$TE= 0
##$TE2= 300
##$TE3= 300
##$TEG= 300
##$TL= (0..7)
0 120 120 120 120 120 120 120 
##$TP= (0..7)
150 150 150 150 150 150 150 150 
##$TP07= 0
##$TPNAME0= <>
##$TPNAME1= <>
##$TPNAME2= <>
##$TPNAME3= <>
##$TPNAME4= <>
##$TPNAME5= <>
##$TPNAME6= <>
##$TPNAME7= <>
##$TPOAL= (0..7)
0.5 0.5 0.5 0.5 0.5 0.5 0.5 0.5 
##$TPOFFS= (0..7)
0 0 0 0 0 0 0 0 
##$TUNHIN= 0
##$TUNHOUT= 0
##$TUNXOUT= 0
##$USERA1= <user>
##$USERA2= <user>
##$USERA3= <user>
##$USERA4= <user>
##$USERA5= <user>
##$V9= 5
##$VALIST= <valist>
##$VCLIST= <CCCCCCCCCCCCCCC>
##$VD= 0
##$VDLIST= <DDDDDDDDDDDDDDD>
##$VPLIST= <PPPPPPPPPPPPPPP>
##$VTLIST= <TTTTTTTTTTTTTTT>
##$WBST= 1024
##$WBSW= 4
##$XGAIN= (0..3)
0 0 0 0 
##$XL= 0
##$YL= 0
##$YMAX_a= 762316
##$YMIN_a= -902370
##$ZGOPTNS= <>
##$ZL1= 120
##$ZL2= 120
##$ZL3= 120
##$ZL4= 120
##$ABSF1= 10
##$ABSF2= 0
##$ABSG= 5
##$ABSL= 3
##$ALPHA= 0
##$AQORDER= 0
##$ASSFAC= 0
##$ASSFACI= 0
##$ASSFACX= 0
##$ASSWID= 0
##$AUNMP= <proc_1d>
##$AZFE= 0.1
##$AZFW= 0.1
##$BCFW= 1
##$BC_mod= 2
##$BYTORDP= 1
##$COROFFS= 0
##$CY= 11.3945322036743
##$DATMOD= 1
##$DC= 2
##$DFILT= <>
##$DTYPP= 0
##$F1P= 2.36226072786647
##$F2P= -0.459571619588291
##$FCOR= 0.5
##$FTSIZE= 0
##$FT_mod= 4
##$GAMMA= 1
##$GB= 0.15
##$INTBC= 1
##$INTSCL= 1
##$ISEN= 128
##$LB= 0.24
##$LEV0= 0
##$LPBIN= 0
##$MAXI= 10000
##$MC2= 0
##$MEAN= 0
##$ME_mod= 0
##$MI= 1.114404
##$NCOEF= 0
##$NC_proc= 0
##$NLEV= 6
##$NOISF1= 3.799351
##$NOISF2= 2.8
##$NSP= 1
##$NTH_PI= 0
##$NZP= 0
##$OFFSET= 15.70392
##$PC= 1
##$PHC0= -18395.09
##$PHC1= 10.20075
##$PH_mod= 1
##$PKNL= yes
##$PPARMOD= 0
##$PSCAL= 0
##$PSIGN= 0
##$REVERSE= no
##$SF= 200.130013532006
##$SI= 16384
##$SIGF1= 3
##$SIGF2= 2
##$SINO= 400
##$SIOLD= 16384
##$SREGLST= <1H.CDCl3>
##$SSB= 0
##$STSI= 0
##$STSR= 0
##$SW_p= 3612.71676300578
##$SYMM= 0
##$S_DEV= 0
##$TDeff= 0
##$TDoff= 0
##$TI= <>
##$TILT= no
##$TM1= 0
##$TM2= 0
##$TOPLEV= 0
##$USERP1= <user>
##$USERP2= <user>
##$USERP3= <user>
##$USERP4= <user>
##$USERP5= <user>
##$WDW= 1
##$XDIM= 8192
##$YMAX_p= 0
##$YMIN_p= 0
$$ End of Bruker specific parameters
$$ ---------------------------------
##NTUPLES= NMR FID
##VAR_NAME=  TIME,          FID/REAL,        FID/IMAG
##SYMBOL=    X,             R,               I
##VAR_TYPE=  INDEPENDENT,   DEPENDENT,       DEPENDENT
##VAR_FORM=  AFFN,          ASDF,            ASDF
##VAR_DIM=   8192,          8192,            8192
##UNITS=     SECONDS,       ARBITRARY UNITS, ARBITRARY UNITS
##FACTOR=    0.0002768,     1,               1
##FIRST=     0,             0,               0
##LAST=      2.2672688,     0,               0
##MIN=       0,             -902370,         0
##MAX=       2.2672688,     762316,          0
$$ Real data points
##PAGE= N=1
##DATA TABLE= (X++(R..R)), XYDATA
$$ [...]
2134a132O268n081n510O464K263l952K118o20n398M200N398m733k380L482l688
$$ -1132 5136 55 -5455 1009 3272 -680 1438 818 -4580 -380 5018 285 -2095 1387 -2301
2149b301n72P379j379q150L064M327l739J223L784o019j986O860l68l674K658
$$ -2301 -2873 4506 3127 -5023 -1959 2368 -1371 -148 3636 -2383 -4369 2491 2123 -1551 1107
2164A107j012m073N238L716o615j136M743k060j221N318k719o269M126M345l264
$$ 1107 95 -3978 1260 4976 -1639 -2775 1968 -92 -1313 4005 1286 -4983 -857 3488 224
2179B24l41J354m189M02O124j889m149K517m79k994N072J894o401l48N449k443
$$ 224 -117 1237 -2952 -2550 3574 1685 -2464 53 -426 -3420 1652 3546 -2855 -3203 2246 -197
2195a97j385L893k067m082M572K846m248l75J553k186J979M170m315l053L562
$$ -197 -1582 2311 244 -3838 734 3580 -668 -1043 510 -1676 303 4473 158 -2895 667
2210F67l32j671M058r04n845K155M676k714j649K869k240k001M183N34l700O77
$$ 667 335 -1336 2722 1818 -4027 -1872 2804 90 -1559 1310 -930 -2931 1252 1786 -1914 -1237
2226a237K147j706J126J944l178j295L904m44j823J869o38l144K544K758k720
$$ -1237 910 -796 330 2274 -904 -2199 1705 1261 -562 1307 669 -2475 69 2827 107
2241A07j045J355j290k63K992j168k394J537J023k161J434J164l041J38L106j070
$$ 107 -938 417 -873 -1136 1856 688 -1706 -169 854 -1307 127 1291 -1750 -1612 1494 424
2257D24j860J982J26k054K046J568k919k26J930r27L02J375j341k016J798M89
$$ 424 -1436 546 672 -1382 664 2232 -687 -913 1017 90 392 1767 426 -1590 208 697
2273F97j071R89J04k323P82K300j586j155J646k25j665J459Q05j862MJ983o61
$$ 697 -374 615 719 -1604 -822 1478 -108 -1263 383 158 -1507 -48 757 -1105 -1101 882 221
2290B21k31N14o47k53J653j47j025L55n6r14Q42J449j772q47J381o23q18J222
$$ 221 -10 504 -143 -396 1257 1110 85 440 384 -530 312 1761 -11 -858 523 -100 -918 304
2308C04J13j437M59R78r65k16R43l80k28O01k17o49K23J034n58J01L45k41j92
$$ 304 417 -1020 -561 417 -548 -764 179 -201 -429 172 -45 -694 -471 563 5 106 451 210 18
2327A8M69r3j22M55l00n99M17P2o13M83j52m52l9Q58q22k03P48j35p63L66M85
$$ 18 487 394 272 727 427 -172 245 317 -296 187 35 -417 -456 402 -420 -623 125 -10 -773 -407 78
2348G8m75j8N15J94m60M57k53L07j10K66j6k18m40K56K33m4j71q8M2o5p0j38L59
$$ 78 -397 -415 100 294 -166 291 38 345 235 501 485 267 -173 83 316 272 101 13 55 -10 -80 -218 141
2371A41l27l81K34M42m15j69P23l92r1K5N32n47k2J37O77p70m03J004n7l55j58
$$ 141 -186 -567 -333 109 -306 -475 248 -144 -235 -210 322 -225 -247 -110 567 -203 -606 398 341 -14 -172
2392a72O31p6p49L54M82n73k81M92L6m57M41mj36k66o5J13N88n58J06k18M75j77
$$ -172 459 383 -366 -12 470 -103 -384 108 144 -313 128 124 -12 -278 -343 -230 358 -200 -94 -312 163 -14
2414a4l02K40J96k50J59J77J62m20J8K72J13n8k74o0N76l84o12P08K83r16J34
$$ -14 -316 -76 120 -130 29 206 368 -52 -34 238 351 293 19 -41 535 151 -461 247 530 -386 -252
2435b52P70q30k38Q61q4p18K42P27m11o6M90q14j6P91o51k85J340o19r07R45P23
$$ -252 518 -312 -550 311 227 -491 -249 478 67 1 491 -323 -339 452 -199 -484 856 237 -670 275 998
2456I98j587j11J561p85o39J002k48j171J222M06q32J37K56q99O89N55m70q95
$$ 998 -589 -700 861 76 -563 439 191 -980 242 648 -184 -47 209 -690 -1 554 84 -811
2474h11J455k91j236J514pj899J047J560j510o33J415n35p10J445Mj576N11J022
$$ -811 644 353 -883 631 624 -1275 -228 1332 -178 -811 604 69 -641 804 808 -768 -257 765
2492G65j288O77J412k087j200K670j32j852J590L43k847J316K470k194q83K261
$$ 765 -523 154 1566 -521 -1721 949 817 -1035 555 898 -1949 -633 1837 -357 -1240 1021
2508A021j097j087K207k0k690J356J400j761Q16J167k573k83L336j022k111K064
$$ 1021 -76 -1163 1044 1024 -1666 -310 1090 -671 145 1312 -1261 -1544 1792 770 -1341 723
2524G23l30k373K387K188l126j109K310o97p57K544j163k648K761P57k126N92
$$ 723 393 -1980 407 2595 -531 -1640 670 -27 -784 1760 597 -2051 710 1467 -659 -67
2540f7J243l114K46M413k046l148K434Q24k363K328J585m012j98L144n65j129
$$ -67 1176 -1938 -1692 2721 675 -2473 -39 785 -1578 750 2335 -1677 -1875 1269 704 -425
2556d25K022j980k195L662R62l202J100J356l197J121L872k886l063L331Q59k462
$$ -425 1597 -383 -2578 1084 2046 -1156 -56 1300 -1897 -776 3096 210 -2853 478 1337 -1125
2572a125J876O30l933J294L635k043j044J469k216p55M504m61m422K054J838l140
$$ -1125 751 1381 -2552 -1258 2377 334 -710 759 -1457 -2212 2292 1831 -2591 -537 1301 -1839
2588a839J993L190l906k817M823M28k611J765q6l464K558K814l198j150K174j904
$$ -1839 154 3344 -562 -3379 1444 1872 -739 1026 940 -2524 34 2848 -350 -1500 674 -1230
2604a230j93M302j912m646K904K679k671J052J928m174j114M948P5k781J420p70
$$ -1230 -1423 2879 967 -3679 -775 1904 -767 285 2213 -1961 -3075 1873 1948 -833 587 -183
2620a83j953L368J995m468m52L402k200K3L261k635m148M287K676l703J41J526
$$ -183 -2136 1232 3227 -1241 -1693 1709 -491 -468 2793 158 -3990 297 2973 -730 -589 937
2636I37l138O31M407j640l036J335L22j342L742k55m727J398L871k699k59K685
$$ 937 -2201 -1570 2837 1197 -1839 -504 -182 -1524 2218 1963 -2764 -1366 2505 -194 -453 2232
2652B232l158k191M941Q61m055N83J711k061J238K487k722k511K917L70j191K633
$$ 2232 -926 -3117 1824 2685 -1370 -787 924 -1137 101 2588 -134 -2645 272 642 -549 2084
2668B084j587l951K861L087k471q48J706k148j284M514p1l864R75J736j553J394
$$ 2084 497 -3454 -593 2494 23 -825 881 -1267 -2551 1963 1892 -1972 -997 739 -814 580
2684E80J565l482m54L375p29j433J897j342k708L251K554l702j111K092j119k5
$$ 580 2145 -1337 -1791 1584 855 -578 1319 -23 -2731 520 3074 -628 -1739 353 -766 -791
2700g91K846j358l300J966J416j203J327L52l239R90L111j470j772K039j122j721
$$ -791 2055 697 -2603 -637 779 -424 903 1255 -1984 -994 2117 647 -1125 914 -208 -1929
2716a929L179J092l593m17K984j126k99J696j576j776K193P48j159L23m49j716
$$ -1929 1250 2342 -1251 -1668 1316 190 -109 1587 11 -1765 428 1176 17 340 -109 -1825
2732a825J607K280k335q36J822r51j115K568K41l178Q08K253j361m16J204j249
$$ -1825 -218 2062 -273 -1109 713 -238 -1353 1215 1456 -1722 -914 1339 -22 -438 766 -483
2748d83n95K413k98j627N86L13j569J989J210k799o18K278k88j068J400Pj935
$$ -483 -1078 1335 1037 -590 -4 309 -1260 729 1939 -860 -1478 800 512 -556 844 851 -1084
2765a084P88J311j156L8K46q97J60J699q76j460J578J12j300J338N31j986J17
$$ -1084 -296 1015 -141 -103 143 -754 -594 1105 229 -1231 347 459 -841 497 1028 -958 -841
2782h41K035o19q98O29j93n40P44L66o29q5J51r93J055O10r91p21J699n98j090
$$ -841 1194 575 -323 306 113 -427 317 683 54 -31 120 -873 182 792 -199 -920 779 181 -909
2801i09Q36P73j465J50J547p05r76O44M37m83L29K40m58k13M82k29K86K75p93
$$ -909 -73 700 -765 -615 932 227 -749 -105 332 -151 178 418 -40 -253 229 0 286 561 -232
2820b32j38J078n28m60M28J01n65k45J063l38m50L75k52j63N78k43l35L46o5j67
$$ -232 -370 708 180 -280 148 249 -316 -561 502 164 -286 89 -163 -326 252 9 -326 20 -45 -212
2840b12M26P0o68j15J112j11p02K63K37m65J1N94m28j04M73l13j3J95l72r7M52
$$ -212 214 284 -384 -499 613 502 -200 63 300 -165 -154 440 12 -92 381 68 55 250 -122 -219 233
2861B33m78p3O5M38j98k12K46k9l45k2M61j61k49j0M40J02l06m5M40l21k08K73
$$ 233 -245 -318 -253 185 -13 -225 21 -8 -353 -375 86 -75 -324 -334 106 208 -98 -143 297 -24 -232 41
2883D1N92m79l28L85M7m05j48Q61m23m43K08K97m02j06L75O2j24j76j53K99Q4
$$ 41 633 154 -174 211 258 -147 -295 566 143 -300 -92 205 -197 -303 72 134 10 -166 -319 -20 64
2904F4k17J23J58l67N0K28Q3Q9j59J55m3j00k4O8J42k28j22J43p0K26o58L78K95
$$ 64 -153 -30 128 -239 -189 39 122 211 52 207 164 64 40 108 250 22 -100 43 -27 199 -459 -81 214
2927B14o01qK79K55m99L87J66m44k10N15j64L2J64j11J41R6j1k05M55nn53L4P47
$$ 214 -387 -395 -116 139 -360 27 193 -251 -461 54 -110 -78 86 -25 116 212 201 -4 451 446 -107 -73 674
2950F74r07P0O58j25o68K52J99o24M29L18k08j70J13j5l01K58J87q06Q00Qn98
$$ 674 -233 -163 495 370 -298 -46 153 -471 -42 276 68 -102 11 -4 -305 -47 140 -666 134 142 -456
2971d56K24M44l94K14N25k26o08N47j70n51O46O92j192P4O01l85j93Q84l72j182
$$ -456 -232 212 -182 32 557 331 -277 270 100 -451 195 887 -305 -231 370 -15 -208 676 304 -878
2991h78J026L04j028K79O54j002J93J342r42m57O73P7r46R53J96j040K25J346
$$ -878 148 452 -576 -297 357 -645 -452 890 -52 -509 164 241 -705 248 444 -596 -371 975
3009I75j055j92J189j112p18J532L57j570R41l5j087K47J819j506r37J696j59
$$ 975 -80 -272 917 -195 -913 619 976 -594 347 312 -775 -528 1291 -215 -1152 544 385
3026C85j093J182j34j642R07J218p64o55J107p15n90J705j84j896J136O53j210
$$ 385 -708 474 340 -1302 -395 823 59 -596 511 -204 -794 911 727 -1169 -33 620 -590
3043e90P12J367k079p06K231k18j372R03j89j337J314J285j770j81J099q64k69
$$ -590 122 1489 -590 -1296 935 717 -655 248 59 -1278 36 1321 -449 -630 469 -395 -664
3060f64K105j290j930J829J068j797Q00R40k444K94K453p67j530R97kj169J867
$$ -664 1441 151 -1779 50 1118 -679 121 1061 -1383 -1089 1364 597 -933 64 62 -1107 760
3077G60P39k553K23J884j264k97K222j897j637K295R86k240L71J210k158Q61K395
$$ 760 1499 -1054 -831 1053 -211 -508 1714 -183 -1820 475 1461 -779 -408 802 -1356 -495 1900
3094A900j694j563J323q2o25J929k41k593N99K371j341J13R89j713j259L135L63
$$ 1900 206 -1357 -34 -116 -741 1188 947 -1646 -1047 1324 -17 96 1085 -628 -1887 1248 1611
3111A611k541P37P88j524Q02K195k578j246K433k39r63J331o51k463K044K165
$$ 1611 -930 -193 595 -929 -127 2068 -510 -1756 677 438 -525 806 155 -2308 -264 1901
3127A901k104p18J457j575j39K891n81k788J075J325j582J059J434k414p52K656
$$ 1901 -203 -921 536 -1039 -1178 1713 1132 -1656 -581 744 -838 221 1655 -759 -1511 1145
3143A145k75j350J005r12j313K687J050k516m57J598j273m7K575j448k683J982
$$ 1145 870 -480 525 -387 -1700 987 2037 -479 -936 662 -611 -658 1917 469 -2214 -232
3159b32J089j458Q50M31k255Q69K210j019j262J322p69j181K713J71k958Q01J931
$$ -232 857 -601 249 680 -1575 -706 1504 485 -777 545 -224 -1405 1308 1479 -1479 -678 1253
3176A253j236m28J721j478j819K515P26j796O77k46j408J625J532j865p46J221
$$ 1253 17 -411 1310 -168 -1987 528 1254 -542 135 -111 -1519 106 1638 -227 -973 248
3192B48m75n37K256o14k591J192K114j653l68J551j872q0K144l74j650O15M59
$$ 248 -227 -764 1492 878 -1713 -521 1593 -60 -428 1123 -749 -829 1315 941 -709 -94 365
3209C65j358J983O09k341m06J972q16o58J751r36j840J381J361j157n09P53q14
$$ 365 -993 990 1599 -742 -1148 824 8 -650 1101 165 -1675 -294 1067 -90 -599 154 -660
3226f60K60J809j343q66R51j50n84J457L7k213N28K166j161o38J017p33j041J739
$$ -660 -400 1409 66 -800 151 1 -583 874 911 -1302 -774 1392 231 -407 610 -123 -1164 575
3244E75O38j627l20P43m92P41P03j458n36J263L7r84J284j60j616Q89J520j038
$$ 575 1213 -414 -734 9 -483 258 961 -497 -1033 230 267 -717 567 407 -1209 -320 1200 162
3262A62r41J334k12q54J021J26j429M95R11o91K93M61j293l75J687k35j129J010
$$ 162 -779 555 343 -511 510 636 -793 -298 613 -78 215 676 -617 -992 695 460 -669 341
3280C41n8j239J002Q40j136l89R85m82l45Q38k41n54P07mq02P46K13j028L53J257
$$ 341 283 -956 46 886 -250 -639 346 -136 -481 357 116 -438 269 265 -537 209 422 -606 -253 1004
3300A004o07j120O09O25o66L30L93q78k77R04N7n43L15j79l33M39j61j79L61N5
$$ 1004 397 -723 -114 511 -155 175 568 -310 -587 317 374 -169 146 -33 -366 73 -88 -267 94 149
3320A49m78J88Q23q81o02Q74J38p09M63P40j103K73N65l47k09M23n29P3L03j1
$$ 149 -329 -141 682 -199 -801 73 211 -498 -35 705 -398 -125 440 93 -116 307 -222 -149 154 143
3340A43n30L55L91p26J45N92n23l95O68K96p15M2L28p2N5J57m50J64j30M41j77
$$ 143 -387 -32 359 -367 -222 370 -153 -548 120 416 -299 -257 71 -1 54 211 -239 -75 -205 236 59
3361E9J35m3k20M18l30j81J36K42k77j18L44l8j35j59N8L75k30r4J01J70q8m18
$$ 59 194 151 -69 349 19 -162 -26 216 -61 -179 165 127 -8 -167 -109 266 36 -58 43 213 125 -293
3383b93K27L23m19l44M73M00q28K43L58Nl40P7L57l45N2N1K97j42j99J23J13j02
$$ -293 -66 257 -162 -506 -33 367 -461 -218 140 145 -195 -118 239 -106 -54 -3 294 152 -47 76 189 87
3405H7j04J22Q3l98k35L23M4J13j82J4J68k42N9L33l58J58j86L05J35m70Q4K51
$$ 87 -17 105 188 -210 -445 -122 -78 35 -147 -133 35 -207 -148 185 -173 -15 -201 104 239 -231 -147 104
3427A04J16k23kL16j69n88N55K27k97k56K40L1j32j40K02J17j13lK69j21K32n49
$$ 104 220 -3 -5 311 142 -446 109 336 39 -217 23 54 -78 -218 -16 101 -12 -15 254 133 365 -184
3449a84L52j75m40Q8N43P0n09L32L5k31K44J57j24n2n6j20mJ48l33M03L02m97
$$ -184 168 -7 -447 -359 184 254 -255 77 112 -119 125 282 158 106 50 -70 -74 74 -259 144 446 -51
3471e1l26M57K93o89j89R37l30n28K65K60m63K89L12n69L33k1j66J05L16k55p6
$$ -51 -377 80 373 -316 -505 432 102 -426 -161 99 -364 -75 237 -332 1 -20 -186 -81 235 -20 -96
3492i6M51m4o57M55M15p11J94M02o31j27N82J39o39K81N5l84M29P6l27L9M25p30
$$ -96 355 311 -346 109 524 -187 7 409 -222 -349 233 372 -267 14 69 -315 114 190 -137 -98 327 -403
3514d03q7J145m90q89R15J76p16M50L99o98l17J122m28n18M36k23j49Q78k84q07
$$ -403 -490 655 165 -724 191 367 -349 101 500 -198 -515 607 179 -339 97 -126 -275 603 319 -488
3534d88K59R14q58j60R00q40n92R63M40p26K79O2o05K54R38p22m15O81l08m21
$$ -488 -229 685 -173 -333 567 -273 -865 98 538 -188 91 153 -452 -198 740 18 -397 284 -24 -445
3554d45J161l10j474R29Q35r84M23M97r76n12J572j22j045J19O24p87M11N88r51
$$ -445 716 406 -1068 -139 696 -288 135 632 -344 -856 716 594 -451 -332 292 -495 -84 504 -447
3573d47l96J329o03n50J062l10j195Q85J227j410R9N37m84l27J460m20j377P41
$$ -447 -843 486 -117 -667 395 85 -1110 -225 1002 -408 -309 228 -256 -583 877 457 -920 -179
3591a79P28p67O36K20j247J70J187m12o08Q39o61q54J078P71j618J56O33m81K08
$$ -179 549 -218 418 638 -609 -439 748 336 -272 567 -94 -948 130 901 -717 -561 72 -409 -201
3610b01P99o99j097J356P37j252P34j54r96N11J499j070r58J046k59n30J630j59
$$ -201 598 -101 -1198 158 895 -357 377 223 -773 -262 1237 167 -791 255 -4 -534 1096 937
3628I37j960N61J085o91j7P93j196m95J634J63j611J021m67o79J160Q13j358n74
$$ 937 -1023 -462 623 -68 -85 708 -488 -983 651 814 -797 224 -243 -922 238 1051 -307 -881
3646h81J442n96k65J129n31j607J191J172j083P4L89j357K07J699k27j461R17
$$ -881 561 -35 -300 829 298 -1309 -118 1054 -29 45 434 -923 -716 983 756 -705 212
3663B12k43m56R06O93j953n5J569n67n04J000p46r61J300P44j208k25R76j120
$$ 212 -31 -487 419 1112 -841 -896 673 106 -398 602 -144 -1105 195 939 -269 -494 482 -638
3681f38M12J253p91j039P62L37n17Q99k22j342N85J311p62o91R06q32o10J671
$$ -638 -226 1027 236 -803 -41 296 -221 678 456 -886 -301 1010 248 -443 463 -369 -979 692
3699F92J26j775P44N25p43N47M86j117o08J531J18p17N25k87j415J145J307j059
$$ 692 818 -957 -213 312 -431 116 602 -515 -1123 408 526 -191 334 47 -1368 -223 1084 25
3717B5o58J111n33l70J388l53j318N91O24r63O36K30r82n4J490n74q96P53Q6j078
$$ 25 -633 478 -55 -425 963 610 -708 -117 507 -456 180 410 -572 -626 864 290 -606 147 233 -845
3737h45J245P20j638j69R73l00n6N46o48o11R30N83q93K29J38q65K90J181n26
$$ -845 400 1120 -518 -687 286 -14 -70 476 -172 -783 147 730 -163 66 204 -661 -371 810 284
3756B84r60P80M00q70Q86K34j317j36J203m05l43M69m80j91O89K66j008M73M70
$$ 284 -676 104 504 -366 520 754 -563 -699 504 99 -244 225 -255 -446 243 509 -499 -26 444
3775D44q13L88Q67p64p04Q42j50n95R36l86o91N00L85k45l14L65r1l94P31O8n70
$$ 444 -369 19 886 122 -582 260 110 -485 451 65 -626 -126 259 14 -300 65 -26 -420 311 379 -191
3796a91Q1L62o10L91M17p92k07O99j41m38L41L21p43M41M80m44j37R1R0k0L34
$$ -191 -110 252 -358 33 450 -342 -549 150 9 -429 -88 233 -510 -69 411 -33 -170 -79 11 -9 325
3817C25k84m38L81K74l65J53R2p11K80N26J85q12K17J14j85K98K75n60R6K30k60
$$ 325 41 -397 -16 258 -107 46 138 -573 -293 233 418 -394 -177 -63 -248 50 325 -235 -139 91 -169
3838a69P2L60n71j55Q66m28j87J71R7k23qM88l08k68L24l7nj11J68o0Q5R6l81
$$ -169 -97 263 -308 -463 403 -25 -212 -41 56 -167 -175 313 5 -263 61 24 19 -92 76 16 101 197 -184
3861a84O8L32k44J9J80n4m93L59P9k09p7M29l26j29L87j30nJ39k60J02lk8Q3J51
$$ -184 -116 216 -28 -9 171 117 -376 -17 62 -147 -224 205 -121 -250 137 7 2 141 -119 -17 -20 -48 35 186
3885A86j29P0k4J20k55l52N39L7P0k30P3J46k85r2P3k7J49K3j76J12Q0k11R1K60
$$ 186 57 127 103 223 -32 -384 155 192 262 32 105 251 -34 -126 -53 -80 69 92 -84 28 108 -103 -12 248
3909B48l50J3J19j63J33P9K49j90L7n4J56j23j55j40oK59l07K09k91L98m41J49
$$ 248 -102 -89 30 -133 0 79 328 138 175 121 277 154 -1 -141 -147 112 -195 14 -277 121 -320 -171
3931a71K97l28j19L32J55k00j49J18J33k62J33p6L49k22P1j2k0m7j3J85j57n8
$$ -171 126 -202 -321 11 166 -34 -183 -65 68 -194 -61 -137 212 -10 61 49 29 -18 -31 154 -3 -61
3953f1o3Q2m5j33L52o7k72J88P8k86K20j82J64J51M9k97N1M09l93k95L43J64m2
$$ -61 -124 -42 -87 -220 132 65 -207 -19 59 -227 -7 -189 -25 126 175 -122 -71 338 -55 -350 -7 157 115
3976A15j91L01k72l7J50J24l93J31J04n1J63n6k40K71j02j64L36n2k23l4J16L51
$$ 115 -76 225 -47 -84 66 190 -203 -72 32 -19 144 88 -152 119 17 -147 189 137 -86 -120 -4 347
3998C47m60l3K11l71J59K45m0KJ55l91j51M75k43q3J71M88o91n0N03l58l15O64
$$ 347 -113 -146 65 -306 -147 98 58 60 215 -176 -327 148 -95 -178 -7 481 -210 -260 243 -115 -430 234
4020B34k26k48j81M40l30L70L9k45J60K19l88J36K09j20n78O93J13k48P1J34l40
$$ 234 8 -240 -421 19 -311 59 98 -147 13 232 -156 -20 189 69 -509 184 297 49 120 254 -86
4041h6N7O06n27l06J18L89j69j74K67n80n5P58l16n0K40k03l29P52J07j064K80
$$ -86 -29 577 50 -256 -138 251 82 -92 175 -405 -460 298 -18 -68 172 -31 -360 392 499 -565 -285
4062b85P91o43j68O37k61l34N78P6n60K62r7j66J27N42l79n01Q40m82k16R34l50
$$ -285 506 -137 -305 332 71 -263 315 391 -169 93 -4 -170 -43 499 120 -381 459 -23 -239 695 345
4083C45p12J78M99k22k7J61m74j68O47L77o45J78j02l39O13J99p47j13O46k59
$$ 345 -367 -189 310 88 61 222 -252 -420 227 604 -41 137 35 -304 309 508 -239 -352 294 35
4103C5m48P63k19p29N00Q07o50j43J48m96K30J072m89o26L15L2k34L91J78j125
$$ 35 -413 350 131 -598 -98 709 59 -84 64 -432 -202 870 381 -245 70 102 -132 259 437 -688
4123f88J59R06m95l37R56p00m30P45M01r88M10M12n74K40P39o89n05R70j53m56
$$ -688 -529 377 -118 -455 501 -199 -629 116 517 -471 -61 351 -223 17 756 67 -438 532 379 -77
4143g7M73j36j259N82J171o28m30N21m75o1Q72j41n76j34M92n21M74M98q30l94
$$ -77 396 260 -999 -417 754 126 -304 217 -258 -319 553 412 -164 -298 194 -327 147 645 -185 -579
4163e79P00J49n31P17m14q87R47P43r38l43P89m84K58O73l91j032O71L04m39M65
$$ -579 121 270 -261 456 42 -845 102 845 -93 -436 353 -131 127 800 409 -623 48 352 -87 378
4183C78j59p48O3J234r00m17O31j3o64Q12L90j049J89O25l66qL28m03m42Q18O4
$$ 378 219 -529 -466 768 -132 -549 82 69 -595 217 607 -442 -253 372 6 -2 326 -77 -519 299 363
4204C63p42M94J96o27J05J016p67o55P04J87m26M61p9r51O61L79k81o4K56p69
$$ 363 -379 115 311 -316 -211 805 38 -617 87 274 -152 309 230 -721 -60 319 38 -26 230 -539
4224e39j16J015Jn81m0M33p49Q90L86p76n06Q52O7o56P03k61o92O79M96p20J35
$$ -539 -655 360 361 -220 -260 173 -576 314 700 -76 -582 270 337 -319 384 123 -569 110 606 -114 21
4245B1p2m22J91Q30l85o22M59L37o62M44N1n18N8N63R0n54K56k37l10P48L76p13
$$ 21 -51 -473 -282 548 163 -459 0 337 -325 119 170 -348 -290 273 363 -191 65 -172 -482 266 642 -71
4267g1J35J30k50j03P38m28m37L84K84m69J36J46n29q7R76m90l77J35J77k18N02
$$ -71 64 194 -56 -159 579 151 -286 98 382 -87 49 195 -334 -421 555 65 -312 -177 0 -218 284
4288B84R9o45q3O97m39j11N62m77l05O69r2m61L10P6l84L44L98n28j89O86l67
$$ 284 383 -262 -345 352 -87 -198 364 -113 -418 251 159 -302 8 84 -300 44 442 -86 -275 411 44
4309D4r1K18k75l93M40L19l56J18m3k1l11O72k86j94Q3K07n64N62L4j90m69O62
$$ 44 -47 171 -104 -497 -57 262 -94 24 -19 -40 -351 321 35 -159 -76 131 -433 129 163 -27 -496 166
4331A66J00l32J22K27o10L63K59k18j4l9q2j56N42j44m97K29N8j74O4L27k53m4
$$ 166 266 -66 56 283 -327 36 295 77 63 24 -58 -214 328 184 -313 -84 -26 -200 -136 191 -62 -106
4353a06K55k20j64N29j66k15J41L42k72j93M8M8K30k4q3l54J99K57m73P3L29k06
$$ -106 149 -71 -235 294 128 -87 54 396 124 -69 -21 27 257 233 150 -204 -5 252 -221 -148 181 -25
4375b5J80N8j56j57M3M3rJ62j05j71J83J69l84j1k17J42K49M3M48m69j73L17j47
$$ -25 155 213 57 -100 -57 -14 -23 139 34 -137 46 215 -169 -180 -397 -255 -6 37 485 16 -157 160 13
4398A3k4m9j22J73M7J28o3J14k67p4J65q3J38j1K6j28j90L40jJ62m21J76lq1J87
$$ 13 -11 -60 -182 -9 38 166 103 217 -50 -124 41 -42 96 85 111 -17 -207 133 132 294 -127 49 46 -35 152
4423A52k91K62l45L08o7m0K69n66N51m84J98q7K33jj77J81n7r8k75K46P9j00J06
$$ 152 -139 123 -222 86 19 -21 248 -318 233 -251 -53 -140 93 92 -85 96 39 -59 -334 -88 -9 -109 -3
4446cK49l12J76j01J77j81K7J49o8k42P6J71L6o6l39K27K19k32J38j58L7J56j38
$$ -3 246 -66 110 9 186 5 32 181 113 -129 -53 118 154 88 -251 -24 195 -37 101 -57 -20 136 -2
4469bj20J33J60m56J51J59j87q2P9J13m7J56mr5j07o6L18r1j10j61O5L26j08m8
$$ -2 -122 11 171 -285 -134 25 -162 -244 -165 -52 -99 57 53 -42 -149 -215 103 12 -98 -259 -194 132 24 -24
4493b4nK27l17q9M20r8j83K89j6j34j07K23k18m6K10n4j34L57m07J35K58k05j60
$$ -24 -29 198 -119 -208 212 114 -69 220 204 70 -37 186 -32 -78 132 78 -56 301 -106 29 287 82 -78
4516g8L91o1l43k42O51m12k15N17j4j30j35%R6J81J4k54QP8L1r9J87J41q32O49
$$ -78 313 252 -91 -333 318 -94 -309 208 194 64 -71 -71 25 206 220 -34 -26 52 83 -16 171 312 -520 129
4540A29K2l15Q5J40l10J0L15K2k85r1L19j93K78J40m82J14J85m9l83O95j51m09
$$ 129 151 -164 -79 61 -249 -239 76 98 -187 -278 41 -152 126 266 -216 -102 83 34 -349 346 195 -214
4562b14K48Q7l81rL97p3o6K74k35k2P0l4k22L47J60o40J46O17m09l51N23k21k19
$$ -214 34 121 -260 -269 128 55 -11 263 28 6 76 42 -180 167 327 -313 -167 450 41 -310 213 -8 -227
4585b27M01k11j34%N60m41pM30m40j38M94j21k71L30Qn39L76M71n75k68L81nl60
$$ -227 174 -37 -171 -171 389 -52 -59 371 -69 -207 287 166 -105 225 233 -306 70 541 -34 -302 79 74 -286
4608b86N38o3n29K87L65o00L17J95k41j45L54k6k81K06J19m41M32P1k34j99K82
$$ -286 252 189 -340 -53 312 -288 29 224 -17 -162 192 166 -115 91 210 -231 201 272 38 -161 121
4629A21L9j85N35l83m52L56L01n44j43M85l62J47K98l41q0M91k56k00N61J50r42
$$ 121 160 -25 510 127 -325 31 332 -212 -355 130 -232 -85 213 -128 -208 283 27 -173 388 538 -404
4650d04J98L54j77k1K77k41k05K84J76k78N7l9l02L05L59n21J13J23Ok26J39K86
$$ -404 -206 148 -29 -50 227 -14 -219 65 241 -37 20 -19 -321 -16 343 -178 -65 58 64 -162 -23 263
4672B63q62L74M02n4k84K77m00m4O10j14k76NK0k63P16k4o98K40M63m31J38%q
$$ 263 -599 -225 177 123 -161 116 -284 -328 282 168 -108 -103 -83 -346 370 346 -352 -112 351 -80 58 58 50
4695E0l83M87K42n75q8L69j21K3J92j52o59P84R5k94J79j13o04L79K85M1j97K27
$$ 50 -333 154 396 -179 -267 102 -19 4 196 44 -615 169 264 -30 149 36 -568 -189 96 137 -60 167
4717A67m95q0O46n6m46J37K72j96K67M81q20j96N33n6k50M17k06m15J4O42l21
$$ 167 -328 -408 238 182 -264 -127 145 -51 216 697 -123 -319 214 158 -92 325 119 -296 -282 360 39
4738C9j94L58k92N2K83j44m17J10K82j06K14l0o14J81M70J23l88K57r3k72M24
$$ 39 -155 203 -89 -37 246 102 -315 -205 77 -29 185 155 -459 -278 192 315 -73 184 91 -181 243
4759B43P2l56r2M05k69L0L16m62k80N21J64m18K20r5k86J46N53l12l80L40r4k1
$$ 243 315 -41 -133 272 3 33 349 -113 -393 128 292 -126 94 -1 -287 -141 412 100 -280 60 -34 -55
4781e5J59J03m51J29N59m68J84Ok13R1J11M8l90K68m64K67k8M73k60l47L07p0
$$ -55 104 207 -244 -115 444 -24 160 166 -47 44 155 203 -187 81 -383 -116 -144 329 69 -278 29 -41
4803d1j76K69p5m13L06J71O8k83L16k06p5L65J66p35L86J87j47r6J78pk32K04
$$ -41 -217 52 -23 -436 -130 41 109 -174 142 -64 -139 226 392 -343 43 230 83 -13 165 158 -74 130
4825A30q9j9K45l89q5K34L34n02J1L49m75J70J27l2l20J22K07J23m27M58m16R1
$$ 130 41 22 267 -122 -207 27 361 -141 -130 219 -256 -86 41 9 -311 -189 18 141 -286 172 -244 -153
4847a53K58k10j19L51Q7k72L20j81k80L95n8k10J2K07j05l95L55K33p0l04J57
$$ -153 105 -105 -224 127 214 -58 262 81 -199 196 138 -72 -60 147 42 -353 2 235 165 -139 18
4868A8j69K50j38l22K19Q6j02J15r6K13o0n0K34p8J64l75k4j06J60K04l19J20
$$ 18 -151 99 -39 -361 -142 -56 -158 -43 -139 74 14 -36 198 120 284 -91 -115 -221 -61 143 -176 -56
4890e6o5J98k15R2K6j1J50k22K34M5n5l04O4K79o5j01P1J24k38J02L8n3j30K44
$$ -56 -121 77 -138 -46 -20 -31 119 -103 131 176 121 -183 -119 160 95 -6 65 189 -49 53 91 38 -92 152
4914A52j46K1j80n2J59J79k72L58m03J93k50R1R7r5J43K6k58o7L31L9l09K78k10
$$ 152 6 27 -153 -205 -46 133 -139 219 -184 9 -241 -150 -53 -148 -5 21 -237 -304 27 66 -243 35 -175
4937a75J75k31N47l04J15j83J5J62j57nj19r8L44j71J05J04o0N4n4q1k45J5L70
$$ -175 0 -231 316 12 127 -56 -41 121 -36 -41 -160 -258 86 -85 20 124 64 118 64 -17 -262 -247 123
4960A23Q0k27K38l32N7lL77k27o3j90L48k90L95k50o3j33J05n3J13q2j43M34n5
$$ 123 203 -24 214 -118 -61 -64 313 86 23 -167 181 -109 286 36 -27 -160 -55 -108 5 -77 -220 214 159
4983A59k20J21J29j05k21L37k57O6j3k4J40q5K43l44K00k35N6L0M4k27J93O0j64
$$ 159 -61 60 189 84 -137 200 -57 9 -4 -28 112 27 270 -74 126 -109 -53 -23 21 -206 -13 47 -117
5006a17J2N5K16r4m4m1K21k69l2M3J47r2JK49k43k7O8J61j18M6j35R4Q3l21k4
$$ -117 -105 -50 166 72 28 -13 208 -61 -93 -50 97 5 6 255 12 -15 53 214 96 142 7 101 184 -137 -161
5031a61J39O0J77N6l13Q5K44j0j74N7j58j74M84m28m1K02J6l83M54j85K07m39
$$ -161 -22 38 215 271 -42 43 287 277 103 160 2 -172 312 -116 -157 45 61 -322 132 -53 154 -285
5053b85L19N1o7k46K96n9L5J75k61j02L72j51k44K13j01n6J78o6n8L03O9k07j04
$$ -285 34 85 18 -228 68 9 44 219 -42 -144 228 77 -167 46 -55 -111 67 1 -57 246 315 108 4
5076DQ6P1j88K20j00R7k19L22p8j93%K6k54K67L1nj63J07j09N0K94l69p7K02J34
$$ 4 90 161 -27 193 93 190 -29 293 215 22 22 48 -206 61 92 87 -76 31 -78 -28 266 -103 -180 22 156
5101A56j81P1K27n82K42L99k03Rl0j52J67k7j40K02k74K27j98L81p0j99j82L40
$$ 156 -25 46 273 -309 -67 332 129 138 108 -44 123 96 -44 158 -116 111 -87 294 224 25 -157 183
5123A83m13J10K09K02k67jJ27k00o9J58k43K30j8J33k75J99J52l70K26m3j53K60
$$ 183 -230 -120 89 291 24 23 150 -50 -119 39 -204 26 8 141 -134 65 217 -153 73 30 -123 137
5145A37J13k42j58M03j33n40N19P7j93L0l4n8l43M93j52n8K41k07K0Q9k04j10
$$ 137 250 8 -150 253 120 -420 99 176 -17 13 -21 -79 -422 71 -81 -139 102 -105 -85 4 -200 -310
5167c10L28L5Qj25J20N3p7L48j59k76k74L92q2R5J79l84j7M84m6k87l9k08M40
$$ -310 18 53 61 -64 56 109 32 380 221 -55 -329 63 -19 76 255 -129 -146 338 292 5 -34 -242 198
5190A98k11K73j44l03K06j32J33j6K0j96M3L08k33K58k36k06L29M9k24q2K21m8
$$ 198 -13 260 116 -187 19 -113 20 4 24 -172 -129 179 -54 204 -32 -238 91 140 -84 -166 55 7
5212Gk06N24k36q6o3L18k61j01K59k41l47M96m6k70J63O1j66J65M00o97K03K26
$$ 7 -199 325 89 3 -60 258 -3 -104 155 -86 -433 63 17 -253 -90 -29 -195 -30 370 -327 -124 102
5234A02J43m99L05J8j67J29M1p0k4j6P5k26L24k10M8N7k5q8R7N4k90K77Q9k5j65
$$ 102 245 -254 51 69 -98 31 72 2 -22 -38 37 -189 135 -75 -27 30 5 -83 14 68 -222 55 144 119 -46
5259d6K6q9j00M09N6l74j13K91j77PK53k44L5J18R3l62L83j38Lj02J50MJ7m8n7
$$ -46 -20 -109 -209 200 256 -118 -231 60 -117 -110 143 -101 -66 52 145 -217 166 28 31 -71 79 83 100 52 -5
5284ek49K20J12k64J00J04j1M6K70j65k87M07k10l04M97q5j30l42M87j81R0l8
$$ -5 -254 -34 78 -186 -86 18 7 53 323 158 -129 278 68 -236 261 176 46 -296 191 10 100 62
5306F2O5j98L66j37n01L90j87j28M03k05J04j10L03K6j53j2j19k56J58K38j21
$$ 62 127 -71 295 158 -343 47 -140 -268 135 -70 34 -76 227 253 100 88 -31 -287 -129 109 -12
5327a2j6j00J00k5L28j48j86r4K86k50K62k32q4K64M12m30j63l3L17j83j24K62
$$ -12 -28 -128 -28 -53 275 127 -59 -153 133 -117 145 -87 -171 93 505 75 -88 -121 196 13 -111 151
5349A51k03Q4Pm1O2Kj8j86J11J61k59P0J13j34J61R6k67J32K1J09Lk7M2l66L82
$$ 151 -52 32 39 -2 60 62 44 -142 -31 130 -129 -59 54 -80 81 177 -90 42 63 172 175 148 190 -176 206
5374B06J43m36R4Pn7k18L48k80k04M80J0k92k7L21k20R7K23J3k15r0L0K04l04
$$ 206 349 -87 7 14 -43 -261 87 -193 -397 83 93 -199 -226 95 -125 -28 195 208 -7 -97 -67 137 -167
5397a67P6K6l4J9L51j34j35M20k54k98J36L86n16K46P2J6qk3j09r3n5K5j19O0
$$ -167 -91 -65 -99 -80 271 137 2 422 168 -130 6 392 -124 122 194 210 202 179 70 -23 -78 -53 -172 -112
5421a12J85j19Q0p1n9O8n9O9J3J31P0k80M2O9J29k49J30j07J00N1N2j95o4J20
$$ -112 73 -46 34 -37 -96 -28 -87 -18 -5 126 196 -84 -42 27 156 -93 37 -70 30 81 133 -62 -126 -6
5445fN9o6m4J22K2j76J52m5K70j82j91j21J05K80o6Kr8M5k01J46k14J92J17k03
$$ -6 53 -13 -57 65 87 -89 63 18 288 106 -85 -206 -101 179 113 115 17 62 -139 7 -207 -15 102 -101
5469a01J15K10j07k07K28j14P6L8l43L50k13R5j82m5Q3J08P8j90J83Jk1l08K23
$$ -101 14 224 117 -90 138 24 100 138 -205 145 -68 27 -155 -200 -117 -9 69 -121 62 63 42 -266 -43
5492d3N0R8j21L29j18j18j9J9r3J55j61J05j4R2k2n2k32Q4K94j36J08j95k95N10
$$ -43 7 105 -16 313 195 77 58 77 -16 139 -22 83 69 161 139 87 -145 -61 233 97 205 10 -285 225
5516B25k35J40j0r4j51J95j14J7J09q8J9p6L30l82J81p7O3k4j61M92k82l3O2l4
$$ 225 -10 130 120 26 -125 70 -44 -27 82 -6 13 -63 267 -115 66 -11 52 28 -133 359 77 44 106 72
5540G2j28J15oq8K05o2j58J71p5J04k85J59K4J9J66r8Qk96K26j69k2K24j3j45
$$ 72 -56 59 53 -35 170 108 -50 121 46 150 -135 24 48 67 233 135 143 -153 73 -96 -118 106 93 -52
5564e2rK3J65k6m9o7R0j07O8Q1R8l27p8M12k19j10J71k5J29p3j27P5k9K59k59
$$ -52 -61 -38 127 101 52 -15 75 -32 36 117 215 -112 -190 222 3 -107 64 39 168 95 -32 43 14 273 14
5589A4k02K37O6j77J55j72J52M5j28l0L5J15O8k51O9L72l47N8L1k52K02K2j27
$$ 14 -188 49 115 -62 93 -79 73 118 -10 -40 -5 110 178 -73 -4 368 21 79 110 -142 60 82 -45
5612d5K17j78kq1L8j34J46J36j2n2j29R8K5M4Mq3kJ59J48m56j6J79K35k24J26
$$ -45 172 -6 -8 -89 -51 -185 -39 97 85 33 -96 2 27 71 75 -8 -10 149 297 -159 -175 4 239 15 141
5637A41k85K18l4j62o7J38Q6k33L06k3j48q1M23m94K89Q9Q1l33Q3J56j18O3k68
$$ 141 -144 74 40 -122 -189 -51 35 -198 108 85 -63 -144 279 -215 74 163 244 -89 -6 150 32 95 -173
5660a73J00n2K37n3Pk8j90j2J79j7j15K79l01J89m3J33j92j73L03J7m18M68L1
$$ -173 -73 -125 112 59 66 38 -152 -164 15 -2 -117 162 -139 50 7 140 -52 -225 78 95 -323 145 176
5683A76k51M0M3n9j35K02j29j6L35l29p5J53K59j74k02J2K38k37J51o2k95J24
$$ 176 -75 -35 8 -51 -186 16 -113 -129 206 -123 -198 -45 214 40 -162 -150 88 -149 2 -60 -355 -231
5705b31J82o1M5J78n07J98K79k24J87m7J27L8j84N0p9L3J1L1J27Nk12o4J52J91
$$ -231 -49 -110 -65 113 -394 -196 83 -141 46 -1 126 164 -20 30 -49 -16 -5 26 153 158 -54 -118 34 225
5729B25l94K14r2j7J26J17k43L63l19j71P8K37J27m38q7L71j57R8j14J93j97K94
$$ 225 -169 45 -47 -64 62 179 -64 299 -20 -191 -113 124 251 -187 -274 97 -60 38 -76 117 -80 214
5751B14j13k8j36j58K11M7K83n13K47l12N81n66K88l4j24O0K31l50L80o4n76L53
$$ 214 101 73 -63 -221 -10 37 320 -193 54 -258 323 -243 45 11 -113 -53 178 -172 208 144 -432 -79
5773g9J7R8j28j78L56k98L92J36m95K65k24J24N4P3k88o2L63p2k70K54o2J48j70
$$ -79 -62 36 -92 -270 86 -212 180 316 -179 86 -138 -14 40 113 -175 -237 126 54 -216 38 -24 124 -46
5796d6K66l0l52J49P6r5L29m38j06K34K1K6O3q0K0Rj75R1j70J42J7p0J92Q5k32
$$ -46 220 190 -162 -13 63 -32 297 -141 -247 -13 8 34 97 17 37 46 -129 -38 -208 -66 -49 -119 73 158 -74
5821g4O1j9R6M2MO0k83J59N3l19J02qR5j51K50O8k68L8k6m8J27N0j78J37j02J66
$$ -74 -13 -32 64 106 110 170 -113 46 99 -220 -118 -126 -31 -182 68 136 -132 -94 -120 -168 -41 9 -169 -32 -134 32
5847C2j19K21j72j10K71q9r1O2K7k99J60K94k90N8J45K2k4j80Q8J29j83J49J04
$$ 32 -87 134 -38 -148 123 34 -57 5 32 -267 -107 187 -103 -45 100 122 98 -82 6 135 -48 101 205
5870B05k47P4j16q7M26l55L01k08J20k28k0J8j45J19J84k60r1K78qO9j62J85M
$$ 205 -42 32 -84 -171 255 -100 201 -7 113 -115 -135 -117 -262 -143 41 -219 -310 -32 -40 29 -133 52 56
5893E6j03Q6q1%J33J32l39M4J26O8l7Pj96L2J52n6o0k24J80L8P0M7l5M5J09j62
$$ 56 -47 39 -42 -42 91 223 -116 -72 54 122 85 92 -104 -72 80 24 -36 -260 -80 -42 28 75 40 85 194 32
5919C2j63L0K2K04n5l1j75R5q6J64l1o9j43J70j04M24j83k85K97j84J8K41j99
$$ 32 -131 -101 -79 125 70 39 -136 -41 -127 37 6 -63 -206 -36 -140 284 101 -184 113 -71 -53 188 -11
5942a1j69J62M8k49K07j48L4Q5n3J33j58L08j38j33J42P6Q0j64j38O9J34j05p9
$$ -11 -180 -18 30 -219 -12 -160 -126 -41 -94 39 -119 189 51 -82 60 136 216 52 -86 -17 117 12 -67
5965f7p6o8K6J65j12L31l24n7L31l06L53l75lJ04O7k46K81o8P4K04r6k27M90l36
$$ -67 -143 -211 -185 -20 -132 199 -125 -182 149 -157 196 -179 -182 -78 -11 -257 24 -44 30 234 138 -89 401 65
5989F5k01J9O8J0J39o1qm8lj27L8lj91J83j00J38N7J55K2m8l83L19j77R0m2K49
$$ 65 -136 -117 -49 -39 100 39 31 -17 -20 -147 -109 -112 -303 -120 -220 -82 -25 130 152 104 -279 40 -137 -47 -89 160
6015A60j26j03k4J45j17J27j37j28R3O7n1J69l55L38o7K7L1J41j88p9J86m7k30
$$ 160 34 -69 -93 52 -65 62 -75 -203 -110 -43 -94 75 -280 58 -9 18 49 190 2 -77 109 62 -168
6038a68P2j3p8K09l0J67m07L47k3J0K6r0j2R0J18l98J86j51J77j07m4K58M1j74
$$ -168 -96 -109 -187 22 -8 159 -248 99 76 86 112 22 10 100 218 -180 6 -145 32 -75 -119 139 180 6
6062FR8j88PJ17oN6Kj49l3j6K60j53J02J34k73n7j7j0K26M9j83O6l7j31j2O7N3
$$ 6 104 -84 -77 40 34 90 92 -57 -90 -106 154 1 103 237 -36 -93 -110 -120 106 155 -28 38 1 -130 -142 -75 -22
6089b2K16l09j01J97j05K25k02l5J11J90j83j60L09k22N2l0J12j42J68k92L05
$$ -22 194 -115 -216 -19 -124 101 -101 -136 -25 165 -18 -178 131 -91 -39 -69 43 -99 69 -223 82
6110H2k05L24n7q2j47m8R6kL3m8J7J27R5j48k40j11M12k88L8J34oj2N8J04Q4k04
$$ 82 -123 201 144 62 -85 -133 -37 -39 -6 -54 -37 90 185 37 -203 -314 98 -190 -152 -18 -24 -36 22 126 210 6
6136FJq1J91l52K97j86J66N2K91j68k87N0n1L6J14j77Q5J36m66N27M9j88j00K27
$$ 6 7 -74 117 -235 62 -124 42 94 385 217 -70 -20 -71 -35 79 -98 -13 123 -343 184 233 45 -55 172
6160A72N5r2k97L26k54L01j2j35j80j00J68m6r3J42o4P0q2J36k4K19k53j00K20
$$ 172 227 135 -162 164 -90 211 199 64 -116 -216 -48 -94 -187 -45 -109 -39 -121 15 -9 210 -43 -143 77
6183G7k26PJ08j70J66n4K73k82O8j10M8J18jJ82k62N5J84j05P6l04J28L41o08
$$ 77 -149 -142 -34 -204 -38 -92 181 -101 -33 -143 -95 23 22 204 -58 -3 181 76 152 -152 -24 317 -291
6206b91J05jJ37L03k45L5j65K18m64L99L8q1J26m0j79L20p1j38J26Qk8j70K21
$$ -291 -186 -187 -50 253 8 43 -122 96 -368 31 69 -12 114 74 -105 215 144 6 132 140 112 -58 163
6229A63l91o5L56j69J48L05l25L9q8L2j89L1M49m12NK10P4k84O1J87k10j0J78
$$ 163 -228 -293 63 -106 42 347 22 61 -27 5 -184 -153 296 -116 -111 99 173 -111 -50 137 -73 -83 95
6252I5l21K4K75j80J26j31N9k07M24m8o6M8j24K12l53q1L82k10J17J80k31j90
$$ 95 -226 -202 73 -107 19 -112 -53 -260 164 116 50 98 -26 186 -167 -248 134 -76 41 221 -10 -200
6274b00L52j93O8q8K76l42K42j86k7M02j81k18J44j61M7L8o0r2q6K46M5r3L49
$$ -200 152 -41 27 -61 215 -127 115 -71 -98 304 123 -95 49 -112 -65 -27 -87 -179 -265 -19 26 -67 282
6297B82n42L49j59K7p3N5P5K2j73J74K02m13L08p5o9J32M7p8K44j61j38o8l7M39
$$ 282 -260 89 -70 -43 -116 -61 14 36 -137 37 239 -174 134 59 -10 122 169 91 335 174 36 -32 -69 370
6321C70m66J86J58l27K15j56p9O4pj1J44j14L5OJ19j28j06K1K25n5r9K3mj43L42
$$ 370 -96 90 248 -79 136 -20 -99 -35 -42 -53 91 -23 12 18 137 9 -97 -76 149 94 -5 18 14 -129 213
6346B13j39rK4k13J90q1j36k5l5J72J26j00k00L88k77K62j40J53jn1j61K4j33
$$ 213 74 65 89 -124 66 -15 -151 -176 -211 -39 87 -13 -213 175 -102 160 20 173 172 121 -40 -16 -149
6369a49K35l8K59k97m9J93n1j76k8J26k1K14k32J08J20j27J44l07K34j43j45K31
$$ -149 86 48 307 10 -39 154 103 -73 -101 25 4 218 -14 94 214 87 231 -76 158 15 -130 101
6391A01k67K78l3j03K26j19j69L1J20j24K86j60j00K13k01J06l89L13q5J16O5
$$ 101 -166 112 79 -24 202 83 -86 -55 65 -59 227 67 -33 180 -21 85 -304 9 -76 40 105
6412A05K6j75r7K0O2m5L0J35k44R2J61m6J02j0k41J35q2o5K94j37M0k66J33J70
$$ 105 131 -44 -141 -121 -59 -104 -74 61 -183 -91 70 24 126 116 -125 10 -72 -137 157 20 60 -206 -73 97
6436I7k17K54k8l17M06pk49p2lm3J39K51j39j52lk21L2J74Q5p8J38o6r6J14R9
$$ 97 -120 134 106 -211 195 188 -61 -133 -136 -179 -40 211 72 -80 -83 -304 -272 -98 -13 -91 47 -19 -115 -1 98
6461I8r4qM9k12L15k72K01j40j01P2L29k44L1m9J29j8k1n5j6kj40J84j61k3J85
$$ 98 4 -4 45 -167 148 -124 77 -63 -164 -92 237 -7 24 -25 104 86 65 10 -6 -8 -148 36 -125 -148 37
6486C7j57N5l4J58J37j90j00J75j1j67J33K9o0L3o1j4Q5j7KO1J15j81j42L5q5
$$ 37 -120 -65 -99 59 196 6 -94 81 70 -97 36 65 5 38 -23 -37 48 31 33 94 209 28 -114 -79 -164
6511a64J10J5R6j79J23p2K06m5n5J02k96K73j39j07M1K19k4k31O4O5k37L95k54
$$ -164 -54 -39 57 -122 1 -71 135 90 35 137 -159 114 -25 -132 -91 128 104 -127 -63 2 -235 160 -94
6534i4j06L38r2j28j6J86J44k12J5k46J18J01k04L60m00L44J3k79N6K07n06L79
$$ -94 -200 138 46 -82 -98 88 232 20 35 -211 -93 8 -196 164 -236 108 121 -158 -102 105 -401 -22
6556b2R1j18J27q0O8J73m15J32M03m80J41l65N40k62j34pk2L92k87l9m6K97J13
$$ -22 69 -49 78 -2 66 239 -176 -44 359 -121 20 -345 195 -67 -201 -208 -230 162 -125 -164 -210 87 200
6579B00j76J8j75K39l50K11L6p9k4K65r1l9m4J30k77K74k5n2n1J9j25K25j61Q9
$$ 200 24 42 -133 106 -244 -33 3 -76 -100 165 74 35 -9 121 -156 118 93 41 -10 9 -116 109 -52 37
6603C7j72J48r1j82L56M3k65K29r1J31q5j77J62j48L20k58LO5K36k67m7N4r4M8
$$ 37 -135 13 -78 -260 96 139 -126 103 12 143 58 -119 43 -105 215 -43 -40 25 261 -6 -53 1 -93 -45
6627d5K17j62J1R6q0J1N2j38n9J92j9Q9m6K07k33R0j44J90k96J69l37J52l5J31
$$ -45 172 10 21 117 37 48 100 -38 -97 95 76 165 119 326 93 183 39 229 -67 102 -235 -83 -118 13
6651A3J14j56j05L18l7K0p7l01K60m5q4j22jK49r1Q4L9j43N9m4m4Jj59K14K43
$$ 13 127 -29 -134 184 147 167 90 -211 49 4 -80 -202 -203 46 -45 39 78 -65 -6 -50 -94 -93 -252 -38 205
6676B05m08K07m7K57j45Qj58r7K65J13Kl65K73J36j9l79J20L5j1p0J41o7o0J28
$$ 205 -203 4 -43 214 69 77 -81 -178 87 200 202 -163 110 246 227 -152 -32 3 -8 -78 63 -4 -64 64
6700F4o0k17L69M6l1j52k3J19R0qk28K45j84l1j18L28k77J63j98K8J1J23m0j33
$$ 64 4 -213 156 202 171 19 -4 115 205 197 -31 214 30 -1 -119 209 -68 95 -103 -75 -64 59 19 -114
6724a14o2J10K6l2L48k95K3J09p6J05%j57j02L12j25mm1j00n9q9K43K59l31K9
$$ -114 -176 -66 -40 -72 276 -19 4 113 37 142 142 -15 -117 195 70 66 25 -75 -134 -223 20 279 -52 -23
6748b3J60M2j29oj85k5J66m0K80k66p4q3R1L36Rj04j06J80j82k27J87lk26J06
$$ -23 137 179 50 44 -141 -166 0 -40 240 -26 -100 -183 -92 244 253 149 43 223 41 -186 1 -2 -228 -122
6772a22j76L33j27pQ0R1n4j08rj20K46r2K58k87j31L07p9K87m19qJ4J98M5j9m9
$$ -122 -298 35 -92 -99 -19 72 18 -90 -99 -219 27 -65 193 -94 -225 82 3 290 -129 -137 -123 75 120 101 52
6797E2K8p5J43k34N0Oj73L89k07j8J07l27R8l0K08l8o9M34l45J15J12q2j02j18
$$ 52 80 5 148 -86 -36 -30 -203 186 -21 -39 68 -259 -161 -191 17 -21 -90 344 -1 114 226 144 42 -76
6821g6J91l8q5K1N3q1O3n7n8K41j05q7K2r7j76J88J92r4J41j37Mp0J01K54k83
$$ -76 115 77 -8 13 66 -15 48 -9 -67 174 69 -18 4 -93 -269 -81 111 17 158 21 25 -45 56 310 27
6846B7k0kL04p6J22l28j26L7j5j9J66J94m28K46k8k8J98l33k21J8L67j91j00J54
$$ 27 7 5 309 233 355 27 -99 -62 -77 -96 70 264 -164 82 54 26 224 -109 -330 -312 55 -136 -236 -82
6870h2J60j0k35M55o43K88J46M1j91q3J05J95j97K65j86Lj60K51p8j31J86m8k7
$$ -82 78 68 -167 288 -355 -67 79 120 -71 -154 -49 146 -51 214 28 31 -129 122 44 -87 99 51 24
6893B4O1n2n2J12k43K21o5k14Kp8L50l8K02O0l65N3k2J63j06N4k38M67j23j54
$$ 24 85 33 -19 93 -150 71 6 -208 -206 -284 66 28 230 290 -75 -22 -44 119 13 67 -171 296 173 19
6917A9p2O7K7q0J4J98j54j29K23k3k06J46J50j28O9j04q3M9K27K4l79l7L53k22
$$ 19 -53 14 41 -39 -25 173 19 -110 113 90 -116 30 180 52 121 17 -66 -17 210 234 -145 -182 171 -51
6941e1J56l64L16R2k16q6J56J26o4J18k5l04r9L48j66j33K76k3j85J91j38K84
$$ -51 105 -259 57 149 -67 -153 3 129 65 183 158 -146 -245 103 -63 -196 80 57 -128 63 -75 209
6963B09n74N33J8l10K25k1l01J46K73j69k0J70q1n7K57l09J69p9J4J4l8J5K7j71
$$ 209 -365 168 186 -124 101 80 -221 -75 198 29 9 179 98 41 298 -11 158 79 93 107 69 84 111 -60
6987f0P5k90K57m0k12K50O0Pp3l7J65n3J2k7R6l47L00K6q8Q5k73J77l2O6j9J91
$$ -60 15 -275 -18 -58 -270 -20 40 47 -26 -63 102 49 61 34 130 -217 83 109 21 106 -167 10 -22 44 25 216
7013B16l05Q3j01Q2J42j79J70o0k69O8K08m8%J37m7m7K8j08j6K72l09j5j5J34
$$ 216 -89 -6 -107 -25 117 -62 108 48 -221 -153 55 7 7 144 97 50 78 -30 -46 226 -83 -98 -113 21
7037B1Q3R6j35N8j54L4J80j1l06L53k88j39K84j53k13M26k64JJ54N9l7k35M15
$$ 21 104 200 65 123 -31 3 183 172 -134 219 -69 -208 76 -77 -290 136 -128 -127 27 86 49 -186 229
7060B29m08K40k6O9j30R6P2l03Q4J35k32R1J86O1l00M09n55K53J5J58r7rK2n0
$$ 229 -179 61 35 104 -26 70 142 -161 -77 58 -174 -83 103 164 -136 273 -282 -29 -14 144 47 38 60 10
7084A0M7J02j84o4R9o5lJ15r0K4J3J21r9Lj43J14o1l6Q8j16J26PJ31j07l4RR0
$$ 10 57 159 -25 -89 10 -55 -58 57 -33 -9 4 125 26 29 -114 0 -61 -97 -9 -125 1 8 139 32 -2 7 97
7111I7N8l05L23q4n7k15J62m7K73j51J59k6j4l02K21n8j25OO0J16k11J52k52K13
$$ 97 155 -150 173 89 32 -183 -21 -68 205 54 213 187 173 -129 92 34 -91 -85 -25 91 -120 32 -220 -7
7135gj4K31n62K33N2J06J58j31j73J22q2L15j19n1l72M74j48j28L21j71J73r4
$$ -7 -21 210 -352 -119 -67 39 197 66 -107 15 -67 248 129 78 -294 180 32 -96 225 54 227 133
7157A33j51J92m72L05M0j54J39K8O7k83L45k3k88j00L79j85m3N4P3k5J40l39O8
$$ 133 -18 174 -298 7 47 -107 32 60 127 -156 189 166 -122 -222 157 -28 -71 -17 56 31 171 -168 -100
7180a00Q5j07J44R6L8k41j1M3L48j91O1j76k63L87l24Q5J94j75O6j29O6J01R1
$$ -100 -15 -122 22 118 156 -85 -96 -53 295 104 165 -11 -274 113 -211 -126 68 -107 -41 -170 -104 -3 88
7203H8j43J19P8j99J08j29K8L1K72k53k2K86n93L25r2j12Q3L13k1j48j94K10l59
$$ 88 -55 64 142 -57 51 -78 -50 -19 253 0 -22 264 -329 -4 -96 -208 -125 188 167 19 -175 35 -324
7226c24M63j9l10L77j3j25l15M35r7j56Q5P4Q8LQ1k54m4O9o7n6J13K01k27J51
$$ -324 139 120 -190 187 174 49 -266 169 72 -84 1 75 163 166 247 -7 -51 18 -49 -105 8 209 -18 133
7250A33l26J09J9K36k14j24J79j15J79J62l84J21M5O6j18M0J87Qm35K95r0Q5j26
$$ 133 -193 -84 -65 171 -43 -167 12 -103 76 238 -146 -25 20 86 -32 8 195 203 -232 63 -27 58 -68
7273f8k9k7l6J20j64J34K02k54J00K25m16J65l6P6M7J08o2J20k49J10j1J14K3
$$ -68 -97 -124 -160 -40 -204 -70 132 -122 -22 203 -213 -48 -84 -8 39 147 85 205 -44 66 55 169 192
7296A92l65j69L14M8j43M76l25r8J16j31O5K38k01J83k70L19k64k42J34K28j21
$$ 192 -173 -342 -28 20 -123 353 28 -70 46 -85 -20 218 17 200 -70 249 -15 -257 -123 105 -16
7317a6J41L2j85K45k26J28Rn4l12L82j23J05k73R1K00m3k86M37j48m77J84M17
$$ -16 125 157 -28 217 -9 119 128 74 -238 144 21 126 -147 -56 144 101 -185 252 104 -373 -189 228
7339B28m32K71o7K5j23J49o3R7R1l00J73K61j64l88J73N4K2J10j41J6mJ8J37j47
$$ 228 -204 67 0 25 -98 51 -12 85 176 -124 49 310 146 -242 -69 -15 7 117 -24 -8 -12 6 143 -4
7363dL16j71k50J64K42k36k74L6L80k39K5J47K8j17q8qpJ76r7m08N62q3k18K12
$$ -4 312 141 -109 55 297 61 -213 -177 203 -36 -11 136 164 47 -41 -49 -56 120 23 -385 177 94 -124 88
7387H8mp5j5j8l31j7K59K50k26QK4j5J2K45j42J64j42j57J89J9k7k29O2m5J79
$$ 88 84 9 -6 -24 -355 -372 -113 137 -89 -81 -57 -72 -60 185 43 207 65 -92 97 116 89 -140 -78 -123 56
7412E6j78K78j35j81J03J78j15J16l50K32N1p0p3j05l4L08R9k74J75j50K40j41
$$ 56 -122 156 21 -160 -57 121 6 122 -228 4 55 -15 -88 -193 -227 81 180 -94 81 -69 171 30
7434C0m4J89m6j19O8q4K61k82K49l04J51j86n8L01K8j48M5o2J80j41M9j43k47
$$ 30 -14 175 129 10 78 -6 255 -27 222 -82 69 -117 -175 126 154 6 51 -11 169 28 77 -66 -313
7457c13L29k57K35J39j34o5k2L09k04o6K84l0k31l6r0L44j2p0j0j5j81J57k06
$$ -313 16 -241 -6 133 -1 -66 -88 221 17 -49 235 205 -26 -62 -152 192 180 110 100 85 -96 61 -145
7480a45L28k61J76j92K66m9m2j90K79j11j75K35L4r2k43J04K13oJ17j56l39P5
$$ -145 183 -78 98 -94 172 123 81 -109 170 59 -116 119 153 61 -182 -78 135 129 246 90 -249 -174
7502a74K26J41k63l6M1j23J61j72K56m9pM7J26lK8j05l35L80l7L2L11m73j2J48
$$ -174 52 193 -70 -106 -65 -188 -27 -199 57 8 1 48 174 171 199 94 -241 139 102 134 445 -28 -40 108
7526A08N3p2J3k50J7J56K46j83Q5j59k0k21L37j2k28J97m22L67l0L5m2ML9p8K32
$$ 108 161 89 102 -148 -131 25 271 88 173 14 -6 -227 110 98 -130 67 -355 12 -18 17 -25 -21 18 -60 172
7551A72j0l29P6Q6MK37k90p1M8K4k5j01Q2J86j00q6J80m08R9K28J42k24N22k38
$$ 172 162 -167 -91 -5 -1 236 -54 -125 -77 -53 -78 -179 -97 89 -11 -97 83 -325 -226 2 144 -80 442 204
7575B04j63J4K8nR0k19p5J2J71k09j61J90K06J84q0p9q4q3J40m7m6l2k69K52J93
$$ 204 41 55 83 78 168 -51 -126 -114 57 -152 -313 -123 83 267 187 108 24 -59 81 34 -12 -44 -313 -61 132
7600A32P7j73j26K09J13k90J8M8j06j8P2Jk17J90Q4o1J89j05n1r9o0P7J24M4j31
$$ 132 209 36 -90 119 232 -58 -40 8 -98 -116 -44 -43 -260 -70 14 -47 142 37 -14 -113 -173 -96 28 72 -59
7625e9j1p2M9K92j16j9j88J26K48j62j2j00k26J14J48k27J05K53j29R2j84N2O2
$$ -59 -70 -142 -93 199 83 64 -124 2 250 88 76 -24 -250 -136 12 -215 -110 143 14 106 -78 -26 36
7648C6j15L5M0j0k15J73l5L7M0j06M38k27J4j29k5J09mr3J49j64K38j04J6J15
$$ 36 -79 -44 -4 -14 -229 -56 -91 -54 -14 -120 318 91 105 -24 -49 60 56 -37 112 -52 186 82 98 213
7672B13m9q1j90j32%K72J18k50K46j69j0j8J8N7m5J2K29k79J20p6k7OKJ54k38
$$ 213 164 83 -107 -239 -239 33 151 -99 147 -22 -32 -50 -32 25 -20 -8 221 -58 62 -14 -41 -35 -33 121 -117
7697a17l5L85m90O1L36m38M03mk42J83on9nk9J00M8j07R7k69K45k6k25R8J22L7
$$ -117 -152 233 -257 -196 140 -298 105 101 -141 42 36 -23 -28 -57 43 91 -16 81 -188 57 31 -194 -96 26 63
7722F3o0r4J74j3j82n2J14k2L15j71j23o1J73L23k95j24j49O8j06J67J14k0j10
$$ 63 3 -91 83 70 -112 -164 -50 -72 243 72 -51 -112 61 384 89 -35 -184 -116 -222 -55 59 39 -71
7745g1q3K27N3k26J6J20r5J18N1k63l8K30j60o5L40k55J46k40J19J7J63k43J42
$$ -71 -154 73 126 -100 -84 36 -59 59 110 -153 -191 39 -121 -186 154 -101 45 -195 -76 -59 104 -139 3
7768CJ36R2n04P9K95l14j1J50K42j75J83m03L15j75N3J38K0j13k20J24M5J2J79
$$ 3 139 231 -273 -194 101 -213 -224 -74 168 -7 176 -227 88 -87 -34 104 124 11 -209 -85 -40 -28 151
7791A51j31JR6k13J39n1k9j34K98Rk42K83j50j23J50j57K07j66K12n6j71M5j18
$$ 151 20 21 117 -96 43 -8 -37 -171 127 136 -106 177 27 -96 54 -103 104 -62 150 94 -77 -32 -150
7814a50K86r8o9P6j65J08K64q6j79J67k55j6J9L31l71J86N4n6Q5k30O8J87j20
$$ -150 136 38 -31 45 -120 -12 252 166 -13 154 -101 -117 -98 233 -138 48 102 46 131 -99 -31 156 36
7837C6k30K40j55J14KJ13J0p0R1k33k13K16K42j11j35L5jO5K23k47O7M0j36M5
$$ 36 -194 46 -109 5 7 120 130 60 151 -82 -295 -79 163 52 -83 -48 -49 16 239 -8 59 99 -37 8
7861Hq0m4M4k1O5J13j15M9N1Q6J60m43J97j0K8pq4j56O5l1L57j48j65M0m7j18
$$ 8 -72 -116 -72 -93 -28 85 -30 19 70 156 316 -127 70 60 88 81 -3 -159 -94 -125 232 84 -81 -41 -88 -206
7887b06m7M20J6j21j41J65O3q1j5O1l30M09k42K58k23j50L41j43o4l06L09L00
$$ -206 -253 167 183 62 -79 86 149 68 53 114 -216 193 -49 209 -14 -164 177 34 -30 -336 -27 273
7909B73k93K05Rl2j11l3R6n1J63m23K20K06l6j69k65P0K41r3K13p7l03JK67m7
$$ 273 -20 185 194 162 51 18 114 63 226 -197 23 229 193 24 -241 -171 70 -23 190 113 -190 -189 78 31
7933C1Jl01K76j30J49j29L42j35l25J49J8O0K2J91o11L30j8p8K63k77l2J15K6
$$ 31 32 -269 7 -123 26 -103 239 104 -221 -72 -54 6 28 219 -392 -62 -80 -158 105 -172 -204 -89 -63
7956f3Q9p7K13o3r7M8Q0o0j15L9J39j20l0j0J86J0n1l27J10p4M5R2N1Kk17q4K68
$$ -63 26 -51 162 99 2 50 130 70 -45 -6 133 13 -17 -27 159 169 118 -209 -99 -173 -128 -36 15 17 -200 -284 -16
7983a6k18P7M6L29p2k94K74j39j72J09L2j47K24r0K73l32j5J40k07K90K03j64
$$ -16 -234 -157 -111 218 146 -148 126 -13 -185 -76 -44 -191 33 -57 216 -116 -131 9 -198 92 295 131
8005A31J95l66K22l73K82ro2n3M5P0l38K46j26J02Kq0N2K13j38k78L96j48Qk69
$$ 131 326 -40 182 -191 91 82 20 -33 12 82 -256 -10 -136 -34 -32 -112 -60 153 15 -263 133 -15 -7 -276
8029b76L79J9k15J38j24L4q0P6k8J55j09K41k60j68O7K10P4p9J4J91k64L31k91
$$ -276 103 122 -93 45 -79 -45 -125 -49 -77 78 -31 210 -50 -218 -151 59 133 54 68 259 -5 326 35
8052C5j86J11j91K33j27Q8J28j48j47M25k02l0J22k31R1q0P0J63k24q3J17M4p5
$$ 35 -151 -40 -231 2 -125 -37 91 -57 -204 221 19 -11 111 -120 -29 -109 -39 124 -100 -183 -66 -22 -97
8075i7L91j74J92k97r5K12j87K97m1l39J47q3M8o9nJ03%l8m3p0N17m88J20m4K
$$ -97 294 120 312 15 -80 132 -55 242 201 -138 9 -74 -26 -95 -100 3 3 -35 -78 -148 369 -119 1 -43 -41
8100d1K74l38loJ03J35j62n2N6J25j0Q6m14J07L36k34P7l6m0N3J17j35k06L12
$$ -41 233 -105 -108 -114 -11 124 -38 -90 -34 91 81 167 -247 -140 196 -38 39 3 -37 16 133 -2 -208 104
8124A04m7p4j19n2J27o9K0K13j51R9p3O1p3L1N7O9r0L1J02j66m7Q2J66j58l0J15
$$ 104 57 -17 -136 -188 -61 -130 -110 103 -48 51 -22 39 -34 -3 54 123 33 64 166 0 -47 35 201 43 13 128
8150A28L58p32K91K2k16K25l8k14K31j22jJ62o0k00P5K04k98J75K08p5JJ07j51
$$ 128 486 -246 45 67 -149 76 38 -176 55 -67 -68 94 34 -166 -91 113 -185 -10 198 123 124 231 80
8173H0j95k73K86o0K5J70l9m4L93o06L9O6K7K58K7j74j7R9
$$ 80 -115 -388 -102 -162 -137 33 -6 -50 343 -263 -224 -158 -131 127 154 -20 -37 62
8191F2
$$ Imaginary data points
##PAGE= N=2
##DATA TABLE= (X++(I..I)), XYDATA
0@%%%%%%Qq%qJ6j6J6k4L2m0N2o0P2r2J16j37J61j93K29k69L16l67M24m89N63o47
$$ 0 0 0 0 0 0 0 8 0 0 -8 8 -8 8 -16 16 -24 28 -32 40 -52 64 -73 88 -105 124 -145 171 -196 228 -261 302 -345
32c45P39q42R55j080J218j371J539j722J924k147K390k656K944l258L605l985
$$ -345 394 -448 507 -573 645 -726 813 -909 1015 -1132 1258 -1398 1546 -1712 1893 -2092
48b092M399m853N353n904O511p183P935q777R729j0817J2068j3528J5262j7366
$$ -2092 2307 -2546 2807 -3097 3414 -3769 4166 -4611 5118 -5699 6369 -7159 8103 -9263
62i263J9990k3373K7938l4508M4901o4013J10834m37307n37569J164962M99724
$$ -9263 10727 -12646 15292 -19216 25685 -38328 72506 -364801 -902370 262592 762316
73G62316q22314J5191L07755L935p3490Q9258k40629k36623L48132J8228j47692
$$ 762316 -59998 -44807 262948 266883 193393 282651 42022 -194601 153531 171759 24067
84B4067k72474K42334J54598Q2571l26439k6529K79388J2274k93675j67890J83028
$$ 24067 -248407 -6073 148525 231096 -95343 -121872 157516 169790 -123885 -291775 -108747
95a08747k4340M5094j07103j30572L276L85960J14447k53925L7714K19355M0491
$$ -108747 -133087 -87993 -195096 -325668 -322392 63568 178015 -75910 -38196 181159 221650
106B21650r2533J60968j37467j75202J06695J29826k59810j11450J66988l0597
$$ 221650 129117 290085 152618 -22584 84111 213937 -45873 -157323 9665 -20932
116b0932j2910P5808m6453j12669K13609J3853k11684J9023J32927j24129j08742
$$ -20932 -33842 41966 -4487 -117156 96453 110306 -101378 -82355 50572 -73557 -182299
127a82299N5684o8554P8451J60430r5845j80702K31308K29773q0631q1636L8501
$$ -182299 -126615 -195169 -116718 43712 -52133 -232835 -1527 228246 147615 65979 104480
138A04480L8245J5244k474j19722m4425q2p646K1250J20j22935J0086K00096k7952
$$ 104480 142725 157969 155495 35773 -8652 -8734 -16380 4870 4990 -117945 -107859 92237 64285
151F4285j61843P7227J31303j58822q5306J31028n331j39232L1191N4825q4416
$$ 64285 -97558 -20331 110972 -47850 -133156 -2128 -7459 -146691 -115500 -60675 -145091
162a45091O6654J65362n0055j06695J53141J17573j00849l2820P1978n7095p5993
$$ -145091 -78437 86925 36870 -69825 83316 200889 100040 67220 139198 82103 6110
173F110O1120j2896j17038k5209P7540J5680m5953k7612M7482N6328n0581l8576
$$ 6110 67230 54334 -62704 -87913 -10373 5307 -40646 -68258 -20776 35552 -15029 -53605
185e3605Q2782J1140j39053j939J08208m5408p3914P6226K7971n2549P1148P9353
$$ -53605 29177 40317 -98736 -100675 7533 -37875 -111789 -35563 -7592 -60141 11007 90360
197I0360n1850o489Q2974j6883n4376K6134J585o4471k2138J4304j6446j9422
$$ 90360 38510 32021 114995 98112 43736 69870 71455 6984 -15154 -850 -17296 -36718
209c6718r351M284K5176J4098j8147P187K5881k1888k5022K8820J1101m9121j8435
$$ -36718 -46069 -41785 -16609 -2511 -20658 -13471 12410 -9478 -34500 -5680 5421 -43700 -62135
222f2135L5421J3696j3521J8603K7188q711M852M6498J9763l9126k5380K7602
$$ -62135 -26714 -13018 -26539 -7936 19252 10541 15393 61891 81654 42528 17148 44750
234D4750J7361m6443m8461J4606K4131k6019k6311J8341J2270p114J3565R945
$$ 44750 62111 15668 -32793 -18187 5944 -20075 -46386 -28045 -15775 -22889 -9324 621
246F21k0121J1914L1956l1384m2229L8541L9185m3226l4208L7960L1412j3767
$$ 621 -19500 -7586 24370 -7014 -49243 -10702 28483 -14743 -48951 -10991 20421 6654
258F654q75J6417N2M108J7819r813l2738N063K8141k1564m5149R558K6905j8522
$$ 6654 5779 22196 22248 26356 44175 34362 1624 6687 34828 13264 -31885 -22327 4578 -13944
272a3944j9552J9123J0137j1377Q668J3652j3829m294K3829J25k9383p83K7027
$$ -13944 -33496 -14373 -4236 -15613 -6945 6707 -7122 -11416 12413 12538 -16845 -17628 9399
285I399o65k6423M483K9907k481k2847J2647K4311j5188j6513J8543M853k5899
$$ 9399 8734 -17689 -13206 16701 14220 -8627 4020 28331 13143 -3370 15173 20026 -5873
298e873k567J7269j0853j4927J1998M254j3313M131J3491l776o923N946O035K32
$$ -5873 -8440 8829 -2024 -16951 -4953 -699 -14012 -9881 3610 -166 -7089 -1143 4892 5124
312E124l531o488L906J0756p073j2544Q478Q439r270k469P504m602l406R796j922
$$ 5124 1593 -4895 -989 9767 2694 -9850 -1372 7067 -2203 -4672 2832 -1770 -5176 4620 2698
327B698j0923P739J0343r744p310R914L845o958k774J988L162K727l948n776N671
$$ 2698 -8225 -486 9857 113 -7197 2717 6562 -396 -3170 -1182 1980 4707 759 -5017 654
342F54O762k923l286o11k63N251K448j1047o155J0544K48j3410J783Q509p702
$$ 654 7416 4493 1207 596 333 5584 8032 -3015 -9170 1374 1622 -11788 -10005 -1496 -9198
357i198k331J4050j57j0933Q372J1845q192l931J1978k975j3737Q651R841j3888
$$ -9198 -11529 2521 2364 -8569 -197 11648 3456 -475 11503 8528 -5209 3442 13283 -605
371f05p756J1964K863p691K112J896l352M752L314r736m010K679k157J825j237
$$ -605 -8361 3603 6466 -1225 887 2783 -569 4183 7497 -2239 -6249 -3570 -5727 -3902 -5139
386e139j3931J454K0014k695j4062J0833J0127n902Q433Q126j6203K29J9028q790
$$ -5139 -19070 -17616 2398 -297 -14359 -3526 6601 699 9132 17258 1055 1284 20312 11522
400A1522j6444Q486J149j0332P529M341j4421L755J5754r731j0148J4168J946
$$ 11522 -4922 3564 4713 -5619 1910 6251 -8170 -4415 11339 1608 -8540 5628 7574
413G574j4817r43J698o277O556M662j9108m251K9161Q585j7479N195J2092n578
$$ 7574 -7243 -8186 -6488 -12765 -6209 -1547 -20655 -24906 4255 12840 -4639 556 12648 7070
427G070J1679J2064l0914j5040L1668M108k9404k055N287m383J9917L512l4444
$$ 7070 18749 30813 -101 -15141 16527 20635 -8769 -10824 -5537 -9920 9997 13509 -20935
440b0935Q766L7084k2350k3454K5546k703k0458J7681o364l0980L1640L2244l8427
$$ -20935 -12169 24915 2565 -20889 4657 1954 -18504 -823 -7187 -38167 -6527 25717 -12710
453a2710j3546L5068L925n33J5672k9312j7327N0932P882n5757n09L0774j4959
$$ -12710 -26256 8812 12737 12204 27876 -1436 -18763 32169 40051 -15706 -16215 14559 -400
466d00k671K0120k6414k2675L9137J8313l0447n453J1667r354K736Q582j8053
$$ -400 -3071 17049 -9365 -32040 7097 25410 -5037 -10490 1177 -8177 -5441 3141 -14912
479a4912M48K5608j9563k8397M0068K9197l8849p795L3626j1943o531L7247k0105
$$ -14912 -14464 11144 -8419 -36816 3252 32449 -6400 -14195 19431 7488 957 38204 18099
492A8099n1464L2849M4295l3336l0876k178j644M0290K6411o5568k9185O5973
$$ 18099 -33365 -516 43779 10443 -20433 -22611 -24255 16035 42446 -23122 -52307 13666
504A3666R016l8872K4655K019m7430K8069L9899m7486j3937M7033j2065k1932
$$ 13666 22682 -16190 8465 10484 -36946 -8877 31022 -16464 -30401 16632 4567 -17365
516a7365K7384o031j0023L8050j5416m5232M6570L4918o8011k2960N2594j216
$$ -17365 10019 3988 -6035 32015 16599 -28633 17937 52855 -15156 -38116 14478 13262
528A3262j9682K0575k1825l9887M0968M5607k9263k7893M250J713K0703K0250
$$ 13262 -6420 14155 -7670 -47557 -6589 39018 9755 -18138 -13888 -12175 8528 28778
540B8778l7810k5322M3393Q359m3420J4770L3083l2223p128M6616j0958l4393
$$ 28778 -9032 -34354 9039 17398 -26022 -11252 21831 -10392 -17520 29096 18138 -16255
552a6255L0015O960l9434K2786L4216l9306k1214J5601j6677J9925N0338n1274
$$ -16255 13760 20720 -18714 4072 38288 -1018 -22232 -6631 -23308 -3383 46955 -4319
564d319o0287O1347L7417m3868J3360J6101n7834J4031P0478l8044n0755M2301
$$ -4319 -64606 -3259 34158 -9710 3650 19751 -38083 -24052 46426 8382 -42373 -72
576g2J2484k0074L1442r374n1288L6661M5323m3127j0088L7105l2564l0283M7200
$$ -72 12412 -7662 23780 14406 -36882 -221 45102 1975 -8113 28992 -3572 -33855 13345
589A3345J2248l5247M345J425k5620K3368L5391k6454k3436J4109k82M592K5516
$$ 13345 25593 -9654 -5309 -3884 -29504 -6136 29255 2801 -20635 -6526 -6808 -2216 23300
602B3300k2217l8544L4703L6964l5448j7868K5287r001p978L8060k970m6232J1517
$$ 23300 1083 -37461 -2758 34206 -1242 -19110 6177 -2824 -10802 27258 24288 -21944 -10427
615a0427K7442j9298N479K3241l7305k2462M0594M274k3766J9620l129l5464K5533
$$ -10427 17015 -2283 3196 26437 -10868 -33330 7264 11538 -12228 7392 4263 -31201 -5668
628e668L0718l1020n084K4985k2479l834M1497j8413m0528K8732J8452k2714J3454
$$ -5668 25050 -5970 -11054 13931 -8548 -12382 29115 10702 -29826 -1094 17358 -5356 8098
641H098N511l9669R807M4385j5199k2903J1719j0160p083L4865j023l6994R082
$$ 8098 13609 -26060 -16253 28132 12933 -9970 1749 -8411 -15494 19371 18348 -18646 -9564
654i564J7449j9226O310K3910k1805j8739K6615Q068j7716O958M222j8238Q775
$$ -9564 7885 -11341 -5031 18879 -2926 -21665 4950 13018 -4698 2260 6482 -11756 -2981
667b981K3346j4600j8455J0983L280l467J4461m492k6810P951K3155j0930o319
$$ -2981 20365 5765 -12690 -1707 1573 -1894 12567 8075 -18735 -10784 12371 1441 -4878
680d878J3595j3242j4602K4345R958k0528k02P451r160Q515J1771j8628m522J8898
$$ -4878 8717 -4525 -19127 5218 15176 -5352 -5554 1897 -7263 1252 13023 -5605 -10127 8771
694H771p369p463J9128p464k2388K0160J6325k4713l767J7494j1794p843J8020
$$ 8771 1402 -6061 13067 5603 -16785 3375 19700 -5013 -8780 8714 -3080 -10923 7097
707G097q10j4861L516J279o66J3499j479j8695O135J4149q731k526J0698r050
$$ 7097 6287 -8574 -5058 -3779 -4445 9054 7575 -11120 -4985 9164 433 -2093 8605 -445
721d45r212J3578M007j2959J497P856m025o95M643l725k846M436j723j377N896
$$ -445 -9657 3921 7928 -5031 -3534 4322 297 -398 4245 520 -2326 2110 387 -990 4906
736D906n180j2620P789J2305q411n690Q015j624n682J0222N786j0244j410P109
$$ 4906 -274 -12894 -5105 7200 -1211 -6901 1114 -510 -6192 4030 9816 -428 -1838 5271
750E271k733l519K749j868p39K506m355o95P908l025p339Q452O118j1188l314
$$ 5271 2538 -981 1768 -100 -839 1667 -2688 -3383 4525 1500 -5839 2613 8731 -2457 -5771
765e771Q538k442n204M430Q99n798o6J612K571M579k091m136N774M055n855O11
$$ -5771 2767 325 -4879 -449 450 -5348 -5414 -3802 -1231 3348 1257 -2879 2895 6950 1095 1706
781A706O047n360o433O470J952q926j161P274J150m255j005J756K181M86j361
$$ 1706 7753 2393 -4040 2430 4382 -4544 -5705 1569 2719 -1536 -2541 -785 1396 1882 521
796E21pJ36l270k714L396J267m566Q10N713p62k389M619K716k433l02K554q54
$$ 521 514 650 -2620 -5334 -1938 -671 -5237 -4427 1286 524 -1865 2754 5470 3037 2735 5289 4435
813D435l987j413J866J550l298m709J790N591k386l034M351K190m522J92M075
$$ 4435 448 -965 901 2451 -847 -5556 -3766 1825 -561 -3595 756 2946 -1576 -1384 2691
828B691l362m550L706K750l571k140J958K941J080j514M47L972j59l187J957M068
$$ 2691 -671 -5221 -1515 1235 -2336 -4476 -2518 423 1503 -11 436 4408 4249 1062 3019 7087
844G087l966n090K753K180n259k541L424J009l001P33L674j050k314J768L261
$$ 7087 3121 -1969 784 2964 -2295 -4836 -1412 -403 -3404 -2671 1003 -47 -2361 -593 2668
859B668j249l503l73K587L29k645q16K860N18j204L834K199m419L20O341k388
$$ 2668 1419 -2084 -2457 130 459 -2186 -3002 -142 376 -828 3006 5205 786 1106 7447 5059
875E059p139Q81K953k315j142q91k636K597L723l585j177L714p42N07L927l325
$$ 5059 -2080 -1199 1754 -561 -1703 -2594 -5230 -2633 1090 -2495 -3672 42 -700 -193 3734 409
891D09m937N668L598o382j691L818j67k15K059k392m79M677j069l789L580J515
$$ 409 -4528 1140 4738 -1644 -3335 483 316 101 2160 -232 -711 3966 2897 -892 2688 4203
907D203n048j6K855l585j613M028j017o233L989O078l143l148K356J533P05K023
$$ 4203 -845 -861 1994 -1591 -3204 824 -193 -6426 -2437 3641 498 -2650 -294 1239 1944 3967
923C967m299m871N667M775n417k173J653k514L974O398q624n978J1468J542j0070
$$ 3967 -332 -5203 464 5239 -178 -2351 -698 -3212 762 7160 -1464 -7442 4026 5568 -4502
938d502M743M087r886K213R385r835m480J2945j270r582N922L391m076N591k553
$$ -4502 241 4328 -5558 -3345 6040 -3795 -8275 4670 3400 -6182 -260 3131 -945 4646 2093
953B093r638R981Q717j4264l581J2017n405m280J2959n126j6054J0923J1987j0617
$$ 2093 -7545 2436 11153 -3111 -6692 5325 -80 -4360 8599 3473 -12581 -1658 10329 -288
967b88m263O210m449j478Q962l439o565P615J42q774P236P407j1707l164J1451
$$ -288 -4551 1659 -2790 -4268 4694 1255 -5310 2305 2447 -6327 909 8316 -3391 -6555 4896
982D896k093n845Q121j930j2522Q895J2530j0006p227L663m603M518J4763j2496
$$ 4896 2803 -3042 5079 3149 -9373 -478 12052 2046 -5181 -1518 -6121 -1603 13160 664
996F64j8504J5449J0105j3966O670R714j9521j327K5658o148j9269J1710N081
$$ 664 -17840 -2391 7714 -6252 418 10132 -9389 -10716 14942 8794 -10475 1235 6316
1009F316j0263Q137L087j5148N188R726j2265N542J4311k0572j1421K5994J686
$$ 6316 -3947 4190 7277 -7871 -2683 7043 -5222 320 14631 -5941 -17362 8632 10318
1022A0318j8971J1135L551k2431P316K3311j1798j3515R219m21j854J3632n134
$$ 10318 -8653 2482 6033 -16398 -9082 14229 2431 -11084 -1865 -2286 -4140 9492 4358
1035D358j4553J1262J0304j1588J360Q076j4238l778K0495j321j8217M140M959
$$ 4358 -10195 1067 11371 -217 1143 9219 -5019 -8797 11698 10377 -7840 -3700 1259
1048A259q751R974J2489j8367r561J4664k058m842J5501o540k5338J4120K1281
$$ 1259 -7492 2482 14971 -3396 -12957 1707 -351 -5193 10308 3768 -21570 -7450 13831
1061A3831j6923n414J6106j1172o370K4748k249k3026R572J0494j0286Q359M016
$$ 13831 -3092 -8506 7600 -3572 -9942 14806 12557 -10469 -897 9597 -689 7670 11686
1074A1686k5141J531K4422r549r006J4425j3183j6110K7402J1597k6290O68J3099
$$ 11686 -13455 -11924 12498 2949 -6057 8368 -4815 -20925 6477 18074 -8216 -7548 5551
1087E551j4933K123K1601j4345j7682J7461O395j0920R381J949j6725R784J9077
$$ 5551 -9382 -7259 14342 -3 -17685 -224 6171 -4749 4632 6581 -10144 -360 18717
1100A8717j1985j0716P836n424m201J7828j710k3063K773J1837o957N138J1903
$$ 18717 6732 -3984 3852 -1572 -5773 12055 10345 -12718 -9945 1892 -5065 73 11976
1113A1976j7998j1951K1948O596j6943N644N280j7072N406K0817j2651j4228J4376
$$ 11976 -6022 -17973 3975 10571 -6372 -728 4552 -12520 -7114 13703 1052 -13176 1200
1126A200L305n221J2094k717j8124J0503J3602j2371J06O462j9570l076K5153
$$ 1200 4505 -716 11378 8661 -9463 1040 14642 2271 2377 8839 -10731 -13807 11346
1139A1346m383k0186J0505K669j3828J4918J3331k1290n269J7470m720n705J2802
$$ 11346 6963 -13223 -2718 -49 -13877 1041 14372 -6918 -12187 5283 563 -5142 7660
1152G660p299j4980J5361J0663j3590l00P304p234L792J4075q272j2100P448J262
$$ 7660 361 -14619 742 11405 -2185 -2485 4819 -2415 1377 15452 7180 -4920 2528 3790
1166C790m515P349k245j6929L290J3109o322l451Q769p163q634J6777O567j5969
$$ 3790 -725 6624 4379 -12550 -9260 3849 -2473 -5924 2845 -4318 -12952 3825 10392 -5577
1180e577J10R959p281j387J1799o193j0809J0254O563o178L454mq720P348J0197
$$ -5577 -5467 4492 -2789 -4176 7623 1430 -9379 875 7438 1260 4714 4710 -4010 3338 13535
1195A3535j1373m967P613q364n043J4953k202j7554M861J0806p419J255R374q099
$$ 13535 2162 -2805 4808 -3556 -8599 6354 4152 -13402 -8541 2265 -5154 -3899 5475 -2624
1209b624n220J1048O93n717L760j861m698P501L474r379Q36P506l864L19P612
$$ -2624 -7844 3204 3897 -1820 1940 79 -4619 2882 6356 -3023 -2187 5319 1455 1774 9386
1224I386o358p452Q292K904p766P63J271q628P05Q621l880n257O216L00o405O818
$$ 9386 3028 -4424 3868 6772 -994 -231 1040 -7588 -6883 1738 -2142 -7399 -1183 -883 -7288 -470
1240d70O403q047j722Q577k680n483N214J891n636K597M083k634j108J577q27
$$ -470 5933 -2114 -3836 4741 2061 -3422 1792 3683 -1953 644 4727 2093 985 2562 1735
1255A735K489J980o039j332L908m379m015O941l07r811J570O983l172j877O107
$$ 1735 4224 6204 165 -1167 2741 -1638 -5653 1288 981 -8830 -7260 -277 -3449 -5326 781
1270G81j86l888L176K774j445K27q9r24K454K22m825J136N300k040k482L889q63
$$ 781 595 -3293 -117 2657 1212 1439 1350 426 2880 3102 -1723 -587 4713 2673 191 4080 3217
1287C217n255K516M820m194m642J940J02k842O38J364j318K35J306K64J028J438
$$ 3217 -2038 478 5298 1104 -3538 -1598 -1496 -4338 -3700 -2336 -3654 -3419 -2113 -1849 -821 617
1303F17p47J079K577j565k572J993J504j581j19J181r51j348R29J005M27j009
$$ 617 -130 949 3526 1961 -611 1382 2886 1305 1186 2367 1416 68 997 2002 2429 1420
1319A420j532N69J032l137k629L076J163m612o8L855j293k397L944L036l287j278
$$ 1420 -112 457 1489 -1648 -4277 -1201 -38 -4650 -4718 -863 -2156 -4553 -609 2427 -860 -2138
1335b138L929K017k476r62K204Q53l155m42K020K57j773n8K244o73k437J6K321
$$ -2138 1791 3808 1332 370 2574 3427 272 -170 1850 2107 334 276 2520 1847 -590 -574 1747
1352A747m43l097o74K032j296k223J552J692k167n09K537J618j264m02K231J127
$$ 1747 1304 -1793 -2467 -435 -1731 -3954 -2402 -710 -2877 -3386 -849 769 -495 -897 1334 2461
1368B461p11j445Q29J282j597n98K240q60k578J434J740j196j878Q55Q67o82j312
$$ 2461 1750 305 1134 2416 819 221 2461 1601 -977 457 2197 1001 -877 -22 845 163 -1149
1385a149o61P72J99j723L32J515j248r34K658J756k258k06K430N51j286j90J184
$$ -1149 -1810 -1038 -839 -2562 -2230 -715 -1963 -2897 -239 1517 -741 -947 1483 2034 748 558 1742
1402A742j1p63n91J540J89k759m70L307p46l107R86K030j506j607J627j13k611
$$ 1742 1731 968 377 1917 2106 -653 -1123 2184 1438 -1669 -683 1347 -159 -1766 -139 -252 -2863
1419b863O35K888r34j824J28J541O98K19q25L9J358M21j782K081O38l933O39M665
$$ -2863 -2228 660 -274 -2098 -1970 -429 269 488 -337 -298 1060 1481 -301 1780 2418 -1515 -876 3789
1437C789k769l804L787J171l874R06K581k356r41J639j111M92J886l646q32N015
$$ 3789 1020 -2784 1003 2174 -1700 -794 1787 -569 -1510 129 -982 -490 1396 -2250 -3082 1933
1453A933k221l321N985N18p662K695P085m608l077M666p30l125L447O01l100J809
$$ 1933 -288 -3609 2376 2894 -4768 -2073 5012 404 -2673 1993 1263 -1862 1585 2186 -914 895
1469H95N6k706L666J653p109N6P432k757m779M808O50o506K953O797m673m241
$$ 895 951 -1755 1911 3564 -3545 -3489 3943 1186 -3593 1215 1865 -4641 -1688 5109 436 -3805
1485c805K996P02n36L627k330m686L662K585m239K655L630q112p95J1058k664
$$ -3805 -809 -107 -643 2984 654 -4032 -370 2215 -2024 631 4261 -3851 -4646 6412 3748
1500C748r620N948L907p153L555N574q416k878Q033j460k015N240n800o578J1069
$$ 3748 -5872 76 3983 -3170 385 5959 -2457 -5335 2698 1238 -777 4463 -1337 -7915 3154
1515C154K950j0290L611M803j0126J072J3089o530r661Q164K711o397M908K334
$$ 3154 6104 -4186 -575 4228 -5898 -4826 8263 1733 -7928 236 2947 -3450 1458 3792
1529C792q814K883P691m758j584M418o903k574J2689j76j2171L334N287o659L174
$$ 3792 -5022 -2139 5552 794 -790 3628 -3275 -5849 6840 6664 -5507 -2173 3114 -3545 -371
1544c71R258r355p669Q959K767n463L808j89r308N336R206q160l640P233l873
$$ -371 8887 -468 -8137 822 3589 -1874 1934 1745 -7563 -2227 6979 -1181 -4821 2412 -1461
1559a461l242J1310j241j3777N337R528o922Q13O236j0960m289J4615r4r144N441
$$ -1461 -4703 6607 5366 -8411 -3074 6454 -468 345 6581 -4379 -8668 5947 5853 -3291 2150
1574B150j056r350J0010Q909j3616l087J0232n816l452J2269n395j3123J0128
$$ 2150 1094 -8256 1754 10663 -2953 -6040 4192 -1624 -5076 7193 1798 -11325 -1197
1587a197Q178r891J151N103q979J616J2928n025r464N977P5m443R925K367j4495
$$ -1197 6981 -2910 -1759 3344 -5635 -4019 8909 3884 -5580 397 472 -3971 5954 8321 -6174
1602f174L79J0873m460j258P319p408q253J1284N480j0903K47M691o727K348J0065
$$ -6174 -5795 5078 618 -640 6679 -729 -8982 2302 7782 -3121 -2874 1817 -4910 -2562 7503
1617G503q096q653Q828L125n126O046J11j2200M606J2366o179m667O331o384m661
$$ 7503 -593 -9246 -418 2707 -2419 3627 3738 -8462 -3856 8510 2331 -2336 3995 -2389 -7050
1632g050J4011J489j4011L068O394p082K974R040j0720o857J1963N36p883N623
$$ -7050 6961 8450 -5561 -2493 3901 -3181 -207 8833 -1887 -8744 3219 3755 -4128 1495
1646A495q92r427P236Q985r240l642O913l597n18R682l434j0648O003N573n115
$$ 1495 603 -8824 -1588 7397 -1843 -5485 1428 -2169 -2687 6995 3561 -7087 -1084 4489 -626
1661f26L402K904j0437l40J1054k639o177N089j507o862P907N380j0394k220P349
$$ -626 2776 5680 -4757 -5097 5957 3318 -2859 2230 723 -6139 1768 7148 -3246 -5466 1883
1676A883k609k097O462l773p847P307N518n893J53K642n857J880R449m174o559
$$ 1883 -726 -2823 3639 -134 -7981 -674 4844 -1049 -896 1746 -4111 -2231 7218 3044 -3515
1691c515M288K28l820O950K165j0414K37P838l268k221N318m482n342P715K454
$$ -3515 773 1001 -2819 4131 6296 -4118 -3881 3957 689 -1532 3786 -696 -6038 1677 4131
1706D131o966O57K521l534K633M744o468k801N918N6j971M255j724o791N102N844
$$ 4131 -2835 -2178 343 -3191 -558 4186 -2282 -5083 835 891 -1080 3175 1451 -5340 -238 5606
1722E606m939j283L553l751k296P131n57n829K431K079l823J245L343m235j566
$$ 5606 667 -616 2937 -814 -3110 4021 3464 -2365 66 2145 -1678 -433 2910 -1325 -2891
1737b891M682o74l615K177J33k941L204K597m256p63K940j342j17L868j845l438
$$ -2891 1791 1117 -2498 -321 -188 -3129 75 2672 -1584 -2347 593 -749 -866 3002 1157 -2281
1753b281K277J432k437K369J629m531k53M159k075k071L381j78l848K559K151
$$ -2281 -4 1428 -1009 1360 2989 -1542 -1795 2364 289 -1782 1599 1421 -2427 132 2283
1768B283l877k24K828j102p56J566j862j362K871O55j510J575o20l066K262L547
$$ 2283 -1594 -1818 1010 -92 -848 718 -1144 -2506 365 1020 -490 1085 465 -2601 -339 3208
1784C208k746j727K553k57k543J726J476k136m75K052o42j308L95P8N04K63m17
$$ 3208 462 -1265 1288 1031 -1512 214 1690 -446 -921 1131 489 -819 -424 -346 158 421 4
1801Dp84P91n92l05J558M23k294j39J848k07j032J064N15j463P9J243r25K1J185
$$ 4 -780 11 -581 -886 672 1095 -1199 -1338 510 303 -729 335 850 -613 -534 709 -216 -195 990
1820I90n18p59R26l82j129J304P75j410k96J086n26o21N31M15o21o12N88K33m58
$$ 990 472 -287 639 257 -872 432 1207 -203 -499 587 61 -560 -29 386 -235 -847 -259 -26 -484
1839d84k28O66M63r55p04J205O34q22l48J269l72j023N39J065k43j053N71Q13
$$ -484 -712 -46 417 -538 -1242 -37 597 -225 -573 696 324 -699 -160 905 662 -391 180 993
1857I93n91j049Q59N98p73l64O83o2q65K27O79N7j180j45J142O9r43R1J023p52
$$ 993 402 -647 212 810 37 -327 356 294 -571 -344 335 392 -788 -933 209 278 -665 -574 449 -303
1877c03r07J460L96j517R1J399J93j206J52Q68l1p37J98O46m23n32L33P22n30
$$ -303 -1210 250 646 -871 -780 619 812 -394 -242 626 595 -142 56 702 279 -253 80 802 272
1896B72n23L97L16m28m91J2K35K55p96rN52L2n42L31J279o85j391J328J329j504
$$ 272 -251 146 462 34 -457 -445 -210 45 -751 -760 -208 -176 -718 -387 892 207 -1184 144 1473 -31
1916c1p86J442K9q84J42J092n04n28r6J087l81j003l60J225M24j607l97J782n66
$$ -31 -817 625 654 -230 -88 1004 500 -28 -124 963 582 -421 -781 444 868 -739 -1136 646 80
1935H0j639J242J646k171j026K518k09j215P25N03p17K84J46o58J489k92k302
$$ 80 -1559 -317 1329 -842 -1868 650 441 -774 -49 454 -263 21 167 -491 998 706 -1596
1952a596J562K581k809j153L328p76l199K537J833l222m63K389p44q16N93p86
$$ -1596 -34 2547 -262 -1415 1913 1137 -2062 475 2308 -914 -1377 1012 268 -548 45 -741
1968g41o49J991m76j550J929P1k813J976L275l411k089L353O24k822K040J400
$$ -741 -1390 601 125 -1425 504 575 -2238 -262 3013 -398 -2487 866 1490 -1332 708 2108
1984B108l255K71K727j315p07J192j763l10L546j329l964K420K029l808J587L717
$$ 2108 -1147 -876 1851 536 -171 1021 -742 -1052 2494 1165 -2799 -379 1650 -2158 -571 3146
2000C146m817k893N679Q68l855K294O17l728K142L795l207j062K785l014j98N268
$$ 3146 -1671 -4564 1115 1983 -1872 422 1039 -2689 -547 3248 41 -1021 1764 -1250 -1448 3820
2016C820k261n214M225K499m629J571L374n484j326O346j053m279K271q6l070
$$ 3820 1559 -3655 570 3069 -1560 11 3385 -2099 -3425 2921 1868 -2411 -140 -226 -3296
2031c296M448K381o190L10L817l014O38N230m145n260O029K916n541J385K936
$$ -3296 1152 3533 -2657 -2347 1470 -1544 -906 4324 179 -5081 948 3864 -1677 -292 2644
2046B644m837K69O257k505n329L454J137k503L965O19p200J403N480k640r77L808
$$ 2644 -2193 -1924 4333 1828 -3501 -47 1090 -1413 2552 3171 -4029 -2626 2854 214 -763 3045
2062C045m743l985Q076J995p150J396L466n110J917O243n014m799O034O82l661
$$ 3045 -1698 -5683 2393 4388 -2762 -1366 2100 -3010 -1093 5150 136 -4663 1371 2053 -1608
2077a608M081m53p158M271O321n596j868M388m142j767Q235m87q738K473L978
$$ -1608 2473 2020 -5138 -867 5454 -142 -2010 2378 -1764 -3531 4704 4217 -4521 -2048 1930
2092A930l580K157L873o667k563O832p0l763L930j665n815N964M762p056j480
$$ 1930 -1650 507 4380 -2287 -4850 1982 1912 -1851 2079 414 -5401 563 5325 -1731 -3211
2107c211N274k939j076O818k553p649M116M851l355N33J612n980N62P350j946
$$ -3211 2063 -876 -1952 4866 2313 -5336 -1220 3631 276 809 2421 -3559 -2997 4353 2407
2122B407m451L044k035l309O798L003r039m75O577k729j576N615l624o008O291
$$ 2407 -2044 1000 -1035 -4344 2454 5457 -3582 -4057 2520 -209 -1785 3830 206 -5802 489
2137D89L875n299j0J868m041K460O123m523m804M739o63k267O062o16q470K370
$$ 489 4364 -935 -945 923 -3118 -658 5465 942 -3862 877 214 -2053 4009 3393 -5077 -2707
2153b707O604l282j723L921m228k797O469P62n153J296J440l348L350L793o063
$$ -2707 3897 615 -1108 2813 -1415 -4212 2257 3019 -2134 -838 602 -2746 604 4397 -1666
2168a666k583N974l86k707L313o75n952L467N988l797k682K655k260m25N472j230
$$ -1666 -4249 1725 1339 -1368 1945 1270 -4682 -1215 4773 976 -1706 949 -1311 -1736 3736 2506
2184B506n006J825J449k358L081K108o360j031O474j272l314K804n11m208M063
$$ 2506 -2500 -675 774 -1584 1497 3605 -2755 -3786 2688 1416 -1898 906 395 -3813 250
2199B50L554m687j683L012j029L60L756l411l290L774J575k463J749N31n482J535
$$ 250 3804 -883 -2566 446 -583 -223 3533 122 -3168 606 2181 -282 1467 1998 -3484 -1949
2215a949N712k538l338K919n41k829L724J293m609J46L106j261p17J868k080j598
$$ -1949 3763 1225 -2113 806 265 -2564 1160 2453 -2156 -2010 1096 -165 -882 986 -1094 -2692
2231b692L850P34l238J090Q86k693K342L033l184k164K139no65K356n80l069J478
$$ -2692 1158 1892 -1346 -256 630 -2063 279 3312 128 -2036 103 98 -567 1789 1209 -1860 -382
2248c82J624j736M14J740k907o89L280p57k721J776J184k377J023K073k561q02
$$ -382 1242 -494 -80 1660 -1247 -1936 1344 587 -2134 -358 826 -1551 -528 1545 -1016 -1818
2264a818K452K58j104R64o24j663J857J020j503L78R73k380K56K846q63k288J804
$$ -1818 634 892 -212 752 128 -1535 322 1342 -161 217 1190 -1190 -934 1912 1049 -1239 565
2281E65M68k037J009Q35j710j37J682l09j242K68nj66J137O0j184L16K72m46Q96
$$ 565 1033 -1004 5 840 -870 -1007 675 366 -876 -608 -613 -779 358 418 -766 -450 -178 -624 272
2300B72J166j369q43J566K29j336Q09N64j294J71O96l33q14P86j58m09J77J16
$$ 272 1438 69 -774 792 1021 -315 494 1058 -236 -65 631 298 -516 270 112 -297 -120 -4
2318dj369P35R31o92j88M91l10l58P59M50l46O6N4r4J72J01k45L89O1p51K5M76
$$ -4 -1373 -638 293 -399 -587 -96 -406 -764 -5 445 99 165 219 125 297 398 153 542 603 -148 -123 353
2340C53j72o38P02j07l41l27R03n25k37M29k64l56p9K47o7M60j91N3L2j9P2M75
$$ 353 181 -457 245 138 -203 -530 373 -152 -389 40 -224 -580 -659 -412 -479 -19 -210 -157 -125 -144 -72 403
2362D03r1j79n2K31p0k1Q2k3j93q1K67n3k74j30J88L01p80M16n7n6j17J9L48l05
$$ 403 312 133 81 312 242 221 303 280 87 6 273 220 -54 -184 4 305 -475 -59 -116 -172 -289 -270 78 -227
2386b27l55M10M55k43l12O17m5n88O04K25l76k09L34J52p63N82J89l74J9j72R9
$$ -227 -582 -172 283 40 -272 345 300 -288 316 541 165 -44 290 442 -321 261 450 76 95 -77 22
2407B2J39j41k93O1L59m10n40P16R6k73j02L42K2r2J58J96J24k48l43J3O83l03
$$ 22 161 20 -273 -212 147 -263 -803 -87 9 -264 -366 -24 -2 -94 64 260 384 136 -207 -194 489 186
2429A86o49R94J29j021K9R33n10n81O53K46q99J8Q70n15k73O86n75k19N25q8o73
$$ 186 -463 531 660 -361 -332 601 91 -490 163 409 -490 -472 398 -117 -390 296 -279 -498 27 -61 -734
2450g34J061J07j086R09N45j266l47J502j48j258J001L41j360O84R78r61l29N94
$$ -734 327 434 -652 257 802 -464 -811 691 543 -715 286 627 -733 -49 929 -32 -361 233
2468B33o06M69Q28j071q43J209N15j607J082N08j890O01J861j190r46J068j5r46
$$ 233 -373 96 924 -147 -990 219 734 -873 209 717 -1173 -572 1289 99 -847 221 206 -740
2486g40J209O52k011K45J463j133j20J639j479j524K476L11j852R37J153k105
$$ -740 469 1121 -890 -645 818 -315 -435 1204 -275 -1799 677 988 -864 73 1226 -879
2502h79Q3K689j735j882K174J02j498J435P44k651Q29J825j502N6J375j925r87
$$ -879 -796 1893 158 -1724 450 552 -946 489 1233 -1418 -589 1236 -266 -210 1165 -760 -1747
2519a747L553l49l047J228J341k515J328K774k937j931K870K02j708K186n57k815
$$ -1747 1806 1457 -1590 -362 979 -1536 -208 2566 -371 -2302 568 770 -938 1248 691 -2124
2535b124J908K132k358l01J963k242k62L964j683l774K554K037k930J380J825
$$ -2124 -216 1916 -442 -743 1220 -1022 -1284 2680 997 -2777 -223 1814 -1116 264 2089
2550B089l521j067M049k99k278J599o57k155K968J717l609J71K300k064p8L566
$$ 2089 -1432 -2499 1550 1251 -1027 572 -85 -2240 728 2445 -1164 -993 1307 -757 -835 2731
2566B731k247l701L505K171l159M84J655l318M96M059j719k432J857p19j509M015
$$ 2731 484 -3217 288 2459 -700 -216 1439 -1879 -1383 2676 957 -1475 382 -337 -1846 2169
2582B169j3m496P14L466k454k17L438l048l182M622J332l521Q59J281k625J516
$$ 2169 2156 -2340 -1626 1840 -614 -831 2607 -441 -3623 999 2331 -1190 -331 950 -1675 -159
2598a59L106l208j725K463l19q91K966j059m615K210M231l036o89K194k776j570
$$ -159 2947 -261 -1986 477 158 -733 2233 1174 -3441 -1231 3000 -36 -725 1469 -1307 -2877
2614b877M681L15l674P52J125j675K332J923m624q17M410j303j461K855j722l705
$$ -2877 1804 2119 -1555 -803 322 -1353 979 2902 -1722 -2539 1871 568 -893 1962 240 -3465
2630c465L724L496l869j546K449j666k95M278j736m159K026J668j402J795Q9m290
$$ -3465 259 3755 -114 -1660 789 -877 -1172 3106 1370 -2789 -763 905 -497 1298 1387 -2903
2646b903Q76M660k037k118K816j543k546M271J767m717l24K844j472L85K289k543
$$ -2903 -2027 2633 596 -1522 1294 -249 -2795 1476 3243 -1474 -1798 1046 -426 -41 2248 -295
2662b95k114K891J316k131J178K0l547J881M027k697k234K312j365j058L481O25
$$ -295 -2409 482 1798 -333 845 865 -2682 -801 3226 529 -1705 607 -758 -1816 1665 2290
2678B290m449N09K797j182k51J661k569j002L575K23k675J450J18k478K319K727
$$ 2290 -2159 -1650 1147 -35 -286 1375 -1194 -2196 1379 1602 -1073 377 495 -1983 336 3063
2694C063l576j766K897L88j377K211q49l832K113K062j236j20P03k403L02L930
$$ 3063 -513 -2279 618 1006 -371 1840 991 -2841 -728 1334 98 -22 681 -1722 -1420 2510
2710B510j811k396K071K37k124K324J514l608r07L717n14j572J151o95j434K131
$$ 2510 699 -1697 374 611 -1513 811 2325 -1283 -2190 1527 1013 -559 592 -103 -1537 594
2726E94J382k291O1K71j145R11K480k277j980K535J2j520J672M57k764N04K633
$$ 594 1976 -315 -254 17 -1128 -217 2263 -14 -1994 541 553 -967 705 1162 -1602 -1098 1535
2743A535j110j238J192m71q64J878K11k489Q46J156j203R81J241k568q45K898
$$ 1535 425 -813 379 -92 -956 922 1133 -1356 -510 646 -557 424 1665 -903 -1748 1150
2759A150j54j600J157K38k127R97J833j313o39P33o01j48J533p37j482J147N66
$$ 1150 996 -604 553 791 -1336 -339 1494 181 -458 275 -326 -474 1059 322 -1160 -13 553
2776E53j318O71R72j653l97K403m58j702P49K97o22R68L83j159j02M60m47O29
$$ 553 -765 -94 878 -775 -1172 1231 773 -929 -180 117 -505 463 846 -313 -415 45 -402 227
2794B27P60j022j067J535M37j587M29J332j444m36J670k45j924R77R15o05K26
$$ 227 987 -35 -1102 433 870 -717 -288 1044 -400 -836 834 589 -1335 -358 557 -48 178
2811A78K55o58o9M99l99j2N23n61l83J080J64r04K94L17n73N4Q05m59l60N54j90
$$ 178 433 -225 -294 205 -194 -206 317 -244 -627 453 617 -287 7 324 -249 -195 610 151 -209 345 155
2832A55l87L09j48k38L91K53o83N6N19m07k62N80o1o02L51N13n66J85K34j46k68
$$ 155 -232 77 -71 -309 82 335 -348 -292 227 -180 -442 138 77 -525 -174 339 -227 -42 192 46 -222
2853b22J70L50j55qn4l32M04J87n27M86ol20p1L70o3k63j19L05j08n75L15K65
$$ -222 -52 298 143 135 81 -251 153 340 -187 299 293 -27 -98 272 209 -54 -173 132 24 -551 -236 29
2875B9j34k21O26l33j54k07M09J22P1p18P67L21j028J41O42o8n28L50K02k27N0
$$ 29 -105 -326 300 -33 -187 -394 15 137 208 -510 257 578 -450 -309 333 265 -263 87 289 62 112
2896A12N1m5l09M7o6J97K86o52N5M98k59q8K41J8m9k63N80l13j10J99j01P9O3
$$ 112 163 118 -191 -144 -210 -13 273 -379 -324 174 -85 -173 68 86 37 -226 354 41 -69 130 29 108 171
2919A71j34k21M89k49q0J22M8j99R4l9R7j69j34J68J29m17L44J36m26L20J9l15
$$ 171 37 -184 305 56 -24 98 146 -53 41 2 99 -70 -204 -36 93 -324 20 156 -270 50 69 -246
2941b46L55Q1m94L62K99o61J92O65n43l83M50K57k53LJ46m20P2M47l83m1L58k68
$$ -246 109 190 -304 58 357 -304 -112 553 10 -373 77 334 81 84 230 -190 -118 329 -54 -95 263 -5
2963ej72M18k13n00M07N96j126K29N66m67L5O19l11n05N78L55p03M04P25j378
$$ -5 -177 241 28 -472 -65 531 -595 -366 200 -267 -232 387 76 -429 149 504 -199 205 930 -448
2983d48J89J052m50n39O13N9j330R34P05j126L99M19n92l66J073k92j396J487
$$ -448 -259 793 343 -196 417 476 -854 80 785 -341 58 477 -115 -481 592 300 -1096 391
3001C91M7r98M42R97j705J42J518p74q78P26M3q52J467K10j447J94J113p42k06
$$ 391 438 -560 -118 879 -826 -684 834 60 -818 -92 -49 -901 566 776 -671 -477 636 -106 -312
3020c12J698j452q71J198P34j676P19P62j503l3J794r32j078R58M0j032J570M6
$$ -312 1386 -66 -937 261 995 -681 38 800 -703 -736 1058 126 -952 6 46 -986 584 630
3038F30j810P06J336j238m8J550j577j113K327M48j856O13L76r44N26J508j652
$$ 630 -1180 -474 862 -376 -424 1126 -451 -1564 763 1211 -645 -32 344 -600 -74 1434 -218
3055b18q82J574j68p26J410o44k107J563J598j780j14J452j681m14K648n34k283
$$ -218 -1100 474 306 -420 990 346 -1761 -198 1400 -380 -494 958 -723 -1137 1511 977 -1306
3072a306P70R91j245J139J269k454l11J996o61q23J609p08k040K189J297k465
$$ -1306 -536 455 -790 349 1618 -836 -1147 849 188 -635 974 266 -1774 415 1712 -753
3088g53m6J445j230k8K244j041k409J529J117j351J285L5k334N67K151q19r01
$$ -753 -799 646 -584 -612 1632 591 -1818 -289 828 -523 762 797 -1537 -970 1181 362 -539
3105e39J116j238q96K700P97l262N32J737j242N7J920j918j651K301J091j779
$$ -539 577 -661 -1557 1143 1940 -1322 -790 947 -295 -238 1682 -236 -1887 414 1505 -274
3121b74P09O1j977J038K749k220j797K142n21j065K609l15l271J222K036j218
$$ -274 435 496 -1481 -443 2306 86 -1711 431 -90 -1155 1454 1139 -2132 -910 1126 -92
3137i2J26J031j824r44L067q5k276R90J0j391J886J613k837o47K286o64o22J837
$$ -92 34 1065 -759 -1703 1364 1279 -997 -7 3 -1388 498 2111 -726 -1373 913 249 -373 1464
3155A464j267k395K008J966j994j60O14j342L21K418r18k099J138K50j028J797
$$ 1464 197 -2198 -190 1776 -218 -378 236 -1106 -785 1633 715 -1384 -246 4 -1024 773
3171G73M91k843J32K765p56j246J921j436j488K338J327k354m35J344j004N59
$$ 773 1264 -1579 -1447 1318 562 -684 1237 -199 -1687 651 1978 -376 -811 533 -471 88
3187H8J577j873j429J887J56r07J363j83k549J011K561j818p23J329p35p00K121
$$ 88 1665 -208 -1637 250 406 -501 862 679 -1870 -859 1702 -116 -839 490 -245 -945 1176
3204A176j46k183M62J369r52N58J322k343r14K592L3j235Q32l95j724J508J932
$$ 1176 1030 -1153 -691 678 -274 284 1606 -737 -1651 941 974 -261 571 176 -1548 -40 1892
3221A892j903j077J316m95r9J240o39j546R00J018j050N35N00j950L90K649j235
$$ 1892 -11 -1088 228 -267 -366 874 235 -1311 -411 607 -443 92 592 -1358 -968 1681 446
3238D46j268J023K31j119J053J076j951k91J298l88k09J076j277q28J289P14j472
$$ 446 -822 201 432 -687 366 1442 -509 -800 498 110 -99 977 -300 -1128 161 875 -597
3255e97N72N13j570N04J744j122j145J158L80j004Q81M88j702K43J142m06r4K59
$$ -597 -25 488 -1082 -578 1166 44 -1101 57 437 -567 314 802 -900 -657 485 79 -15 244
3273B44o07l15J452M8j284N69J00o71N27Q62r26q63J001K54q19P38k40p99N60
$$ 244 -363 -678 774 822 -462 107 207 -464 63 925 -1 -864 137 391 -428 310 70 -729 -169
3292a69N81n83j35Q61j115K40J065n32j274J000N70j011L66Q82p87o26Q32L38
$$ -169 412 -171 -306 555 -560 -320 745 213 -1061 -61 509 -502 -136 746 -41 -667 165 503
3310E03n97J99j68j25N79J2m77l5N85n59k98J099n95o24L90L98o14O2M74k87l19
$$ 503 -94 105 -63 -188 391 403 -74 -109 476 -83 -381 718 123 -501 -111 287 -327 -265 209 -78 -397
3331c97P84k23p96P53k20r0O01j25o61M28M95n99j84P24k97o58M32O09p70j14
$$ -397 387 164 -632 121 -99 -189 412 287 -374 54 549 -50 -234 490 193 -465 -33 576 -194 -308
3351c08L96j74k42M47J6j38r9j6L7N26m08m70M41L20m25k27O95k24o57L79N96
$$ -308 88 -86 -328 119 135 -3 -102 -118 -81 445 37 -433 8 328 -97 -324 371 147 -510 -131 465
3372D65j15n16J70J02k33P6l5j5M71k67j50K10k47k50P34k62l80p5L58J77n39
$$ 465 350 -166 4 106 -127 -51 -86 -101 370 103 -47 163 -84 -334 400 138 -242 -317 41 218 -321
3393c21M8M08k04l03K98J51J11k02P1O8L0m13L80K38l19J00m4J01j65m6qK55o53
$$ -321 -273 135 -69 -372 -74 77 188 -14 57 125 155 -258 122 360 41 141 97 198 33 -13 -21 234 -419
3416d19J88K04q6K56l62K10m7j3p2L68mm90o6M03L5n72N00M07l30k49L43j41j55
$$ -419 -231 -27 -113 143 -219 -9 -56 -69 -141 227 223 -267 -333 70 105 -467 33 440 110 -139 204 63 -92
3439i2K02J38j77k62o8K64K19j71q7J64J34j93k31L77k56O6j03M6M5K7k1m4N3
$$ -92 110 248 71 -191 -259 5 224 53 -34 130 264 71 -160 217 -39 27 -76 -30 15 42 21 -23 30
3462C0R5j96J06k76J62j07M43J75p32J94L68l57J83K90m22l08K41K93k57l6K23
$$ 30 125 -71 35 -241 -79 -186 257 432 -300 -106 262 -95 88 378 -44 -352 -111 182 -75 -111 112
3483A12j47r2L10m03J98K94k61l99N17j79n54L63P24n29k85O57j67n22Q87k00
$$ 112 -35 -127 183 -220 -22 272 11 -388 129 -50 -604 -241 483 -46 -331 326 159 -363 524 324
3503C24m25J45P1l34M65R2n04l34Q69l27l84N62m8r05R34N30j342P9O17l48k75
$$ 324 -101 44 115 -219 246 338 -166 -500 369 42 -342 220 172 -733 201 731 -611 -532 85 -263 -538
3524e38P98l7n97K15M55n48N93L2o94n0R87l45m09P19m17j039R99M13q34M9O85
$$ -538 260 223 -374 -159 296 -252 341 373 -321 -371 616 271 -138 581 164 -875 124 537 -297 -248 437
3545D37m92j33O45o96l44P62r0p56P61L97j447P49J220q98p02O62q0p47J530K12
$$ 437 -55 -188 457 -239 -583 179 89 -667 94 491 -956 -207 1013 115 -587 75 -5 -752 778 990
3565I90j546J56R68p61J94M25p97k29J107M57j511P73K0j205Q54J174j236q47
$$ 990 -556 -400 568 -193 1 426 -371 -600 507 964 -547 226 246 -959 -105 1069 -167 -1014
3583a014J256j30o70J000j6j404N16J214q14J67M58j411q6J798n79q89Q04J25
$$ -1014 242 112 -558 442 426 -978 -462 752 -62 105 563 -848 -934 864 285 -604 200 325
3601C25r01J102O27j663m32J474j98m92Q54o30j192J240O72j132P5N71r05j2J782
$$ 325 -576 526 1153 -510 -942 532 334 -158 696 66 -1126 114 786 -346 -271 300 -605 -617 1165
3620A165j027j468J341K44q45J083L82j756K84J583q12m05Q30p72r09J632N88
$$ 1165 138 -1330 11 255 -590 493 875 -881 -597 986 174 -231 599 -173 -1082 550 1138
3637A138j694j2R77p15J83J360j492q92J593M7r43J115m16j502R40J397j145k92
$$ 1138 -556 -568 409 -306 -123 1237 -255 -1147 446 493 -450 665 249 -1253 -313 1084 -61 -353
3655c53P14r46r4J731l02j574N98O42p32N30R34j810l4J368k15j036P89j35j073
$$ -353 361 -585 -679 1052 750 -824 -226 416 -316 214 1148 -662 -696 672 457 -579 210 75 -998
3674i98R52J565j740l40Q30l13k31R94o72j168Q18O27m72K61M57j376Q9J725n53
$$ -998 -46 1519 -221 -561 269 -44 -275 719 47 -1121 -303 324 -148 113 570 -806 -717 1008 455
3693D55j230O38K31o11J003O54j983R2J449o07k68Q47q45q11J134P96j199J69
$$ 455 -775 -137 94 -517 486 1140 -843 -751 698 91 -177 670 -175 -986 148 944 -255 -86
3711h6L00r08O13J344j299j099J101J68m67P49K48j645N36J222o62j43N53q92
$$ -86 214 -694 -81 1263 -36 -1135 -34 134 -333 416 664 -981 -445 777 115 -28 525 -367
3729c67l07J399p1j159N45L48q99P03Q23j259o87J454m06l48O58j21j267J018
$$ -367 -674 725 654 -505 40 388 -511 192 1015 -244 -931 523 117 -231 427 306 -961 57
3747E7N13m39n51P70q50j06J463n89j180Q61N95r98N92M65j180J02J179n73n86
$$ 57 570 131 -420 350 -500 -606 857 268 -912 -51 544 -454 138 603 -577 -475 704 131 -455
3766d55Q12m0q22R81J50j189N3P79k58r5N69p41m89Q48P89j268N20J65n85J64
$$ -455 357 317 -505 476 626 -563 -510 269 11 -84 485 -256 -745 103 892 -376 144 309 -276 -112
3786a12N09l43o60O29L8l03O97j21p19K21L82L2l33M68p76k52Q99J73p41L50K38
$$ -112 397 54 -606 23 61 -242 455 334 -385 -164 218 250 -83 385 -391 -643 256 429 -312 38 276
3807B76o85R1O05k14l81M58k92J23K67m54j53J42N40l96J85J72m76j85P62l5p60
$$ 276 -409 -318 287 73 -308 150 -142 -19 248 -206 -359 -217 323 -73 112 284 -192 -377 385 350 -410
3828d10L07%R7qK55l22m82Q32k97j03L28k40k07K66J05k36j58L10R9k79N03M3
$$ -410 -103 -103 -6 -14 241 -81 -563 269 -28 -131 197 -43 -250 16 121 -115 -273 37 136 -143 360 403
3850D03r89M33J24m6K75k02q1j15L52j19P9R4k64J72nJ30m02J61K26k26j28J93
$$ 403 -586 -153 -29 -75 200 -2 -83 -198 154 35 114 208 -56 116 111 241 -161 0 226 0 -128 65
3872F5K8j72J10J11k31K3k42J71J84L1Q6j53j8M7k19L46l3j81r9L26k68k37L47
$$ 65 93 -79 31 142 -89 -66 -308 -137 47 78 164 11 -7 40 -179 167 134 -47 -146 180 -88 -325 22
3895B2PJ37l15o4L19l71J14L0J21K29l85Q0J53o1m80M89j07j10j07J72K04m39
$$ 22 29 166 -149 -213 106 -265 -151 -121 0 229 -156 -76 77 16 -464 25 -82 -192 -299 -127 77 -362
3917c62M61J0M8j19P6r3j01R5p3K57J47o73N08l7k00j20K36P0k24l48M84p0k08
$$ -362 99 109 157 38 114 21 -80 15 -58 199 346 -327 181 144 -56 -176 60 130 -94 -442 42 -28 -236
3940b36K29o6k75M42j4j76L19n28Q2M59k90j30N80k97M6k19M05k72k32m7L39P1
$$ -236 -7 -73 -348 94 80 -96 223 -305 -223 236 -54 -184 396 99 145 -74 331 59 -173 -220 119 190
3962A90l25Q0j93K04K26m09O0K67k41m2L87o4l05m6K04n8l42N33r0j17M61l91
$$ 190 -135 -55 -248 -44 182 -227 -167 100 -141 -183 204 140 -165 -211 -7 -65 -407 126 36 -81 380 -11
3984a1P0P4j22k03L72Ql93L62q0l04m9O38j9p38J16L86j95J08J56j46m17J69L11
$$ -11 59 133 11 -192 180 188 -205 157 77 -227 -276 362 343 -395 -279 107 -88 20 176 30 -387 -218 93
4007I3k75J98l6k96L88K29m73j54P00l49k57L25L01j044N90M50j50j95O7J83n20
$$ 93 -182 16 -20 -316 72 301 -172 -326 374 25 -232 93 394 -650 -60 390 240 45 112 295 -225
4028b25L59j20j8R4l8l27P5L66o36M05M67n40l8L37k8o48L49N29k57j70K97m19
$$ -225 134 14 -4 90 52 -275 -200 166 -470 -65 402 -138 -176 161 133 -515 -166 363 106 -64 233 -186
4050a86J22L37k1l62K68q0l85O13K90j075M45M04l51k86L86j19m99N30K35m87
$$ -186 -64 273 252 -110 158 78 -307 306 596 -479 -34 370 19 -267 119 0 -499 31 266 -221
4070b21O5K88l66K00N15o17j82L74J06o63Q88R3j045L75Q23o67j32M18j88m27
$$ -221 -156 132 -234 -34 481 -136 -318 56 162 -501 387 480 -565 -190 633 -34 -166 252 64 -363
4090c63O65J10o09J13K16n43N86M76q23m28J038j11p24M83J19p74K62R69n79l05
$$ -363 302 412 -197 -84 132 -411 175 651 -172 -600 438 327 -397 86 205 -569 -307 662 83 -222
4110b22L08Ll09O53M8q82L44N27n42M16N4p45l2P54p2n87M45M5o06N75L39q50
$$ -222 86 89 -220 433 481 -401 -57 470 -72 344 398 -347 -379 375 303 -284 161 206 -400 175 514 -336
4132c36k28Q69l93K00L35o04m43R08L0o32K32M21j086O36Q16p49l78N26J22o94
$$ -336 -564 305 -88 112 447 -157 -600 308 338 -294 -62 359 -727 -91 725 -24 -402 124 246 -448
4152d48P39J89j220L11Q28k36L1L00p59k68Q49J27q03k6N34q01O60Q38r31n99
$$ -448 291 480 -740 -429 399 163 194 494 -265 -533 316 443 -360 -386 148 -653 7 845 -86 -685
4172f85P86J67l67P33n06o06M54N08m29K6J88p79J80J023k79p95L61L50m29L11
$$ -685 101 268 -99 634 128 -478 -24 484 55 81 269 -510 -330 693 414 -381 -20 330 -99 212
4192B12M10j124l32Q20K28m77K33k9p28Q71L28n34j20N09l66m3Q86n89p99Q06
$$ 212 622 -502 -834 -14 214 -263 -30 -59 -787 84 412 -122 -242 267 -99 -142 744 155 -644 162
4212A62M7k20K64n7o30N0J059o60m05M85k02K4M61K2o91%M67o58K95O82q52l79
$$ 162 209 -11 253 196 -434 -384 675 15 -390 95 -107 -83 378 400 -291 -291 176 -482 -187 495 -357 -736
4234g36Q83J09l58J83L88q86M64O15p69R1J77m25l9O18q5j022N25Q39p12p2M84
$$ -736 147 256 -102 81 469 -417 47 662 -107 -16 161 -264 -303 315 230 -792 -267 572 -140 -212 272
4255B72o09J2O12j34n99J75M40m03J76K59l11l35N95l37K79L12k36m41K08N16
$$ 272 -337 -325 287 153 -446 -271 169 -234 -58 201 -110 -445 150 -187 92 404 168 -273 -65 451
4275D51n62N8L50m87pO15j92l67J32P0q1K06K36o73L5O08n02J01N1k22l07N12
$$ 451 -111 -53 297 -190 -197 418 226 -141 -9 61 -20 186 422 -251 -216 392 -110 -9 42 -180 -487 25
4297B5K50n33K16K33n41M38L21r0n56J48L18j89J54n8k72J05L57k92l93M25j35
$$ 25 275 -258 -42 191 -350 88 409 319 -237 -89 229 40 194 136 -136 -31 326 34 -359 66 -69
4318f9J2K52K29q97K98L67k87M44k12k13k29M19k75J5n4J98l74K75L12l39P9K52
$$ -69 -57 195 424 -473 -175 192 -95 349 137 -76 -305 114 -161 -146 -200 -2 -376 -101 211 -128 -49 203
4340B03k84j37M79j15n21K35K49q8J69J24n21J32K87j10l26J36K5q6J58j31JL36
$$ 203 -81 -218 261 146 -375 -140 109 21 190 314 -207 -75 212 102 -224 -88 -63 -149 9 -122 -121 215
4362B15k27k24K24K13o62L49J73l3j96n5K57j6R4M4k15q7L16O0k49Nj7N3J50j39
$$ 215 -12 -236 -12 201 -461 -112 61 28 -168 -223 34 18 112 156 -59 -146 170 230 -19 -14 -31 22 172 33
4386C3qj60O5Q1j50N53m78J31k65QJ46J66j54k5L02m56J58P8K98l57J10j00J41
$$ 33 25 -135 -70 11 -139 414 -64 67 -198 -190 -44 122 -32 -57 245 -211 -53 25 323 -34 76 -24 117
4409A17n7n5k0J57k59qr3j3K09m6p2J3O0J88j49R8k9l34K79K0k65M05p7k34R3
$$ 117 60 5 -15 142 -117 -125 -218 -231 -22 -68 -140 -127 -67 121 -28 70 41 -293 -14 6 -259 146 69 -165 -72
4434g2J24L1k97J35M4J04M0j48K26J86m83L41l50J71Q5n2Q2k56m2J0J92j77m8
$$ -72 52 83 -214 -79 -35 69 109 -39 187 373 -110 231 -119 52 137 85 167 -89 -131 -121 71 -106 -154
4457a54L14k42j09O84o58k0L97k23J68k62m6J05J45j42M9n5N6O8j61Q2jR9r3O3
$$ -154 160 -82 -191 493 -165 -185 212 -11 157 -105 -151 -46 99 -43 6 -49 7 75 -86 -4 -5 94 1 64
4481F4j92K17J4m6k89K69r7j75L41Q8n45L99N9m3j11K8K75k93k3p0J07J64r3l2
$$ 64 -128 89 103 57 -232 37 -60 -235 106 194 -351 48 107 64 -47 -19 256 -37 -60 -130 -23 141 48 16
4505A6r2L66k91P6k30K27j0k85L16m75N00J56k51j65K47r0k84N4L03k54K59p6
$$ 16 -76 290 -1 75 -155 72 62 -223 93 -382 118 274 23 -142 105 15 -269 -215 88 -166 93 17
4527A7p5j6L22m66J00L58l07q6K57K83n76K18Q5j91k47L50L95o32M03r6l19J70
$$ 17 -58 -74 248 -218 -118 240 -67 -153 104 387 -189 29 114 -77 -324 26 421 -211 192 96 -223 -53
4549e3L4q7K40k14k55J39K51J81j81J23J83n51l3L47l09N0L25j79n4J71k99j6
$$ -53 -19 -106 134 -80 -335 -196 55 236 55 178 361 -190 -223 124 -185 -135 190 11 -43 128 -171 -187
4571a87N0K05j92M03j85m96L21K31k25j35M20k46K5J11Q7m88K20J57l28K37L47
$$ -187 -137 68 -124 279 94 -402 -81 150 -75 -210 210 -36 -11 100 187 -301 -81 76 -252 -15 332
4592C32l16n6K31K17o19N53j52o07L96L92m07k24J95J6K2L66r4o12N8O79p7l60
$$ 332 16 -40 191 408 -211 342 190 -417 -21 371 -36 -260 -65 -49 -27 339 245 -367 -309 370 293 -67
4614f7K00m29j80P99l26l54J98M55k83J8L43o20J14M88k35k63L21R9n38M03L95
$$ -67 133 -296 -476 323 -3 -357 -159 296 13 31 374 -246 -132 356 121 -142 179 278 -260 143 538
4635E38o64m6M47o80K88M86j33n66Q2M30j54k04M18p83j19J081l38k87J67R9j54
$$ 538 -126 -172 275 -405 -117 369 236 -330 -248 182 28 -176 242 -541 -660 421 83 -204 -37 62 -92
4656i2L94jn51J16J30k90M70K47l68o15N69L04o04M81q2j75OO15n52N2Jj87l6
$$ -92 302 301 -250 -134 -4 -294 176 423 55 -560 9 313 -291 190 108 -67 -61 554 2 54 55 -132 -168
4679a68L74J97q31J26J48N2Q9J71m54j35O67O5o17O57k46l80O0M24j25m64N75
$$ -168 206 403 -428 -302 -154 -102 -13 158 -296 -431 236 301 -316 341 95 -285 -225 199 74 -390 185
4700A85k94l0L98l46j13L04K25m94J14J00k06o3O46j1n12o7J37k60L55J83m90
$$ 185 -109 -139 259 -87 -200 104 329 -165 -51 49 -157 -220 426 415 -97 -164 -27 -287 68 251 -239
4721b39j9N10l02j10M47o53L1N05J96o48K00K69k47K9J98k91j74K28N6l4K74L22
$$ -239 -258 252 -50 -160 287 -366 -335 170 366 -282 -82 187 -60 -31 167 -124 -298 -70 -14 -48 226 548
4743E48p22J27K63j34l37M94m31L1M49k42j67J32Q1k20K86N5k10k2L69k07Jl6
$$ 548 -174 -47 216 82 -255 239 -192 -161 288 46 -121 11 92 -128 158 213 3 -19 350 143 144 108
4765A08j3n22P50k8k55j76L06j08p2M63m08l82Q5K35J11j89K28k17k37L97M8n04
$$ 108 95 -427 323 295 40 -136 170 62 -10 453 45 -337 -252 -17 94 -95 133 -84 -321 76 124 -380
4787c80L41k27J71J11K34n08M5N97m35J14P4j95K3K62p8k78M4O08p64K17K63l42
$$ -380 -39 -266 -95 16 250 -258 -213 384 -51 63 137 -58 -35 227 149 -129 -85 523 -241 -24 239 -103
4809a03J06j74J37p6J12K33k42k53M72k29j89L39J6k83L72j51j63M7J12j88p6
$$ -103 3 -171 -34 -110 2 235 -7 -260 212 -17 -206 133 149 -134 238 87 -76 -29 83 -105 -181
4830a81M30k49JJ32q0l5q4N3k85M19Lj36J00j25j80J88K06l45P7K75j88q3K7O2
$$ -181 249 0 1 133 53 18 -66 -13 -298 121 124 -12 88 -37 -217 -29 177 -168 -91 184 -4 -87 -60 2
4854BN9l2J45Rl81K91m4j09j77O23m16j07L14k01O6l3N3lJ16j05j0N1k17q8K83
$$ 2 61 29 174 183 -198 93 49 -60 -237 386 -30 -137 177 -24 42 9 62 59 175 70 60 111 -106 -194 89
4879H9k93J41Q4k1R9j40q5Q5O4r8K02k7k56j6n3qK35p5j97K91j8k45J77L26j74
$$ 89 -204 -63 21 0 99 -41 -126 -41 23 -75 127 100 -156 -172 -225 -233 2 -73 -270 21 3 -242 -65 261 87
4904H7L7j33J51k60O7J7ok0k07J29l5j9R7j31K87K8jM2l6k82L40l2p8Qn8j22J41
$$ 87 124 -9 142 -118 -51 -34 -40 -60 -267 -138 -173 -192 -95 -226 61 89 88 130 94 -188 152 120 42 50 -8 -130 11
4931A1K6k13K00M9N6j73k2J72j48j10N0R4p0K34j52k25J54j8O7k8j24n1L43k43
$$ 11 37 -176 24 73 129 -44 -66 106 -42 -152 -102 -8 -78 156 4 -221 -67 -85 -18 -46 -170 -221 122 -121
4955a21O4r3K37n5J11l30J75j52K38k45J14M8%L12m63R9j48K42p3K21l73K00j52
$$ -121 -57 -150 87 32 143 -187 -12 -164 74 -171 -57 -9 -9 303 -160 -61 -209 33 -40 181 -192 8 -144
4978a44QL01Kj35J13k51J01P7r0q7L5j50K64K00j97l3Q0n8j10J97j16o3Mj1J55
$$ -144 -136 165 167 32 145 -106 -5 72 -18 -105 -70 -220 44 244 47 14 94 36 -74 123 7 -56 -52 -63 92
5003I2J5m3m5ln9k8J8J99j13j45J90j73jL34k17j23J61k6J2j18L37k43k56L67
$$ 92 107 64 19 16 -43 -71 -53 146 33 -112 78 -95 -96 238 21 -102 59 33 45 -73 264 21 -235 132
5027A32j97mj9l8M1J10k46K15O6p0k00K10O9k1o7o4J8j10N9J36%k74L64%j37K0
$$ 132 -65 -69 -88 -126 -85 25 -221 -6 60 -10 -210 0 69 48 -19 -83 -65 -175 -116 20 20 -254 110 110 -27 -7
5053gk26Q0J46j56P4J7l9J07j2L65l13r8n3R8J03k93K85K8l9R2k63M0j50J71j42
$$ -7 -233 -153 -7 -163 -89 -72 -111 -4 -16 349 36 -62 -115 -17 86 -207 78 106 67 159 -104 -64 -214 -43 -185
$$ [...]
8191b55
##END NTUPLES=NMR FID
##END=
