##TITLE=1H_Pr Bzt-mat
 CDCl3
 8 sc, 
 11.05.2022
##JCAMPDX= 6.0         $$ Bruker NMR JCAMP-DX V2.0
##DATA TYPE= NMR FID
##DATA CLASS= NTUPLES
##ORIGIN= UXNMR, Bruker Analytische Messtechnik GmbH
##OWNER= root
$$ XWIN-NMR		Version 3.5
$$ Wed May 11 11:11:17 2022 Russian Standard Time (UT+4h)  she@DPX200
##.OBSERVE FREQUENCY= 200.1313499996
##.OBSERVE NUCLEUS= ^1H
##.DELAY= (6, 6)
##.ACQUISITION MODE= SIMULTANEOUS
##.ACQUISITION SCHEME= undefined
##.AVERAGES= 8
##.DIGITISER RES= 18
##SPECTROMETER/DATA SYSTEM= spect
##.PULSE SEQUENCE= zg30
##.SOLVENT NAME= CDCl3
##.SHIFT REFERENCE= (INTERNAL, CDCl3, 0, 15.7039)
##AUDIT TRAIL= $$ (NUMBER, WHEN, WHO, WHERE, WHAT)
$$ ##TITLE= Audit trail, XWIN-NMR		Version 3.5
$$ ##JCAMPDX= 5.01
$$ ##ORIGIN= Bruker BioSpin GmbH
$$ ##OWNER= she
$$ F:/spectra/data/she/nmr/H-F/1/audita.txt
$$ ##AUDIT TRAIL=  $$ (NUMBER, WHEN, WHO, WHERE, WHAT)
(   1,<2022-05-11 11:10:05.76 +0400>,<she>,<DPX200>,
      <created by zg, POWCHK disabled, PULCHK disabled
       configuration hash MD5:
       00 E9 B6 7A A2 85 ED C7 34 08 36 98 17 FE 4E 26
       data hash MD5: 16K
       68 23 02 B4 93 D2 43 84 B4 12 D2 51 08 61 C3 6E>)
$$ ##END=
$$ 
$$ hash MD5
$$ 60 61 98 C6 C4 A5 22 89 FB 0D FD A0 6F 44 C9 7F
##$RELAX= 
##$RELAX= 
##$RELAX= 
##$RELAX= 
##$RELAX= 
##$RELAX= 
$$ Bruker specific parameters
$$ --------------------------
##$DU= <F:/spectra>
##$EXPNO= 1
##$NAME= <H-F>
##$PROCNO= 1
##$TYPE= <nmr>
##$USER= <she>
##$AMP= (0..31)
100 100 100 100 100 100 100 100 100 100 100 100 100 100 100 100 100 100 
100 100 100 100 100 100 100 100 100 100 100 100 100 100 
##$AQSEQ= 0
##$AQ_mod= 1
##$AUNM= <au_zg>
##$AUTOPOS= <>
##$BF1= 200.13
##$BF2= 200.13
##$BF3= 200.13
##$BF4= 200.13
##$BF5= 200.13
##$BF6= 200.13
##$BF7= 200.13
##$BF8= 200.13
##$BYTORDA= 1
##$CFDGTYP= 0
##$CFRGTYP= 5
##$CHEMSTR= <none>
##$CNST= (0..31)
1 1 145 1 1 1 1 1 1 1 1 1 1 1 1 1 1 1 1 1 1 1 1 1 1 1 1 1 1 1 1 1 
##$CPDPRG= <>
##$CPDPRG1= <>
##$CPDPRG2= <>
##$CPDPRG3= <>
##$CPDPRG4= <mlev>
##$CPDPRG5= <mlev>
##$CPDPRG6= <mlev>
##$CPDPRG7= <mlev>
##$CPDPRG8= <mlev>
##$CPDPRGB= <>
##$CPDPRGT= <>
##$D= (0..31)
0 1.2 0 0 0 0 0 0 0 0.06 0 0.03 0 0 0 0 0.0002 0 0 0 0 0 0 0 0 0 0 0 0 
0 0 0 
##$DATE= 1652253005
##$DBL= (0..7)
120 120 120 120 120 120 120 120 
##$DBP= (0..7)
150 150 150 150 150 150 150 150 
##$DBP07= 0
##$DBPNAM0= <>
##$DBPNAM1= <>
##$DBPNAM2= <>
##$DBPNAM3= <>
##$DBPNAM4= <>
##$DBPNAM5= <>
##$DBPNAM6= <>
##$DBPNAM7= <>
##$DBPOAL= (0..7)
0.5 0.5 0.5 0.5 0.5 0.5 0.5 0.5 
##$DBPOFFS= (0..7)
0 0 0 0 0 0 0 0 
##$DE= 6
##$DECBNUC= <off>
##$DECIM= 32
##$DECNUC= <off>
##$DECSTAT= 4
##$DIGMOD= 1
##$DIGTYP= 9
##$DL= (0..7)
0 120 120 120 120 120 120 120 
##$DP= (0..7)
150 150 150 150 150 150 150 150 
##$DP07= 0
##$DPNAME0= <>
##$DPNAME1= <>
##$DPNAME2= <>
##$DPNAME3= <>
##$DPNAME4= <>
##$DPNAME5= <>
##$DPNAME6= <>
##$DPNAME7= <>
##$DPOAL= (0..7)
0.5 0.5 0.5 0.5 0.5 0.5 0.5 0.5 
##$DPOFFS= (0..7)
0 0 0 0 0 0 0 0 
##$DQDMODE= 0
##$DR= 18
##$DS= 0
##$DSLIST= <SSSSSSSSSSSSSSS>
$$ [...]
##$SUBNAM2= <"">
##$SUBNAM3= <"">
##$SUBNAM4= <"">
##$SUBNAM5= <"">
##$SUBNAM6= <"">
##$SUBNAM7= <"">
##$SUBNAM8= <"">
##$SUBNAM9= <"">
##$SW= 18.0517283424761
##$SWIBOX= (0..15)
0 0 2 0 0 0 0 0 0 0 0 0 0 0 0 0 
##$SW_h= 3612.71676300578
##$TD= 16384
##$TD0= 1
##$TE= 0
##$TE2= 300
##$TE3= 300
##$TEG= 300
##$TL= (0..7)
0 120 120 120 120 120 120 120 
##$TP= (0..7)
150 150 150 150 150 150 150 150 
##$TP07= 0
##$TPNAME0= <>
##$TPNAME1= <>
##$TPNAME2= <>
##$TPNAME3= <>
##$TPNAME4= <>
##$TPNAME5= <>
##$TPNAME6= <>
##$TPNAME7= <>
##$TPOAL= (0..7)
0.5 0.5 0.5 0.5 0.5 0.5 0.5 0.5 
##$TPOFFS= (0..7)
0 0 0 0 0 0 0 0 
##$TUNHIN= 0
##$TUNHOUT= 0
##$TUNXOUT= 0
##$USERA1= <user>
##$USERA2= <user>
##$USERA3= <user>
##$USERA4= <user>
##$USERA5= <user>
##$V9= 5
##$VALIST= <valist>
##$VCLIST= <CCCCCCCCCCCCCCC>
##$VD= 0
##$VDLIST= <DDDDDDDDDDDDDDD>
##$VPLIST= <PPPPPPPPPPPPPPP>
##$VTLIST= <TTTTTTTTTTTTTTT>
##$WBST= 1024
##$WBSW= 4
##$XGAIN= (0..3)
0 0 0 0 
##$XL= 0
##$YL= 0
##$YMAX_a= 379653
##$YMIN_a= -226615
##$ZGOPTNS= <>
##$ZL1= 120
##$ZL2= 120
##$ZL3= 120
##$ZL4= 120
##$ABSF1= 10
##$ABSF2= 0
##$ABSG= 5
##$ABSL= 3
##$ALPHA= 0
##$AQORDER= 0
##$ASSFAC= 0
##$ASSFACI= 0
##$ASSFACX= 0
##$ASSWID= 0
##$AUNMP= <proc_1d>
##$AZFE= 0.1
##$AZFW= 0.1
##$BCFW= 1
##$BC_mod= 2
##$BYTORDP= 1
##$COROFFS= 0
##$CY= 11.3945322036743
##$DATMOD= 1
##$DC= 2
##$DFILT= <>
##$DTYPP= 0
##$F1P= 2.36226072786647
##$F2P= -0.459571619588291
##$FCOR= 0.5
##$FTSIZE= 0
##$FT_mod= 4
##$GAMMA= 1
##$GB= 0.15
##$INTBC= 1
##$INTSCL= 1
##$ISEN= 128
##$LB= 0.24
##$LEV0= 0
##$LPBIN= 0
##$MAXI= 10000
##$MC2= 0
##$MEAN= 0
##$ME_mod= 0
##$MI= 1.114404
##$NCOEF= 0
##$NC_proc= 0
##$NLEV= 6
##$NOISF1= 3.799351
##$NOISF2= 2.8
##$NSP= 1
##$NTH_PI= 0
##$NZP= 0
##$OFFSET= 15.70392
##$PC= 1
##$PHC0= -18026.57
##$PHC1= 9.00075
##$PH_mod= 1
##$PKNL= yes
##$PPARMOD= 0
##$PSCAL= 0
##$PSIGN= 0
##$REVERSE= no
##$SF= 200.130013532006
##$SI= 16384
##$SIGF1= 3
##$SIGF2= 2
##$SINO= 400
##$SIOLD= 16384
##$SREGLST= <1H.CDCl3>
##$SSB= 0
##$STSI= 0
##$STSR= 0
##$SW_p= 3612.71676300578
##$SYMM= 0
##$S_DEV= 0
##$TDeff= 0
##$TDoff= 0
##$TI= <>
##$TILT= no
##$TM1= 0
##$TM2= 0
##$TOPLEV= 0
##$USERP1= <user>
##$USERP2= <user>
##$USERP3= <user>
##$USERP4= <user>
##$USERP5= <user>
##$WDW= 1
##$XDIM= 8192
##$YMAX_p= 0
##$YMIN_p= 0
$$ End of Bruker specific parameters
$$ ---------------------------------
##NTUPLES= NMR FID
##VAR_NAME=  TIME,          FID/REAL,        FID/IMAG
##SYMBOL=    X,             R,               I
##VAR_TYPE=  INDEPENDENT,   DEPENDENT,       DEPENDENT
##VAR_FORM=  AFFN,          ASDF,            ASDF
##VAR_DIM=   8192,          8192,            8192
##UNITS=     SECONDS,       ARBITRARY UNITS, ARBITRARY UNITS
##FACTOR=    0.0002768,     1,               1
##FIRST=     0,             0,               0
##LAST=      2.2672688,     0,               0
##MIN=       0,             -226615,         0
##MAX=       2.2672688,     379653,          0
$$ Real data points
##PAGE= N=1
##DATA TABLE= (X++(R..R)), XYDATA
0 0 0 0 0 0 0 0 0 0 0 0 -8 8 -8 8 -16 16 -23 25 -32 39 -47 55 -65 79 -91 105 -123 144 -167 191 -217 247
32 247 -280 316 -359 403 -451 508 -566 633 -703 781 -867 957 -1061 1172 -1292 1427 -1570
49 -1570 1730 -1905 2098 -2314 2553 -2820 3123 -3466 3861 -4323 4864 -5516 6316 -7327 8645
64 8645 -10451 13081 -17297 25158 -45001 211041 379653 274193 330586 54486 20568 -78041
76 -78041 -226615 -170581 -208782 -206341 -45141 -111271 -19510 55319 -48993 17411 2837 -88243
88 -88243 1800 -49577 -24948 77265 27868 109370 151658 58874 118646 60626 -26045 13319
100 13319 -61470 -61574 -8164 -61269 7560 22451 -37940 18403 -26450 -77176 -32149 -75629
112 -75629 -56048 -4749 -20946 45620 59287 26500 73210 24992 -22948 3168 -47361 -48294
124 -48294 -3524 -7004 49692 84227 81100 118407 75354 19526 5736 -85546 -134626 -126060 -162013
137 -162013 -122984 -61745 -34678 48946 82748 87829 127564 77592 43133 44671 -31979 -37072
149 -37072 -24111 -57922 -6289 10353 8708 66922 37798 32498 53673 -18080 -18070 -23627 -85219
162 -85219 -49850 -62428 -76612 -17433 -44339 -21356 27113 -15793 36400 57503 20961 86093
174 86093 68561 50264 92672 28207 26310 25322 -54381 -23893 -46636 -92094 -25938 -56982 -50861
187 -50861 9653 -36244 1663 14962 -35066 18776 -8917 -27871 38525 -4030 24974 76029
199 76029 28026 77662 71686 18838 54655 -8162 -38414 -13767 -85253 -59234 -38537 -76887
211 -76887 -6963 -7546 -16014 48379 8640 21007 47967 -13175 18418 9263 -35547 12155 -18140
224 -18140 -22130 23388 -15993 15812 34955 -5015 39927 21714 -6170 29232 -14570 -18645
236 -18645 -162 -45005 -18828 -18488 -42672 2206 -14423 -11049 27606 -2213 17801 30291 -2775
249 -2775 21698 8582 -9661 15645 -10321 -4902 13532 -12164 9276 10479 -9235 11673 -3411
262 -3411 -12211 679 -19500 -15232 -7270 -20107 -3207 -2191 -4091 13476 8860 11874 22132 11351
276 11351 13890 13952 470 2084 -2318 -10395 -7780 -10509 -11973 -6449 -6734 -5362 3 -1091 -582 4476
292 4476 -509 339 5027 -2378 4105 5755 -2338 6807 3858 -2075 8916 -1130 181 7904 -5996
307 -5996 5743 4803 -8493 7501 -4111 -11134 3349 -15612 -7624 2428 -14285 7569 5419
320 5419 -3039 19514 2018 2264 13281 -14138 -1015 -952 -20076 6404 -2866 -3480 20735 -380
334 -380 10229 17367 -11242 6946 -5192 -21577 5940 -14517 -5462 16600 -6424 16369 16532
347 16532 -7797 13792 -9313 -19149 1235 -24030 -6390 8717 -9587 21539 14564 1149
359 1149 22771 -8595 -11819 -2008 -30899 -6965 -2481 -9321 28049 18607 20047 39421 5096
372 5096 8770 626 -32982 -16172 -28937 -32226 -1205 -11493 5962 24876 3193 19921 7223
385 7223 -15695 -2077 -23124 -21150 677 -9568 17060 28223 19899 39742 21581 5125 5763
398 5763 -24172 -25617 -24697 -35824 -10565 -6116 -2366 21467 11128 11837 13564 -8033 -4396 -11886
412 -11886 -16456 982 -2107 8376 22502 11606 14712 6914 -12561 -15430 -28947 -28494 -17766
425 -17766 -13901 10845 26121 31083 44981 36354 22302 9690 -16880 -30045 -43087 -47692 -34403
438 -34403 -25761 -7013 14634 20715 31102 27871 18032 12503 -3896 -6305 -4664 -7525 7627 14080
452 14080 18186 24860 13679 6038 -8314 -30888 -34751 -46352 -47243 -27273 -18018 3995 28043
465 28043 35114 49768 43807 32515 29303 2448 -6044 -7214 -22957 -12146 -7556 -11147 862
478 862 -8283 -9600 -9403 -27067 -17668 -15019 -18929 7636 12040 20036 38559 27782 29756 21792 -3133
493 -3133 -1746 -21772 -32284 -15375 -23659 -8592 11762 9060 27546 23071 10064 13250 -14331
506 -14331 -22202 -19369 -37141 -19482 -7068 -6120 19296 18346 19628 27010 4981 6214 418 -19237
520 -19237 -4676 -9164 -11898 6367 -1234 6321 10216 -3964 6176 -5359 -16108 -650 -12516
533 -12516 -8422 7068 143 14418 16475 8949 17217 -1145 -6335 -3259 -23988 -16894 -11929 -18770
547 -18770 -1233 -500 2722 13892 4058 13557 15814 3495 18249 12354 5631 14662 1489 -1455
561 -1455 -4734 -19878 -15848 -24727 -30637 -16780 -21072 -12204 5441 6296 23136 28798 29526 38891 23499
576 23499 18786 16084 -6784 -9830 -15775 -26343 -21286 -25685 -20781 -14008 -17881 -2347 2987 1002
590 1002 17837 19183 18933 24255 16640 17481 10223 -357 4128 -8113 -11923 -3442 -14929 -12878 -9445
605 -9445 -13756 -7637 -9731 -5514 4326 -1474 8008 14409 5708 13756 12358 5944 8354 -1443 -262
620 -262 -4101 -14411 -6009 -9014 -12928 981 -623 3837 10235 4506 11325 2837 -3058 4665 -6779
635 -6779 -6670 1323 -6271 -173 1049 -2743 3405 -5367 -3263 2554 -9534 -578 3064 -2779 7496
650 7496 5039 3534 8865 -787 4539 1723 -10439 733 -5097 -8457 4613 -1391 5247 8490
664 8490 1420 8868 -1105 -7425 187 -12710 -10414 -2519 -8526 1624 2891 1243 12018 2118
678 2118 4598 9023 -4587 3062 3124 -5323 3331 -1527 -662 5213 -4420 2480 2235 -7777 2178 -4173
694 -4173 -6286 3220 -3014 3526 5553 -487 8413 980 -4520 2756 -8576 -6505 -1198 -9441 -124
709 -124 309 -875 9562 676 4631 8930 -2861 5005 1942 -4799 3605 -3150 -2423 2842 -4409
724 -4409 2856 2603 -4505 5043 -1745 -3686 2527 -7387 -1524 -900 -7851 2443 -1873 -1759 8327
739 8327 428 4789 7853 -750 5964 -286 -4581 1847 -7571 -4558 1100 -5706 4186 3838 525
754 525 8604 -275 -150 1825 -9538 -3200 -5352 -9348 1552 -2338 2309 9563 2594 8694 7382
769 7382 -261 5408 -2980 -4620 574 -7694 -1647 -207 -5390 1505 -2600 -4356 732 -7309 -1462
784 -1462 2117 -2643 8234 6985 5072 11984 2810 3728 2516 -7437 -2411 -6204 -8709 1855 -3024
799 -3024 3208 7850 811 6272 -177 -8388 -5272 -14159 -12465 -6065 -10289 2824 7234 8450 18652
814 18652 11693 9915 11167 -2947 -2283 -5322 -12263 -2708 -5584 -1543 7314 2163 7636 5789 -3584
829 -3584 -372 -8537 -13321 -6184 -11788 -4621 1123 -1234 9284 6879 4467 10310 3 2074 3254
844 3254 -4242 3925 2637 -226 8390 1956 1268 3780 -8303 -3470 -7215 -11560 -1457 -5801 -835
859 -835 7644 694 8104 5900 -1997 3070 -5591 -7397 -926 -7222 1636 6305 3461 14018 9120
874 9120 5704 9089 -4023 -4364 -5621 -14831 -7452 -8016 -7662 3660 -555 5267 9057 1207 6419
889 6419 1360 -4504 2319 -4327 -1932 3817 -1614 6168 5120 543 6794 -2021 -4452 -970 -10610
904 -10610 -5847 -5273 -9014 494 -2571 -800 6985 173 5714 7691 1562 8345 4275 2257 7135
919 7135 -1626 25 -1085 -10392 -4714 -8361 -11468 -3449 -6890 -1444 4006 465 9201 6998 3942
934 3942 10358 2509 1501 3619 -4508 -1318 -4215 -8170 -2117 -8511 -5955 -177 -6580 935 3701
949 3701 1235 9496 6761 8341 11701 3281 6565 2765 -6539 -2175 -8647 -11716 -5898 -10125 -4634
964 -4634 -1904 -4594 4064 707 -407 7537 1019 4955 8441 3769 9602 5512 2668 5946 -5050
979 -5050 -4299 -3546 -12488 -6560 -6343 -7169 1311 -882 4781 9180 2901 9425 6487 -1196 4092 -2735
995 -2735 -4454 -758 -6043 -301 -1456 -5420 1607 -5592 -7484 -864 -7370 -2016 3159 2096 11888
1010 11888 9729 10268 15049 3448 3685 1479 -9879 -6159 -9169 -11314 -3940 -6864 -458 4066 -1458
1025 -1458 6015 2218 -4764 196 -7715 -8147 -3709 -6608 3090 5752 5807 16321 10606 8755 11734
1040 11734 425 732 -1927 -8186 -2846 -8452 -7573 -2187 -10260 -5434 -3532 -9396 -1705 -2032 -1004
1055 -1004 6424 3351 9281 11322 4802 11450 6053 -254 3799 -4275 -4941 -3438 -7833 -1167 -2390
1070 -2390 -3148 4798 -2521 -2347 348 -8678 -5480 -5258 -6317 2504 1489 7095 13248 7138 11899 9122
1086 9122 -151 1976 -4980 -8379 -5597 -10771 -4055 -1351 -2654 8009 5684 4418 8816 494 -1173
1101 -1173 -3866 -11246 -7255 -11493 -10238 -1009 -3931 2846 9057 5655 11751 10589 8037 11370 4159
1116 4159 4971 4223 -5663 -2295 -5686 -11533 -6279 -9476 -7730 -3089 -6066 471 -601 -3695 3857
1131 3857 -1535 -2099 3204 -1662 2270 3871 2152 9569 6481 8397 13917 6430 8017 6707 -3206
1146 -3206 -2748 -9773 -13870 -11458 -17181 -11399 -6469 -9027 1546 3084 2134 9117 5193 6490 6847
1161 6847 251 5150 851 -2370 4997 311 2041 7756 3275 7109 5065 -265 2481 -7394 -9380
1176 -9380 -7268 -16259 -11802 -8906 -11031 -1921 -894 3606 10559 7040 12587 12510 4720 8404 2811
1191 2811 -2520 564 -5209 -2752 -518 -3831 3636 1479 -1387 4124 -3263 -4151 -3564 -10505 -6853
1206 -6853 -8602 -9639 -2225 -4770 551 8285 5705 12330 14105 10404 13895 7049 4329 3531 -6445
1221 -6445 -5038 -7538 -13138 -7451 -9684 -8735 -2302 -4227 1083 3182 -282 5263 1180 -1196 2948
1236 2948 -2916 -735 2070 -464 6725 6097 6774 12257 6190 6265 6014 -3037 -2310 -7386 -12047 -8182
1252 -8182 -12554 -9372 -4009 -6301 1495 2822 1375 7549 2512 2657 4233 -2151 1490 749 -2157
1267 -2157 4504 2464 3943 8839 4317 7770 6761 503 2653 -3868 -7502 -5909 -13192 -11038 -9416
1282 -9416 -12006 -4375 -3130 -952 7196 4636 9315 11471 6031 9460 5264 646 2755 -2913 -1949
1297 -1949 286 -4419 1145 569 -1597 3412 -1833 -2593 -1170 -7843 -5132 -6327 -9328 -2659 -4339
1312 -4339 -1463 4867 2442 8037 8532 5253 9567 4897 2780 3966 -3184 -2075 -2290 -7093 -2440
1327 -2440 -4579 -5357 86 -3751 -643 2215 -1967 2398 7 -2390 2114 -3168 -1618 1158 -2693
1342 -2693 3204 3532 2853 8550 4487 5687 6920 -174 695 -2616 -8020 -4740 -8904 -8072 -2579 -5150
1358 -5150 858 2582 613 7337 2403 1134 3950 -2725 -48 160 -3879 2076 1677 1704 6398 1578
1374 1578 3770 3883 -1528 687 -2682 -5763 -1774 -6801 -4321 -2100 -4937 -89 -820 -2485 3039
1389 3039 -217 1503 4629 854 5697 4393 1502 5716 895 125 2247 -3143 -149 -1194 -3774
1404 -3774 1151 -2197 -1245 2358 -3024 -302 -1409 -5021 -1137 -4646 -3325 1408 -1692 3292 5040
1419 5040 3032 6634 4198 578 2673 -2442 -2832 -1924 -5379 -834 -475 -1377 3834 1286 1773 3063
1435 3063 -1297 666 -801 -3582 485 -3004 -1650 2125 -1615 1371 1089 -2070 980 -2020 -1755
1450 -1755 786 -3550 999 2242 -945 4092 2069 386 2881 -1480 197 -479 -3815 724 -1369
1465 -1369 -2075 2911 -683 852 2354 -1302 1921 -947 -2659 1208 -3562 -1289 1997 -1760 1802
1480 1802 1614 -397 2528 -1476 -620 1256 -3738 1075 891 -2180 2989 393 51 2664 -1439 1532
1496 1532 436 -2765 2402 -1093 -2019 1889 -1854 8 620 -1845 1741 -1942 -2125 1991 -2561 -192
1512 -192 2757 -592 3207 2119 811 3162 -2017 -375 160 -5303 -432 -651 -2896 1426 -368 744
1528 744 2219 -1321 2730 757 -2093 2186 -1348 -2041 1671 -1793 1142 2214 -123 4632 975
1543 975 1316 3474 -3597 -804 -1278 -4435 -2161 -3604 -2856 -533 -3069 50 2263 -1724 3914 3263
1559 3263 1171 5017 1346 2755 2157 -1696 1658 -644 -2710 1890 -1334 -954 1184 -2325 -102
1574 -102 -2048 -3359 307 -4101 -2951 400 -4037 -1022 584 -973 3116 2209 4004 6305 1775
1589 1775 4453 3261 -1899 1221 -1332 -3148 -388 -2963 -708 -594 -2457 1676 -857 -2078 1897
1604 1897 -2138 -1651 -204 -3360 -631 -1751 -1665 3089 97 2665 5725 1409 4256 3543 441 2211
1620 2211 -1527 -1228 -229 -4573 -1280 -1772 -4589 382 -1515 -1227 2336 -398 2102 1782 -1145 2471
1636 2471 -864 -1912 1976 -1535 679 2507 -207 2950 1061 232 3029 -1165 224 721 -3788
1651 -3788 -1109 -2672 -4063 -1092 -3256 -736 1641 -765 3731 3089 723 4025 337 -148 1485
1666 1485 -2096 663 -435 -1965 1679 -1222 -469 2565 -1168 770 845 -2459 133 -3205 -3508 -971
1682 -971 -4425 -1109 870 -1337 3192 2449 2224 4894 1686 3088 2998 -1043 2000 -264 -2947 510
1698 510 -2514 -2153 -635 -3048 424 -1223 -2355 1425 -2123 -1109 1117 -2169 657 610 -884 2465
1714 2465 164 1111 3341 -112 2825 2306 -588 2522 -98 -975 522 -3315 -1285 -897 -3536 786
1730 786 -973 -1384 2111 -936 432 1359 -1347 1418 -798 -1642 1614 -1804 -226 1891 -803 2173
1746 2173 1435 321 2980 -111 576 1724 -2790 -60 -1060 -2900 403 -1739 -786 1340 -1393 1380
1762 1380 1111 -954 2656 -71 -306 1994 -1344 119 302 -1908 1259 -933 -1262 1335 -1863 -69
1778 -69 754 -1719 1440 -144 -761 2251 -920 674 1771 -1752 1678 496 -1021 2263 -799 242
1794 242 1410 -1810 1171 -93 -2175 794 -1836 -1031 752 -2303 532 282 -1313 1933 -361 -2
1810 -2 2017 -1577 978 919 -1611 1806 -462 -717 1897 -1319 890 1297 -1411 1700 -115 -660 1868
1827 1868 -1192 -73 985 -2133 509 -1005 -2002 1104 -1787 -510 910 -2018 1600 870 -540
1842 -540 2449 -354 339 1929 -1483 955 163 -1828 1121 -1165 -956 1238 -2183 645 684 -1571
1858 -1571 1735 -292 -723 1766 -1054 574 1153 -1818 1303 -355 -1236 1451 -2216 -652 454 -2640
1874 -2640 628 -936 -1673 1257 -1093 191 2183 -634 2355 1988 579 3047 375 902 1817 -1930
1890 -1930 208 -869 -3120 92 -2517 -1550 244 -1961 541 799 -836 2261 -137 -720 1815 -1612
1906 -1612 189 457 -1652 1702 -58 -231 2856 -216 1398 2352 -791 1685 -283 -1344 873 -2319
1922 -2319 -825 419 -2754 489 -570 -2052 1318 -1097 60 1769 -916 1971 753 -1060 1815
1937 1815 -534 -561 1455 -1660 469 456 -1263 1260 -542 -389 1670 -1560 565 553 -1609 944 -349
1954 -349 -1084 1311 -1190 709 1455 -989 1536 -195 -1618 1331 -1827 -498 303 -1617 1396 460
1970 460 -577 3055 -10 558 1875 -1551 388 -913 -2665 -479 -2717 -1128 1075 -1580 1618
1985 1618 1946 243 3561 1151 1858 2819 -1420 572 618 -2927 181 -1782 -2738 -505 -2858 -1337
2001 -1337 -630 -1892 1282 -194 -298 2899 -780 1037 2092 -485 2157 994 448 1789 -1221 304
2017 304 1414 -2352 291 201 -1969 881 -1704 -1017 -364 -3270 307 -152 -1970 2071 -92 74 2370
2034 2370 -1155 1260 377 -1290 2063 -933 -187 2393 -1159 -147 1229 -711 1287 276 155 1867
2050 1867 -2474 -340 648 -2790 95 -132 -1785 1031 -1066 311 588 -1734 1241 405 -1323 2074
2066 2074 105 -487 1550 -513 1439 811 -433 2479 -699 -260 1729 -1901 -528 -634 -2033 88
2082 88 -1437 -72 2201 -1200 1290 2330 -757 1517 628 -511 1267 -752 507 128 -3324 273
2098 273 -1111 -2607 969 -1001 349 1662 225 2607 803 332 3473 167 541 2725 -1278 -243
2114 -243 -826 -1575 -519 -2687 -1433 418 -1997 904 1068 -1035 1952 1229 491 2638 -263 2283
2130 2283 755 -2300 938 -1507 -2809 -404 -2606 -714 274 -1821 1845 592 317 2812 19
2145 19 1576 2716 -78 1165 -315 -1512 67 -2646 -1332 268 -3024 -103 524 -1358 1046 -537
2161 -537 14 1339 -987 1424 970 -1122 2153 -76 -1065 1140 -1310 336 401 -1517 914 -1025
2177 -1025 -909 1555 -221 1127 2228 153 2227 887 -249 1170 -1739 -1209 -84 -3220 -421
2192 -421 -1224 -1970 719 -1362 320 1567 -684 1991 1247 -442 2578 -604 -170 1085 -1586 290
2208 290 245 -798 2240 206 608 3139 -359 1097 894 -1995 -216 -2388 -3357 -1512 -4494 -2186
2224 -2186 -1002 -2367 1464 995 1084 4040 1801 3310 3409 619 2732 679 -948 998 -1723 -1362
2240 -1362 -514 -3203 -750 -1384 -2559 71 -2422 -1050 248 -1846 821 945 -136 2693 1468 1670
2256 1670 3475 490 2097 1529 -1257 678 -1703 -2466 -971 -3332 -1262 -229 -1633 1676 723 722
2272 722 2857 343 1146 1320 -1608 -58 -1480 -2255 104 -1904 -502 1503 -282 2787 2114 1413
2288 1413 3354 585 474 845 -2721 -1104 -2094 -3984 -1084 -2669 -1939 333 -940 1463 1390 478 2971
2305 2971 1002 732 2371 -331 1151 1418 -319 1932 472 432 1895 -942 -332 -449 -3487 -1222
2321 -1222 -3099 -4270 -1633 -3589 -1624 703 -757 3092 2718 2238 5048 2494 2910 2719 -511 1400
2337 1400 -219 -2694 -75 -2009 -1658 232 -1975 192 389 -1224 1146 -1025 -1255 -309 -2626 -1330
2353 -1330 -771 -2350 740 46 493 3307 1081 2767 3373 851 2705 863 -628 766 -2212 -1387
2369 -1387 -602 -2650 326 -875 -1389 1074 -1505 -1007 -227 -2498 -404 -956 -2008 749 -467 987
2385 987 3130 1542 3864 3637 1908 3458 546 -493 -179 -3268 -2371 -2877 -4507 -1696 -2782 -2279
2401 -2279 821 -550 1499 2225 865 2868 1372 661 2142 -347 341 931 -1333 1178 229 -406
2417 -406 1566 -927 201 952 -1900 -383 -1643 -3140 -1162 -2771 -1658 158 -1194 1619 2072 783
2433 783 3736 1616 1726 2726 -175 812 75 -1950 82 -1547 -1479 625 -1318 375 544 -1264 469
2450 469 -1116 -1735 -78 -2298 -930 130 -1524 1157 768 421 2544 1010 1805 2265 83 1840
2466 1840 302 -1117 1013 -1200 -1230 113 -2170 77 -223 -1539 598 -1298 -1106 484 -1718 -274
2482 -274 72 -1332 811 -219 16 2079 103 1764 2050 229 2595 915 212 915 -1705 -652
2498 -652 -1043 -2782 -306 -1351 -1521 1048 -378 404 1514 -215 1318 278 -560 1041 -1477 -1055
2514 -1055 362 -1937 326 590 113 2070 639 990 1642 -895 361 437 -1540 619 -835 -1350 250
2531 250 -1622 30 163 -1206 1351 324 -134 1714 -14 428 1042 -779 1139 -137 -559 1206
2547 1206 -1441 -597 166 -2145 131 -431 -997 940 -586 803 1436 -911 1106 825 -640 1051
2563 1051 6 -65 696 -1141 699 -198 -966 1539 -299 -131 1362 -588 452 408 -758 420 -1079
2580 -1079 -995 725 -1975 -602 -364 -1824 176 -96 102 2300 549 2171 2555 -127 2027 650
2596 650 -959 516 -1495 -1387 -901 -2735 -849 -1843 -2321 672 -704 -281 2229 968 2456 2096 1440
2613 1440 2707 256 177 998 -2625 -1436 -2057 -3985 -2432 -3037 -2012 229 -370 2289 3289 2044
2629 2044 4399 3076 1973 2880 547 314 -301 -2589 -1625 -3073 -3968 -2411 -3646 -2620 -522 -1122
2645 -1122 1614 1348 1916 4056 2176 2712 3767 562 1479 250 -1486 -1040 -2702 -1998 -1309 -2336 -317
2662 -317 28 -1109 1383 629 397 1647 275 1545 1183 132 1931 43 -624 684 -1854 -1733 -1082
2679 -1082 -2601 -1096 -1210 -846 1700 400 1821 3160 1147 2541 1620 -208 171 -2120 -1744 -1446
2695 -1446 -2971 -502 -295 -872 1180 192 292 1115 -77 847 363 -663 1097 -58 -278 872 -710
2712 -710 -71 145 -1164 663 -831 -424 1170 -343 1035 1331 -175 669 -516 -1639 -602 -2333
2728 -2333 -1510 -429 -1323 1236 1595 1449 3207 1518 1626 1314 -1309 -19 -1319 -2400 -806 -2319
2744 -2319 -1293 -104 -1221 46 -15 -1432 -67 -890 -894 794 -23 1976 2755 1609 3583 2004 1265
2761 1265 1526 -1576 -1472 -2162 -3308 -1784 -2382 -1733 380 -484 467 1377 -182 1521 533 -162 1698
2778 1698 -315 408 1264 -245 1105 369 -864 401 -1496 -1518 -122 -1099 570 1052 565 2027 1009
2795 1009 1121 1444 -1341 -891 -1456 -2616 -875 -1644 -832 795 165 1430 1912 74 1334 -300 -438
2812 -438 344 -878 144 568 8 2092 1384 463 1628 -750 -1260 -862 -2562 -1204 -1105 -1469 888 163
2830 163 813 2173 750 2025 1516 -98 308 -894 -864 225 -1212 328 146 -995 581 -885 -941
2847 -941 167 -1371 -326 268 -760 938 408 332 1430 -45 449 122 -1369 -69 -614 -874 1021
2864 1021 -140 702 1240 -280 474 107 -680 31 -1523 -489 81 -1080 499 1174 -170 1753 374
2881 374 308 489 -1265 -624 -380 -1277 1191 791 703 1698 378 1183 978 -241 133 -766 -1289 -393 -1998
2900 -1998 -19 -56 -1435 832 58 -346 1238 -319 74 541 -502 1252 812 121 1416 202 -44
2917 -44 957 -1199 520 68 -1409 81 -678 67 1045 -1061 169 388 -850 921 -385 -778 863
2934 863 -688 619 44 -109 1859 103 -153 980 -291 -437 -84 -939 501 -377 -61 1557 106
2951 106 1012 1383 -366 1158 473 -397 -210 -1410 47 495 -1716 141 -520 -462 1119 -543 -296 623
2969 623 -626 198 607 -719 1216 -220 -57 1027 -1075 -450 -431 -1673 73 -1042 -890 934 -624
2986 -624 1004 1614 -133 1881 375 -273 684 -632 -466 -38 -1814 -230 -828 -1104 -102 -1586 -785
3003 -785 -351 -1031 954 760 818 2905 1254 1913 2102 -43 680 -661 -1942 -1091 -2779 -2453 -758 -2211
3021 -2211 -564 446 -122 1871 1061 1206 1671 -56 1449 1151 -236 1070 115 -477 -113 -1723 -1760
3038 -1760 -1400 -2776 -860 -1106 -928 1610 1439 2146 2408 1133 2196 1122 -548 510 -1563 -1364 -909
3055 -909 -2048 5 296 -531 1112 -132 171 545 -1525 -259 -33 -1153 914 312 318 1700 324
3072 324 824 188 -1261 -172 -994 -993 945 -341 675 1783 631 1415 -234 -597 174 -1847 -1369 -581
3090 -581 -1977 -44 963 563 2043 665 913 919 -795 -287 -1242 -2020 -423 -843 -350 1049 72 818
3108 818 506 -559 586 -744 -246 1696 588 2130 2909 1293 2569 611 -513 -768 -3427 -3514 -3398
3125 -3398 -4653 -2449 -1398 -344 2045 2181 3526 3923 2378 2704 1142 -246 619 -976 -687 -60
3141 -60 -1190 -367 -1628 -2477 -1598 -3783 -2370 -532 -1354 1032 1911 2680 4276 3296 3001 2669 -261 -520
3159 -520 -1589 -3932 -2461 -3105 -2512 -730 -845 850 986 -224 1703 430 152 1529 381 1017 1796
3176 1796 1248 2253 1078 162 467 -2109 -2405 -2163 -3437 -1930 -827 -391 1827 1363 2201 3097 991
3193 991 1663 540 -1648 -688 -1989 -1392 -289 -915 887 901 254 1272 -93 -595 145 -1084 -432 -260
3211 -260 -317 1373 913 913 2151 -316 203 -74 -1560 -521 -1090 -1154 439 -444 434 894 -336 600 -232
3230 -232 -1474 -380 -1463 -1176 -29 -417 1374 1494 779 2513 1018 263 868 -1395 -503 -948 -1739
3247 -1739 -180 -958 -830 592 -651 288 140 -885 -169 -681 -281 717 -427 793 1516 292 1471
3264 1471 700 -612 288 -1374 -1126 -446 -1798 104 -100 -65 1505 553 834 1167 6 849 -313 -721
3282 -721 424 -796 -368 496 -694 435 466 -995 698 -790 -749 404 -801 178 926 -572 1708
3299 1708 1027 899 1361 -1 43 570 -865 492 -522 -964 534 -441 435 1001 -538 423 -68 -270
3317 -270 490 -254 256 262 -1191 954 692 -40 1075 -57 469 888 -878 767 67 -637 814 -61
3335 -61 -69 517 -692 32 95 -684 415 -434 -751 534 -506 473 603 -430 876 -291 -169 436 -782
3354 -782 222 480 -476 733 215 -243 571 -422 220 207 -831 -240 -561 -822 511 -446 409 914 5
3373 5 988 764 -279 1040 -106 -342 570 -1024 -10 -7 -823 584 -400 -374 346 -1070 122 -90 -887
3392 -887 479 -349 -381 527 -590 338 574 -623 658 266 62 1233 462 654 963 -176 424 -357
3410 -357 -1124 -106 -1557 -1003 -385 -1253 240 303 -65 1221 -187 -85 441 -1078 37 0 -661 901
3428 901 299 954 1587 507 916 385 -790 119 -1334 -1293 -296 -1276 -306 499 -296 905 285 -284 364
3447 364 -1025 -259 42 -783 634 669 297 1450 333 681 570 -844 75 -490 -1176 399 -497 -197
3465 -197 580 -519 563 7 -1200 17 -1086 -887 416 -266 1176 1545 1088 2204 615 40 137
3482 137 -1911 -1724 -1677 -2268 -615 -321 248 1449 835 1460 1725 22 22 -196 -1514 -401 -1192 -266 372
3501 372 -398 1060 440 -262 583 -1077 -886 -134 -756 495 852 1234 2120 993 927 1019 -1094 -1305 -1506
3520 -1506 -2551 -1539 -1800 -1281 313 -526 1261 1693 584 1738 833 651 1190 506 1071 1240 154
3537 154 1092 262 -926 -701 -2752 -2891 -2337 -2829 -1399 -577 15 2530 2216 2866 3020 1297 1385 274
3555 274 -1052 -742 -1431 -1224 -328 -1171 154 336 -448 753 -415 -598 -119 -661 129 54 -231 1430 792
3574 792 507 1665 81 -6 -460 -1340 -1018 -1571 -900 338 -502 805 1457 355 883 307 -322 24 -894
3593 -894 -398 319 -845 764 880 34 900 311 -69 -218 -918 377 -520 -527 693 -159 325 686 -10
3612 -10 371 -33 -407 84 -519 -405 937 98 857 1069 478 613 -167 -1093 -426 -1679 -869 -1078 -1396 215
3632 215 -35 108 1228 991 1471 1805 607 1226 348 -510 244 -936 -1262 -605 -1658 -1243 -1084 -1536 -395
3651 -395 -819 -228 974 379 1280 1884 1257 1846 864 677 736 -819 96 -314 -1597 -160 -1309 -1601 -592
3670 -592 -1158 -609 43 -415 701 752 545 1485 528 721 1065 -64 332 -316 -801 45 -864 -663 97 -828
3690 -828 59 126 -168 506 300 212 668 -190 665 321 -79 677 -164 -671 135 -542 -215 -301 -871 -34 -130
3711 -130 -370 690 -315 -16 537 -533 442 179 -66 804 -228 546 657 -450 363 149 -382 478
3729 478 -402 -23 491 -675 85 187 -356 271 -306 -70 403 -803 -445 490 -493 -120 -9 272 852
3748 852 -244 318 214 -420 309 -57 -1101 304 -457 212 930 29 1252 267 -296 337 697 245 66
3767 66 -632 62 -478 -327 944 -614 275 349 -161 248 -175 18 1044 227 -35 567 -466 671 356
3786 356 -87 498 55 -434 176 -694 -240 567 -399 441 -411 27 455 -71 -223 626 -196 714 -602 -407
3806 -407 431 144 237 -219 -383 583 1270 -1237 578 -916 790 428 -689 137 -366 -659 -412 -398 -145
3825 -145 750 -349 262 170 -1042 -30 258 -13 1029 -505 -103 1056 -279 13 -374 -741 -515 -874
3843 -874 -638 -7 -465 452 257 271 1410 530 751 1217 58 147 -273 -317 616 -697 -136 136 113 589
3863 589 98 328 182 -121 -598 -126 -1067 372 444 -312 940 760 723 956 -388 -450 78 -752 15 -407
3883 -407 -384 354 603 297 -30 176 -122 -154 -533 -99 -710 581 474 -489 955 153 -834 673 -853
3902 -853 -471 379 -862 -241 66 -109 1022 779 198 1035 -472 -49 -418 -716 64 -732 79 309 -169
3921 -169 658 -21 16 412 -142 -269 184 -486 277 -398 -77 691 891 -14 416 -1106 -39 -609 -1091 -265
3941 -265 -723 -541 931 -516 114 -17 464 38 622 -99 1474 -59 -63 49 556 849 93 494 -383
3960 -383 -473 -989 -485 -222 171 229 -445 12 -258 733 -329 -64 -229 -363 -296 -190 -169 -299 767 383 530
3981 530 335 40 460 -434 -735 480 -1155 263 244 -1336 345 1030 97 844 411 277 742 303 563
4000 563 -896 -844 76 -1030 -179 -39 -1007 -294 -69 -255 237 -720 1056 -269 340 -294 674 -84 380
4019 380 -243 -228 422 -204 -186 -1313 -406 312 -439 -216 176 -343 -471 566 -154 1475 1106 392 1376 945
4039 945 791 515 20 69 -1110 -570 -24 -754 -211 354 14 350 901 -169 715 366 471 389 -580 1103
4059 1103 701 -922 147 36 -796 -355 -1498 -538 11 -1364 542 298 693 1648 1268 527 1441 477
4077 477 279 -208 503 532 -888 -453 -549 248 99 585 -1419 -408 -1011 460 -441 -279 -212 354 258 568
4097 568 712 -249 804 -551 675 150 49 -349 -810 321 1153 301 1054 161 -299 1 -73 -908 97
4116 97 -350 -100 290 -222 1667 759 61 648 -373 -626 409 -262 -173 -171 -911 -64 -18 30 638 12 -473
4137 -473 -1249 -577 -252 -570 -16 468 314 1444 1183 648 651 747 -2 -154 -1278 -85 -656 -659 1053 -562
4157 -562 830 674 103 -257 1280 153 -379 479 -366 211 82 142 -272 -172 -271 1314 -394 -237 229
4176 229 95 258 -907 1238 790 95 1118 -388 172 762 -108 709 -84 -545 549 -142 -595 635
4194 635 92 225 468 -370 446 -156 68 333 -228 604 851 64 1168 340 -472 124 -375 -213 158 611
4214 611 128 195 -81 1122 -123 -187 226 -541 -48 -420 -364 313 -68 170 37 -149 -157 -151 -1115 780 -100
4235 -100 -825 -339 -404 -664 -134 -55 437 -238 366 445 -26 16 377 -412 358 -695 17 150 -363 141 -413
4256 -413 -813 304 -172 -408 284 -640 -136 304 363 527 132 -114 624 -328 140 189 -461 -119 20 -460
4276 -460 538 238 1 811 -13 85 348 -363 282 -441 -253 555 -445 -212 569 -664 327 71 -30 118
4296 118 -184 274 184 -363 62 179 -143 566 243 596 238 -291 411 -245 -485 441 -435 -183 332 -163
4316 -163 315 148 116 273 -9 172 38 -247 -265 423 79 509 -50 -22 140 -417 253 -309 -764 381 247
4337 247 135 646 -385 1027 246 -527 -61 -218 -201 -16 -1221 123 233 490 136 189 -47 1192 -428
4356 -428 515 414 -276 759 -212 -633 618 558 140 399 -403 -632 -254 -272 -106 -741 536 598 212 880
4376 880 186 116 303 -534 -766 70 251 -495 -396 -1263 806 -229 473 390 -295 421 -21 -251 911 -177
4396 -177 -418 465 680 84 470 142 126 -240 98 151 -84 387 -68 -411 -101 -539 -461 666 469 -852
4416 -852 -877 -941 -22 663 -242 -73 -1164 -116 -678 -966 -743 -78 -495 40 40 38 177 160 417 843 666 183
4438 183 -189 -24 -88 -54 366 351 243 592 -108 -21 328 -211 -251 49 -411 543 -10 -104 910 -114 367
4459 367 796 -87 484 -43 -573 132 -572 -496 180 -160 478 191 -114 152 -141 -192 207 -322 37 261 -1
4480 -1 401 203 -52 246 -416 -281 138 -627 2 -239 -170 157 -125 268 347 221 424 -142 -318 383 -191
4501 -191 -90 263 -31 177 -17 51 519 -197 -77 -151 -448 -88 20 -46 631 220 401 557 58 206 225
4522 225 -395 223 -2 -293 166 -365 -110 145 -248 134 -206 -54 150 -118 -63 437 -292 235 315 286 -20
4543 -20 -272 536 337 -199 16 -30 -174 519 26 360 602 -392 -214 -384 -778 155 -547 5 420 -32 -306
4564 -306 -59 236 3 -70 -418 662 608 -310 -57 -616 227 -324 -397 433 -354 18 -183 -244 242 -453 60
4585 60 492 -3 -412 466 287 400 -107 181 -349 -93 296 733 -92 564 -41 -118 240 -82 152 256 -178
4606 -178 90 -82 -178 415 -107 -98 94 -637 -149 -192 -514 95 -392 -215 215 -106 378 448 339 433 -28 88
4628 88 301 -341 -127 81 -56 154 -47 -257 162 -427 -22 100 -253 365 -196 -75 380 4 265 423
4648 423 -88 130 190 -41 429 -75 -154 122 -466 70 -103 -481 344 186 -154 39 -180 357 540 -207 154
4669 154 124 -163 180 -518 -346 153 -165 148 117 -300 808 2 -230 -207 -153 313 -484 69 111 135 -456 -657
4691 -657 544 -25 422 72 314 -517 428 109 -356 838 979 -1043 376 -253 -329 461 -75 -85 -100 294
4711 294 -36 237 -135 39 15 150 341 -473 384 -367 -679 715 -146 1226 -621 221 810 -314 653
4730 653 -94 303 256 26 -1130 -375 765 -1481 765 190 264 -30 56 403 83 310 159 -737 72 -298
4750 -298 259 696 46 778 810 382 -270 -353 -279 641 -30 -606 -62 -45 559 -142 21 -786 221 7 -67
4771 -67 460 -177 428 152 -560 650 180 -651 29 345 155 758 111 105 -743 328 456 -43 1077 -732
4791 -732 -951 354 -556 242 343 -267 482 59 179 674 217 -171 509 69 -23 -520 -481 -270 -363 -485 -242
4812 -242 -423 -780 -154 -399 9 363 -315 1030 -312 175 -1041 281 244 605 171 19 -397 -110 -152
4831 -152 -1235 377 -93 214 -201 24 -74 -442 -923 546 197 -121 459 -628 292 679 607 -385 -656
4850 -656 339 193 -231 204 -300 -320 543 -548 -508 1389 -481 161 407 29 -154 1021 -133 88 704
4869 704 -240 73 730 -375 -759 -731 -280 -43 -842 890 -1092 290 -372 204 711 209 -803 1003
4887 1003 359 143 611 -435 -228 743 -284 -563 342 619 408 347 40 6 -370 800 -411 -100 695
4906 695 237 738 -508 -261 594 11 28 -382 -677 67 168 -545 485 -285 274 646 115 -15 -66 378
4926 378 -95 626 -362 -117 -186 339 -426 133 -60 67 -281 237 -125 136 392 47 -109 559 -563 637
4946 637 -46 85 527 96 328 184 -469 367 122 -83 -127 -175 -49 -251 143 -47 -145 -336 35 -59 376
4967 376 168 -129 -9 -70 -123 -184 -743 -152 -183 -266 16 -161 364 373 -135 323 312 -114 287 -180 -236 139 -216
4990 -216 82 194 -117 76 288 -187 500 -295 -141 -36 -181 129 -142 -170 284 -42 64 66 -308 90 -18
5011 -18 -209 85 -7 -17 138 87 192 98 229 268 -206 264 188 -48 22 -85 -66 34 -83 49 306 -139 227
5034 227 -159 -447 257 -20 -24 476 -39 343 135 -282 92 -335 -234 128 93 -8 254 52 322 293 354 413
5056 413 -307 168 141 -184 -171 -187 -476 -368 -299 -229 450 75 80 69 -430 89 95 31 33 510 92 132 -147 -2 -100
5081 -100 -293 -190 -190 -313 95 -240 -3 -141 20 350 -213 208 203 -51 141 257 -34 -5 212 96 132 8
5103 8 -7 -231 -175 7 -110 -173 32 8 101 319 -18 379 -87 306 162 -313 62 196 -189 247 77 -142
5125 -142 312 -433 -81 -161 -90 7 -168 -121 145 -169 13 244 -101 172 198 -77 -78 -216 -7 -35 -331 157 -104
5148 -104 -202 26 -80 -144 296 40 227 260 34 449 22 31 -5 -605 126 -214 -517 -252 -174 78 291 45
5170 45 288 93 17 525 39 3 -43 166 -130 109 -101 214 -202 -371 273 -304 -83 -54 -330 121 -55 -378
5192 -378 176 -217 -127 228 -177 263 30 34 97 -337 -120 106 58 264 80 -94 477 152 308 553 32 -270
5214 -270 9 -316 -39 -207 -206 382 -113 51 65 -536 213 -21 -61 123 -76 250 401 -76 365 82 -236
5235 -236 13 -269 -125 -174 -219 203 9 23 498 99 189 244 16 -110 -335 -196 -135 -138 -28 149 48 24 67
5258 67 -136 65 -29 -5 343 -150 -10 327 53 385 107 -248 253 -408 -323 -426 -46 64 -75 145 841
5279 841 194 -311 206 626 33 -835 111 492 -340 209 387 -475 441 248 -224 207 -107 232 178 -212
5299 -212 209 -315 127 366 138 179 165 -334 100 -22 -414 125 -313 154 337 -182 322 104 -968 201
5319 201 -43 101 444 158 211 0 140 324 163 -291 557 52 -186 -265 129 110 635 -212 381 247 501
5340 501 534 -188 -661 361 -294 1036 192 -454 -253 -285 59 432 97 -141 -178 -312 401 9 47 328 -400
5361 -400 -131 338 79 150 192 546 3 142 319 -640 -116 107 -646 -729 66 521 1004 98 -52 156 41
5382 41 308 237 -1322 213 -444 -174 494 -445 182 244 295 -391 -277 158 380 778 86 140 -148 -226 893
5403 893 22 197 218 -597 250 -118 -499 -184 -634 200 -309 105 366 124 -88 121 574 38 366 524
5423 524 528 125 -84 -131 -556 801 235 -1237 -157 -20 -620 111 -93 347 -63 763 697 507 -538 -135
5443 -135 -617 52 19 -779 722 -543 -646 338 701 -186 -35 881 -204 -557 89 -671 -337 -424 -41 -856
5463 -856 -174 125 767 -765 58 737 447 896 296 -5 -33 586 80 1316 412 340 -950 148 150 353
5483 353 254 310 58 -557 -225 1505 77 206 271 154 -538 -228 -951 -360 -884 41 -251 -139 493 57
5503 57 -872 82 -539 -352 232 31 -276 -245 683 111 863 854 -687 574 -255 -280 -176 754 -191 -619 491
5524 491 -921 304 427 982 427 -490 -289 -409 -957 616 -716 -413 -284 -816 822 -89 249 -326
5542 -326 -122 -601 634 -900 44 243 -69 655 707 84 -182 172 554 223 -660 1 571 145 -155 -215
5562 -215 -301 694 -239 550 -74 -172 592 264 556 163 -542 157 -1161 -1002 60 -175 209 -187 -98 387
5582 387 -885 -549 -152 9 430 19 -155 99 -228 613 -73 -350 -94 137 305 124 -146 839 4 342
5602 342 -131 290 -292 237 364 -87 539 -81 -307 381 566 -202 306 -141 106 18 62 764 19 151 8
5623 8 -198 402 412 -215 776 -128 -226 200 -359 293 -615 328 -173 -735 283 476 209 123 81 325 -17 -312
5645 -312 -547 162 -253 -197 -310 85 102 621 -413 37 405 -243 381 9 260 276 -103 681 204 -154 314
5666 314 9 -160 283 -114 -157 -112 -180 325 381 358 179 -37 790 385 -91 167 -97 -206 -147 -362 -184 41
5688 41 -298 161 -551 271 -24 150 391 364 -283 1009 71 105 11 -472 -217 -457 -1106 -525 -263 -474 142
5709 142 -445 313 -161 138 -49 208 93 120 190 175 160 76 -381 -415 -216 538 221 471 294 -282 471 134
5731 134 96 111 274 107 351 435 165 507 352 354 -309 474 -87 -181 332 370 134 478 818 -513 519 177
5753 177 97 -47 -323 286 -399 441 19 -144 -466 -432 177 595 227 48 -51 -280 162 -225 -540 -3 13
5774 13 275 253 -218 295 368 -388 44 -441 -24 117 -79 -31 281 448 91 343 -320 417 -351 321 -142
5795 -142 110 618 160 -269 681 -785 56 -156 536 -10 10 -689 -353 125 -479 451 -195 -219 194 137 2
5816 2 -411 -396 842 -422 241 -106 39 341 -83 -292 144 140 248 48 -445 623 453 -310 79 510 -302
5837 -302 -276 202 361 -652 -718 200 -479 -166 -283 219 -191 -488 674 -395 -438 288 191 374 -183 -196 530
5858 530 -649 32 9 -562 683 -262 54 -2 57 -201 390 734 379 -152 420 11 927 -126 -228 -690
5878 -690 -280 191 -287 -468 366 -418 623 628 -77 -676 -349 -518 -235 1086 -224 -487 -202 20 -49 -107
5898 -107 21 285 -99 253 -398 -315 -17 -376 -389 180 241 252 492 -212 212 236 230 34 -61 -401 -210 350 -248
5921 -248 -102 -171 456 -197 -388 -89 -48 -93 -335 -415 -171 350 -278 674 192 693 512 264 307 -709 -602
5942 -602 213 159 -247 -473 408 142 127 565 -676 -159 -99 -224 613 562 782 -44 252 347 967 697 376
5963 376 520 478 402 6 -522 -183 382 -133 176 238 -291 624 430 -66 73 -484 169 785 456 82 -461
5984 -461 -186 102 -45 -253 22 -19 114 -191 46 612 242 518 280 161 383 -22 554 -268 -318 74 -56
6005 -56 419 433 -296 -428 -12 -568 -222 -729 -238 -276 -125 17 96 -314 176 410 231 339 177 -60 -6 -213
6027 -213 -58 -220 -232 -121 -301 5 -30 41 48 39 -80 267 9 9 -90 -83 301 -118 -355 13 307 -228 38 -252
6051 -252 98 85 164 87 -11 -233 264 -132 68 198 -639 60 -203 57 -149 -382 -333 -1 96 147 74 -28 -18
6074 -18 212 -167 324 113 -322 -110 -145 116 -144 -176 158 -302 -290 16 -34 99 191 35 175 200 -78 424
6096 424 237 30 0 -344 -229 -277 -460 -322 -381 58 -18 -346 163 -323 23 612 246 218 75 5 147 27
6118 27 -107 393 -372 -305 -196 -316 -30 -43 -68 295 -245 11 118 207 246 180 -23 223 173 51 179 -376 214
6141 214 -242 -97 99 -190 119 243 -148 290 -44 572 313 -111 60 -14 -442 -128 -77 -204 17 144 -22
6162 -22 6 220 97 96 178 -254 -204 -125 3 30 -5 -1 -72 202 -99 -159 189 200 -47 231 268 223 -37 18 128 -78
6188 -78 -105 -158 -419 -171 -176 -95 -125 -120 167 336 106 318 6 -19 115 -152 -138 83 -458 -222 -153 -123 -295 -60
6212 -60 -136 188 -24 10 170 175 88 393 369 316 74 132 31 -346 -51 -366 -558 -563 -264 -448 -4 262 251 101
6236 101 -39 283 -61 307 118 188 367 273 10 32 -154 -287 -175 -661 -200 -270 -265 -260 -99 175 328 -11 255
6259 255 590 -333 62 23 -129 -124 -39 -349 -255 26 95 96 283 -54 121 -53 71 566 476 541 -41 67 -480
6282 -480 390 154 419 122 127 -221 -353 -412 -195 79 -156 162 149 57 17 82 71 120 -7 -479 544 256 651
6305 651 -93 122 41 -85 253 -531 276 -274 -584 719 6 409 -441 100 -289 390 538 -94 673 99
6325 99 -385 -383 36 -348 50 -192 138 13 -47 159 570 211 -145 173 460 -537 -46 356 359 170 176 170 -295
6348 -295 38 -240 -314 -440 265 58 -116 -75 352 -279 56 -54 -72 290 -636 11 415 -135 226 -311 179
6369 179 248 -266 -321 232 310 254 170 -302 27 101 541 -93 -1042 336 -653 -544 -97 -713 -78 -355 369 113
6391 113 204 537 -231 117 484 152 -395 993 229 557 -180 -562 217 242 -44 -538 265 433 1033 176
6411 176 74 475 -147 -422 -123 208 535 451 189 720 473 131 -221 -99 -618 212 -289 167 -408 434
6431 434 3 760 498 -43 476 299 453 433 -127 -234 -108 -237 71 -70 97 -305 510 27 448 435 514
6452 514 -197 79 -151 486 132 -85 159 -1149 194 440 170 506 -590 -272 19 14 556 -185 -556 670
6472 670 -204 -113 -10 -650 349 524 36 -191 80 1083 241 -105 85 330 -634 438 170 -150 -197 -132
6492 -132 -336 -53 107 -232 -17 701 -169 481 531 -239 53 342 -2 406 409 -140 88 265 58 835 526
6513 526 -163 445 129 1 205 862 376 -299 -40 124 -57 -383 -792 364 239 -14 -6 151 384 425 548
6534 548 279 579 -364 171 -417 -113 588 581 -541 -507 266 -29 -74 -354 418 190 -743 332 546 -38 71
6555 71 517 210 421 -367 116 -463 164 320 405 -86 67 -71 -636 -298 -86 123 386 292 45 -372 481
6576 481 -487 -67 930 -323 -260 53 394 -44 147 -473 -96 226 -280 -99 -77 -115 709 18 232 129 295
6597 295 254 27 90 -26 -438 220 -97 -232 25 -48 -223 -569 -299 -111 -226 -30 197 -6 34 208 183 357
6619 357 81 -95 -37 -427 -233 -55 -549 -424 -220 -307 -57 -44 86 235 -18 256 130 114 430 -7 -53 220
6641 220 -276 -169 99 -420 -26 -96 -392 -222 -135 95 385 115 -50 198 -43 196 78 -58 50 -122 74
6662 74 90 14 210 -394 -68 249 -124 167 -302 -49 232 -235 -86 -64 -77 40 214 95 -1 -137 190 246
6684 246 149 -90 -130 -239 459 7 91 73 -28 -339 4 -139 -129 -179 -293 297 -320 -12 147 97 284 60
6706 60 -17 16 -82 -93 -39 -309 -42 -121 -368 -143 -144 -312 199 -44 -9 183 -1 82 119 -67 344 -107 6 34
6730 34 -295 -225 -61 -137 79 -266 -173 155 -62 234 79 -63 198 -124 82 84 23 207 -71 -218 -59 -102 -16
6753 -16 -74 -170 -18 21 -294 343 -99 -124 510 -200 51 68 282 -336 -362 -398 323 -362 -95 -62 333 -129 -20
6776 -20 132 -3 -126 -167 67 133 -128 -35 -146 -122 297 141 115 120 -265 -2 141 -51 -233 -204 140 87 304
6799 304 232 -64 318 -169 -109 -38 -190 73 69 -229 131 -399 -90 -119 -98 39 160 -123 131 -379 76 102 -198
6822 -198 78 237 -58 198 36 -370 -15 -115 46 -43 -129 156 157 -74 273 -144 -60 240 -44 296 82 -55
6844 -55 -1 -28 -295 285 -203 -19 136 -137 -43 -128 -36 123 -191 -76 396 -147 254 148 -141 232 -207 -157
6866 -157 6 -259 20 -21 -158 64 42 134 192 180 -53 -176 -410 64 -173 -165 122 -307 118 116 114 140 -80 -157
6890 -157 258 45 212 -29 -162 193 115 -121 172 92 111 79 -79 175 -137 -254 21 -170 172 113 -26 246
6912 246 -143 -218 61 -272 -10 14 35 37 -283 176 278 -36 -245 461 -226 190 -179 -201 112 -109 -21 151
6934 151 -58 114 8 89 155 -146 -10 148 -279 35 -82 0 238 45 -16 121 -42 29 105 -75 -4 45 97
6957 97 22 97 -63 90 -23 130 -227 -159 465 -214 85 144 -110 183 117 51 22 -255 -307 66 -169 -212 -67
6980 -67 62 -59 -153 137 25 -175 24 66 -137 36 106 282 26 7 -207 119 -216 -19 82 91 231 50
7002 50 93 -18 -141 93 -223 -30 -67 -190 -214 63 -176 290 51 207 119 -147 68 122 -76 -103 -157 -131 227
7025 227 -205 13 59 161 230 389 33 267 -138 -207 481 -170 129 58 -49 -4 -244 75 -236 -151 -9 -145
7047 -145 -241 123 209 39 83 -102 219 194 -6 -15 -43 63 -80 111 103 193 -34 -57 -22 112 78 -251 -335 -11 -80
7072 -80 222 -167 -248 219 -17 114 13 -116 277 -11 -64 197 -153 237 399 -106 49 -62 -381 -224 56
7093 56 -58 -168 -242 146 5 156 215 105 189 -6 -205 -93 0 -213 55 -148 -161 -100 -164 -43 37 -157 77
7116 77 -197 8 96 140 -43 53 10 167 68 -101 -17 -156 -121 -49 -230 -228 103 -133 -58 262 144 1 -87 64
7140 64 238 -28 288 -70 165 164 16 -54 -7 -373 225 114 -357 -205 -326 247 226 43 187 -102 300 333
7162 333 10 -167 297 -250 -71 -137 -184 251 33 -115 -4 -2 102 77 -284 -56 45 -120 -35 -6 335 274 -40
7185 -40 65 57 228 -200 -220 -70 -182 -127 66 33 -203 61 12 -81 76 -189 -51 -47 -64 159 -38 181 88 83 -104
7210 -104 -110 98 273 -75 -198 116 -291 -95 -161 -145 154 -47 82 149 -118 12 -96 -104 58 300 0 -125
7232 -125 132 -200 -132 -128 -90 -250 -159 115 -37 171 -20 20 308 163 0 26 68 -312 32 -12 -85 176 -6
7255 -6 -97 -44 -151 89 -126 -335 -74 -314 -44 38 132 209 10 -45 8 1 152 127 26 126 -388 99 15 -164
7279 -164 236 -68 106 -63 -184 -50 -49 55 160 -29 165 37 -135 -114 150 -189 107 33 -55 142 -288 -48
7301 -48 176 -145 -115 66 42 32 -134 -57 145 -294 233 -9 32 147 -33 -48 235 169 -180 253 -181 48 343
7324 343 -322 136 -33 -103 218 -68 274 -35 -89 -72 -180 -63 -137 19 -27 66 79 83 202 -304 -90 -295 -124
7347 -124 -34 -209 -140 3 -3 -94 69 -204 -1 -38 86 -35 135 -135 -149 127 203 151 -29 -102 -81 -92 -364 59
7371 59 118 -168 91 -56 56 149 3 31 273 -112 -10 193 -71 114 -139 -368 36 -181 176 45 39 103
7393 103 -77 -150 11 -63 108 240 227 96 -122 -141 99 12 -87 -26 -229 4 -32 49 161 6 -31 195 21
7416 21 211 72 -113 293 82 -46 365 -43 102 -195 -307 -66 -437 -106 8 -189 79 -193 185 48
7436 48 147 105 598 288 -171 245 392 258 99 -694 174 -623 21 -207 -13 189 -204 740 -333 -155 326
7457 326 -315 -904 -213 187 -423 -49 -508 -612 564 -1064 258 -237 -95 814 712 53 178 166 1433
7476 1433 501 -146 784 -82 -671 -725 -336 -766 610 -329 -100 -50 508 -245 -353 361 -59 392 -211 -709
7496 -709 -334 -113 170 870 664 -691 -329 -416 91 273 -147 -191 415 -354 -566 520 471 -612 -128 231
7516 231 102 423 -140 435 426 104 207 -302 380 -127 -142 529 -163 -273 318 546 58 -304 513 293 -645
7537 -645 -209 673 202 230 1180 89 105 594 507 -75 0 -753 -103 -383 -438 -106 459 461 -41 371 226 -383
7559 -383 112 -41 127 -26 -73 38 30 239 90 125 244 -47 -303 141 -359 -101 -26 -67 -93 155 -132 251
7581 251 69 26 74 201 158 67 97 -86 -38 -128 341 -126 98 -59 90 196 -61 -251 -112 93 -45 382
7603 382 147 0 84 -248 -94 -17 -224 -31 -134 158 295 -6 181 -148 -18 -27 -144 -193 -90 157 4 -111
7625 -111 268 -56 -33 -273 277 -246 -30 91 -184 -43 -21 22 132 200 67 82 83 211 112 64 218 -449 193
7648 193 -128 -91 -54 -299 -2 113 -160 -6 78 317 114 -81 -48 191 -267 67 64 -285 40 292 51 341
7670 341 132 70 -134 -203 27 -159 -98 -85 -363 -125 77 -97 178 -70 80 634 -460 193 666 -12 -615
7691 -615 266 53 154 137 -177 133 -229 373 339 -449 -429 -175 -3 -20 -190 345 241 -91 176 -198 512
7712 512 -13 -129 134 -319 -170 208 -357 -545 36 -436 266 30 -836 -257 95 -32 128 190 -136 -626
7732 -626 -77 -165 340 -134 -141 -413 -127 -640 114 72 360 -130 -57 -127 -753 -78 419 -17 19 -335 121 26 -545
7755 -545 440 -66 -278 -427 -153 379 235 88 298 -4 -298 -495 -617 243 -207 367 -143 -611 -517 497
7775 497 305 -565 55 -217 356 -87 -112 21 -372 216 -831 83 -33 309 26 -489 -368 -45 26 302
7795 302 19 101 150 288 -109 -256 -311 321 777 468 78 -268 -396 276 138 31 -219 -542 -692 66 55
7816 55 -287 -70 -98 -32 247 -298 814 372 -423 -105 -430 245 -274 -69 544 258 -200 -252 -385 197 -402
7837 -402 -134 -247 157 29 -322 130 -169 -294 276 -309 29 132 419 -59 482 650 -336 -384 139 -286
7857 -286 -313 594 -17 -237 -380 487 131 -324 -77 36 -636 -644 -113 -85 -622 -173 -358 -314 49 585 8 -103
7879 -103 -8 172 232 -206 -7 3 -61 29 -9 -197 326 216 172 200 -19 -178 79 -36 203 230 8 -123 -184
7902 -184 102 -34 -16 239 133 -258 250 -226 84 194 -43 246 92 74 -110 147 169 516 11 85 271
7923 271 -134 8 56 63 398 -57 88 -14 -152 47 -88 -39 156 37 131 -20 -67 -1 -94 -32 217 -151 23
7946 23 206 -149 -128 -85 -171 80 -126 -127 -71 -174 332 168 -72 97 -139 39 120 170 -104 -59 -29 60 -272 94
7970 94 158 -160 39 86 -107 74 -31 -6 -100 73 -32 -75 39 136 243 -190 -27 -159 8 39 -138 204 296
7993 296 -20 137 -87 119 183 -64 2 -236 11 -71 -216 151 161 101 276 138 53 182 -92 -107 8 5 170
8016 170 230 -65 265 -98 -116 129 -198 -122 33 -114 39 371 -11 -57 -25 165 178 -180 188 -262 -140 -152
8038 -152 -236 27 33 -260 182 -4 -124 -74 35 -124 -168 -86 -107 -43 -196 215 28 35 232 -37 -151 124 216 81
8062 81 0 377 -79 -96 98 -19 -188 -6 23 -373 49 -443 -164 -109 -41 16 193 -162 172 123 -114 150 -3
8085 -3 -156 -88 -121 43 217 -50 57 -198 -52 144 -66 -42 14 -216 51 6 -114 -99 -121 -185 49 12 44 -100
8109 -100 -126 -175 18 80 87 251 194 52 -36 123 -109 -20 -192 -215 92 -90 -40 38 55 303 -63 -152 -245 15 -284
8134 -284 -49 14 115 -63 -12 -81 -163 202 -66 -32 56 88 -151 239 -43 198 169 -230 -63 -41 -85 212 -143
8157 -143 -6 127 199 75 247 -12 138 -21 207 -61 63 -19 -128 -50 -215 -286 -83 2 -131 123 -83 -116
8179 -116 109 -70 -153 54 -84 -11 -103 -28 -32 261 -111 17
8191A7
$$ Imaginary data points
##PAGE= N=2
##DATA TABLE= (X++(I..I)), XYDATA
0 0 0 0 0 0 0 0 0 0 0 0 0 0 0 -1 8 -8 8 -8 8 -16 16 -17 24 -25 32 -37 42 -49 57 -65 76 -85 98 -110 126 -142
36 -142 159 -179 200 -224 250 -277 307 -340 377 -416 459 -506 557 -615 678 -746 821 -906 1001
55 1001 -1109 1228 -1364 1523 -1709 1931 -2202 2538 -2970 3548 -4370 5638 -7885 13110 -52696
70 -52696 16284 130336 240477 338635 270539 307259 210013 57688 55028 -60467 -134630 -56497
82 -56497 -112835 -58103 6886 -47760 21831 -15047 -98232 -28064 -117458 -129827 -31537 -89017
94 -89017 -7488 65503 19708 120340 87072 34557 106937 -2774 -10839 47932 -54363 15033
106 15033 41180 -21955 69912 10608 -25881 33785 -89372 -67713 -25725 -118598 -14778 7750
118 7750 -27177 81893 24029 13910 51883 -73815 -36243 -36128 -117996 4402 6641 11497
130 11497 143520 99719 126046 155743 36467 54037 -16365 -128145 -74062 -149985 -154911 -50966
142 -50966 -88070 -2795 65031 24732 104247 65404 10499 54532 -41253 -45194 -2190 -67190
154 -67190 3406 31689 5670 87676 55261 41007 83332 2132 9533 15956 -58778 -22171
166 -22171 -41810 -79573 -31998 -71228 -62656 -22733 -61930 -11000 13818 -6805 60119 58953
178 58953 52340 95182 58598 54537 53473 -1053 7957 -14443 -47604 -16470 -35454 -37286 -2730
191 -2730 -25267 -18475 -12284 -41304 -32150 -39824 -49943 -19331 -17148 1477 43123 45231 63104
204 63104 79144 57720 53134 36467 236 -7924 -31697 -49997 -38732 -46347 -37686 -10441 -12179
217 -12179 3915 20957 6673 18001 11966 -9164 3468 -14485 -24181 -2608 -21465 -11192
229 -11192 10336 -6130 19100 25864 11527 38992 20546 11913 28763 -9787 -5390 -970 -38311
242 -38311 -14030 -19945 -35827 1191 -15721 -8940 19239 -10625 13461 19198 -13282 21238 1359
255 1359 -13221 21576 -11345 1121 23893 -10538 20785 15442 -11305 23879 -7210 -14620 11378
268 11378 -32656 -11492 -2667 -36648 5118 -7192 -16978 24864 -5283 8697 32199 -7378
280 -7378 24264 16327 -11899 22931 -8258 -11776 15000 -24043 -2251 7410 -24350 11874 -4239
293 -4239 -16187 17454 -15661 -3321 12541 -21254 8472 5612 -15381 18822 -4561 -5909 19138
306 19138 -12615 7203 12719 -11573 17479 3143 -6469 18065 -11666 -3828 6613 -21931 -695
319 -695 -4296 -16580 10783 -3652 627 18255 -4117 8712 6454 -13697 2108 -10372 -15183
332 -15183 5039 -9162 2721 13568 1272 15540 7037 -2735 5038 -11091 -9834 -3105 -11280
345 -11280 1332 6434 4234 16081 9135 4962 3496 -8305 -10716 -12952 -15174 -6591 -2652 5058
359 5058 13265 11471 11960 6073 -2843 -11238 -20180 -20185 -21001 -12167 1879 9405 23908 29878 25774 25753
375 25753 10361 -1762 -8965 -24792 -20927 -16937 -16758 4293 7229 10781 19986 3956 -121 -6961
389 -6961 -27590 -20130 -23678 -22384 3497 5068 21559 36815 23471 31904 17527 -5606 59
402 59 -23268 -27491 -11619 -21853 -2708 9304 1289 21167 5682 -3207 5261 -20987 -15836 -4357
416 -4357 -15602 10584 17118 14137 32685 11332 3469 321 -34834 -26778 -29787 -39162 -5357 788
430 788 17023 47515 36677 45260 38878 4732 5933 -22237 -42207 -27569 -42235 -26257 -3615
443 -3615 -7138 17958 18248 6696 19618 -5251 -10575 -774 -18057 2397 16442 15586 41239 33243
457 33243 26614 26854 -8889 -18599 -31401 -59352 -44239 -42649 -35045 -3761 2224 22071 35292
470 35292 24824 34779 23474 4733 13939 -2586 -3002 7872 -2245 7843 6070 -5583 -388
483 -388 -20425 -29130 -23545 -36969 -23690 -7987 -2458 20774 26142 29660 34192 14271 7991 -4010
497 -4010 -24905 -19864 -22557 -18358 704 5655 19974 25953 18157 21084 5703 -9366 -10976 -26406
511 -26406 -26643 -19527 -17783 -2354 3836 11671 22268 12187 12230 8961 -6271 -4931 -9314 -9864 -441
526 -441 -687 9695 12533 3121 9644 -1014 -12949 -7188 -15325 -11007 -4269 -1875 11923 11383 12904
541 12904 22228 8350 5602 6132 -10536 -8617 -13424 -17793 -10089 -16563 -8647 -281 -8078 5796
555 5796 8089 1717 14667 11509 14532 22758 13818 21355 14663 -699 2928 -15024 -27923 -23609
569 -23609 -35694 -28463 -20467 -18469 2691 5107 12954 31468 21439 26521 32519 16634 17988 6680
583 6680 -4953 -4562 -22412 -21185 -17794 -30438 -16886 -12364 -17070 -1034 -1017 4741 13654 6509 21063
598 21063 19464 8697 20876 8030 -773 6067 -7113 -5985 -6106 -14137 -3748 -12109 -15477 -2326
612 -2326 -15081 -7862 3865 -2224 9507 11130 9041 16622 3356 4954 6588 -12417 -4536 -5703
626 -5703 -13362 -2117 -5260 -1538 6044 -1194 8954 7611 -3188 8862 1080 -4917 2645 -4478
640 -4478 472 1042 -3676 6127 -2549 -5785 3251 -9826 -7402 -493 -7013 2483 2219 3266 12142
655 12142 295 4799 5563 -7674 -1506 -2954 -8062 1906 -1530 4054 8621 1033 10257 6125 -2689
670 -2689 3584 -5283 -9147 -4729 -12149 -4510 -3366 -4763 6752 430 2245 8827 -1366 1190 2730
685 2730 -3992 3266 -1346 240 7476 -2114 2930 3637 -6630 -67 -3887 -6422 1158 -4123 2046
700 2046 5398 -413 8953 3853 -2285 4718 -2979 -4550 -2434 -9439 -2191 -5301 -5633 3193 -2375
715 -2375 2101 7477 -932 4959 2280 -2818 4534 -3322 -440 3787 -5330 2953 3014 -2267 5561 -11
731 -11 157 4057 -5220 -259 -963 -9637 -658 -5970 -5816 3444 -3252 3827 6661 495 9179 2002
747 2002 -1801 3846 -6842 -3099 226 -6866 2713 1764 -260 9121 733 3749 5078 -6652 -1504
762 -1504 -5985 -12255 -2157 -7857 -3228 4965 -1118 8325 7801 1127 9060 1594 -1136 3979 -5103
777 -5103 106 1069 -5338 2941 -3486 -6356 -131 -10331 -5696 -2648 -9238 2953 2834 1891 12898
792 12898 4315 7001 7245 -3544 922 -3597 -8546 1812 -3914 1972 9872 3069 10296 6300 -2912
807 -2912 8 -11546 -14442 -10253 -17837 -7525 -1857 -2077 12217 9811 10479 14926 2631 3251 434
822 434 -9510 -992 -3461 -3949 7284 2276 8394 11169 1249 5625 -1925 -8783 -4466 -12913 -9590
837 -9590 -4032 -7557 2273 1623 -117 7378 -218 893 3282 -4121 3106 2301 1113 9512 4905 5893
853 5893 8054 -1478 188 -3977 -10331 -3561 -8094 -5417 3362 -1384 5733 6159 -774 3481 -4451
868 -4451 -8454 -4554 -10992 -4226 440 -639 10697 9309 8720 13916 3616 2873 127 -9433 -5551
883 -5551 -9170 -9858 -980 -5016 864 5639 -1057 5183 1591 -3569 1414 -5286 -2810 1528 -2949
898 -2949 6227 6122 2629 10033 2747 986 2936 -6567 -3050 -5219 -10205 -2221 -7295 -5593 1147
913 1147 -5481 1008 3058 -791 8094 4271 5314 11499 2835 6578 6195 -3662 828 -5442 -9412
928 -9412 -4488 -11377 -6098 -2227 -6696 4075 3561 1896 10476 4091 5316 7918 -340 5002 563
943 563 -4625 1970 -6616 -7292 -2390 -11080 -5560 -3472 -5508 4437 1984 6102 13419 5744 10996 10490
959 10490 797 5429 -887 -4958 -1475 -9385 -5218 -4254 -10583 -1748 -4600 -6819 1739 -3470 296
974 296 4702 621 9471 7269 4881 12313 3227 1045 2478 -7942 -5949 -8076 -10907 -2984 -6696
989 -6696 -960 6430 -346 6680 7112 435 5448 1056 50 3431 -2636 2815 1881 -4825 1678 -3937
1005 -3937 -8724 -4603 -10933 -8326 -5682 -6780 3911 4139 6696 16529 9942 10406 10341 -322 -497 -5740
1021 -5740 -8724 -3101 -7123 -931 4742 -517 5330 3398 -3135 -1058 -8310 -9162 -7391 -12667 -3698
1036 -3698 -2017 -2763 8517 6655 8073 13655 7688 9831 6377 671 4957 -2780 -3760 1338 -6403
1051 -6403 -3841 -3466 -9628 -5824 -9774 -8867 -2638 -6172 2427 7840 3821 11875 9274 4508 7174
1066 7174 -301 58 441 -4749 2871 630 -1453 6215 -252 -786 652 -7332 -5180 -8606 -11628 -4194
1082 -4194 -7620 -1938 7378 3712 11165 12808 6470 8843 149 -3609 -2821 -11208 -5130 -2660 -5369
1097 -5369 5384 5322 5241 10566 3961 5336 1979 -6571 -2778 -9711 -13734 -7096 -12582 -8250 -1663 -3073
1113 -3073 5645 6368 6836 13811 6600 8184 11285 1930 5263 3613 -2618 519 -5381 -5107 -2756 -9272
1129 -9272 -2620 -2012 -6673 993 -3168 -5305 -1974 -7937 -4769 -4160 -6099 3633 2714 4888 14569 10278
1145 10278 13036 14734 7967 9584 2111 -3098 -1518 -12213 -11138 -8676 -14563 -6851 -5172 -4927 2538
1160 2538 -528 2655 4476 -2667 2520 254 -4395 2251 -328 1440 6668 4379 10814 10231 6749
1175 6749 12388 4480 -7 619 -9440 -10260 -11644 -15977 -9807 -10863 -6833 1921 -1091 5451 8936
1190 8936 3980 8633 5399 1989 4165 -2222 761 1990 -2715 4799 4049 2339 8239 2986 2332
1205 2332 1770 -6309 -4632 -9618 -13912 -8450 -12685 -9560 -2605 -3824 3638 6799 7307 14486 10475
1220 10475 10977 13306 4179 4981 1732 -5525 -2840 -7594 -7859 -3820 -7602 -2035 -63 -3587 2624
1235 2624 -934 -3393 -165 -6097 -4379 -2810 -6150 1641 1294 3040 11504 8156 11098 13168 6255
1250 6255 7825 2102 -3772 -1906 -9494 -8833 -5712 -10233 -3884 -2424 -3760 3156 -303 -14 2523
1265 2523 -4049 -967 -1724 -5777 626 -1566 109 7032 4375 9735 11587 7286 11551 5749 1760
1280 1760 3166 -6539 -7222 -8229 -13931 -9007 -10848 -9790 -1722 -4665 1320 5927 2496 7607 6025
1295 6025 2157 5693 126 225 2377 -2376 3325 3324 1394 6671 2272 1936 3407 -4044 -2683 -4784
1311 -4784 -10194 -5590 -8818 -7777 -1720 -4507 1654 4082 2408 8706 5382 4873 7797 1890 3184
1326 3184 2996 -2973 914 -2566 -4050 204 -4001 -1373 1380 -2844 2101 -451 -3143 1001 -3933
1341 -3933 -3431 -2350 -6153 -750 -681 -1068 6452 4246 6822 10198 4399 6971 3749 -2076 -126 -5196
1357 -5196 -6794 -4454 -8199 -2444 -619 -2370 3984 1092 165 3187 -2481 -1192 -922 -4592 480
1372 480 -1081 -170 5236 1957 5216 6953 1651 5788 1805 -1116 1778 -3701 -3273 -1987 -6114 -1781
1388 -1781 -3282 -4832 -883 -3838 -2546 1072 -2852 1916 2692 430 5198 1692 2090 4136 -1245
1403 -1245 1761 1057 -2729 2607 -155 -474 3677 -1073 201 -177 -4508 -1240 -4951 -5583 -1743 -4597
1419 -4597 -1154 2607 -126 5425 3794 2078 4794 -214 115 -285 -5183 -1618 -2067 -3327 1849 -458
1435 -458 1672 3517 -827 3283 934 -2555 1896 -2238 -1335 2192 -1902 1374 668 -1852 2166 -2062
1451 -2062 -2326 623 -3989 -1223 357 -1976 3186 896 1449 3536 -1120 1083 1170 -3798 553 -204
1467 -204 -1732 2302 -427 1399 2206 -1397 2588 -495 -2575 1824 -2538 -1394 1270 -2151 1130
1482 1130 447 -783 2807 -1611 -299 2092 -3549 -263 314 -2549 1385 -375 529 3030 -1243 2288
1498 2288 1654 -2912 1845 -520 -1656 2179 -1028 1275 1170 -2244 1729 -1824 -3658 774 -3107
1513 -3107 -1368 1657 -696 2731 1034 801 4267 -530 623 2269 -3333 -749 -1363 -3730 -133
1528 -133 -2025 572 2435 -1569 2578 1441 -2163 1630 -1618 -3017 174 -1757 692 1026 -875
1543 -875 4939 1556 1404 5637 -32 916 1856 -2310 69 -3911 -3719 -1515 -5788 -2412 -558 -3276
1559 -3276 991 465 -286 2885 -119 2494 3496 -325 3513 1858 -1359 2334 -268 -327 1698 -656
1575 -656 2984 1091 -1837 1844 -2840 -4143 -1482 -5418 -3501 -2711 -3824 738 -1272 731 4439
1590 4439 664 3691 5069 1179 3639 1504 -215 1377 -2719 -126 610 -2501 2594 952 -1071
1605 -1071 2128 -1328 -1194 -1159 -4274 -963 -2997 -4497 333 -2616 -1013 2735 552 3806 4022 2563
1621 2563 5177 1032 1115 2127 -3208 -985 -565 -3493 113 -1626 -1809 894 -2506 760 663 -2354
1637 -2354 2102 -436 -1645 1142 -2203 -481 334 -1425 2754 1285 1193 5157 498 1612 2396 -1671
1653 -1671 -52 -1823 -3224 -859 -4095 -2388 -201 -3594 396 1083 -581 3379 1314 1738 2600 -1463
1669 -1463 1142 85 -2397 1976 -245 -7 3307 184 2362 1673 -967 1600 -1942 -3144 -840
1684 -840 -5073 -3044 -1660 -4116 -300 -756 -88 3535 580 3265 4336 191 3398 1822 -361 2218
1700 2218 -814 74 1124 -2350 984 -531 -2586 1099 -1875 -1728 228 -3032 -656 -1171 -2786 907
1716 907 -1570 -633 2864 -591 2242 2846 275 3348 1001 724 2198 -1823 173 375 -3049 356
1732 356 -1176 -1828 1214 -1375 455 1285 -1802 1562 -617 -2314 849 -2396 -1087 973 -1683 1496
1748 1496 564 0 3552 188 1098 2864 -1148 964 410 -2146 714 -2050 -1268 748 -2370 780
1764 780 792 -1583 2187 115 -459 1898 -1200 905 1001 -1719 1665 -585 -1164 1601 -1993 -325 892
1781 892 -2113 1315 -390 -1260 1570 -1590 -239 1382 -1605 1462 301 -1117 2239 -616 708
1796 708 2113 -1222 1630 413 -1262 1411 -1578 -1149 881 -2658 203 9 -1732 1700 -548 -530
1812 -530 1584 -1350 534 909 -1713 1425 -752 -954 1843 -1486 448 1321 -1506 1783 189 -452
1828 -452 2280 -885 911 1736 -1290 1530 -143 -1560 1132 -1914 -1148 -26 -2410 589 139 -1321
1844 -1321 1888 -475 130 1954 -1008 1153 846 -1479 1810 -591 -1129 1214 -1783 600 605 -1724
1860 -1724 1243 -168 -899 1857 -1325 901 1060 -1225 2095 592 -316 2038 -1210 87 426 -2385
1876 -2385 494 -1303 -2579 248 -2380 -1225 561 -2015 1317 1058 14 3331 856 1463 3090
1891 3090 48 1633 707 -1683 1081 -1798 -1509 375 -2590 199 512 -1462 1889 -326 -729 1461
1907 1461 -1728 -169 -200 -2445 863 -742 -854 2182 -686 1155 2106 -318 2703 834 -341 2536
1923 2536 -1139 -448 798 -2352 57 -645 -2086 572 -1573 -510 924 -1971 1312 948 -1352 1878
1939 1878 -405 -421 1290 -1440 754 263 -1783 1642 -754 -332 2058 -1100 355 511 -1442 797
1955 797 -787 -902 1435 -1526 676 1171 -822 1576 370 -1297 1108 -1765 -254 -318 -2847 986
1971 986 -152 -945 2909 256 1584 2718 -479 1295 -258 -2240 455 -2733 -1922 269 -2439 -255
1987 -255 -102 -932 1692 779 1563 3356 101 2304 2444 -1084 1641 -336 -1763 72 -2141 -485
2003 -485 -1341 -2936 -19 -1131 -2991 1251 -955 70 1567 -457 1532 -351 -609 2470 -48 927
2019 927 2811 -633 1672 1518 -991 974 -1665 -882 553 -2875 200 272 -2043 683 -814 -785 1672
2036 1672 -1087 1206 832 -1536 1560 -722 -1727 1247 -1005 549 1413 -186 1828 617 -637
2051 -637 2515 -1099 -370 1341 -1424 338 -93 -1159 672 -2009 -214 1219 -2443 984 250 -1718
2067 -1718 769 -1035 -302 562 -935 1613 839 -678 2307 339 -630 1706 -1184 530 89 -1551
2083 -1551 753 -1703 -1898 977 -1534 -17 1460 343 1900 870 175 2662 -1109 882 967 -2285
2099 -2285 898 -4 -1880 30 -2545 -1611 -814 -2317 791 538 -161 3719 1144 818 2393 64
2115 64 991 229 -994 1405 -1999 -1871 -299 -2863 -566 -125 -1633 1134 183 549 2464 -786 2460
2132 2460 1888 -1105 1511 601 -861 204 -2872 -1390 -977 -2987 344 -1177 -1143 2260 536 830
2148 830 1812 474 2183 485 -293 1821 -1266 -844 507 -2561 -349 -374 -1473 1121 -1090 127
2164 127 1393 -1573 731 670 -1716 1608 290 71 1747 -973 579 43 -2322 351 -1400 -1757
2180 -1757 1163 -1105 536 1566 -99 2249 1015 448 3048 -426 302 1071 -2166 -230 -1578 -2359
2196 -2359 -259 -2188 -917 961 -1671 1188 618 -1015 1542 -186 7 983 -1865 553 -183 -1656
2212 -1656 1649 -120 500 3204 795 2631 2733 97 2219 -579 -1582 -195 -4147 -2857 -2227 -4502
2228 -4502 -1807 -1878 -1605 1405 -321 1816 3093 1122 3607 2293 599 2755 46 334 1392 -1274
2244 -1274 810 -241 -2347 263 -2240 -1947 -477 -3128 -1146 -883 -1883 922 184 438 2946 821
2260 821 2694 2772 171 2145 -97 -1058 238 -2791 -1495 -919 -2779 419 -162 -335 2377 196 1400
2277 1400 1965 -792 758 -801 -2275 -208 -2978 -1930 -184 -1693 1262 1569 1038 3742 1848 2032
2293 2032 3225 -621 706 -308 -2785 -930 -2928 -2653 -1116 -2789 -253 13 -1489 1571 -139
2308 -139 -133 1448 -996 789 1312 -311 2605 1376 1217 3679 1002 2123 2319 -1066 404 -1793 -3661
2325 -3661 -2014 -4633 -3767 -1950 -3653 -783 203 -100 2286 1635 2101 3850 805 2588 1295 -701
2341 -701 1341 -1018 -937 900 -1274 1195 783 -669 1894 -149 -686 625 -2268 -1642 -1541 -3720 -972
2358 -972 -2059 -1791 1170 -690 1897 2464 756 3085 2044 918 2412 -564 189 746 -1753 723
2374 723 -161 -829 1535 -625 -261 483 -2291 -1038 -2169 -3585 -1222 -2852 -1771 865 -606 2281
2390 2281 3331 2272 4820 2986 2244 2949 -401 10 -874 -3293 -1454 -3247 -3269 -859 -2830 -448
2406 -448 429 -1055 1745 626 79 2088 -137 550 1157 -1032 1272 307 -18 2459 147 1156 1945
2423 1945 -451 894 -419 -1987 -729 -2947 -3089 -1342 -3489 -909 -203 -1118 2337 1070 1604 3098
2439 3098 648 1648 1536 -804 1245 -909 -1056 1012 -759 495 839 -751 1163 -265 -1009 286
2455 286 -2490 -1767 -839 -2979 -503 -870 -1469 1634 -197 1506 2385 171 2141 1236 252 1679 176
2472 176 127 915 -1295 539 271 -1314 969 -887 -780 620 -1619 -419 -863 -2147 -185 -1707 -1369
2489 -1369 594 -999 586 1697 142 2512 1096 1221 2376 -271 766 633 -2313 -297 -1337
2504 -1337 -1969 410 -1206 294 1134 -381 1587 354 -775 1461 -1023 -724 255 -1667 109 -245
2520 -245 -1016 1311 -383 636 1893 2 1319 986 -819 477 -764 -1013 276 -1776 -59 220
2536 220 -1635 839 -538 -996 1354 -469 912 1163 11 1703 -148 -382 1570 -885 -182 503
2552 503 -1241 -234 -673 -1157 619 -1502 -140 973 -1276 938 925 -584 1019 -369 -44 1074
2568 1074 -1019 954 470 -1190 1115 -430 -816 1009 -383 1037 882 -264 1914 47 -671 856
2584 856 -1787 -1038 -533 -2225 -678 -1445 -1162 612 -980 1060 2147 233 2458 2240 723 1864
2600 1864 -133 38 -131 -2157 -522 -1198 -2766 -1004 -1811 -1801 -304 -815 1605 1417 1558 4124 2219
2617 2219 2220 3113 172 -300 -708 -2793 -2059 -3463 -3585 -1756 -3897 -943 284 -599 2667 2746 2927 4199
2635 4199 2528 3215 2457 -140 1356 -635 -2347 -1170 -3077 -3237 -2581 -3532 -1426 -1735 -1168 2215 940
2652 940 2182 3734 2024 2563 1775 638 855 -1212 -1142 -370 -2603 -1106 -721 -1735 135 -608 -544 903
2670 903 -502 750 1263 -495 2285 1304 514 1721 -175 -498 -818 -2731 -1521 -2651 -2600 -71 -998
2687 -998 576 2401 828 2565 2003 1076 1654 -432 -137 38 -2318 -634 -975 -1623 513 -388 36
2704 36 857 -738 823 457 -899 798 1 -46 1283 -232 346 216 -1266 724 -781 -767 1188 -509
2722 -509 807 1958 140 1622 423 -953 -160 -2476 -2114 -1364 -2712 -436 21 182 2485 1535 2319
2739 2319 2715 634 1554 557 -978 131 -1162 -740 506 -1443 398 -690 -1470 -581 -2430 -2326 -882
2756 -882 -2098 -1 1282 1118 3508 2761 2360 3404 1041 947 408 -1982 -842 -2018 -2324 -639 -1467
2773 -1467 -614 625 -1104 833 -60 -1058 985 -563 167 1274 2 1469 814 -361 839 -1357
2789 -1357 -1146 -340 -1828 -264 462 -64 1979 1472 1361 2184 -28 467 -133 -2445 -875 -1924 -1858 245
2807 245 -1191 622 1071 -311 1495 -421 -764 49 -1456 -355 385 -642 1991 1356 1105 1869 -14
2824 -14 -98 -195 -2231 -1036 -1491 -2589 -547 -1160 -239 1765 53 1330 1139 61 810 -469 -335 609
2842 609 -540 569 1013 -253 920 -574 -1103 3 -1858 -506 149 -1792 762 327 649 1747
2858 1747 -164 661 569 -1405 373 -850 -931 674 -693 254 1541 -102 1450 571 -973 384 -1376
2875 -1376 -877 3 -1299 159 212 -412 1537 -143 -93 740 -1319 -115 -753 -1875 392 -567 -295 1122
2893 1122 708 1796 1717 -254 1327 4 -654 515 -1655 -947 -411 -1384 386 -440 -700 238 -1487
2910 -1487 -356 -56 -1044 263 67 -216 1456 100 336 1486 -36 574 398 -721 696 -766 -110
2927 -110 689 -983 165 -303 -1289 221 -853 -253 219 -959 -30 150 -561 768 667 391 1033 -504
2945 -504 -266 -746 -1775 -364 -929 -1280 477 -122 147 1118 176 733 256 13 342 -581 -165 15 -1489
2964 -1489 -88 -222 -962 593 -404 -380 561 -1358 114 327 -351 1321 756 -33 1565 -142 436 -177
2982 -177 -1480 -382 -1435 -1368 -73 -1148 312 1430 80 1295 443 537 1756 70 663 680 -1034
2999 -1034 -97 -662 -1038 -352 -1733 -1216 -820 -1978 -339 -403 -779 1517 774 1499 2512 1511 2347 946
3017 946 -284 394 -1538 -1969 -796 -2467 -1012 -670 -1455 179 -364 63 1374 372 1406 1918 -7
3034 -7 1954 1221 709 1266 -751 -435 -874 -2939 -1484 -2188 -2695 -135 -608 793 2077 1377 2729 1534
3052 1534 759 1349 -615 -917 468 -1723 -180 -13 -324 568 -184 -112 430 -1563 -844 -409 -1625 438
3070 438 25 242 1398 338 783 611 -860 193 -977 -1460 -300 -762 -95 940 408 2081 853
3087 853 214 1151 -1170 -1609 -1176 -1963 -714 -246 -116 1516 769 932 1554 -319 261 -400 -1992 22
3105 22 -840 -840 467 -407 299 -281 -1256 229 -1366 -1714 63 -405 1199 2791 2529 4365 2594 1957
3123 1957 2247 -1163 -1504 -2955 -4779 -3512 -3727 -2893 -809 -690 1175 1938 1143 2820 2240 1064 2040
3140 2040 1255 1211 1349 240 677 30 -1572 -896 -2805 -3309 -2529 -3655 -1873 -761 213 3107 2859 3694
3158 3694 4590 2088 2251 1054 -1488 -1219 -2271 -2343 -1238 -2340 -478 58 -1324 413 -672 -1081 82
3175 82 -682 633 1250 1062 2944 2231 1635 2718 166 -987 -1070 -3448 -2183 -2503 -2196 -54 -288 1238
3193 1238 2903 1496 2027 1182 -392 413 -1336 -1275 -445 -1392 282 698 4 1178 64 -685 -172 -1062
3211 -1062 -1016 -595 -1300 586 326 694 2285 592 992 1083 -953 32 -1121 -1283 545 -677 308 1402
3229 1402 -33 1109 502 -854 -340 -1825 -1189 -876 -1625 279 780 330 2268 1460 1041 1589 -91
3246 -91 540 -366 -749 388 -797 -482 756 -631 440 322 -1551 -10 -1089 -1219 -77 -724 468
3263 468 1216 419 1779 1129 290 834 -1104 -382 -334 -1612 -322 -726 -764 826 -363 524 1452 -204
3281 -204 847 285 -382 797 -417 387 708 -452 711 -55 -1200 810 -1003 -935 -234 -919 -367 -285
3299 -285 -337 366 420 688 1486 443 352 -280 -22 -3 -439 -609 316 -499 644 615 -830 845 6 -928
3319 -928 541 -432 -301 291 -540 24 445 -416 820 -36 290 669 -1241 255 122 -392 556 72 -315
3338 -315 795 -609 278 448 -910 450 -707 -696 466 -376 157 281 -224 759 467 -256 732 -961
3356 -961 -170 330 -785 564 -64 -89 1087 52 72 411 -831 156 -552 -1247 -159 -609 -125 634 -350
3375 -350 911 859 -205 840 -40 124 1012 -415 411 297 -188 897 -226 -121 604 -724 -206 -123
3393 -123 -828 351 -541 -381 582 -1016 266 175 -841 630 -77 -359 894 13 991 1356 306 1360
3411 1360 626 -305 452 -1184 -800 -136 -1449 -80 -146 -211 807 -63 -174 583 -981 -464 -528 -1115 416
3430 416 -102 535 1513 437 1212 1317 68 725 -404 -837 98 -1220 125 383 -673 718 312 -199
3448 -199 816 -806 -847 -256 -1258 1 52 -482 1360 261 796 1117 -443 607 -288 -774 107 -400
3466 -400 182 1046 -440 512 292 -1289 -103 -1435 -1339 -495 -1150 487 957 771 2686 1717 1219 1662
3484 1662 -479 -729 -1458 -2331 -1180 -1592 -1272 795 256 1377 1775 258 1036 -63 -917 -138 -1033 -326
3502 -326 496 -180 966 624 -300 487 -693 -886 -832 -1368 -120 305 414 2166 1867 1766 2498 1021 501
3521 501 -640 -1875 -1237 -2217 -2264 -953 -1516 -321 393 -348 914 485 -39 990 321 1445 1744 1460
3539 1460 2383 1572 877 971 -1097 -1932 -2366 -3668 -2719 -2402 -2148 210 219 1460 2562 2237 2086 1220 172
3558 172 658 -1097 -884 -242 -1116 438 755 -138 790 -348 -758 -165 -1633 -629 -210 -1020 1091 693
3576 693 994 1559 337 807 99 -1360 -351 -998 -1640 60 -511 64 798 258 806 505 -143 200 -876
3595 -876 -914 -286 -1298 250 446 138 1099 86 493 161 -1027 -41 -109 -899 258 247 296 725 -242 -119
3615 -119 -555 -971 65 -747 -817 573 66 966 1158 467 1452 545 195 338 -1034 -1074 -1017 -2063 -879
3634 -879 -1074 -820 440 96 950 1733 826 1553 1465 690 1504 377 280 351 -1127 -685 -1251 -1936 -963 -1797
3654 -1797 -1482 -283 -792 -26 682 276 1471 1146 1325 1756 591 1077 1037 -218 299 -430 -954 -344 -1440
3673 -1440 -849 -696 -1105 -168 -365 -474 1040 314 1063 1187 355 912 351 -393 526 -475 -646 43 -918
3692 -918 -177 -75 -772 140 -857 -190 661 -160 1031 924 -153 900 612 80 672 -238 -87 214 -1009
3711 -1009 201 -151 -424 96 -294 -177 133 -611 796 -125 -518 530 -397 50 679 -226 640 481 166
3730 166 311 -353 -675 -15 -894 -173 -101 -497 80 -1060 170 191 -444 -45 -370 -269 234 -104 -629 440
3750 440 291 796 823 61 138 -1080 -949 -543 -1169 -50 661 -201 380 139 322 860 -217 12 408 -603
3770 -603 165 139 -432 42 -50 -43 783 -566 48 18 -406 402 -789 -440 131 -241 343 -125 -180 612 -759
3791 -759 -146 -336 -472 137 -659 -377 511 -296 -38 755 90 243 203 -551 505 43 475 921 11 109
3811 109 903 -1048 -316 -761 -535 1276 -225 -662 -567 -441 350 -520 -37 961 -298 -469 158 -519 523
3830 523 319 -246 70 -151 -656 441 -223 641 929 -82 1066 -284 -387 -371 -615 -743 -765 -1404 -258
3849 -258 -221 -101 1204 -75 1048 949 258 369 -206 -271 28 -149 232 475 46 1073 43 -75 193
3868 193 -59 -266 -137 -784 -264 -217 -521 1118 673 -145 311 169 889 344 -674 429 -621 -229 52
3887 52 -897 599 267 55 -361 -531 133 -273 -1437 -395 137 -336 849 133 -262 473 -86 -474 -644
3906 -644 -720 -230 -354 -1056 978 534 -73 1398 412 396 161 -502 -242 -925 -1215 226 -295 330 542 -384
3926 -384 503 -145 -71 -430 -1304 -14 200 -14 540 563 873 970 110 393 -556 -1003 112 -658 -964 -126
3946 -126 -395 0 674 -806 498 190 -81 285 276 178 1065 -797 668 625 56 432 68 -105 558 -1154
3966 -1154 -496 164 -410 514 -543 -333 -325 -205 -213 -1313 -1737 20 -765 -721 757 -121 1004 612 37 793
3986 793 575 -165 -900 -1419 -676 -567 -521 -721 -1028 -228 -81 925 132 -588 155 884 373 -120 236 -668
4006 -668 -759 -362 -2101 -1143 56 -1126 204 -271 -1331 664 115 832 422 839 205 -199 1243 757
4024 757 -162 -103 518 -623 346 -1179 -1043 92 -1022 -493 -111 -489 271 891 608 1318 998 1406 2049
4043 2049 28 96 -372 -448 177 -693 17 -376 161 112 150 104 806 -207 151 127 -21 -89 494 627 654 590
4065 590 25 -908 -8 -588 -257 -1687 -91 -1257 33 116 611 461 -113 548 1110 -436 51 -895 -173
4084 -173 1052 177 228 596 117 146 1150 -1484 -1179 -222 -543 -1007 -409 -869 -7 150 930 724 -203 38
4104 38 0 -89 512 -325 -7 841 -72 985 43 -503 317 -325 -751 271 -1323 -373 176 -829 97 476
4124 476 33 728 -1167 57 -98 -408 -562 41 -827 32 -1265 -23 -98 -1009 151 -455 -8 -334 -603
4143 -603 -43 938 -87 1109 576 -248 1924 -620 -514 -656 -1353 -1435 -795 -793 -553 -14 380 767 104 -285
4163 -285 -189 -130 -438 -677 107 791 -264 330 869 -604 -491 -972 -533 -236 -1583 -154 70 579 332
4182 332 388 254 256 1005 696 726 -923 538 185 -1289 -41 -328 125 676 110 -497 388 -34 -581 -752
4202 -752 281 -236 -1309 -291 228 -51 247 23 318 1082 -329 -623 232 -832 359 -653 -551 389
4220 389 -740 -268 -163 186 289 -121 340 -327 -624 272 86 176 668 -174 -76 327 -185 -547 120 -454
4240 -454 -342 -105 -575 -721 -482 86 948 8 147 231 -334 301 -538 -535 148 176 -36 5 -116 -73 -117 -54 384
4263 384 -787 331 79 -538 195 -301 -124 399 -477 5 151 -96 -4 305 -315 231 -198 -10 457 170
4283 170 265 185 43 437 -133 -371 246 -306 -74 122 -426 339 -86 -111 544 -218 -387 -212 -483 303 -125
4304 -125 43 643 -153 175 523 -143 463 -135 -352 -103 -433 -477 -183 -289 676 486 54 246 -229 -309 -507
4325 -507 -320 459 -333 -637 910 627 -184 554 -457 93 103 -129 273 -133 171 1003 -317 51 565
4344 565 -226 651 -315 -643 113 -1211 -188 172 7 -31 -35 -318 400 -662 -581 80 -837 400 402 -137 253
4365 253 -144 -168 59 -460 203 -793 -723 369 -300 57 -350 -178 1193 96 -111 505 -600 197 456
4384 456 212 -331 516 -245 -404 -131 103 629 -414 272 168 -191 -59 -223 -362 605 -362 185 -114 158
4404 158 635 31 -443 268 -175 -665 995 -644 -9 969 427 95 285 685 -34 -150 -447 6 43 1290
4424 1290 1256 -418 612 -426 210 296 -207 177 -33 187 31 170 595 486 275 266 187 -46 -335 3
4444 3 890 456 -214 594 81 -137 586 -606 133 -169 -652 -270 -494 -238 -9 -155 -81 344 -301 -62 -237
4465 -237 -589 -161 -329 -107 191 -271 461 303 -350 501 -217 -329 -300 -418 146 -85 84 593 93 248
4485 248 554 -175 159 157 -464 -131 -444 -514 389 -621 -16 -23 -244 398 -34 -136 68 -159 -156 440 -162 600
4507 600 189 -152 510 -365 -185 -267 -681 -279 -504 -735 224 -86 -182 611 -135 -93 378 -277 107 -192 -262
4528 -262 55 -112 238 558 -116 131 -254 -253 274 -304 -275 -191 127 191 212 -334 201 270 -161 -13 -337 821
4550 821 137 -735 495 -619 -243 18 -440 -462 120 -81 400 -687 138 605 -640 63 -58 -539 359
4569 359 341 623 1138 406 343 230 -136 365 249 17 -52 -205 404 -86 -308 273 -351 -580 -97 -360 146
4590 146 281 41 -334 236 -428 -245 -395 -560 154 -353 202 -22 -465 556 123 320 757 -26 385 163
4610 163 21 402 -53 -119 -28 -302 -167 -197 -562 -33 -471 -357 362 -186 243 269 17 302 106 136 332 -43
4632 -43 241 237 -432 19 241 -97 30 -166 43 266 -527 -112 -96 -426 -48 -224 -43 498 -15 350 -2
4653 -2 -182 443 300 202 388 -69 124 151 -304 -89 -249 -119 113 -313 236 325 -159 244 109 6 126 -330
4675 -330 -184 -9 -424 -58 213 287 258 -106 232 400 -291 355 -204 -514 150 -171 -346 -387 -750 22 -520
4696 -520 -677 12 552 -140 -198 -445 96 202 -176 535 -284 -389 -332 110 614 575 573 779 110 1 354 111
4718 111 -751 -397 -403 297 -22 -1410 345 -316 -281 -88 -527 -350 157 -895 189 -339 43 240 133 -354
4738 -354 33 -174 -102 -453 670 401 -605 341 -170 -689 202 362 -1210 768 -32 368 -558 -1206 224
4757 224 341 46 -260 205 -417 308 56 172 -37 63 -108 -126 -127 -204 747 3 471 -822 -404 -421 -148
4778 -148 -45 25 -678 379 -332 -459 -300 245 144 -77 -16 557 -169 5 -113 -728 -550 -747 -386 -235
4798 -235 -312 155 26 114 -904 325 546 -324 -442 -112 286 -30 261 269 -99 -970 9 358 381 190 -119
4819 -119 78 382 373 -579 534 77 55 382 70 -131 180 86 575 372 -41 179 -388 343 230 154 -14
4840 -14 -387 -728 480 -790 -439 -257 -813 -731 105 -1402 572 192 -581 -84 -412 431 120 537 -111
4859 -111 43 584 686 206 -217 574 -610 81 163 -434 -286 -345 -227 -403 150 -410 -316 -599 -425 -233 -260
4880 -260 -305 -138 -98 620 670 832 -669 54 -620 -468 307 413 216 -117 -52 -176 711 55 -140 786 -779
4901 -779 -531 -564 -969 251 -705 36 -444 458 570 684 244 408 267 -228 -356 -669 -573 -312 416 -116
4921 -116 26 110 442 -276 272 -121 -455 -439 -702 114 -15 -590 -172 319 -122 274 -82 -140 417 -828 -253
4942 -253 51 -486 -368 -180 -10 104 -31 231 437 -60 181 40 148 358 -569 -542 145 -370 294 -199
4962 -199 31 53 -674 -287 74 -200 427 188 182 698 299 40 105 -329 -114 2 -525 -123 48 -62 133
4983 133 -52 -27 112 -145 236 -159 57 272 -229 -181 7 209 174 93 247 134 -120 97 116 -260 20 60
5005 60 -82 292 -56 -56 231 -79 236 126 -327 -86 -384 -457 71 -288 -13 239 -429 503 -80 107 488
5026 488 59 153 210 -121 531 169 11 262 -37 158 123 -166 361 -118 17 -60 -138 46 349 -133 358 118
5048 118 -206 163 -48 -394 -219 -15 199 267 238 519 242 93 445 12 -128 88 -356 150 -142 -100 -226
5069 -226 -177 -180 -14 -399 -52 -383 28 301 -143 134 287 -435 200 90 50 126 34 -299 85 -164 -103 -145 -50
5092 -50 99 41 -158 210 -221 77 -15 -588 207 -119 109 27 -330 155 -43 -210 118 -81 -167 -3 -242 -162
5114 -162 -205 -50 248 94 -147 556 -102 -99 -104 -14 126 51 -138 217 -184 37 82 -57 49 55 -374 79 -271
5137 -271 22 71 61 225 119 91 355 55 118 224 -249 182 28 -340 -240 -247 -158 302 208 78 356 -178 338
5160 338 -8 438 -46 -218 -27 -165 -274 -146 -96 -178 -166 -208 227 328 -43 317 95 26 42 -98 106 303
5182 303 -358 127 -95 -187 341 -236 -99 -87 -117 22 -244 -193 135 64 -186 124 38 -26 61 -292 230 -206 -549
5205 -549 40 -119 -2 298 12 412 75 -48 380 -246 126 -32 -375 243 185 -97 389 -82 131 269
5225 269 -300 11 -106 -188 189 30 -49 257 258 232 83 -15 -73 -327 -258 -106 -428 -214 -129 -225 444 -44 168
5248 168 399 -370 214 -87 -138 189 -141 203 302 25 260 200 -269 99 -191 -119 -294 -176 3 309 -232
5269 -232 398 74 -63 -288 -779 -565 368 -647 -417 -504 -500 947 -76 -244 350 477 -1 603 360 818
5289 818 283 -31 -155 -654 -583 -58 -225 402 -221 -521 -292 -439 -342 -57 -91 196 236 35 359 159 92 141
5311 141 -443 135 -353 -51 456 -5 -454 731 349 555 -247 -162 -259 -128 -386 -38 116 436 -277 563
5331 563 430 -24 332 -141 -504 -47 91 -151 -92 -471 269 -217 -174 523 706 192 -378 -397 -261 737 111
5352 111 264 -461 -87 555 -684 -332 393 120 -558 -111 -422 354 -258 -448 161 462 254 277 -604 -344
5372 -344 79 492 0 -439 -535 -457 -127 254 -94 -13 -206 62 -82 98 -140 82 -727 -254 127 79 -297
5393 -297 239 123 -65 609 -93 -13 -209 762 1041 -713 -247 521 92 724 89 -96 614 -413 -157 -170
5413 -170 171 -147 -340 -320 548 -3 -34 0 214 -275 -3 -158 -175 -117 -911 678 276 -167 643 -837 269
5434 269 393 -333 -273 67 -176 -15 214 846 335 677 -451 -988 -417 492 -347 -498 -353 -544 72 -914
5454 -914 -229 407 547 323 351 251 1040 -194 -786 197 -782 -674 1660 468 147 -28 -217 -1032 -825
5473 -825 -15 -652 -584 -48 28 770 611 -380 -262 773 -238 154 86 -445 -335 -1029 -160 798 -61 4 -540
5494 -540 417 -363 -136 882 251 -127 701 197 -420 773 184 229 156 -671 -57 -676 -822 83 -28 346
5514 346 68 132 153 483 -455 -602 -181 -38 469 53 -390 -363 -390 250 -107 -733 -585 -593 -571 225 -566 -238
5536 -238 -218 -111 -507 -122 516 545 312 149 -4 -272 346 -129 3 222 515 827 -963 102 -444 165
5556 165 265 -389 -254 567 263 -118 363 -167 317 263 -171 -332 -430 413 138 149 -312 -666 617 272 310
5577 310 719 -44 -403 -480 -372 -421 -244 58 -210 -563 -438 -430 -236 -151 93 259 -499 304 -36 -614 511
5598 511 -1088 18 327 -222 289 -476 28 -64 -98 373 1062 -398 141 -415 -483 -58 -377 -309 276 -279
5618 -279 -470 -541 -34 60 -146 -480 191 286 99 198 -494 161 -66 -218 40 -62 57 31 -411 400 110 401
5640 401 587 -53 144 314 242 155 37 -108 -11 -388 103 -37 -175 345 -719 -48 -100 215 355 54 -381
5661 -381 3 -116 -329 518 -211 260 25 -97 -322 -46 -161 -490 -301 49 -475 -266 -252 59 202 253 326
5682 326 148 -6 -14 78 144 73 300 26 -577 87 -715 83 490 -248 -96 -12 222 146 28 266 -114 480
5704 480 246 -71 -834 -291 -447 237 169 184 50 34 94 556 680 28 170 -207 58 299 -443 118 -243
5725 -243 51 -333 -158 -215 148 -710 -624 -22 -172 628 -268 -396 -204 -209 666 314 383 -193 -327 -42 365 -411
5747 -411 -268 312 196 69 264 -411 205 -323 -368 409 218 284 -31 -113 529 -174 -39 -407 -334 189 -517
5768 -517 8 -220 -267 169 25 65 95 -69 186 155 -167 486 482 -212 -391 -526 -323 -100 -1 -255 146 -29
5790 -29 -264 -272 -90 341 -10 -453 -593 -143 -470 484 409 -234 120 -149 840 -120 169 -248 -342 -395 -112 -364
5812 -364 153 -140 -32 355 190 -404 -104 -477 496 -62 246 -374 188 1152 -32 217 376 33 -77 -123
5832 -123 279 61 -939 51 366 5 117 633 362 294 -335 -440 169 255 -174 -127 353 -592 -239 315 220
5853 220 193 -409 -149 214 629 -279 -528 723 85 -213 -373 -33 329 -324 -732 85 71 -559 67 -46
5873 -46 -390 512 -57 294 639 84 357 -210 40 -815 -810 788 -46 -215 -132 -932 51 354 -511 177 -387
5894 -387 -265 659 -94 -271 734 -109 419 402 -55 419 21 182 -211 69 -394 -270 -322 563 -547 214
5914 214 227 -167 -192 57 -525 345 71 402 67 -18 74 112 465 -320 66 -141 14 -515 -117 203 60 331
5936 331 -415 -298 145 361 -12 184 182 -634 124 -622 92 -518 50 37 428 80 411 1200 -473 -387 214
5957 214 531 402 -27 531 307 -346 -667 -46 -164 497 -298 -465 126 -301 -335 -989 358 -531 -286 57
5977 57 -267 108 -5 -715 5 286 347 383 -207 -13 267 524 -302 -433 -91 629 -341 91 -555 -163 452
5998 452 -355 15 -118 351 225 -39 -9 -172 -267 150 -399 -178 316 -213 145 528 -99 -800 -418 -187 146
6019 146 -460 -108 -443 197 -36 251 581 -116 411 -298 56 -77 -163 182 -232 -60 -9 -299 23 -14 -189
6040 -189 276 -119 -149 45 -392 -284 31 -83 -75 11 -268 -33 -87 -43 -228 -361 -57 -30 148 146 181 166 597 94
6064 94 152 141 -71 -191 -204 -436 -177 -87 199 251 57 494 19 8 88 170 -244 52 -154 317 241 -5 -118
6087 -118 -151 -411 -28 -69 120 -319 -111 19 -46 429 229 -53 378 351 102 190 -5 19 143 -339 -124 -133 -347
6110 -347 -73 47 94 99 -62 332 84 -119 138 46 -82 337 -261 -219 2 -117 -94 -178 -222 -95 -60 55 100
6133 100 61 369 89 -114 329 8 316 182 -150 -32 -280 -256 -98 16 -172 -37 -147 103 -106 6 31
6154 31 -142 -77 217 65 -325 -109 -176 295 178 -192 49 -257 242 167 -197 394 -12 18 -264 -242 -61 24
6176 24 -292 -96 -233 -256 136 -253 53 -49 -7 419 167 506 466 100 49 -30 -509 -170 -99 -124 -264 -210 -92
6199 -92 34 3 94 124 239 160 175 155 -31 -95 220 102 -276 17 -239 155 -260 -440 -305 55 -339 265 -100
6222 -100 207 515 347 340 138 32 158 30 -209 -168 -329 -275 -252 -154 130 47 17 197 -216 -34 329 54 228
6245 228 77 122 272 -87 38 -61 33 -230 -189 -537 -147 -224 -220 -271 20 18 491 -55 755 116 -326 171 -81
6268 -81 61 -190 -107 -114 -20 -341 -75 251 -335 -450 -174 -286 373 309 456 47 335 -66 -135 270 -619 -594 -220
6291 -220 -285 -203 -40 -371 77 -310 200 242 222 -135 -76 126 -231 377 -277 395 180 -42 -171 568 -556
6312 -556 160 222 322 -666 -313 164 -45 -409 -400 -6 461 -68 -165 -67 199 202 331 -376 200 418 196 357
6334 357 -307 -72 -100 126 -171 -388 -303 420 194 3 158 42 221 -145 411 -147 -265 -502 168 4 154
6355 154 529 94 170 293 13 -329 -276 -653 -291 474 -162 733 -117 507 -326 49 112 539 -81 -451 -198
6376 -198 -289 -77 669 3 175 -55 681 -664 347 -241 -813 -160 -411 323 145 -714 23 -347 -161 -514
6396 -514 -186 281 -425 470 -335 186 104 -178 -244 -622 -388 -254 37 67 -765 -456 -11 573 151 17 522
6417 522 68 -298 432 11 0 195 210 312 -329 -52 135 162 -632 -1172 140 -96 -481 -341 585 56 351
6438 351 475 -549 112 -19 245 524 -111 372 103 -146 -204 182 -513 259 478 226 13 111 -81 -526
6458 -526 30 -26 -461 -318 -93 -16 -194 -235 -122 695 -1270 -440 382 -63 -216 -540 221 232 -48 -70 575
6479 575 -493 223 178 -274 88 66 -693 -280 -345 -180 -402 -637 -5 178 41 1298 76 -162 -291 -561
6499 -561 97 325 -517 382 198 -722 -453 -249 529 387 -1221 -73 304 -436 10 995 310 461 -531
6518 -531 868 -162 -163 563 -629 -627 -393 -375 106 -627 -274 78 579 465 51 -722 -21 256 548 1262 581
6539 581 -562 -554 194 -578 -624 36 -22 -1011 432 529 230 664 36 -423 -250 -241 -9 -396 -287 -453 676
6560 676 -1234 679 -272 -275 630 -507 -149 -105 -345 15 -56 -518 -188 -226 -524 418 -239 -63 -102 -288 512
6581 512 -377 727 -23 -53 298 -136 -534 129 -99 -1016 109 -678 -309 130 -212 -88 -127 -22 662 -43
6601 -43 474 117 61 164 6 39 -170 -139 -126 17 -247 -135 -160 -299 -249 -111 44 342 -31 121 267 4
6623 4 269 69 25 161 -207 -219 -170 -415 -279 -1 69 206 -226 81 -104 -93 248 31 -17 222 -172 227 260
6646 260 108 50 9 47 -154 -227 -458 -197 -202 177 -240 -115 231 -89 28 54 -169 28 -123 -72 36 -298 -125
6669 -125 119 186 -144 37 -82 220 -266 -65 277 -233 130 242 -99 181 -141 -87 -159 -195 -53 92 -28
6690 -28 29 -59 125 269 -243 -115 -31 -11 -96 -219 -83 62 148 -70 15 186 167 388 47 164 73 270 -67
6713 -67 90 -146 -81 -376 -177 -205 -182 -2 -246 -70 -33 -165 289 -13 -55 202 -104 10 -67 -175 12 -109
6735 -109 -328 -195 -91 -305 74 -208 -243 -5 74 391 -51 -10 109 -46 -99 15 213 76 -71 -122 -57 53
6757 53 -356 -163 -182 -486 -280 -147 38 223 103 42 -112 -154 243 -106 -122 -314 -49 -232 -305 126 -598 -119
6779 -119 -141 -412 -146 374 -138 -11 397 -79 141 -52 268 85 -205 333 122 8 135 75 -1 -266 -88
6800 -88 -59 5 -429 53 29 -162 344 36 -62 95 -50 -266 -137 17 252 -127 321 35 -210 191 92 -181
6822 -181 232 22 -66 24 -376 1 175 152 8 10 60 -17 118 128 239 -184 47 -99 -106 76 -59 156 -154
6845 -154 1 -3 -333 -176 -30 -86 219 -227 -331 269 109 -76 218 67 3 -4 -265 0 218 5 1 75 362
6868 362 -13 9 -6 -244 -8 -28 -242 195 43 -89 200 41 -249 92 -30 -81 251 -32 97 -16 -85 -95
6890 -95 116 183 -108 -148 2 -318 189 -80 -160 100 42 13 211 1 -25 347 -73 -99 235 -194 -96 139 -218
6913 -218 17 -117 -233 -69 -256 43 78 -8 252 134 156 -66 88 120 164 111 -36 -91 21 143 -79 -50 215
6936 215 -27 183 43 -234 -19 -81 -137 178 -287 114 202 -62 -29 34 -72 -29 -214 -26 -51 -397 148 -137
6958 -137 -65 116 -122 -84 310 -36 232 -16 -205 66 -174 -35 216 -63 -122 152 -248 244 -367 -38 5
6979 5 58 -129 121 -180 249 32 -2 255 -44 -9 43 -54 162 -132 -8 114 -35 189 -122 27 15 22 -63 82
7003 82 -5 134 117 -165 39 -72 51 79 -340 82 -103 124 70 55 -272 -13 121 -10 133 43 90 -19 -61
7026 -61 198 -124 -216 -25 -241 62 54 23 -18 -12 -258 94 -275 153 -75 -131 563 -39 -141 391 114 -175 -5
7049 -5 -264 -50 -188 -101 165 -238 73 -91 -149 173 -287 -39 64 -259 338 40 159 158 -23 62 224 28
7071 28 -129 -84 -345 -44 -282 -102 192 -167 -36 325 -97 63 55 -203 39 -123 237 374 -206 -58 154
7092 154 -20 -15 -17 -212 -160 30 -7 186 -47 37 301 -54 214 310 164 195 -24 -101 204 -85 -138 -273 -172 -17
7116 -17 -152 -3 -322 -404 288 -31 100 162 158 294 38 195 206 -204 99 344 -324 -155 -74 -526 -74 -184
7138 -184 -170 -146 -35 282 11 -72 273 -102 -34 288 -397 4 258 19 -127 -165 -222 -132 -230 -254 -90 -29 101
7161 101 214 -11 153 -118 -15 50 -43 46 -2 -108 209 -39 231 153 42 -149 0 -140 133 -285 -243 -34
7183 -34 6 141 -5 163 132 125 243 94 -156 227 176 36 32 -56 27 247 -250 13 176 -262 115 -155 -169 6
7207 6 -76 -53 98 173 153 169 -4 33 -107 -5 -58 -74 -96 -65 -82 172 -131 -110 146 49 180 422 -155 77 84 -37
7233 -37 -139 72 85 -67 99 152 -104 -187 -112 -109 -243 62 -302 86 88 37 64 77 -68 182 -200 7 230 73
7257 73 -22 26 -246 -86 -156 -23 18 191 -73 228 158 168 57 38 68 -220 67 20 -155 -50 -43 57 -38 -120 45
7282 45 131 -27 184 160 77 241 -338 -122 69 -139 118 -61 25 154 -58 -255 61 -98 -43 -196 -154 140
7304 140 -229 111 55 -105 -165 110 -109 78 -113 -27 36 -99 -29 -105 -134 136 124 244 40 68 15 -100 -246
7327 -246 158 -83 114 -56 -75 9 6 -38 20 218 -27 241 -202 -143 -182 -188 111 33 107 24 -73 32 254 65 196
7352 196 -27 -152 -14 -356 131 -97 -117 155 3 -122 110 62 66 -39 124 27 -8 -97 -1 -221 9 5 -267
7375 -267 365 -167 18 182 -440 -74 -374 185 110 95 -165 -114 223 -180 376 29 130 -108 -120 256 169 46
7397 46 213 70 182 74 -175 -40 -405 -85 82 99 -141 175 -89 81 219 47 85 5 -180 228 193 66
7419 66 0 -86 188 -185 53 334 69 241 -94 -538 161 -136 -610 -81 -184 -207 -284 -387 396 99 -255 399
7441 399 -149 -360 -407 -95 452 79 382 43 59 79 137 -450 -1299 -1009 -127 95 267 19 -95 -11 787 -222
7463 -222 -768 199 -99 -241 -308 -221 264 477 149 349 -530 435 -31 -554 114 472 -194 203 117 49 409
7484 409 -870 -148 -62 -18 -857 98 -37 -385 -894 -320 480 289 -647 -960 -140 -420 -664 169 155 -458 301
7505 301 409 -117 -373 47 -575 -199 -398 -201 22 -82 -215 344 193 -289 -701 -369 173 -351 285 -378
7525 -378 -372 -573 -159 306 225 215 -210 31 -90 448 479 149 -205 -52 -72 -505 304 424 247 -517 296 318
7547 318 396 54 696 385 -54 -670 307 287 -36 -325 378 428 -243 84 -184 -406 96 36 -298 191 172 265
7569 265 53 49 194 -160 -40 -108 -357 -159 -29 18 124 0 -211 385 -9 -290 274 -47 -285 112 -68
7590 -68 287 -25 144 58 -197 -84 38 -195 107 -91 -421 120 -231 111 96 31 -104 164 90 230 95 -377
7612 -377 65 68 -112 -14 -107 -117 -92 -99 -138 63 134 -43 -361 100 -157 51 341 -263 -229 -189 61 -277 -206 45
7636 45 330 -462 192 -97 -138 -8 67 -256 -38 91 46 75 -174 335 34 -480 159 -459 -291 55 -322 216
7658 216 -176 -386 285 -51 -96 -61 -72 -134 67 -142 72 291 13 365 198 123 388 -106 158 97 -1 154
7680 154 55 389 345 18 476 267 -416 375 334 178 242 -136 -142 -65 -408 -57 66 569 28 -268 429 742
7702 742 -175 367 75 19 301 -55 541 480 696 30 -195 161 258 -728 143 12 -43 -255 344 -30 465
7723 465 -6 -245 -148 -589 -56 -276 -126 423 -241 456 335 -191 -268 160 -19 -229 529 563 316 -21 -403
7744 -403 -403 -207 -445 -37 -149 741 -271 -261 445 144 -383 -380 681 993 302 -2 162 580 -123 -105 310
7765 310 352 -67 -74 380 306 -167 -326 71 561 -297 -109 -28 -327 768 -444 104 473 -320 277 -213 510
7786 510 -463 752 -158 -105 149 -701 1008 -123 129 453 29 64 106 -204 -760 -722 -88 -80 119 8 465
7807 465 -112 64 94 -68 346 135 702 -8 -345 37 -395 -211 314 587 -192 -92 -322 321 774 458
7827 458 118 65 -679 457 -30 -184 717 235 438 189 220 199 -14 523 -188 31 530 726 -92 -142 -418
7848 -418 600 173 16 -475 210 -442 38 -183 182 658 -442 156 42 447 142 -547 719 143 -254
7867 -254 416 19 -320 420 108 -89 319 -209 255 -472 -94 -41 -183 -126 -13 -286 -67 46 -59 34 -132
7888 -132 -76 -69 -367 -152 -116 -171 15 -174 -207 97 -203 -83 -273 -73 159 -71 -24 -9 -307 18 14 53 122 63
7912 63 61 195 -7 52 218 -138 207 -31 155 151 -5 212 297 -144 293 -200 -100 70 -169 133 -17 -140
7934 -140 147 -34 54 12 -85 -204 150 -69 132 216 -84 178 36 257 -169 33 -29 121 128 -63 -143 133 -43
7957 -43 -9 -118 159 -86 185 -196 -33 -118 -28 -190 -116 -113 169 140 -152 141 86 -92 10 -36 -30 149 -149 0
7981 0 -181 205 263 82 8 91 -6 129 -255 -51 104 -118 -249 157 56 136 94 64 32 21 -252 -112 -95 163
8005 163 -57 -151 89 -109 15 -76 -79 -111 -185 -61 100 -128 115 312 251 239 245 -290 -22 -178 -86 11 -326 -22
8029 -22 -133 -6 418 -197 165 -36 196 -174 204 164 -16 -33 -139 14 -103 -167 -131 -178 -172 -124 -232 -200 -14
8052 -14 8 12 134 228 55 80 135 33 8 -79 -108 -237 34 53 107 -283 295 -27 -122 -75 -27 -194 -120 -327 28
8077 28 -11 150 -15 -37 -74 42 -80 -11 67 -186 76 34 -11 63 156 317 57 163 228 -67 -123 -168 29 -166
8101 -166 210 154 220 107 128 273 -60 193 -184 -324 137 -139 -50 -51 -116 -212 151 41 39 -8 19 206 -106 -122
8125 -122 -249 -16 -236 231 196 -193 -93 50 37 -414 -157 63 -16 -55 -38 192 269 66 60 224 7 -279 126
8148 126 -393 -71 -152 -116 8 69 226 315 141 96 59 149 -13 -136 -27 -9 236 65 -152 -311 198 -39 -92
8171 -92 -136 -64 -43 64 -177 -82 -114 -104 387 35 209 81 -75 154 23 46 247 240 81 -343
8191c43
##END NTUPLES=NMR FID
##END=
