##TITLE=1H_Pr Bzt-E
 CDCl3
 8 sc, 
 4.05.2022
##JCAMPDX= 6.0         $$ Bruker NMR JCAMP-DX V2.0
##DATA TYPE= NMR FID
##DATA CLASS= NTUPLES
##ORIGIN= UXNMR, Bruker Analytische Messtechnik GmbH
##OWNER= root
$$ XWIN-NMR		Version 3.5
$$ Wed May  4 16:08:35 2022 Russian Standard Time (UT+4h)  she@DPX200
##.OBSERVE FREQUENCY= 200.13135
##.OBSERVE NUCLEUS= ^1H
##.DELAY= (6, 6)
##.ACQUISITION MODE= SIMULTANEOUS
##.ACQUISITION SCHEME= undefined
##.AVERAGES= 8
##.DIGITISER RES= 18
##SPECTROMETER/DATA SYSTEM= spect
##.PULSE SEQUENCE= zg30
##.SOLVENT NAME= CDCl3
##.SHIFT REFERENCE= (INTERNAL, CDCl3, 0, 15.7039)
##AUDIT TRAIL= $$ (NUMBER, WHEN, WHO, WHERE, WHAT)
$$ ##TITLE= Audit trail, XWIN-NMR		Version 3.5
$$ ##JCAMPDX= 5.01
$$ ##ORIGIN= Bruker BioSpin GmbH
$$ ##OWNER= she
$$ F:/spectra/data/she/nmr/H-F/1/audita.txt
$$ ##AUDIT TRAIL=  $$ (NUMBER, WHEN, WHO, WHERE, WHAT)
(   1,<2022-05-04 16:06:57.78 +0400>,<she>,<DPX200>,
      <created by zg, POWCHK disabled, PULCHK disabled
       configuration hash MD5:
       00 E9 B6 7A A2 85 ED C7 34 08 36 98 17 FE 4E 26
       data hash MD5: 16K
       37 C3 34 68 92 D3 66 71 FB 23 27 05 72 74 AF A2>)
$$ ##END=
$$ 
$$ hash MD5
$$ 4E C5 2C 2F E5 93 36 BC 6C 2D 10 DF D5 2C FE 6C
##$RELAX= 
##$RELAX= 
##$RELAX= 
##$RELAX= 
##$RELAX= 
##$RELAX= 
$$ Bruker specific parameters
$$ --------------------------
##$DU= <F:/spectra>
##$EXPNO= 1
##$NAME= <H-F>
##$PROCNO= 1
##$TYPE= <nmr>
##$USER= <she>
##$AMP= (0..31)
100 100 100 100 100 100 100 100 100 100 100 100 100 100 100 100 100 100 
100 100 100 100 100 100 100 100 100 100 100 100 100 100 
##$AQSEQ= 0
##$AQ_mod= 1
##$AUNM= <au_zg>
##$AUTOPOS= <>
##$BF1= 200.13
##$BF2= 200.13
##$BF3= 200.13
##$BF4= 200.13
##$BF5= 200.13
##$BF6= 200.13
##$BF7= 200.13
##$BF8= 200.13
##$BYTORDA= 1
##$CFDGTYP= 0
##$CFRGTYP= 5
##$CHEMSTR= <none>
##$CNST= (0..31)
1 1 145 1 1 1 1 1 1 1 1 1 1 1 1 1 1 1 1 1 1 1 1 1 1 1 1 1 1 1 1 1 
##$CPDPRG= <>
##$CPDPRG1= <>
##$CPDPRG2= <>
##$CPDPRG3= <>
##$CPDPRG4= <mlev>
##$CPDPRG5= <mlev>
##$CPDPRG6= <mlev>
##$CPDPRG7= <mlev>
##$CPDPRG8= <mlev>
##$CPDPRGB= <>
##$CPDPRGT= <>
##$D= (0..31)
0 1.2 0 0 0 0 0 0 0 0.06 0 0.03 0 0 0 0 0.0002 0 0 0 0 0 0 0 0 0 0 0 0 
0 0 0 
##$DATE= 1651666017
##$DBL= (0..7)
120 120 120 120 120 120 120 120 
##$DBP= (0..7)
150 150 150 150 150 150 150 150 
##$DBP07= 0
##$DBPNAM0= <>
##$DBPNAM1= <>
##$DBPNAM2= <>
##$DBPNAM3= <>
##$DBPNAM4= <>
##$DBPNAM5= <>
##$DBPNAM6= <>
##$DBPNAM7= <>
##$DBPOAL= (0..7)
0.5 0.5 0.5 0.5 0.5 0.5 0.5 0.5 
##$DBPOFFS= (0..7)
0 0 0 0 0 0 0 0 
##$DE= 6
##$DECBNUC= <off>
##$DECIM= 32
##$DECNUC= <off>
##$DECSTAT= 4
##$DIGMOD= 1
##$DIGTYP= 9
##$DL= (0..7)
0 120 120 120 120 120 120 120 
##$DP= (0..7)
150 150 150 150 150 150 150 150 
##$DP07= 0
##$DPNAME0= <>
##$DPNAME1= <>
##$DPNAME2= <>
##$DPNAME3= <>
##$DPNAME4= <>
##$DPNAME5= <>
##$DPNAME6= <>
##$DPNAME7= <>
##$DPOAL= (0..7)
0.5 0.5 0.5 0.5 0.5 0.5 0.5 0.5 
##$DPOFFS= (0..7)
0 0 0 0 0 0 0 0 
##$DQDMODE= 0
##$DR= 18
##$DS= 0
##$DSLIST= <SSSSSSSSSSSSSSS>
$$ [...]
##$SUBNAM2= <"">
##$SUBNAM3= <"">
##$SUBNAM4= <"">
##$SUBNAM5= <"">
##$SUBNAM6= <"">
##$SUBNAM7= <"">
##$SUBNAM8= <"">
##$SUBNAM9= <"">
##$SW= 18.05172834244
##$SWIBOX= (0..15)
0 0 2 0 0 0 0 0 0 0 0 0 0 0 0 0 
##$SW_h= 3612.71676300578
##$TD= 16384
##$TD0= 1
##$TE= 0
##$TE2= 300
##$TE3= 300
##$TEG= 300
##$TL= (0..7)
0 120 120 120 120 120 120 120 
##$TP= (0..7)
150 150 150 150 150 150 150 150 
##$TP07= 0
##$TPNAME0= <>
##$TPNAME1= <>
##$TPNAME2= <>
##$TPNAME3= <>
##$TPNAME4= <>
##$TPNAME5= <>
##$TPNAME6= <>
##$TPNAME7= <>
##$TPOAL= (0..7)
0.5 0.5 0.5 0.5 0.5 0.5 0.5 0.5 
##$TPOFFS= (0..7)
0 0 0 0 0 0 0 0 
##$TUNHIN= 0
##$TUNHOUT= 0
##$TUNXOUT= 0
##$USERA1= <user>
##$USERA2= <user>
##$USERA3= <user>
##$USERA4= <user>
##$USERA5= <user>
##$V9= 5
##$VALIST= <valist>
##$VCLIST= <CCCCCCCCCCCCCCC>
##$VD= 0
##$VDLIST= <DDDDDDDDDDDDDDD>
##$VPLIST= <PPPPPPPPPPPPPPP>
##$VTLIST= <TTTTTTTTTTTTTTT>
##$WBST= 1024
##$WBSW= 4
##$XGAIN= (0..3)
0 0 0 0 
##$XL= 0
##$YL= 0
##$YMAX_a= 394368
##$YMIN_a= -386471
##$ZGOPTNS= <>
##$ZL1= 120
##$ZL2= 120
##$ZL3= 120
##$ZL4= 120
##$ABSF1= 10
##$ABSF2= 0
##$ABSG= 5
##$ABSL= 3
##$ALPHA= 0
##$AQORDER= 0
##$ASSFAC= 0
##$ASSFACI= 0
##$ASSFACX= 0
##$ASSWID= 0
##$AUNMP= <proc_1d>
##$AZFE= 0.1
##$AZFW= 0.1
##$BCFW= 1
##$BC_mod= 2
##$BYTORDP= 1
##$COROFFS= 0
##$CY= 11.3945322036743
##$DATMOD= 1
##$DC= 2
##$DFILT= <>
##$DTYPP= 0
##$F1P= 2.36226072786647
##$F2P= -0.459571619588291
##$FCOR= 0.5
##$FTSIZE= 0
##$FT_mod= 4
##$GAMMA= 1
##$GB= 0.15
##$INTBC= 1
##$INTSCL= 1
##$ISEN= 128
##$LB= 0.24
##$LEV0= 0
##$LPBIN= 0
##$MAXI= 10000
##$MC2= 0
##$MEAN= 0
##$ME_mod= 0
##$MI= 1.114404
##$NCOEF= 0
##$NC_proc= 0
##$NLEV= 6
##$NOISF1= 3.799351
##$NOISF2= 2.8
##$NSP= 1
##$NTH_PI= 0
##$NZP= 0
##$OFFSET= 15.70392
##$PC= 1
##$PHC0= -18396.28
##$PHC1= 11.00075
##$PH_mod= 1
##$PKNL= yes
##$PPARMOD= 0
##$PSCAL= 0
##$PSIGN= 0
##$REVERSE= no
##$SF= 200.130013532006
##$SI= 16384
##$SIGF1= 3
##$SIGF2= 2
##$SINO= 400
##$SIOLD= 16384
##$SREGLST= <1H.CDCl3>
##$SSB= 0
##$STSI= 0
##$STSR= 0
##$SW_p= 3612.71676300578
##$SYMM= 0
##$S_DEV= 0
##$TDeff= 0
##$TDoff= 0
##$TI= <>
##$TILT= no
##$TM1= 0
##$TM2= 0
##$TOPLEV= 0
##$USERP1= <user>
##$USERP2= <user>
##$USERP3= <user>
##$USERP4= <user>
##$USERP5= <user>
##$WDW= 1
##$XDIM= 8192
##$YMAX_p= 0
##$YMIN_p= 0
$$ End of Bruker specific parameters
$$ ---------------------------------
##NTUPLES= NMR FID
##VAR_NAME=  TIME,          FID/REAL,        FID/IMAG
##SYMBOL=    X,             R,               I
##VAR_TYPE=  INDEPENDENT,   DEPENDENT,       DEPENDENT
##VAR_FORM=  AFFN,          ASDF,            ASDF
##VAR_DIM=   8192,          8192,            8192
##UNITS=     SECONDS,       ARBITRARY UNITS, ARBITRARY UNITS
##FACTOR=    0.0002768,     1,               1
##FIRST=     0,             0,               0
##LAST=      2.2672688,     0,               0
##MIN=       0,             -386471,         0
##MAX=       2.2672688,     394368,          0
$$ Real data points
##PAGE= N=1
##DATA TABLE= (X++(R..R)), XYDATA
$$ plain form
0 0 0 0 0 0 0 0 0 0 -8 8 -8 8 -16 16 -24 32 -35 48 -56 64 -80 96 -112 134 -158 184 -211 248 -283 326 -373
31 -373 426 -483 547 -619 696 -782 874 -978 1090 -1216 1351 -1497 1659 -1834 2026 -2236
47 -2236 2465 -2715 2990 -3291 3627 -3996 4406 -4866 5386 -5972 6644 -7425 8340 -9438
61 -9438 10771 -12440 14597 -17507 21662 -28133 39714 -67025 273029 120717 -128746 324122
73 324122 286887 77865 -122168 30677 -158348 -46163 -59086 -139735 -189127 -80780 115815
84 115815 -12428 -62821 -123230 52543 75470 -86772 -113977 -107392 29016 -61408 -20758
95 -20758 -37663 71552 146903 146679 165323 59885 145651 128090 97215 -23310 -44354 -53246
107 -53246 -153924 -77556 -103737 -124729 -152247 10467 26492 -55952 -6294 9983 92143 35467
$$ packed form
0@%%%%%%%%qJ6j6J6k4L2m0N6o7Q3j04J20j44J76k08K46k92L42l95M59n31O09o99
31c73P99r09J030j166J315j478J656j852K068k306K567k848L156l493L860m262
47b236M701n180N705o281O918p623Q402r272J0252j1358J2616j4069J5765j7778
61i438K0209k3211K7037l2104L9169m9795O7847j06739L40054j52312k49463M52868
73C24122l7235k09022k00033J52845j89025J12185j2923q0649m9392J08347J96595
84A15815j28243n0393o0409J75773K2927j62242k7205O585J36408r0424M0650
95b0758j6905J09215P5351k24J8644j05438Q5766j7561l0875j20525k1044q892
107e3246j00678P6368k6181k0992k7518J62714J6025q2444M9658J6277Q2160n6676
$$ plain form
119 35467 -15702 -66727 16115 16934 -58291 40932 31748 5018 50899 204689 73860 -49630
131 -49630 123769 169897 8713 -143887 -43746 -40568 -94138 -128167 -132869 -98202 -77978 28086
143 28086 2371 -19950 18100 119926 111316 -11620 -777 41614 61643 -25551 -28794 1157
155 1157 17966 33933 14527 45824 30318 65292 57260 -3828 -56020 -27549 -5720 -112511
167 -112511 -115678 -70370 -52370 -80753 -34363 26125 14376 47376 60997 78033 66379 59135
179 59135 30217 31691 36455 -32205 -22245 -740 -10926 -34000 10020 22764 -22529 10886 31953
192 31953 -6818 -56384 -12300 -14582 -69645 -65063 -42971 -26436 -29940 9944 18970 20153 53338
205 53338 84058 67592 26515 51803 49467 16323 -25890 -26814 -6892 -24938 -40920 -40821 -6654
$$ packed form
119C5467n1169n1025Q2842Q19p5225R9223r184k6730M5881J53790j30829j23490
131d9630J73399M6128j61184j52600J00141L178n3570l4029m702L4667K0224J06064
143B8086k5715k2321L8050J01826q610j22936J0843M2391K0029q7194l243K9951
155A157J6809J5967j9406L1297j5506L4974q032o1088n2192K8471K1829j06791
167a12511l167M5308J8000k8383M6390O0488j1749L3000J3621J7036j1654p244
179E9135k8918J474M764o8660R960K1505j0186k3074M4020J2744m5293L3415K1067
192C1953l8771m9566M4084k282n5063M582K2092J6535l504L9884R026J183L3185
205E3338L0720j6466m1077K5288k336l3144m2213r24J9922j8046j5982R9L4167
$$ plain form
218 -6654 -7312 -10977 -400 3022 -10040 -11541 12404 -30649 -49061 -4452 14881 -27353 -34396
231 -34396 23863 43618 34772 24482 39511 45649 45543 27799 -5415 -843 -6688 -18150 -28430
244 -28430 -36389 -41385 -19997 -247 -22855 -19704 7868 19319 -9211 -7350 15562 -2167 -9553
257 -9553 1860 175 -14386 7157 21349 7776 10432 28526 29451 4516 13994 20702 101
270 101 -12089 -11137 -12809 -23329 -21915 -19962 -9409 -10725 -11939 -239 7846 8149 524 12113 10692
285 10692 -4648 2641 13527 -5642 -15492 10945 11554 -5848 -4340 13362 11120 -1817 5064
298 5064 2999 -2491 -552 -2028 -11432 -7939 -2409 -5052 -1229 -6787 -5619 6575 11538 -2840 -7460
313 -7460 13655 11940 -9644 -5023 11726 -3069 -10379 2959 -1750 -9514 -1312 6894 -4118 -6787
$$ packed form
218f654o58l665J0577L422j3062j501K3945m3053j8412M4609J9333m2234p043
231c4396N8259J9755q846j0290J5029O138j06j7744l3214M572n845j1462j0280
244b8430p959m996K1388J9750k2608L151K7572J1451k8530J861K2912j7729p386
257i553J1413j685j4561K1543J4192j3573K656J8094R25k4935R478O708k0601
270A01j2190R52j672j0520J414J953J0553j316j214J1700Q085L03p625J1589j421
285A0692j5340P289J0886j9169r850K6437O09j7402J508J7702k242j2937O881
298E064k065n490J939j476r404L493N530k643L823n558J168J2194M963j4378m620
313g460K1115j715k1584M621J6749j4795p310J3338m709p764Q202Q206j1012k669
$$ plain form
327 -6787 5441 4871 329 4691 4885 -237 7393 5964 -833 1937 1236 -3569 -4028 271 -3032 -6660
343 -6660 -4095 -2634 -2936 1141 -575 -8085 2734 5911 -7198 -5818 4969 499 -7729 1369 6255
358 6255 1158 3890 13769 8711 2657 10904 8688 474 -734 -2180 -5650 -6955 -10294 -12941 -6407
373 -6407 -2828 -8627 -8903 5572 7505 -2954 5014 9653 -2269 -2506 8825 1367 -9302 -1735
387 -1735 5775 3199 3219 5875 1272 4798 12101 3050 -2652 413 -5533 -9512 -4060 -12105 -20213 -8863
403 -8863 1288 -3216 -6378 3092 10452 12950 13062 4038 203 9434 9353 -2096 -5734 -5305 -2284 2063
419 2063 -447 -3973 -3895 5168 12815 2427 -9002 -2500 3195 -4529 -13477 -16141 -9982 -2836 -959
434 -959 -4837 -1457 13603 16265 9614 12223 10712 5133 13199 7022 -13066 -9973 505 -6339 -12049
$$ packed form
327f787J2228n70m542M362J94n122P630j429o797K770p01m805m59M299l303l628
343f660K565J461l02M077j716p510J0819L177j3109J380J0787m470q228R098M886
358F255n097K732R879n058o054Q247k216q214j208j446l470j305l339k647O534
373f407L579n799k76J4475J933j0459P968M639j1922k37J1331p458j0669P567
387a735P510k576K0K656m603L526P303r051n702L065n946l979N452q045q108J1350
403h863J0151m504l162R470P360K498J12r024l835R231q1j1449l638M29L021M347
419B063k510l526P8R063P647j0388j1429O502N695p724q948k664O159P146J877
434i59l878L380J5060K662o651K609j511n579Q066o177k0088L093J0478o844n710
$$ plain form
449 -12049 -7752 -7203 -2393 8936 1746 -12715 -2150 10224 -1037 -10769 -12308 -8737 5071 6528
463 6528 -4805 -2130 9818 16313 17756 12968 7739 10334 14179 6633 -9206 -14719 -9243 -6766
477 -6766 -12415 -20825 -14138 -931 -3861 -4182 5899 311 -2588 9168 5749 -5304 -3308 957
491 957 4124 7041 -1341 -6633 11820 25200 9525 3898 15553 6864 -4190 1904 -5312 -17060
505 -17060 -12319 -11942 -17085 -14156 -10207 -4292 3561 2788 -1268 5003 12978 8676 1000 1913 5514 6891
521 6891 -2651 -10787 3382 12672 3182 6171 11234 -2512 -1890 12622 5841 -10756 -13469 -6794
535 -6794 -2405 -9520 -22554 -14110 7090 1800 -13337 828 12279 1481 6696 17922 6724
548 6724 -1229 2442 1388 3055 2426 -3552 1891 6820 -4674 -6689 8273 8700 -3667 -1870 -241
$$ packed form
449a2049M297N49M810J1329p190j4461J0565J2374j1261r732j539L571J3808J457
463F528j1333K675J1948O495J443m788n229K595L845p546j5839n513N476K477
477f766n649q410O687J3207k930l21J0081n588k899J1756l419j1053J996M265
491I57L167K917q382n292J8453J3380j5675n627J1655q689j1054O094p216j1748
505a7060M741L77n143K929L949N915P853p73m056O271P975m302p676R13L601J377
521F891r542q136J4169R290r490K989N063j3746O22J4512o781j6597k713O675
535f794M389p115j3034Q444K1200n290j5137J4165J1451j0798N215J1226j1198
548F724p953L671j054J667o29n978N443M929j1494k015J4962M27j2367J797J629
$$ plain form
563 -241 -8828 -9705 -6117 -6719 -5167 -7860 -8637 4904 7423 -812 8708 17555 8581 2348 6355 5227
579 5227 -2158 -5445 -486 4403 -3161 -16154 -8881 8825 5385 -4598 -48 1362 -1891 928 -3557
594 -3557 -5025 1492 -4333 -8361 2559 932 -5053 9425 15180 -2375 -1805 15233 5986 -8669
608 -8669 249 3956 -3620 -4557 -9720 -11340 1422 3544 -4289 -1815 1038 -906 4448 7597 129
623 129 -4183 3793 6178 -1193 -4370 -1015 4206 5451 -1210 -3582 1587 2620 1691 -120 -2717 62
639 62 -470 -6465 -3166 -1465 -6296 -1381 4687 -3289 -7587 3613 8177 488 2115 2631 -4151 2942
655 2942 10338 -925 -4245 2120 332 1663 3006 -5197 -4913 6724 3749 -8461 -4219 4495 -1208
670 -1208 -3755 -46 -2797 -1914 2854 -2057 -4677 452 3030 2250 -1211 -3657 1488 7639 5555 -2062
$$ packed form
563b41q587q77L588o02J552k693p77J3541K519q235R520Q847q974o233M007j128
579E227p385l287M959M889p564j2993P273J7706l440r983M550J410l253K819m485
594c557j468O517n825m028J0920j627n985J4478N755j7555N70J7038r247j4655
608h669Q918L707p576r37n163j620J2762K122p833K474K853j944N354L149p468
623A29m312P976K385p371l177L355N221J245o661k372N169J033r29j811k597K779
639F2n32n995L299J701m831M915O068p976m298J1200M564p689J627N16o782P093
655B942P396j1263l320O365j788J331J343q203K84J1637k975j2210M242Q714n703
670a208k547L709k751Q83M768m911k620N129K578p80l461k446N145O151k084p617
$$ plain form
686 -2062 -3293 3486 3988 -852 -2021 -1923 -1746 -255 -606 -2924 -3215 2356 6261 -558 -2457 3423 1723
703 1723 771 4019 -1644 -6367 59 -454 -6581 -3785 2521 -1294 -3211 3412 799 -3424 4782 6237
719 6237 -1710 -1466 498 -1561 303 945 -926 555 4087 2842 986 3997 5148 2464 2704 790
735 790 -5903 -5538 -2803 -6194 -7176 -5511 -4207 -3297 -2502 -423 3454 6911 5703 399 929 5718 3125
752 3125 -218 1890 1010 -1487 1470 4027 1143 906 7077 5845 -2217 -2229 1208 -4741 -7921 -6289
768 -6289 -8862 -9560 -6167 -6306 -5157 415 4891 4307 5072 7719 5950 6050 7931 3556 -261 1125
784 1125 -615 -2280 -692 -23 1079 2369 1275 -364 613 489 -3333 -5354 -3683 -7704 -12570 -6824
800 -6824 -2526 -5288 -3367 2909 5653 6305 9052 11083 8472 6885 7196 2091 -1064 -1097 -4033 -5277
$$ packed form
686b062j231O779N02m840j169R8J77J491l51k318k91N571L905o819j899N880j700
703A723r52L248n663m723O426n13o127K796O306l815j917O623k613m223Q206J455
719F237p947K44J964k059J864O42j871J481L532j245j856L011J151k684K40j914
735G90o693L65K735l391r82J665J304R10P95K079L877L457j208n304N30M789k593
752C125l343K108q80k497K957K557k884k37O171j232q062j2L437n949l180J632
768f289k573o98L393j39J149N572M476n84P65K647j769J00J881m375l817J386
784A125j740j665J588O69J102J290j094j639R77j24l822k021J671m021m866N746
800f824M298k762J921O276K744O52K747K031k611j587L11n105l155l3k936j244
$$ plain form
816 -5277 -1985 -1951 -3471 -744 1177 -629 -584 2074 -791 -6146 -3791 -2814 -6556 -5677 -2953 -1631 1323
833 1323 3563 5147 7617 9108 8956 7412 5301 1846 -1534 -963 -2449 -8368 -7625 -3996 -5100 -4487
849 -4487 -1034 564 788 1693 3796 2497 -308 -28 -1625 -3113 -297 -752 -2672 1759 4795 3609
865 3609 4977 7442 5931 2070 2612 2418 -3960 -5519 -4497 -7726 -7590 -5926 -6541 -2786 1411 1094
881 1094 2160 5233 4575 2350 4337 5178 -1701 -2713 2881 1353 -1589 510 773 1727 3492 2202
897 2202 915 243 -982 -1472 -3082 -4826 -6576 -6252 -3121 -2999 -4220 -251 3625 2720 2787 4941 5994
914 5994 3207 2619 4972 1120 -1856 1644 -98 -3000 -455 -767 -3307 -240 1489 -1210 -1468 705
930 705 -1732 -3305 -112 -1656 -4123 -301 -694 -2858 1567 2179 -94 3074 3471 189 2713 5453
$$ packed form
816e277L292L4j520K727J921j806M5K658k865n355K355R77l742Q79K724J322K954
833A323K240J584K470J491j52j544k111l455l380N71j486n919P43L629j104O13
849d487L453J598K24R05K103j299k805K80j597j488K816m55j920M431L036j186
865C609J368K465j511l861N42j94o378j559J022l229J36J664o15L755M197l17
881A094J066L073o58k225J987Q41o879j012N594j528k942K099K63R54J765j290
897B202j287o72j225m90j610j744j750L24L131J22j221L969L876r05O7K154J053
914E994k787n88K353l852k976L500j742k902K545l12k540L067J729k699k58K173
930G05k437j573L193j544k467L822l93k164M425O12k273L168L97l282K524K740
$$ plain form
946 5453 854 -2792 1755 2644 -2268 -3196 -1392 -351 490 -2007 -3510 307 836 295 725 -1091 -1316
963 -1316 2531 3101 31 -2708 -2228 1700 1714 -2886 -4532 -1465 426 734 1193 -1145 -2305 3140 4927
980 4927 -530 348 3787 -937 -857 3156 -2138 -3652 2986 1988 -2404 1 2504 1983 2207 -47 -3438
997 -3438 -430 475 -7539 -6847 -904 -5036 -5845 116 -1128 -2402 4200 8091 5543 4127 5312 6286
1013 6286 4630 630 -1128 847 2058 -2725 -4537 -1647 -261 1346 875 -2105 -1753 -2143 -2756 -2355
1029 -2355 -6770 -10019 -4300 -2517 -6473 -4678 656 4615 9485 11097 5974 6385 13475 10007 2082
1044 2082 3642 173 -7485 -4245 -1439 -7344 -7895 -2696 -92 -83 -2966 -3004 1774 1390 -5952 -6880 -1301
1061 -1301 -5679 -9983 -2033 2940 1562 7382 11394 8573 10411 13728 13757 9233 747 -4261 -3926 -6059
$$ packed form
946E453m599l646M547Q89m912r28J804J041Q41k497j503L817N29n41M30j816k25
963a316L847N70l070k739M80L928J4m600j646L067J891L08M59k338j160N445J787
980D927n457Q78L439m724Q0M013n294j514O638r98m392K405K503n21K24k254l391
997c438L008R05q014O92N943m132q09N961j244j274O602L891k548j416J185R74
1013F286j656m000j758J975J211m783j812K890J386J607m71k980L52l90o13M01
1029b355m415l249N719J783l956J795N334L959M870J612n123M11P090l468p925
1044B082J560l469p658L240K806n905n51N199K604Rk883l8M778l84p342r28N579
1061a301m378m304P950M973j378N820M012k821J838L317K9m524q486n008L35k133
$$ plain form
1077 -6059 -10833 -12377 -9855 -7929 -6702 -3878 -1172 1726 4201 2501 1328 1268 -2507 -2145 -64 -3190
1093 -3190 -1785 3469 4448 6025 9547 10421 11686 13650 8465 -351 -2063 -2420 -9784 -13915 -12769 -16252
1109 -16252 -14908 -8500 -5425 -1701 2623 4555 8923 10900 5274 3693 7463 3820 -2772 -543 2417
1124 2417 -2089 -682 7511 7929 5225 7259 6380 2507 -1664 -4678 -6326 -13087 -19401 -16494 -11818
1139 -11818 -11773 -8854 -1982 3566 7488 12758 15348 13673 13135 11784 7270 3120 -504 -3119 -2812 -3863
1155 -3863 -4242 -569 614 -341 2785 2711 -1098 -2384 -5030 -11294 -14237 -12077 -12282 -11852 -7001 -2694
1171 -2694 883 9093 15223 16572 18771 17815 13387 11662 7097 -89 -3616 -6252 -10120 -11184 -8424
1186 -8424 -6476 -5528 -2364 879 121 -1741 -2594 -3200 -5198 -8847 -8767 -5870 -7458 -5964 3548 9395
$$ packed form
1077f059m774j544K522J926J227K824K706K898K475j700j173o0l775L62K081l126
1093c190J405N254R79J577L522Q74J265J964n185q816j712l57p364m131J146l483
1109a6252J344O408L075L724M324J932M368J977n626j581L770l643o592K229K960
1124B417m506J407Q193M18k704K034q79l873m171l014j648o761o314K907M676
1139a1818M5K919O872N548L922N270K590j675n38j351m514m150l624k615L07j051
1155c863l79L673J183r55L126p4l809j286k646o264k943K160k05M30M851M307
1171b694L577Q210O130J349K199r56m428j725m565p186l527k636l868j064K760
1186h424J948R48L164L243p58j862q53o06j998l649Q0K897j588J494R512N847
$$ plain form
1202 9395 10789 14461 18182 18100 15448 12870 9545 2415 -4576 -8374 -11225 -15322 -16601 -12074 -7665
1217 -7665 -8545 -5515 972 1369 534 3795 2823 -1372 -2907 -2956 -3800 -2656 1756 5707 6618 9852 13645
1234 13645 14902 14680 12142 8860 3263 -4021 -7829 -11809 -17122 -16885 -14223 -13795 -10593 -5003 -1420
1249 -1420 2251 5889 8500 7855 5034 3328 2224 1586 260 -612 1264 3122 3090 6201 9981 9442
1265 9442 8495 6798 2555 -2258 -6947 -9644 -11848 -14969 -15874 -13940 -9975 -6432 -2584 4911 8916
1280 8916 8156 9749 12622 9668 5526 3709 2773 -591 -3519 -2163 -676 -1407 1702 5136 3544 1504
1296 1504 1915 694 -3325 -6535 -7890 -10498 -12387 -10533 -8793 -5988 -495 3585 7103 10426 11928
1311 11928 12262 11940 9580 6735 2968 -1733 -4332 -4985 -5036 -5792 -5361 -2259 -1829 -1154 1391 589 -1912
$$ packed form
1202I395J394L672L721q2k652k578l325p130o991l798k851m097j279M527M409
1217g665q80L030O487L97q35L261r72m195j535m9q44J144M412L951R11L234L793
1234A3645J257k22k538l282n597p284l808l980n313K37K662M28L202N590L583
1249a420L671L638K611o45k821j706j104o38j326q72J876J858l2L111L780n39
1265I442r47j697m243m813m689k697k204l121r05J934L965L543L848P495M005
1280H916p60J593K873k954m142j817r36l364k928J356J487p31L109L434j592k040
1296A504M11j221m019l210j355k608j889J854J740K805N493M080L518L323J502
1311A1928L34l22k360k845l767m701k599o53n1p56M31L102M30O75K545q02k501
$$ plain form
1328 -1912 -1930 -2695 -5326 -7156 -6593 -4539 -3697 -1380 2673 5982 7720 9971 11000 11057 9700 6098 2864
1345 2864 -47 -3270 -6185 -7865 -7147 -7434 -7514 -4082 -2511 -2483 590 2538 573 -1052 -141 -412 -1868
1362 -1868 -2166 -1121 -657 744 3172 4919 6935 7314 6785 7855 6414 2293 426 -1628 -5587 -7079
1378 -7079 -7171 -7923 -8249 -5847 -3430 -1971 -502 1514 2261 3053 2692 1496 748 1374 660 -106 -157 1048
1396 1048 2748 2444 3517 5111 3818 2204 2936 1395 -1609 -3142 -3889 -5559 -6220 -5193 -4461 -3681
1412 -3681 -1662 -831 611 3527 2346 1563 3746 3363 759 774 664 -39 -140 235 385 532 1173 1450
1430 1450 1277 1802 162 -1129 365 -524 -3158 -2457 -2442 -2247 -1784 -1222 -16 -122 -53 2379 3013 690
1448 690 215 1118 1673 -453 -573 -604 -1326 -271 -335 -1238 64 1470 -672 448 1737 -20 -103 1674
$$ packed form
1328a912j8p65k631j830N63K054Q42K317M053L309J738K251J029N7j357l602l234
1345B864k911l223k915j680P18k87q0L432J571K8L073J948j965j625R11k71j456
1362a868k98J045M64J401K428J747K016L79n29J070j441m121j867k054l959j492
1378g079r2p52l26K402K417J459J469K016P47P92l61j196p48O26p14p66n1J205
1396A048J700l04J073J594j293j614P32j541l004j533p47j670o61J027P32P80
1412c681K019Q31J442K916j181p83K183l83k604J5j10p03j01L75J50J47O41K77
1430A450j73N25j640j291J494q89k634P01J5J95M63N62J206j06O9K432O34k323
1448F90m75R03N55k126j20l1p22J055o4r03J302J406k142J120J289j757q3J777
$$ plain form
1466 1674 559 -867 511 426 -577 -358 771 -791 -636 -74 -1093 -236 874 -1806 -1271 1064 185
1483 185 -762 -181 -326 -28 639 432 -304 -424 381 655 1370 1525 874 733 1334 1419 1225 -73 -989 -454
1503 -454 -1796 -2632 -1242 -2456 -3297 -785 -103 -1334 -60 1530 1156 1869 2780 403 -27 1790 295
1520 295 -1303 1009 316 -1466 839 1230 -178 1579 2102 -573 -581 566 -2016 -3315 -1909 -2531 -3978
1537 -3978 -1600 -1103 -1427 1223 2252 2210 3326 3663 2454 2372 1305 3 169 -380 -1986 -2739 -1963 -216
1555 -216 37 -716 -44 577 -54 -479 390 -847 -3068 -2323 -1230 -2329 -1327 617 49 1579 4571
1572 4571 3950 3301 4787 2775 1085 2459 847 -3564 -3585 -2451 -4412 -3738 -1262 -2409 -1993 749
1588 749 300 806 2657 530 -1073 597 243 -1443 -687 787 405 1036 3077 3406 3064 4093 3244
$$ packed form
1466A674j115j426J378q5j003K19J129j562J55N62j019Q57J110k680N35K335q79
1483A85r47N81j45K98O67k07p36j20Q05K74P15J55o51j41O01Q5j94j298r16N35
1503d54j342q36J390j214q41K512O82j231J274J590l74P13R11k377m30J817j495
1520B95j598K312o93j782K305L91j408J757N23k675qJ147k582j299J406o22j447
1537c978K378M97l24K650J029m2J116L37j209q2j067j302J66n49j606p53P76J747
1555b16K53p53O72O21o31m25Q69j237k221P45J093j099J002J944n68J530K992
1572D571o21o49J486k012j690J374j612m411k1J134j961O74K476j147M16K742
1588G49m49N06J851k127j603J670l54j686P56J474l82O31K041L29l42J029q49
$$ plain form
1605 3244 2793 1256 -1035 -2472 -2908 -4470 -5441 -4673 -3862 -3577 -3475 -477 2447 1667 755 3249 3141
1622 3141 903 1555 2344 -316 -1368 1550 1612 10 2410 2966 1608 2769 2713 426 108 -1262 -4035
1639 -4035 -3783 -3344 -5833 -6286 -3582 -1924 -1753 676 1923 1108 3922 4638 2956 3303 2378 -199 209
1656 209 1325 50 -716 343 820 -29 1023 2389 802 -579 -497 -1260 -2796 -3818 -4081 -3657 -3067
1673 -3067 -2539 -1448 -563 1067 2516 2484 4597 5283 2249 1824 2571 986 -658 130 -184 -2494 -1781
1690 -1781 461 -6 -434 920 276 33 -451 -1728 -1347 -1025 -2775 -2916 -1195 -1359 -2085 623 2537
1707 2537 2184 2394 3545 1971 970 2712 1554 -676 -807 -1957 -2655 -1726 -1309 -993 -601 98 38 -597
1725 -597 221 1690 308 -669 263 -482 -1805 -1120 134 455 415 1424 1484 1021 1529 1332 896 1675 23
$$ packed form
1605C244m51j537k291j437m36j562r71P68Q11K85J02K998K924p80r12K494j08
1622C141k238O52P89k660j052K918O2j602K400N56j358J161n6k287l18j370k773
1639d035K52M39k489m53K704J658J71K429J247q15K814P16j682L47r25k577M08
1656B09J116j275p66J059M77q49J052J366j587j381Q2p63j536j022k63M24N90
1673c067N28J091Q85J630J449l2K113O86l034m25P47j585j644P88l14k310P13
1690a781K242m67m28J354o44k43m84j277L81L22j750j41J721j64p26K708J914
1707B537l53K10J151j574j001J742j158k230j31j150o98R29M17L16L92O99o0o35
1725e97Q18J469j382r77R32p45j323O85J254L21m0J009O0m63N08j97m36P79j652
$$ plain form
1744 23 -1944 -1337 -1537 -2169 -1053 -506 -1468 -1595 209 1134 686 1361 1483 791 849 274 -652 901 633
1763 633 -889 141 546 -592 -727 854 994 -97 -385 19 -1057 -1808 -150 -97 -1233 -1150 -565 22
1781 22 -296 153 1604 1500 1278 742 728 1167 1244 267 278 102 -1118 -1050 -42 -145 -515 -492 -244 -411 -147
1802 -147 -85 -377 -259 216 -472 -402 685 -863 -521 896 848 -516 -385 946 951 -178 671 871 -42 77
1822 77 23 -457 -221 -304 -287 -230 -849 -908 -287 118 287 317 379 806 -93 -153 843 649 -890 -968 -145 -205 -917
1845 -917 -693 247 -543 -252 53 499 723 390 165 959 29 -468 411 608 -237 -593 547 600 -254 407
1865 407 1208 -29 -281 213 -301 -624 -1044 -1400 -993 -945 -1036 -884 -854 106 945 721 1070 1218 999 920 1082
1886 1082 751 -85 -186 631 -328 -562 640 500 -140 186 115 303 -310 -1330 -563 -707 -1925 -2102 -1210
$$ packed form
1744B3j967O07k00o32J116N47r62j27J804R25m48O75J22o92N8n75r26J553k68
1763F33j522J030M05j138j35J581J40j091k88M04j076p51J658N3j136Q3N85N87
1781B2l18M49J451j04k22n36j4M39P7r77J1j76j220O8J008j03l70K3K48j67K64
1802a47O2k92J18M75o88P0J087j548L42J417m8j364J31J331Nj129Q49K00r13J19
1822G7n4m80K36q3J7N7o19n9O21M05J69L0O2M27q99o0R96j94j539p8Q23o0p12
1845i17K24R40p90K91L05M46K24l33k25P94r30m97Q79J97q45l56J140N3q54O61
1865D07Q01j237k52M94n14l23m20l56M07M8r1J52L0R60Q39k24L49J48k19p9J62
1886A082l31q36j01Q17r59k34J202j40o40L26p1J88o13j020P67j44j218j77Q92
$$ plain form
1905 -1210 -1023 -1365 -203 617 543 1010 2386 1827 1159 1743 1203 1134 894 -517 -679 336 -13 -921 -201
1924 -201 289 -365 -764 439 532 -1096 -1384 -1279 -1109 -1514 -1988 -853 70 -526 757 1341 1315 1454 2493
1943 2493 2248 1414 510 495 794 -256 -992 -1581 -1011 -447 -960 -447 355 -173 -335 128 -256 -316 -1172 -1525
1963 -1525 -355 -387 -900 -71 921 437 677 1992 2099 817 1188 1262 386 -454 -435 -1006 -956 -1375 -1742 -547
1983 -547 -377 -747 -170 385 268 407 593 534 89 -258 -364 -490 76 -39 -862 663 790 428 1033 1015
2003 1015 24 -27 177 -45 -938 -1675 -1044 -671 -1203 -1231 -377 304 521 518 1276 963 967 1014 466 151 199 -462
2025 -462 -261 452 -648 -419 450 56 -459 549 543 -549 -650 -602 -1076 -1134 -777 -1263 -1029 -386 -459 550
2045 550 1635 730 594 1836 1231 724 933 388 -536 -115 351 -526 -1007 -103 -469 -503 253 -355 -506 -342
$$ packed form
1905a210J87l42J162Q20p4M67J376n59o68N84n40o9k40j411j62J015l49r08P20
1924b01M90o54l99J203R3j628k88J05J70m05m74J135R23n96J283N84k6J39J039
1943B493k45q34r04j5K99j050p36n89N70N64n13N13Q02n28j62M63l84o0q56l53
1963a525J170l2n13Q29R92m84K40J315J07j282L71P4q76q40J9n71N0m19l67J195
1983e47J70l70N77N55j17J39J86n9m45l47j06j26N66j15q23J525J27l62O05j8
2003A015r91n1K04k22q93p37O31L73n32k8Q54O81K17lP58l13MM7n48l15M8o61
2025d62K01P13j100K29Q69l94n15J008oj092j01M8m74n8L57m86K34O43p3J009
2045E50J085r05j36J242o05n07K09n45r24M21M66q77m81R04l66l4P56o08j51J64
$$ plain form
2065 -342 -720 -536 -5 -347 -413 -750 -536 439 654 682 1011 545 1149 1093 1259 632 -147 235 77 -291 -646
2086 -646 -773 -929 20 -829 -1136 436 -487 -1283 -85 893 -400 -557 -12 134 -339 615 607 -337 310 312
2106 312 286 907 201 -381 661 602 -873 70 851 -523 -780 386 590 -704 -709 348 65 -115 57
2125 57 -376 -86 -19 -100 595 300 -588 -444 -83 177 -86 -501 -125 -554 -756 323 1226 794 -66 397 1005
2146 1005 665 839 409 -488 71 -12 -893 -623 116 -1176 -784 588 150 -863 -273 190 -192 -213 204
2165 204 -779 -937 -726 -490 441 900 48 592 1963 1229 1184 2176 1707 -90 -356 124 -492 -1649 -1421
2184 -1421 -1049 -1473 -1121 -924 -354 -43 -21 93 409 -370 -1018 -586 -116 -427 -165 61 736 233 1088 2627
2204 2627 2295 1613 1521 1308 437 -425 -1023 -1457 -2150 -1559 -1930 -2426 -1218 -415 -279 587 1128 204 604 797
$$ packed form
2065c42l78J84N31l42o6l37K14R75K15K8L29m66O04n6J66o27p79L82j58l68l55
2086f46j27j56R49q49l07J572r23p96J198R78j293j57N45J46m73R54qr44O47K
2106C12k6O21p06n82J042n9j475R43P81j374k57J166K04j294nJ057k83j80J72
2125E7m33K90O7q1O95k95q88J44L61K60k63m15L76m29k02J079R03m32q60M63O08
2146A005l40J74m30q97N59q3q81K70P39j292L92J372m38j013N90M63l82k1M17
2165B04r83j58K11K36R31M59q52N44J371p34m5R92m69j797k66M80o16j157K28
2184a421L72m24L52J97N70L11K2J14L16p79o48M32M70l11K62K26O75n03Q55J539
2204B627l32o82r2k13q71q62n98m34o93N91l71m96J208Q03J36Q66N41r24M00J93
$$ plain form
2224 797 407 133 -211 -429 -768 -334 374 1165 1708 1653 1226 1728 1747 335 -214 -506 -1836 -2830 -2858 -2756
2244 -2756 -2799 -2075 -667 -308 593 1477 1798 2228 2293 1844 1702 720 -369 -697 -525 -324 -612 97 1032 823
2264 823 -85 1358 1434 -38 -865 -1041 -2386 -3199 -2912 -2609 -2329 -2122 -113 1308 1881 2718 3337 4080 3958
2283 3958 2201 1585 1018 -203 -1170 -1440 -1920 -1731 -1384 -792 -239 171 339 -114 -141 -234 -1641 -2446 -1888
2302 -1888 -2131 -2382 -1378 -267 999 1768 3829 4674 4108 3947 3961 2972 1321 -373 -1519 -2593 -3498
2319 -3498 -3637 -3125 -2807 -2036 -1567 -292 459 458 -151 297 -152 -920 -1183 -986 -1085 -319 936 1942 2650 3388
2339 3388 4400 4840 3684 2559 1675 543 -1440 -3296 -3883 -4252 -5123 -4383 -2988 -2599 -1406 133 1151
2356 1151 1599 1540 1191 978 312 177 -395 -51 238 594 1416 2500 3013 3048 3142 2843 1948 -234 -1085 -1998
$$ packed form
2224G97l90k74l44k18l39M34P08P91N43n5m27N02J9j412n49k92j330r94k8J02
2244b756m3P24J408L59R01Q84L21M30O5m49j42r82j089l28J72K01k88P09R35k09
2264H23r08J443P6j472q27j76j345q13K87L03K80K07K009J421N73Q37O19P43j22
2283C958j757o16n67j221r67k70m80J89L47N92N53M10J68m53k7r3j407q05N58
2302a888k43k51J004J111J266P69K061Q45n66j61J4r89j651j694j146j074r05
2319c498j39N12L18P71M69J275P51jo09M48m49p68k63J97r9P66J255J006P08P38
2339C388J012M40j156j125q84j132j983j856n87l69q71P40J395L89J193J539J018
2356A151M48n9l49k13o66j35n72L44K89L56Q22J084N13L5R4k99q95k182q51r13
$$ plain form
2376 -1998 -3462 -4494 -4842 -4765 -3736 -2908 -1359 211 1259 2121 2682 3023 2608 2075 1612 626 -182 -47
2394 -47 138 -474 312 1450 1862 1881 1471 1455 928 -241 -1492 -2572 -3327 -3609 -4470 -4034 -2477 -1952 -569
2413 -569 1720 2473 2870 3303 3869 3288 2372 1254 865 -210 -1137 -1445 -852 -631 -1188 14 966 664 340
2432 340 155 -404 -1177 -2001 -2615 -2629 -2538 -2422 -1169 -369 763 2070 2871 3503 3514 3599 2900 1971 735 -698
2452 -698 -1504 -1362 -2289 -2983 -1719 -1228 -1777 -746 530 693 -48 -170 16 -481 -814 -976 -982 -958 -139 442
2472 442 1810 2149 2389 3151 3166 2592 1463 705 -62 -1101 -2458 -2219 -2579 -2748 -2571 -1845 -905 -161 62
2491 62 706 929 1000 570 310 555 322 -546 163 447 354 904 2003 1262 1221 1884 1403 220 -314 -572 -1706
2512 -1706 -1769 -1982 -2693 -1905 -1390 -1530 -761 229 684 723 1275 1225 1135 751 595 370 144 245 184 7 552
$$ packed form
2376a998j464j032l48P7J029Q28J549J570J048Q62N61L41m15n33m63r86q08J35
2394d7J85o12P86J138M12J9m10j6n27j169j251j080p55k82q61M36J557N25J383
2413e69K289P53L97M33N66n81r16j118l89j075r27l08N93K21n57J202R52l02l24
2432C40j85n59p73q24o14j4R1J16J253Q00J132J307Q01O32J1Q5o99r29j236j433
2452f98q06J42r27o94J264M91n49J031J276J63p41j22J86m97l33j62oK4Q19N81
2472D42J368L39K40P62J5n74j129p58p67j039j357K39l60j69J77P26R40P44K23
2491F2O44K23P1m30k60K45k33q68P09K84r3N50J099p41m1O63m81j183n34k58j134
2512a706o3k13p11P88N15j40P69R90M55L9N52n0r0l84j56k25k26J01o1j77N45
$$ plain form
2533 552 873 534 751 449 125 172 -35 -993 -1381 -1418 -1410 -1702 -1064 -423 -516 -631 752 931 635 1209 865
2554 865 207 621 776 72 -143 9 -12 -449 393 230 -368 359 751 -192 157 332 -284 -827 -293 -355 -598
2575 -598 -656 -433 -873 -211 234 -54 123 499 -76 194 597 -159 -167 158 280 -482 -65 469 134 -497 186
2596 186 496 43 48 54 -194 413 181 -94 -222 -174 -305 -370 -61 -80 -910 -575 -17 -495 -401 398 43 -560 216
2619 216 753 107 73 215 371 294 597 -221 43 332 -218 -290 658 436 -184 29 264 236 -571 -424 -744
2640 -744 -1024 -308 -502 -795 -370 -307 101 929 766 330 398 900 785 94 494 164 -325 -652 331 12 -319
2661 -319 -27 -25 353 168 45 -221 -549 -416 -811 -696 -376 -952 -921 409 363 -143 983 1619 880 810 1398
2682 1398 546 -245 -397 -223 -810 -837 -872 -847 -534 -368 -203 399 300 169 402 385 -161 -501 -221 -16 -432
$$ packed form
2533E52L21l39K17l02l24M7k07r58l88l7Qk92O38O41r3j15J383J79k96N74l44
2554H65o58M14J55p04k15J52k1m37Q42j63n98P27L92r43L49J75o16n43N34o2k43
2575e98n8K23m40O62M45k88J77L76n75K70M03p56qL25J22p62M17N34l35o31O83
2596A86L10m53NOk48O07k32k75j28M8j31o5L09j9q30L35N58m78R4P99l55o03P76
2619B16N37o46l4J42J56p7L03q18K64K89n50p2R48k22o20K13K35k8q07J47l20
2640g44k80P16j94k93M25O3M08Q28j63m36O8N02j15o91M00l30m89l27R83l19l31
2661c19K92KL78j85j23k66l28J33l95J15L20n76L1J330m6n06J126O36p39p0N88
2682A398q52p91j52J74n87k7l5K5L13J66J65O02r9j31K33j7n46l40K80K05m16
$$ plain form
2703 -432 -104 306 309 328 590 1085 1109 1401 460 -99 -146 -183 -826 -1178 -1107 -871 -1200 -424 -224 -5 165 720
2725 720 759 468 810 477 134 111 207 33 -2 129 324 694 1275 665 306 514 161 -605 -344 -723 -1422
2746 -1422 -1732 -1481 -1230 -863 -318 -183 422 677 904 1355 1339 893 723 899 719 -232 -196 -93 94 -212
2766 -212 424 522 255 165 108 -42 -506 -901 -1272 -1321 -1694 -1235 -830 -564 -122 519 518 1322 1334 1403 1399 1287 770
2789 770 386 301 -76 -132 -678 -234 -381 -331 7 -96 475 143 -477 -232 -449 -986 -1061 -852 -1244 -538 -536 114
2811 114 387 1014 1239 1428 1343 1169 918 975 318 -409 -644 -485 -584 -856 -832 -433 110 -415 -20 225 -81
2832 -81 -144 -181 -304 -685 -639 -206 -405 -436 161 822 631 802 1190 1140 846 480 281 192 -667 -641 -1027 -774 -637
2855 -637 -455 -486 -309 142 334 469 176 492 138 139 -28 -209 -365 -309 -263 -38 -107 159 380 546 568 688
$$ packed form
2703d32L28M10LJ9K62M95K4K92r41n59m7l7o43l52P1K36l29P76K00K19J70N55
2725G20L9k91L42l33l43k3R6j74l5J31J95L70N81o10l59K08l53p66K61l79o99
2746a422l10K51K51L67N45J35O05K55K27M51j6m46j70J76j80r51L6J03J87l06
2766b12O36R8k67r0n7j50m64l95l71m9l73M59M05K66M42O41jQ04J2O9mj12n17
2789G70l84q5l77n6n46M44j47N0L38j03N71l32o20K45k17n37p5K09l92P06KO50
2811A14K73O27K25J89q5j74k51N7o57p27k35J59r9k72K4L99N43n25L95K45l06
2832h1o3l7j23l81M6M33j99l1N97O61j91J71L88n0k94l66j99q9q59K6l86K53J37
2855f37J82l1J77M51J92J35k93L16l54Jj67j81j56N6M6K25o9K66K21J66K2J20
$$ plain form
2877 688 525 -191 -456 -127 -587 -716 -826 -405 -491 -126 314 285 456 814 658 467 381 336 326 -55 -312 -735
2899 -735 -220 235 81 -37 336 253 194 180 117 64 -514 -627 -185 -344 -790 -328 12 -71 -81 411 668 293
2921 293 387 668 530 104 113 95 -150 -482 -658 -165 -55 -474 -195 -6 -134 1 199 -139 -301 -413 -490 -433
2943 -433 74 -52 -15 156 204 244 609 612 705 374 501 378 0 -193 -320 202 -131 -341 -333 -215 -504 -241 -146
2966 -146 55 120 -113 -176 163 -169 -297 99 -56 -453 30 382 130 176 353 653 179 219 166 167 162 -294 -10
2989 -10 68 -25 -343 -75 129 110 -396 254 73 72 -59 -19 114 -116 -138 -160 18 -295 -110 25 -75 290 -239
3012 -239 181 406 445 339 95 416 119 -182 141 91 22 85 -14 75 75 -104 -2 156 -50 237 -236 -28 -373
3035 -373 -350 -181 -455 -778 -156 154 -413 150 386 316 236 763 337 267 416 528 187 233 364 -470 -148 180
$$ packed form
2877F88j63p16k65L29m60j29j10M21q6L65M40k9J71L58j56j91q6m5j0l81k57m23
2899g35N15M55j54j18L73q3n9j4o3n3n78j13M42j59m46M62L40q3j0M92K57l75
2921B93R4K81j38m26Rj8k45l32j76M93J10m19K79J89j28J35J98l38j62j12p7N7
2943d33N07j26L7J71M8M0L65LR3l31J27j23l78j93j27N22l33k10QJ18k89K63R5
2966a46K01O5k33o3L39l32j28L96j55l97M83L52k52M6J77L00m74M0n3Jnm56K84
2989a0P8r3l18K68K04j9n06O50j81jj31M0J33k30k2k2J78l13J85J35j00L65n29
3012b39M20K25L9j06k44L21k97l01L23n0o9O3r9Q9%j79J02J58k06K87m73K08l45
3035c73K3J69k74l23O22L10n67N63K36p0q0N27m26p0J49J12l41M6J31q34L22L28
$$ plain form
3057 180 -242 -151 17 -299 -225 -277 -72 -145 -432 -483 -147 -319 -184 -198 -43 29 287 510 672 625 317 460 422
3080 422 242 90 -21 -122 -466 -228 3 -645 -345 96 -346 -212 315 127 -425 -168 170 -635 -52 67
3100 67 -307 -130 476 99 136 704 842 500 502 330 158 -260 -224 -363 -750 -535 -710 -652 -491 134 -212 461
3122 461 517 -205 353 578 -181 -431 -303 4 -221 -201 251 167 67 436 273 631 566 162 -555 -85 -64 -457
3144 -457 -659 -187 -755 -746 219 423 -184 363 882 431 351 525 283 58 88 -11 -84 -11 -80 -578 76 348 -112
3167 -112 -121 107 -90 -230 -118 -149 -593 -641 -376 -119 -230 15 336 479 784 948 693 609 413 62 148 303
3189 303 -609 -795 -207 -163 -371 -154 -93 -421 -104 183 -420 -68 5 -263 -300 -239 76 -292 -219 476 399 491 1053
3212 1053 406 302 677 442 -111 -264 -276 -326 -442 -410 -510 -338 -321 -202 -41 80 -180 -426 70 179 -398
$$ packed form
3057A80m22R1J68l16P4n2K05p3k87n1L36j72J35j4J55P2K58K23J62m7l08J43l8
3080D22j80j52j11j01l44K38K31o48L00M41m42J34N27j88n52K57L38q05N83J19
3100F7l74J77O06l77L7N68J38l42Kj72j72m18L6j39l87K15j75N8J61O25l46O73
3122D61N6p22N58K25p59k50J28L07k25K0M52q4j00L69j63L58o5m04p17M70K1l93
3144d57k02M72n68RR65K04o07N47N19m51q0J74k42k25L0r9p3P3o9m98O54K72m60
3167a12rK28j97j40J12l1m44m8K65K57j11K45L21J43L05J64k55q4j96l51Q6J55
3189C03r12j86N88M4k08K17O1l28L17K87o03L52P3k68l7O1L15l68P3O95p7R2N62
3212A053o47j04L75k35n53j53j2n0j16L2j00J72J7J19J61J21k60k46M96J09n77
$$ plain form
3233 -398 -108 -44 -115 -24 288 433 0 -39 492 138 165 451 419 139 -33 -306 -408 -11 -356 -527 -505 -366
3255 -366 -152 -377 153 -95 -163 355 170 -285 15 56 26 32 253 465 272 344 193 161 363 538 127 260
3277 260 173 -40 18 -255 -93 27 -77 -175 -246 -191 -129 -335 -27 80 -209 -135 59 -124 8 -2 -8 -36 -205 250
3301 250 -26 -277 -96 64 126 17 212 262 190 172 390 332 -64 39 -57 -134 -128 -466 -266 -248 -620 -452 22
3324 22 216 -46 -282 182 67 -114 73 36 -225 -116 23 42 380 370 231 394 470 511 178 198 -201 -308
3346 -308 -117 -575 -572 -715 -526 -569 -270 -18 132 220 312 272 264 356 392 -154 -38 71 -203 22 432 241 390
3369 390 592 416 314 157 20 -408 -667 -680 -759 -222 -613 -632 -365 -70 154 429 706 756 681 544 315 604
3391 604 296 -267 -314 -2 -65 -335 -334 13 95 158 113 116 -498 -640 -406 -877 -590 -634 -368 -456 -226 99 723 707
$$ packed form
3233c98K90O4p1R1L12J45m33l9N31l54K7K86l2k80j72k73j02L97l45j71K2J39
3255c66K14k25N30k48o8N18j85m55L00M1l0OK21K12j93P2j51l2K02J75m11J33
3277B60q7k13N8k73J62J20j04r8p1N5O2k06L08J07k89P4J94j83J32j0ok8j69M55
3301B50k76k51J81J60O2j09J95N0p2j8K18n8l96J03r6p7Ol38K00J8l72J68M74
3324B2J94k62k36M64j15j81J87l7k61J09J39J9L38j0j39J63P6M1l33K0l99j07
3346c08J91m58Lj43J89m3K99K52J50Q8R2m0qR2L6n46J16J09k74K25M10j91J49
3369C90K02j76j02j57j37m28k59j3p9N37l91j9K67K95K24K75K77N0p5j37k29K89
3391F04l08n63m7L12o3k70JL47Q2O3m5Lo14j42K34m71K87m4K66q8K30L25O24j6
$$ plain form
3415 707 721 928 750 469 373 192 43 -343 -597 -674 -781 -322 -346 -364 -179 -114 11 250 190 -302 -269 -109 -330
3438 -330 -383 -176 30 221 490 698 753 1168 1030 632 661 440 -295 -603 -723 -829 -1105 -1102 -933 -785 -356 -101
3460 -101 107 424 308 174 303 208 62 -72 196 120 -1 338 583 788 756 938 779 618 250 -24 -441
3481 -441 -753 -965 -1156 -1112 -1269 -690 -410 -464 351 261 675 672 377 1047 857 886 -267 146 -787 -103 259 601
3503 601 443 614 834 198 449 81 -500 -539 -888 -1063 -1286 -1395 -848 -851 -540 193 209 325 1078 1050 864 775
3525 775 383 116 147 -181 -183 -184 -57 -96 227 483 364 230 -66 12 -242 -467 -710 -957 -1161 -911 -672 -421
3547 -421 101 362 570 704 811 879 992 949 29 88 -52 -335 -584 -435 -745 -631 92 285 -102 -7 -10 -132
3569 -132 -326 -203 -384 -766 -335 -490 -404 10 194 280 561 636 1010 753 507 399 71 -170 -406 -456 -858
$$ packed form
3415G07J4K07j78k81r6j81j49l86k54p7j07M59k4j8J85O5J25K39o0m92L3J60k21
3438c30n3K07K06J91K69K08N5M15j38l98K9k21p35l08j20j06k76LJ69J48M29K55
3460a01K08L17j16j34J29r5j46j34K68p6j21L39K45K05l2J82j59j61l68k74m17
3481d41l12k12j91M4j57N79K80n4Q15r0M14lk95O70j90K9j153M13r33O84L62L42
3503F01j58J71K20o36K51l68n81l9l49j75k23j09N47lL11P33J6J16P53k8j86q9
3525G75l92k67L1l28kjJ27l9L23K56j19j34k96P8k54k25k43k47k04K50K39K51
3547d21N22K61K08J34J07O8J13m3r20N9j40k83k49J49l10J14P23J93l87R5lj22
3569a32j94J23j81l82M31j55Q6M14J84Q6K81P5L74k57k46j08l28k41k36n0m02
$$ plain form
3590 -858 -614 -954 -409 -508 -104 -183 139 108 54 2 406 -97 -92 -129 186 -319 178 362 454 639 788 564 562 580
3614 580 -109 -56 -231 -677 -741 -602 -560 -722 -541 -90 -105 24 663 482 239 532 -133 390 176 -123 197
3635 197 17 -15 -65 154 559 380 346 52 197 -246 -245 -599 -679 -876 -627 -335 -703 -585 28 35 290 379 448
3658 448 799 276 487 288 354 75 -101 123 239 -32 -218 171 -18 -102 230 -22 -228 -408 -618 -570 -244
3679 -244 -329 -196 -295 -196 -75 43 368 266 326 562 286 289 377 0 -34 3 -96 3 -134 -41 161 -86 167 51
3703 51 -318 -444 -93 -201 -390 -221 -306 -184 -138 61 62 99 229 324 268 267 240 139 168 -51 30 129 96 -263 17
3728 17 235 7 112 95 51 -128 137 -90 -133 -477 -83 78 37 -128 -47 -105 227 4 32 210 157 -183 -78
3751 -78 25 209 37 98 184 301 70 309 87 173 -189 -207 109 140 -63 -134 14 104 97 -140 15 95 -141 -103
$$ packed form
3590h58K44l40N45r9M04p9L22l1n4n2M04n03Nl7L15n05M97J84R2J85J49k24kJ8
3614E80o89N3j75m46o4J39M2j62J81M51j5J29O39j81k43K93o65N23k14k99L20
3635A97j80l2n0K19M05j79l4k94J45m43Jl54q0j97K49K92l68J18O13PK55Q9O9
3658D48L51n23K11j99O6k79j76K24J16k71j86L89j89q4L32k52k06j80k10M8L26
3679b44q5J33r9R9J21J18L25j02O0K36k76LQ8l77l4L7r9R9j37R3K02k47K53j16
3703E1l69j26L51j08j89J69q5J22M6J99JL7J30R5n6jk7j01K9k19Q1R9l3l59K80
3728A7K18k28J05j7m4j79K65k27m3l44L94J61m1j65Q1n8L32k23K8J78n3l40J05
3751g8J03J84j72O1Q6J17k31K39k22Q6l62j8L16L1k03p1J48R0pk37J55Q0k36L8
$$ plain form
3775 -103 12 -172 -23 -290 -166 -144 -25 77 71 331 94 203 25 -261 36 -66 -206 -111 15 -261 -106
3796 -106 -345 -105 -68 80 -14 -96 241 -7 -357 -184 -216 -372 -366 -92 -73 223 76 268 564 120 104 210 -22
3819 -22 -27 -93 -84 -247 -318 -443 -231 -229 -211 228 92 251 323 159 205 -104 -156 48 -144 -19 -169 -124 331 165 293
3844 293 230 327 196 -160 20 -228 -184 -452 -328 -141 -487 -253 -189 141 -121 240 531 424 244 108 162 171
3866 171 -45 -6 19 -98 -59 26 31 322 -69 280 14 -165 -119 -169 -62 -764 -375 -388 -130 -112 112 -63 234
3889 234 389 343 619 454 300 250 -29 113 -28 -79 -60 -117 -151 56 -215 -35 81 -39 -85 -201 -515 -551 -445
3912 -445 -513 -270 -230 112 -67 210 491 548 473 558 616 445 419 -131 2 -348 -218 -340 -335 -394 -83 -12 109 167
3936 167 -304 -41 -121 -366 -124 -120 -261 -249 -173 87 200 512 447 411 628 320 615 542 -37 -68 -110 -513 -228
$$ packed form
3775a03J15j84J49k67J24K2J19J02oK60k37J09j78k86K97j02j40R5J26k76J55
3796a06k39K40L7J48r4q2L37k48l50J73l2j56OK74J9K96j47J92K96m44j6J06k32
3819b2no6Rj63p1j25K12KJ8M39j36J59P2j64M6l09n2K04j92J25j50M5M55j66J28
3844B93o3R7j31l56J80k48M4k68J24J87l46K34O4L30k62L61K91j07j80j36N4R
3866A71k16L9K5j17L9Q5NK91l91L49k66j79M6n0J07p02L89j3K58J8K24j75K97
3889B34J55m6K76j65j54n0k79J42j41n1J9n7l4K07k71J80J16j20m6j16l14l6J06
3912d45o8K43M0L42j79K77K81N7p5Q5N8j71k6n50J33l50J30j22Nn9L11P1J21N8
3936A67m71K63q0k45K42Mj41J2P6K60J13L12o5l6K17l08K95p3n79l1m2m03K85
$$ plain form
3959 -228 -309 -256 -382 -129 -118 -48 317 229 200 75 272 -78 -441 -287 -144 -23 67 209 275 536 369 288 262
3982 262 147 281 -11 171 -280 -308 -276 -439 -546 -261 -262 -184 102 126 233 112 144 5 52 137 -33 -330 -162
4005 -162 24 -153 -115 100 382 248 264 324 89 138 -39 -418 -376 -190 -268 -32 87 -197 230 125 232 269
4027 269 43 389 59 99 -199 -137 -401 -225 -464 -236 -247 -37 -181 -137 112 332 -183 -132 -47 -166 -30 -60
4049 -60 -92 -135 286 -24 443 265 343 206 363 347 147 -18 74 -254 -71 6 -381 -175 57 153 -116 218 -112
4072 -112 -148 61 55 54 -285 191 -199 -23 -82 -47 80 140 17 11 103 0 41 -53 54 -41 -117 139 98 -108 -365
4097 -365 31 -10 -46 -151 -15 -127 232 11 41 115 169 -17 -103 19 3 -133 126 101 -301 284 79 57 121
4120 121 202 317 152 -206 -131 -121 33 -50 58 157 12 148 133 167 24 -141 -46 115 -40 -115 -24 25 -10 214
$$ packed form
3959b28q1N3j26K53J1P0L65q8k9j25J97l50l63J54J43J21R0J42O6K61j67q1k6
3982B62j15J34k92J82m51k8L2j63j07K85jP8K86K4J07j21L2j39M7Q5j70k97J68
4005a62J86j77L8K15K82j34J6O0k35M9j77l79M2J86p8K36J19k84M27j05J07L7
4027B69k26L46l30M0k98O2k64J76k39K28j1K10j44M4K49K20n15N1Q5j19J36l0
4049f0l2m3M21l10M67j78P8j37J57j6k00j65R2l28J83P7l87K06K32R6k69L34l30
4072a12l6K09ojl39M76l90J76n9L5J27O0j23oR2j03M1r4J07r5p6K56m1k06k57
4097c65L96m1l6j05J36j12L59k21L0P4N4j86q6J22j6j36K59k5m02N85k05k2O4
4120A21Q1J15j65l58P5J0J54q3J08R9j45J36j5L4j43j65R5J61j55p5R1M9l5K24
$$ plain form
4144 214 -39 -95 139 67 340 439 136 97 153 84 -231 -94 87 -166 -147 -74 105 125 -200 -96 13 -13 -217
4167 -217 -20 -16 -20 -462 -131 88 -145 -69 -56 183 22 140 258 41 -21 241 187 77 54 209 32 -251 43
4190 43 -26 -48 -107 -252 -296 -55 -184 -249 112 -48 -149 -318 -187 -108 -23 22 138 -42 -337 264 79 304 275
4213 275 320 30 13 37 -9 -142 -210 -157 -173 -21 4 -182 76 -85 -21 46 -79 16 -32 -284 -111 15 189 -126
4237 -126 -129 -28 226 157 522 212 114 215 42 69 -39 -247 -38 -332 -353 24 -67 -201 -64 -225 114 -97
4259 -97 -5 -40 -163 -108 107 53 1 -85 8 -163 -60 254 273 136 -31 -2 -29 12 -214 -5 -276 -99 -230 -340
4283 -340 -18 149 -87 105 61 242 133 168 137 6 -36 -107 -210 -29 -51 32 -66 -79 107 6 57 31 -191 113
4307 113 36 59 -347 108 76 -17 -89 27 -127 142 -72 206 126 79 23 -62 -137 -104 -193 90 -120 -9 -242 -304
$$ packed form
4144B14k53n6K34p2K73R9l03l9N6o9l15J37J81k53J9P3J79K0l25J04J09k6k04
4167b17J97Mmm42L31K19k33P6J3K39j61J18J18k17o2K62n4j10k3J55j77k83K94
4190D3o9k2n9j45m4K41j29o5L61j60j01j69J31P9Q5M5J16j80k95O01j85K25k9
4213B75M5k90j7K4m6j33o8N3j6J52K5j86K58j61O4O7j25R5m8k52J73J26J74l15
4237a26lJ01K54o9L65l10r8J01j73K7j08k08K09k94k1L77r1j34J37j61L39k11
4259i7R2l5j23N5K15n4n2q6R3j71J03L14J9j37j67K9k7M1k26K09k71J77j31j10
4283c40L22J67k36J92m4J81j09L5l1j31m2p1j03J81k2Q3r8j3J86j01N1k6k22L04
4307A13p7K3m06M55l2r3p2J16j54K69k14K78q0m7n6q5p5L3q9K83k10J11k33o2
$$ plain form
4331 -304 -232 -119 31 -180 261 -178 122 19 29 -170 -277 58 131 298 28 49 220 293 35 -66 -62 0 -12
4354 -12 -35 -24 -156 -321 -204 -69 -208 194 110 30 93 -178 6 -19 205 233 -290 168 -31 -112 286 18 95
4377 95 6 345 -80 90 281 -262 28 -144 2 -193 -120 178 -237 -135 -191 110 -11 -39 85 37 56 -160
4399 -160 -143 -72 176 -18 71 4 58 271 144 -89 -44 -4 394 67 39 33 22 -23 72 -107 -246 18 -74 173 293
4424 293 -113 -107 -48 -206 245 -89 49 -139 85 -201 199 10 57 -106 -293 236 178 -171 -150 86 -170 53
4446 53 205 -243 -23 -169 129 -76 11 -160 -95 -263 183 -228 -260 -164 30 -35 -132 114 36 226 339 1 201
4469 201 35 227 45 145 -14 -116 139 86 34 42 63 234 283 -11 -59 -215 117 -64 -167 0 36 90 -34
4492 -34 -103 221 71 -71 17 120 56 29 -14 -123 262 -3 -164 88 330 9 -195 -112 -130 -87 164 -182 -100
$$ packed form
4331c04P2J13J50k11M41m39L00j03J0j99j07L35P3J67k70K1J71P3k58j01MO2j2
4354a2k3J1j32j65J17J35j39M02q4q0O3k71J84k5K24K8n23M58j99q1L98k68P7
4377I5q9L39m25J70J91n43K90j72J46j95P3K98m15J02n6L01j21k8J24m8J9k16
4399a60J7P1K48j94Q9o7N4K13j27k33M5M0L98l27k8oj1m5R5j79j39K64r2K47J20
4424B93m06ON9j58M51l34J38j88K24k86M00j89M7j63j87N29n8l49K1K36k56K23
4446E3J52m48K20j46K98k05Q7j71O5j68M46m11l2R6J94o5r7K46p8J90J13l38K00
4469B01j66J92j82J00j59j02K55n3n2QK1J71M9k94m8j56L32j81j03J67L6N4j24
4492c4o9L24j50j42Q8J03o4k7m3j09L85k65j61K52K42l21k04Q3j8M3K51l46Q2
$$ plain form
4515 -100 131 -22 52 -63 30 -30 -77 -158 66 226 79 6 184 182 -108 141 -44 73 -230 166 68 -213 34
4538 34 -24 -41 -127 -37 -162 -266 21 -54 -149 32 282 110 -146 10 54 -17 -48 249 190 -18 -190 -263 -20 -170
4562 -170 -32 -17 12 -66 213 -123 -248 15 95 -65 -272 -211 -63 -94 22 -89 248 237 165 -169 49 -118 -149
4585 -149 -123 -195 -27 -183 -123 -193 -108 -141 -239 -182 -121 202 224 273 -53 -88 -13 231 121 156 310 -98 73 116 228
4610 228 -25 145 -68 -50 -68 -173 -291 -385 -315 -108 -392 -27 -234 -74 17 69 109 358 -7 164 -17 101
4632 101 10 111 -24 -145 93 263 151 -60 261 -164 212 -206 -253 -11 -153 -178 -206 -368 -74 -212 -292 -49
4654 -49 302 337 325 135 331 114 209 350 -82 -45 -100 55 47 -66 -76 -76 158 -3 199 -189 -162 -327 -5 -121
4678 -121 -279 -298 -124 154 -188 278 83 -8 136 137 369 361 214 -121 -2 7 -37 -353 26 -88 288 57 396
$$ packed form
4515a00K31j53P4j15R3o0m7q1K24J60j47p3J78kk90K49j85J17l03L96r8k81K47
4538C4n8j7q6R0j25j04K87p5r5J81K50j72k56J56M4p1l1K97n9k08j72p3K43j50
4562a70J38J5K9p8K79l36j25K63Q0j60k07O1J48l1J16j11L37j1p2l34K18j67l1
4585a49K6p2J68j56O0p0Q5l3r8N7O1L23K2M9l26l5P5K44j10L5J54m08J71M3J12
4610B28k53J70k13J8j8j05j18r4P0K07k84L65k07J60R1N2M0K49l65J71j81J18
4632A01r1J01j35j21K38J70j12k11L21m25L76m18m7K42j42k5k8j62K94j38q0K43
4654d9L51L5j2j90J96k17R5J41m32L7n5J55qj13j0%K34j61K02l88K7j65L22j16
4678a21j58j9J74K78l42M66j95r1J44JK32qj47l35J19Rm4l16L79j14L76k31L39
$$ plain form
4701 396 -260 -99 174 39 -154 -7 322 -182 -189 -136 258 50 214 95 307 -107 209 243 184 80 36 50
4723 50 -405 99 -118 -111 -49 -112 159 -36 -87 2 33 76 199 185 -48 44 56 56 66 151 63 -13 -71 51 -106 -72 -21
4750 -21 51 45 -181 -81 -101 -151 -186 -227 -47 -190 180 -5 23 200 196 223 58 188 -230 61 -66 14 -26 -325 -8
4775 -8 -71 6 72 152 338 113 -315 -5 -115 -122 -25 69 -241 -83 92 -85 -57 253 149 7 168 33 148 116
4799 116 282 -19 -108 214 35 -134 24 -125 -31 -136 -65 -250 -45 -156 -84 -89 -101 56 4 -81 249 104 177
4822 177 222 -311 267 341 -146 -130 23 56 -34 -262 96 -11 -109 -189 124 84 -234 71 -38 -201 -121 -8 -183
4845 -183 -124 87 134 -105 157 258 239 264 -7 144 -8 204 196 -65 24 -136 -117 158 7 124 71 84 40 5
4869 5 -157 -217 -84 -2 -66 -101 -129 -39 -139 196 -194 131 -74 -13 -41 60 116 -7 -28 -288 196 55 -235 128
$$ packed form
4701C96o56J61K73j35j93J47L29n04pN3L94k08J64j19K12m14L16L4n9j04m4J4
4723E0m55N04k17PO2o3K71j95n1Q9L1M3J23j4k33R2J2%J0Q5q8p6n8J22j57L4N1
4750b1P2ok26J00k0n0l5m1J80j43L70j85K8J77mK7j65J30m18K91j27Q0m0k99L17
4775ho3P7O6Q0J86k25m28L10j10pR7R4l10J58J75j77K8L10j04j42J61j35J15l2
4799A16J66l01q9L22j79j69J58j49R4j05P1j85K05j11P2nj2J57n2q5L30j45P3
4822A77M5n33N78P4m87J6J53L3r0k28L58j07r8q0L13m0l18L05j09j63Q0J13j75
4845a83N9K11M7k39K62J01j9K5k71J51j52K12qk61Q9j60J9K75j51J17n3J3m4l5
4869Ej62o0J33Q2o4l5k8R0j00L35l90L25k05O1k8J01N6j23k1k60M84j41k90L63
$$ plain form
4893 128 226 -40 -84 59 -156 0 -44 101 -125 -78 -36 -296 -32 16 221 -43 -71 -12 -61 178 -210 -16 -69
4916 -69 72 197 -234 -51 206 -122 -3 78 33 -237 -113 -160 -85 44 151 -114 -178 132 -69 -198 0 350
4938 350 64 190 17 -79 171 -74 -7 -193 13 38 -113 1 220 -30 366 -29 -172 40 -50 355 -30
4959 -30 -231 -45 -205 -58 147 -66 179 134 78 9 -188 -66 -39 -38 -128 -49 -86 -155 -200 -150 -135 106 -77 71 -14
4984 -14 -94 -160 96 -136 -4 52 -70 -93 -234 -42 165 220 191 176 186 -187 -191 -28 -30 -122 -21 121 -120 -66 -145
5009 -145 -51 160 25 -212 -223 -86 -136 -175 -196 -240 -23 17 102 216 -82 -115 86 227 182 1 -20 223 37 -267
5033 -267 86 168 119 -9 89 -39 83 -53 -37 143 -36 59 48 -201 -202 39 -317 -62 177 -25 174 87 134
5056 134 245 127 33 70 51 -49 -113 -169 -6 -104 -96 173 -166 -55 -69 86 -17 -57 -167 -26 -201 92 -85
$$ packed form
4893A28R8k66m4J43k15J56m4J45k26M7M2k60K64M8K05k64k8N9m9K39l88J94n3
4916f9J41J25m31J83K57l28J19Q1m5k70J24m7P5J29J07k65o4L10k01j29J98L50
4938C50k86J26j73r6K50k45O7j86K06K5j51J14K19k50L96l95j43K12r0M05l85
4959c0k01J86j60J47K05k13K45m5n6o9j97J22K7Jr0P9l7o9m5N0J5K41j83J48q5
4984a4q0o6K56k32J32N6j22k3j41J92K07N5k9j5J0l73mJ63kr2J01J42k41N4p9
5009a45R4K11j35k37j1J37n0l9k1m4K17M0Q5J14k98l3K01J41m5j81k1K43j86l04
5033b67L53Q2m9j28R8j28J22j36J6J80j79R5j1k49jK41l56K55K39k02J99q7M7
5056A34J11j18r4L7j9j00o4n6J63r8QK69l39J11j4J55j03m0j10J41j75K93j77
$$ plain form
5079 -85 -110 193 54 156 83 -29 -39 52 34 -148 -360 -59 -147 216 -25 -276 -26 -123 -71 61 80 13 -41 -49 -57
5104 -57 -335 -43 -24 -87 14 -69 -57 -191 9 249 -97 -46 -6 -14 81 -44 186 66 155 96 -141 220 12 -56
5128 -56 -259 -1 96 -30 8 -118 -99 -172 -101 -15 -160 116 1 -171 -181 -84 6 135 245 -204 -11 -168 -42
5151 -42 97 -190 -61 -57 277 59 -85 -67 9 -18 122 81 -55 84 132 68 -30 -24 13 34 -76 -172 -162 -60 89
5176 89 -3 35 369 -30 -52 185 -128 73 -64 -161 116 -26 -106 115 -159 -127 -67 92 157 203 -81 18 233 -17
5200 -17 46 -80 -179 10 60 -141 19 8 35 198 140 -218 -66 -201 314 177 -14 -31 185 132 8 120 11
5223 11 73 -20 -68 -106 129 -92 -86 -123 -126 18 -205 247 260 -110 -45 -132 -178 -60 -58 -133 138 77 32 70 -27 72 193
5250 193 158 -22 -24 -47 10 15 -22 -106 -310 -60 34 -246 -250 -221 -67 -77 73 -7 107 -77 27 131 6 -120 -65
$$ packed form
5079h5k5L03j39J02p3j12j0R1j8j82k12L01q8L63k41k51K50r7N2J32J9o7n4qq
5104e7k78K92J9o3J01q3J2j34K00K40l46N1M0qR5j25K30j20Q9n9k37L61k08o8
5128e6k03K58R7j26L8j26J9p3P1Q6j45K76j15j72j0R7R0J29J10m49J93j57J26
5151d2J39k87J29ML34k18j44J8P6k7J40m1j36J39M8o4r8OL7K1j10r6J0J02J49
5176H9r2L8L34l99k2K37l13K01j37r7K77j42q0K21k74L2O0J59O5M6k84R9K15k50
5200a7O3j26r9J89N0k01J60j1K7J63n8l58J52j35N15j37j91j7K16n3j24J12j09
5223A1O2r3m8l8K35k21Ol7lJ44k23M52J3l70O5q7m6J18Kp5K71o1m5L8r7R9J21
5250A93l5j80kk3N7Nl7q4k04K50R4k80mK9J54j0J50q0J14j84J04J04j25j26N5
$$ plain form
5275 -65 -65 -26 41 1 59 -10 90 126 -7 -37 18 216 47 -49 -72 -206 143 -170 172 0 -252 -155 -160 -133 132 18
5301 18 81 52 257 11 -90 -61 48 -223 -84 39 -97 -1 -70 -59 149 369 -10 38 33 -108 177 -64 141
5324 141 -264 68 -128 6 68 128 326 23 -95 -117 -79 297 84 271 56 -29 -148 -145 -36 62 2 -123 34
5347 34 -13 80 -268 -81 58 -19 37 -97 6 118 -138 -15 0 22 124 179 -34 138 10 291 -116 5 118
5370 118 85 22 75 93 120 -21 2 35 295 111 26 53 2 -61 187 -270 161 -87 38 -141 -44 -81 -33 59 -55
5395 -55 10 -250 -168 149 -152 197 133 240 64 -254 -4 -125 3 -2 132 -43 38 -74 208 149 -106 -19 -143
5418 -143 -150 212 -52 92 -265 -153 124 140 144 175 -41 48 -171 -173 -227 -96 132 -118 -138 101 -84 -230 243 -211
5442 -211 -140 -114 32 25 16 39 -145 -27 226 248 -30 127 310 111 -70 -39 -233 24 -137 116 -78 -37 61 -200
$$ packed form
5275f5%L9O7m0N8o9J00L6j33l0N5J98j69r6k3j34L49l13L42j72k52R7nK7K65j14
5301A8O3k9K05k46j01K9J09k71J39J23j36R6o9J1K08K20l79M8nj41K85k41K05
5324A41m05L32j96J34O2O0J98l03j18k2L8L76k13J87k15q5j19LJ09R8o0j25J57
5347C4m7R3l48J87J39p7N6j34J03J12k56J23J5K2J02N5k13J72j28K81m07J21J13
5370A18l3o3N3J8K7j41K3L3K60j84q5K7n1o3K48m57M31k48J25j79R7l7M8R2j14
5395e5O5k60Q2L17l01L49o4J07j76l18K50j21J28nJ34j75Q1j12K82n9k55Q7j24
5418a43pL62k64J44l57J12K77J6ML1k16Q9k19kn4J31K28k50k0K39j85j46M73m54
5442b11P1K6J46prK3j84J18K53K2k78J57J83j99j81L1j94K57j61K53j94M1R8k61
$$ plain form
5466 -200 30 -299 -104 -26 100 168 4 -6 133 -47 -174 352 121 -32 -30 25 -2 -32 194 53 1 -55 -128 -28
5490 -28 33 -231 74 -53 198 -12 -141 -168 132 132 46 -28 -24 120 19 5 76 -7 -158 18 -144 -7 161 246
5514 246 12 -120 -189 -228 -29 -123 -259 -155 -19 -162 -30 12 99 -157 19 -132 -81 -30 53 -12 -196 -67 -170
5537 -170 212 -32 113 -153 -76 -22 -10 -41 -122 -136 -38 161 151 33 105 94 -12 -190 17 -302 118 164 90 -35
5561 -35 -1 -59 -67 -384 83 -295 -60 -129 5 331 189 127 43 73 -199 -59 -44 27 -88 -207 116 19 -119 104
5585 104 44 68 -204 -226 -61 285 101 44 194 -290 -171 36 -127 51 66 -164 -202 156 -81 -13 -141 91
5607 91 156 -33 -45 26 -164 -137 152 74 -2 -11 -92 22 -252 299 32 -23 -65 -206 -136 36 -23 55 -50 -44 17 22 48
5634 48 212 -40 -2 -67 52 278 123 247 -78 142 97 -77 52 8 -130 28 -73 124 -114 -25 -119 -77 -28
$$ packed form
5466b00K30l29J95P8J26O8j64j0J39j80j27N26k31j53KN5k7l0K26j41n2n6p3J00
5490b8O1k64L05j27K51k10j29k7L00%q6p4MJ44j01j4P1q3j51J76j62J37J68Q5
5514B46k34j32o9l9J99r4j36J04J36j43J32M2Q7k56J76j51N1N1Q3o5j84J29j03
5537a70L82k44J45k66P7N4J2l1q1j4R8J99j0j18P2j1j06j78K07l19M20M6p4j25
5561c5L4n8ql17M67l78K35o9J34L26j42o2q4L0k72J40J5P1j15j19L23r7j38K23
5585A04o0K4k72k2J65L46j84n7J50m84J19K07j63J78J5k30l8L58k37O8j28K32
5607I1O5j89j2P1j90K7K89p8p6rq1J14k74N51k67n5m2j41P0J72n9P8j05OO1NK6
5634D8J64k52L8o5J19K26j55J24l25K20m5j74J29m4j38J58j01J97k38Q9r4M2M9
$$ plain form
5657 -28 -112 206 63 -25 -37 -148 -68 -63 -52 132 47 -160 34 63 -111 -182 -29 -108 -9 43 22 83 55 1 -170 -76
5683 -76 229 -119 102 132 -121 -11 -80 -2 -158 14 119 -175 90 -51 102 8 -45 205 -106 29 80 -124
5705 -124 -57 -58 40 31 -20 132 309 142 6 28 307 -67 -54 51 13 -22 -67 284 3 112 -66 -58 125 -30 -287
5730 -287 40 231 209 -7 5 -160 68 -131 -311 110 32 -271 167 -124 -17 123 113 -24 -174 113 155 -125
5752 -125 95 -174 33 116 262 155 96 274 -18 97 -167 -27 -146 -37 71 -133 -55 31 291 268 241 19
5774 19 -210 124 185 122 21 188 -72 83 77 162 42 82 184 -110 -22 0 187 77 1 90 40 -144 77 261
5798 261 90 111 69 -93 76 -105 26 -232 138 57 174 122 140 -26 265 59 -71 132 7 48 101 -88
5820 -88 164 108 -216 -12 -225 -116 8 37 -132 151 -42 160 -242 -91 256 -133 133 -18 -52 -15 -54 -80
$$ packed form
5657b8q4L18j43q8j2j11Q0NJ1J84q5k07J94K9j74p1J53p9R9N2k1O1k8n4j71R4
5683g6L05l48K21L0k53J10o9P8j56J72J05k94K65j41J53r4n3K50l11J35N1k04
5705a24O7jR8rn1J52J77j67j36K2K79l74J3J05l8l5m5L51k81J09j78QJ83j55k57
5730b87L27J91k2k16J2j65K28j99j80M21p8l03M38k91J07J40j0j37j50K87M2k80
5752a25K20k69K07Q3J46j07n9J78k92J15k64J40j19J09J08k04P8Q6K60k3k7k22
5774A9k29L34O1o3j01J67k60J55oQ5j20M0J02k94Q8K2J87j10p6Q9n0j84K21J84
5798B61j71K1m2j62J69j81J31k58L70q1J17n2J8j66K91k06j30K03j25M1N3j89
5820h8K52n6l24K04k13J09J24K9j69K83j93K02m02J51L47l89K66j51l4L7l9k6
$$ plain form
5842 -80 131 -205 127 73 165 -44 -64 -106 108 95 -158 1 94 206 -62 86 -100 1 124 182 15 90 33
5865 33 91 -179 153 77 295 55 -235 84 7 -259 -53 117 -83 80 78 29 -3 -234 -5 -218 -91 -108 -3
5888 -3 69 -89 178 -61 142 -67 -17 84 126 -103 -76 0 -2 27 -33 -80 18 -120 169 224 -227 -54 -261 86 21
5913 21 -49 -142 -203 115 103 -77 -99 52 -12 22 -206 -166 -16 33 -158 153 -122 -109 112 -397 -92 -4 15 143
5937 143 -92 -38 -190 -211 -11 84 136 -35 70 70 17 169 97 120 -85 -36 73 159 106 -3 -134 -110 123 17
5961 17 -118 16 -281 -60 -191 46 -194 215 350 -52 -227 113 130 -109 105 151 130 76 29 -162 -94 198
5983 198 -2 105 26 -60 69 -85 -77 59 -149 63 -50 -107 53 -316 38 199 35 13 -68 -420 43 285
6005 285 157 -249 129 97 -173 62 -49 -53 -19 156 -94 -14 13 -55 68 4 354 -63 144 322 27 -81 145
$$ packed form
5842h0K11l36L32n4R2k09k0m2K14j3k53J59R3J12k68J48j86J01J23N8j67P5n7
5865C3N8k70L32p6K18k40k90L19p7k66K06J70k00J63km9l2k31K29k13J27j7J05
5888cP2j58K67k39K03k09N0J01M2k29K7P6kK9o0m7R8j38K89N5m51J73k07L47o5
5913B1p0r3o1L18j2j80k2J51o4L4k28M0J50M9j91L11k75J3K21n09L05Q8J9J28
5937A43k35N4j52k1K00R5N2j71J05%n3J52p2K3k05M9J09Q6n3j09j31K4K33j06
5961A7j35J34k97K21j31K37k40M09J35m02j75L40J7k39K14M6k1n4m7j91O8K92
5983A98k00J07p9q6J29j54QJ36k08K12j13n7J60l69L54J61j64k2q1l52M63K42
6005B85j28m06L78l2k70K35j11mL4J75k50Q0K7o8J23o4L50m17K07J78k95j08K26
$$ plain form
6028 145 48 -27 115 -51 178 -43 42 -21 54 -99 -172 -18 -117 -31 13 58 62 -20 5 -20 -109 194 -55 -109 -83 -36
6054 -36 -17 46 -25 -45 1 -151 -82 65 69 -29 173 106 100 141 -13 84 -40 135 143 -5 -51 182 24 -239 31 11
6080 11 -160 -12 167 144 -113 40 104 51 -34 -115 -3 -11 -138 158 379 13 -202 12 -24 31 20 -154 31 74
6104 74 -57 -100 -147 62 26 -5 163 50 401 35 116 -29 54 -185 78 98 -39 -12 -61 19 -17 -150 49 348
6128 348 -36 -170 -143 82 -225 -57 151 44 1 -5 97 207 151 -191 58 -101 223 96 38 28 90 -7 111
6151 111 83 -65 88 57 55 -47 62 -73 95 -124 -41 -175 73 37 165 376 -7 -162 116 24 160 -77
6173 -77 162 133 89 11 230 -92 35 79 -190 105 41 239 24 18 16 -54 8 -146 -208 128 202 210 101 -208 189
6198 189 -38 94 179 77 -185 36 -80 -137 -69 125 -144 -277 -10 -128 -115 156 -133 210 -44 -159 -48
$$ packed form
6028A45r7p5J42j66K29k21Q5o3P5j53p3J54r9Q6M4M5Mq2K5k5q9L03k49n4K6M7
6054c6J9O3p1k0M6j52O9J47Mr8K02o7oM1j54R7j24J75Qj48m6K33j58k63K70k0
6080A1j71J48J79k3k57J53O4n3q5q1J12qj27K96K21l66k15K14l6N5j1j74J85M3
6104G4j31m3m7K09l6l1J68j13L51l66Q1j45Q3k39K63K0j37K7m9Q0l6j33J99K99
6128C48l84j34K7K25l07J68K08j07m3oJ02J10n6l42K49j59L24j27n8j0O2r7J18
6151A11k8j48J53l1kj02J09j35J68k19Q3j34K48l6J28K11l83j55K78r2J36k37
6173g7K39k9m4p8K19l22J27M4k69K95o4J98k15okp0O2j54o2L36P4Qj09l09L97
6198A89k27J32Q5j02k62K21j16n7O8J94k69j33K67j18J3K71k89L43k54j15J11
$$ plain form
6219 -48 -190 42 -100 156 -43 -194 -123 248 74 92 37 -38 -60 29 -230 41 -64 -88 -157 -46 -204 -84 115
6242 115 100 141 -63 278 94 136 -128 -308 213 -62 -132 86 -20 -135 -28 1 -20 -97 182 -99 225 292 -30
6265 -30 96 131 120 -177 -202 74 -54 26 -2 -227 159 63 -176 217 296 187 -247 309 130 -41 1 210 -52
6288 -52 11 34 74 129 -31 -92 -27 -78 -82 -152 -89 15 29 -98 -272 114 -84 -48 213 49 93 152 171 -48 171 -20
6314 -20 -23 -28 -189 0 -22 -227 -47 -209 -272 -136 0 -14 70 -91 39 24 -140 60 86 90 385 72 55 256 -81
6339 -81 -134 -205 121 -412 -313 -599 -100 71 -164 -339 -428 62 355 215 -511 136 337 168 -133 541 11 -356
6361 -356 103 -448 -405 -225 -931 515 145 817 -175 195 285 -898 336 51 -113 -553 -303 -97 81 488
6381 488 -300 -17 -286 -17 -480 -481 203 125 -55 183 -51 -67 -150 12 265 -151 51 -24 500 -194 -304 12
$$ packed form
6219d8j42K32j42K56j99j51P1L71j74J8n5p5k2Q9k59K71j05k4o9J11j58J20J99
6242A15j5M1k04L41j84M2k64j80N21k75p0K18j06j15J07K9k1p7K79k81L24O7l22
6265c0J26L5j1k97k5K76j28Q0k8k25L86r6k39L93P9j09m34N56j79j71M2K09k62
6288e2O3K3M0N5j60o1O5n1mp0O3J04J4j27j74L86j98L6K61j64M4N9J9k19K19j91
6314b0lnj61J89k2k05J80j62o3J36J36j4Q4j61J30j5j64K00K6MK95l13j7K01l37
6339h1n3p1L26n33R9k86M99J71k35j75q9M90K93j40p26O47K01j69l01O74n30l67
6361c56M59n51M3J80p06J446l70O72r92L70R0j183J234k85j64m40K50K06J78M07
6381D88p88K83k69K69m63jO84p8j80K38k34j6q3J62K53m16K02p5N24o94j10L16
$$ plain form
6403 12 151 190 103 55 -134 -75 99 -241 1 28 -5 213 50 -103 -192 -33 128 -63 245 -163 28 -45 222
6426 222 78 -132 94 112 19 -24 -1 163 -5 -152 -102 64 24 -92 44 56 -44 33 72 -10 -148 160 92 58
6450 58 108 22 -28 267 34 31 12 185 -1 18 -51 -112 -49 109 -193 -43 -425 -219 137 -166 12 127 7 -29
6474 -29 92 -71 54 142 -16 -81 147 -69 34 -16 -202 41 70 -30 146 123 -19 -102 218 -49 -122 155 193
6497 193 -91 -297 -224 -196 -78 -142 -113 210 -243 212 -12 28 -276 -39 34 -170 163 -26 159 -11 -146 19
6519 19 171 -69 -68 -8 59 139 164 -136 108 -52 -110 -69 267 30 237 341 -66 -40 126 166 -162 5 -20 -34
6543 -34 171 -122 -187 10 -8 -18 41 281 -68 0 198 42 172 -12 -152 169 52 -36 -68 131 45 -311 140
6566 140 -151 15 -6 164 31 218 -90 -218 -61 -213 280 79 -316 -78 137 38 -13 -139 10 45 -200
$$ packed form
6403A2J39L9q7m8j89N9J74l40K42K7l3K18j63j53q9J59J61j91L08m08J91p3K67
6426B22j44k10K26J8r3m3K3J64j68j47N0J66m0j16J36J2j00P7L9q2j38L08o8l4
6450E8N0q6n0K95k33lj9J73j86J9o9o1O3J58l02J50l82K06L56l03J78J15j20l6
6474b9J21j63J25Q8j58o5K28k16J03n0j86K43K9j00J76k3j42q3L20k67p3K77L8
6497A93k84k06P3K8J18o4K9L23m53M55k24M0l04K37P3k04L33j89J85j70j35J65
6519A9J52k40JO0O7Q0K5l00K44j60n8M1L36k37K07J04m07K6J66M0l28J67k5j4
6543c4K05k93o5J97j8j0N9K40l49O8J98j56J30j84j40L21j17q8l2J99q6l56M51
6566A40k91J66k1J70j33J87l08j28J57j52M93k01l95K38K15r9n1j26J49L5k45
$$ plain form
6587 -200 -28 134 214 -161 -55 198 -36 -40 40 197 -127 -108 -81 255 80 -168 28 71 -170 171 62 -209
6609 -209 349 214 -219 -81 60 148 32 -64 -79 198 -5 -230 -13 -217 35 115 228 141 106 -11 2 -212
6631 -212 74 31 91 -31 -192 32 -292 -176 -174 -129 99 64 -108 56 -42 -232 136 -46 -42 -28 29 -225 21 78
6655 78 -166 -58 87 44 213 -168 -64 12 -120 353 -110 271 30 -101 -65 76 -54 -139 -84 -108 -32 -93 -213
6678 -213 -50 161 -107 7 -19 71 184 25 60 161 -145 -17 68 -246 106 -29 -217 -85 -114 149 -152 -23
6700 -23 -103 87 90 -89 92 -223 -52 -279 -79 -10 133 -81 44 -39 -184 88 154 -3 -131 137 -212 27
6722 27 -215 -158 -53 -376 -88 -176 -151 65 -47 -235 -173 63 -57 41 101 -62 -118 -147 36 -159 -28 193 39
6745 39 -41 1 161 98 -246 69 148 -264 4 31 216 -301 -120 -19 -82 -38 -106 -60 3 152 -71 17 222 -13
$$ packed form
6587b00J72J62Q0l75J06K53k34mQ0J57l24J9K7L36j75k48J96M3k41L41j09k71
6609b09N58j35m33J38J41Q8j16r6j5K77k03k25K17k04K52Q0J13q7l5j17J3k14
6631b12K86m3O0j22j61K24l24J16KM5K28l5j72J64r8j90L68j82MJ4N7k54K46N7
6655G8k44J08J45m3J69l81J04P6j32M73m63L81k41j31L6J41j30q5N5k4P6o1j20
6678b13J63K11k68J14k6R0J13j59L5J01l06J28Q5l14L52j35j88J32k9K63l01J29
6700b3q0J90Lj79J81l15J71k27K00O9J43k14J25q3j45K72O6j57j28K68l49K39
6722B7k42N7J05l23K88q8K5K16j12j88O2K36j20R8O0j63n6k9J83j95J31K21j54
6745C9q0M2J60o3l44L15P9m12K68K7J85n17J81J01o3M4o8M6O3J49k23Q8K05k35
$$ plain form
6769 -13 -104 -201 -125 91 54 -95 196 -87 26 -327 254 264 -35 20 -202 -214 -83 -118 -19 105 -196 166 -157
6792 -157 199 161 35 154 145 -40 19 -169 -197 170 5 -150 78 132 -20 -58 123 34 260 44 -5 105 62
6815 62 -143 50 42 9 -32 4 -120 -15 155 -54 38 127 153 254 -36 85 -105 15 -129 -112 192 24 -137
6838 -137 220 149 -111 34 18 -115 -9 -40 127 -35 -89 93 -109 -83 -81 288 101 -93 127 108 -52 -162 -64
6861 -64 -208 -66 6 -126 -6 -31 -162 -335 -46 -114 125 -158 -15 114 76 -119 117 65 30 119 205 11 -212
6884 -212 -53 41 -54 -256 221 -360 -92 -50 -71 30 -140 -360 103 91 -109 -101 68 83 190 51 73 167 -91
6907 -91 278 -79 47 91 -11 18 -52 -41 -107 327 -192 8 198 -57 -401 -180 42 -228 -143 -123 28 249 -138
6930 -138 -199 -219 130 -4 -30 -178 283 52 150 -99 -100 -165 54 64 -34 21 -128 45 165 85 -262 -164 23 41
$$ packed form
6769a3r1r7P6K16l7j49K91k83J13l53N81J0k99N5k22j2J31l5R9J24l01L62l23
6792a57L56l8j26J19rj85N9j88k8L67j65j55K28N4j52l8J81q9K26k16m9J10m3
6815F2k05J93ql3m1L6j24J05J70k09R2Q9K6J01k90J21j90J20j44J7L04j68j61
6838a37L57p1k60J45j6j33J06l1J67j62n4J82k02K6KL69j87j94K20j9j60j10R8
6861f4j44J42P2j32J20k5j31j73K89o8K39k83J43J29l8j95K36n2l5Q9Q6j94k23
6884b12J59R4r5k02M77n81K68M2k1J01j70k20M63j2k00QJ69J5J07j39K2R4k58
6907i1L69l57J26M4j02K9p0J1o6M34n19K00J90k55l44K21K22k70Q5K0J51K21l87
6930a38o1k0L49j34k6j48M61k31R8k49jo5K19J0r8N5j49J73J20q0l47R8J87J8
$$ plain form
6954 41 280 91 242 -4 117 -14 -234 -250 168 292 37 145 -186 -115 16 286 -35 -31 -202 -97 -232 70
6976 70 -269 -2 -162 -164 -199 38 -31 11 -19 -96 -145 -174 -45 -43 72 -98 106 -218 -122 55 -54 -176 156 10
7000 10 142 -32 161 200 66 -218 -149 18 -49 -84 -45 -43 6 5 -112 225 -173 35 -131 184 255 -48 35 74 -52
7025 -52 3 -389 227 -44 -36 -61 -2 -277 231 -29 -86 -80 -144 72 -146 -71 93 -78 -86 49 7 193 23 92 76
7050 76 103 234 -80 39 12 55 -199 -90 -223 126 -100 -159 -329 -323 16 59 208 -17 -21 -79 231 233 89 67 75
7075 75 -122 72 -349 -308 55 -107 87 82 -206 186 -266 131 73 72 -103 -121 -87 -86 118 37 -232 -26 218 147
7099 147 40 75 -226 -270 -30 -58 268 -50 -213 207 -51 -148 136 -54 73 141 228 34 93 160 -73 -38 200
7122 200 -119 -203 11 47 -1 101 -41 62 86 -129 290 -164 158 47 -4 -235 151 -136 -57 -71 55 45 -88
$$ packed form
6954D1K39j89J51k46J21j31k20j6M18J24k55J08l31P1J31K70l21Mj71J05j35L02
6976G0l39K67j60kl5K37o9M2l0p7m9k9J29KJ15j70K04l24R6J77j09j22L32j46
7000A0J32j74J93L9j34k84O9J67o7l5L9KM9jj17L37l98K08j66L15P1l03Q3L9j26
7025e2N5l92O16k71Qk5N9k75N08k60n7Oo4K16k18P5J64j71qJ35m2J86j70O9j6
7050G6K7J31l14J19k7M3k54J09j33L49k26n9j70OL39M3J49k25mn8L10Kj44k2Q
7075G5j97J94m21M1L63j62J94nk88L92m52L97n8jj75j8L4JK04q1k69K06K44p1
7099A47j07L5l01m4K40k8L26l18j63M20k58r7K84j90J27O8Q7j94N9O7k33L5K38
7122B00l19q4K14L6m8J02j42J03K4k15M19m54L22j11n1k31L86k87P9j4J26j0j33
$$ plain form
7145 -88 -60 37 22 144 -4 -250 -88 -108 242 -243 -55 81 115 -28 17 32 -98 38 -153 16 -14 230 14
7168 14 164 145 -174 242 30 96 122 206 62 38 -69 -68 10 -20 108 -222 360 183 82 108 108 -38 -278 -95
7192 -95 -67 -16 176 -72 -266 141 -36 -58 -93 -168 -84 97 138 13 124 8 -272 -80 360 80 -161 -183 159
7215 159 -186 289 72 114 6 -172 -21 -222 38 -217 92 293 -134 72 -208 -21 185 63 28 52 182
7236 182 -84 76 -8 215 -18 -23 36 68 -107 179 41 72 64 -73 -20 -20 -311 -9 30 33 32 33 -68 44 18 106 114
7263 114 175 -65 -14 219 -8 138 -112 -99 363 181 1 223 -25 -69 148 133 -123 105 -30 -31 155 161 -121
7286 -121 -181 -48 3 -76 -51 -112 9 -21 -120 -17 -59 -134 -119 109 -21 -161 188 143 -15 89 192 -80 -36 34
7310 34 28 24 -6 -192 -104 -205 136 -5 208 41 224 -174 -65 -78 -37 26 -421 50 -135 -147 -57 142 14 108
$$ packed form
7145h8K8R7j5J22j48k46J62k0L50m85J88J36L4j43M5J5j30J36j91J69l0K44k16
7168A4J50j9l19M16k12O6K6Q4j44k4j07JP8l0J28l30N82j77j01K6%j46k40J83
7192i5K8N1J92k48j94M07j77k2l5p5Q4J81M1j25J11j16k80J92M40k80k41k2L42
7215A59l45M75k17M2j08j78J51k01K60k55L09K01m27K06k80J87K06j22l5K4J30
7236A82k66J60q4K23k33nN9L2j75K86j38L1qj37N3%k91L02L9LjJj01J12k6Q8Q
7263A14O1k40N1K33k27J46k50J3M62j82j80K22k48m4K17j5k56K28j35jJ86Ok82
7286a21o0J33N1p9K5o1J21l0r9J03m2p5J5K28j30j40L49m5j58J04J03k72M4P0
7310C4oml0j86Q8j01L41j41K13j67J83l98J09j3M1O3m47M71j85j2R0J99j28R4
$$ plain form
7334 108 -85 21 -137 -29 -28 -62 83 -32 -69 -108 189 174 -112 145 -7 -3 163 156 -109 56 -171 120 -126
7357 -126 -273 40 -78 -147 20 97 -106 -146 84 -185 -2 -71 -67 118 -142 -95 124 106 -157 73 -215 37 -34
7380 -34 -206 -9 -92 -205 -217 -280 -93 -96 -20 49 16 11 41 165 -65 -77 38 12 -117 51 -134 -22 -99 29 198
7405 198 224 -77 98 -295 -102 23 -119 -109 -22 76 372 192 -52 -12 -111 156 164 -38 -37 146 160 110 -86 -101
7429 -101 105 140 -145 119 -33 -209 -4 162 20 66 97 292 -37 176 45 208 31 197 -99 95 139
7450 139 92 183 -153 46 -86 -162 -230 -81 47 26 81 -18 -49 175 213 75 125 9 18 269 -159 -14 70 81 -154
7475 -154 104 -65 4 -227 -127 21 -151 -55 18 55 37 1 50 3 15 -58 68 44 11 -5 30 -201 145 223 69
7500 69 -66 124 -153 -147 190 178 -44 -20 237 -156 -9 4 7 170 -2 -55 72 -52 -273 66 17 -2 182 118
$$ packed form
7334A08j93J06j58J08Jl4J45j15l7l9K97j5k86K57j52MJ66pk65J65k27K91k46
7357a26j47L13j18o9J67P7k03m0K30k69J83o9MJ85k60M7K19j8k63K30k88K52p1
7380c4j72J97q3j13j2o3J87lP6O9l3nL0J24k30j2J15k6j29J68j85J12p7J28J69
7405A98K6l01J75l93J93J25j42J0Q7R8K96j80k44M0r9K67Qk02JJ83J4n0j96j5
7429a01K06L5k85K64j52j76K05J66j42M6L1J95l29K13j31J63j77J66k96J94M4
7450A39m7R1l36J99j32p6o8J49J28k1N5r9l1K24L8j38N0j16RK51m28J45Q4J1k35
7475a54K58j69O9k31J00J48j72R6P3L7j8l6M9m7J2p3J26k4l3j6L5k31L46P8j54
7500F9j35J90k77OL37j2k22K4K57l93J47J3LJ63j72n3J27j24k21L39m9j9J84o4
$$ plain form
7524 118 83 0 -37 33 -108 -160 -32 -72 154 70 24 -74 201 10 74 -134 99 -114 -8 217 -189 -150 -164 95
7548 95 -259 -94 -6 181 42 41 266 58 -33 -120 114 -66 226 -67 109 -58 -87 75 -307 189 134 92 90 -65
7572 -65 -2 24 -2 -226 -25 -43 90 -192 -6 -65 -296 58 -114 -19 84 21 38 11 -75 -43 -40 -134 163 282 -58
7597 -58 -6 -70 252 -76 189 109 -107 127 114 31 -113 -99 15 66 -62 -115 101 105 -77 -98 70 -168 69 73 -212
7622 -212 67 162 -39 -94 18 188 103 -147 -29 0 -19 102 75 -182 42 3 169 146 -22 167 -13 -244 -137
7645 -137 84 16 282 69 -45 -67 -207 -14 -64 20 267 200 165 -26 -20 16 -64 -46 79 -6 183 -3 125 -242
7669 -242 31 89 -35 -97 -87 185 233 151 159 -9 -198 166 -89 -43 -287 -121 -136 -119 -116 101 45 16 -164 89 260
7694 260 12 133 -121 -147 -221 87 95 186 -23 79 -6 -12 10 87 -71 -144 -235 6 33 221 -218 -30 -81 206 -16
$$ packed form
7524A18l5q3l7P0j41n2J28m0K26q4m6r8K75j91O4k08K33k13J06K25m06L9j4K59
7548I5l54J65Q8J87j39jK25k08r1q7K34j80K92k93J76j67k9J62l82M96n5m2kj55
7572f5O3K6k6k24K01j8J33k82J86n9k31L54j72R5J03o3J7k7q6L2Lr4K97J19l40
7597e8N2o4L22l28K65q0k16K34j3q3j44J4J14N1j28n3K16Mj82k1J68k38K37Mk85
7622b12K79R5k01n5J12J70q5k50J18K9j9J21k7k57K24l9J66k3j68J89j80k31J07
7645a37K21o8K66k13j14k2j40J93n0Q4K47o7l5j91OL6q0J8J25q5J89j86J28l67
7669b42K73N8j24o2J0K72M8q2Qj68j89L64k55M6k44J66j5J7LK17n6k9j80K53J71
7694B60k48J21k54k6p4L08QR1k09J02q5oK2P7j58p3r1K41K7J88m39J88n1K87k22
$$ plain form
7719 -16 -63 111 139 207 -253 -163 -309 -190 3 -61 255 -37 -82 -74 -103 261 165 -37 -234 -150 124 -75 -17 -70 -102
7744 -102 184 -67 191 368 84 124 169 -24 68 -169 -234 -4 4 274 6 108 5 66 -183 319 64 128 193
7767 193 -104 12 -62 -59 -94 107 -111 -84 -43 -151 -26 8 70 201 -112 -6 98 -53 -158 218 -16 2 127
7790 127 -106 -191 -102 137 -111 146 -3 25 66 -29 -48 40 149 26 -61 16 -82 6 113 224 127 2 110 240
7814 240 -136 26 102 47 112 181 0 -76 -63 -24 14 39 69 34 -18 125 -189 -106 110 135 169 -93 -156 233 -76
7839 -76 6 73 40 40 60 429 93 -92 -85 -5 274 -296 35 41 -16 4 59 -27 -140 2 -152 -57 -61 50 -45 7 -48
7866 -48 -58 -70 125 47 -178 -42 -87 -45 -71 -35 -48 -72 -112 144 67 127 -38 50 -110 -37 78 -84 17 -114 60
7891 60 61 78 -25 148 -112 -209 -82 180 93 67 -111 88 -90 -20 -116 132 117 118 46 -129 83 252 63 -201
$$ packed form
7719a6m7J74K8O8m60R0j46J19J93o4L16k92m5Qk9L64r6k02j97Q4K74j99N8n3l2
7744a02K86k51K58J77k84M0M5j93R2k37o5K30QK70k68J02j03O1k49N02k55O4O5
7767A93k97J16p4Ll5K01k18K7M1j08J25L4O2J31l13J06J04j51j05L76k34J8J25
7790A27k33q5Q9K39k48K57j49K8M1r5j9Q8J09j23q7P7r8Q8J07J11r7j25J08J30
7814B40l76J62P6n5O5O9j81p6J3L9L8K5L0l5n2J43l14Q3K16K5L4k62o3L89l09
7839g6Q2O7l3%K0L69l36j85PQ0K79n70L31On7K0N5q6j13J42j54R5mJ11r5N2n5
7866d8j0j2J95p8k25J36m5M2k6L6j3k4m0K56p7O0j65Q8j60P3J15j62J01j31J74
7891F0JJ7j03J73k60r7J27K62q7k6j78J99j78P0r6K48j5Jp2j75K12J69j89k64
$$ plain form
7915 -201 -15 35 102 -272 80 69 256 13 191 4 59 208 115 -1 -182 32 -112 -81 -185 141 -59 -188
7937 -188 -13 16 14 -20 -90 204 -162 -72 -149 -76 -94 -78 -135 1 -349 -66 246 54 39 -99 -181 95 -84 -186
7961 -186 166 147 -51 -238 -52 -102 -31 108 -6 -73 78 -167 149 -162 -18 -95 -108 -20 -198 25 48 31 -300
7984 -300 46 -199 -21 -66 14 96 -144 84 -46 -128 0 -43 53 12 229 -10 85 54 194 -133 153 -30 251
8007 251 85 -136 314 80 172 56 180 -46 -235 -68 -65 -96 70 -32 11 178 123 44 -58 -120 59 -10 -2 -204
8031 -204 -187 -95 79 217 -32 -16 145 120 28 89 96 -16 -3 66 51 125 52 -162 -69 -24 71 -10 -160 41 73 -96
8057 -96 -137 112 -114 99 63 6 243 -75 89 -106 232 212 -69 54 17 108 -11 38 -85 -72 68 151 54 90
8081 90 11 -193 -67 86 22 -6 -219 -116 5 -269 -81 157 -32 -86 47 -12 120 -94 -216 45 17 164
$$ packed form
7915b01J86N0O7l74L52j1J87k43J78j87N5J49r3j16j81K14j44L1j04L26k00j29
7937a88J75K9kl4p0K94l66R0p7P3j8J6n7J36l50K83L12j92j5j38q2K76j79j02
7961a86L52j9j98j87J86n0P1J39j14o7J51k45L16l11J44p7j3Q8j78K23K3j7l31
7984c00L46k45J78m5Q0Q2k40K28j30q2J28m3R6m1K17k39R5l1J40l27K86j83K81
8007B51j66k21M50k34R2j16J24k26j89J67Ll1J66j02M3J67n5p9j02o2J79o9Qk02
8031b04J7R2J74J38k49J6J61k5r2O1Pj12J3O9j5P4p3k14R3M5R5q1j50K01L2j69
8057i6m1K49k26K13l6n7K37l18J64j95L38k0k81J23l7R1j19M9j23J3J40Q3r7L6
8081I0p9k04J26J53o4k8k13J03J21k74J88K38j89n4J33n9J32k14j22K61k8J47
$$ plain form
8103 164 -301 241 -168 -137 50 29 -5 136 -161 -79 -298 96 107 99 51 -235 -80 73 128 -174 103 68 44 97
8127 97 272 -33 83 69 -162 36 177 139 180 178 71 50 -195 7 3 -137 92 10 -76 38 81 79 86 7 20 126
8153 126 -81 -24 41 147 -251 163 0 201 42 -30 40 85 62 157 -163 -89 317 25 -46 -115 -11 -132 231
8176 231 21 -282 44 219 160 -30 3 -150 -8 49 -36 -83 -118 73 -298
$$ packed form
8103A64m65N42m09L1J87k1l4J41k97Q2k19L94J1qm8k86J55J53N5l02K77l5k4N3
8127I7J75l05J16j4k31J98J41l8M1kj07k1k45K02mj40K29q2q6J14M3kPp9J3J06
8153A26k07N7O5J06l98M14j63K01j59p2P0M5k3R5l20P4M06k92p1o9J04j21L63
8176B31k10l03L26J75n9j90L3j53J42N7q5m7l5J91l71
8191b98
$$ Imaginary data points
##PAGE= N=2
##DATA TABLE= (X++(I..I)), XYDATA
$$ plain form
0 0 0 0 0 0 0 0 0 0 0 0 0 -8 8 -8 8 -13 16 -16 24 -28 32 -40 48 -56 65 -78 92 -106 124 -141 163 -185 210
33 210 -238 271 -306 343 -386 432 -483 538 -599 666 -738 816 -904 998 -1102 1215 -1339
50 -1339 1475 -1626 1792 -1976 2185 -2416 2677 -2977 3326 -3733 4222 -4814 5561 -6534 7861
65 7861 -9804 12958 -19006 35011 -171896 -386471 120025 394368 24894 56263 198015
76 198015 168065 166088 104025 68818 -133993 62690 61202 5485 -130201 -95484 104291 79194
88 79194 16295 -124389 23709 9241 -60494 -133807 -181493 -80710 -118850 -51723 -116471 -47960
100 -47960 23946 133662 161758 80006 171016 137809 139619 79406 93131 -17571 -96755 9535
112 9535 -54818 -114910 -145366 -15028 -2372 64 -32675 -64233 54390 9180 -37844 -61732
$$ packed form
0@%%%%%%%%%%%qJ6j6J6k1K9l2M0n2O0p2Q8j04J21j43J70j98K30k65L04l48L95
33B10m48N09n77O49p29Q18r15J021j137J265j404J554j720J902k100K317k554
50a339K814l101L418l768M161m601N093n654O303p059P955r036J0375j2095J4395
65G861j7665K2762l1964N4017k06907k14575N06496K74343l69474L1369J41752
76A98015k9950j977o2063l5207k02811J96683j488n5717j35686L4717J99775k5097
88G9194o2899j40684J48098j4468o9735p3313m7686J00783l8140O7127o4748O8511
100d7960P1906J09716K8096q1752R1010l3207J810o0213J3725j10702p9184J06290
112I535o4353o0092l0456J30338J2656K436l2739l1558J18623m5210m7024k3888
$$ plain form
124 -61732 -12286 -97083 -76052 63620 -38935 -90230 59196 230558 57960 -8661 132089
135 132089 173624 100452 -7457 7166 -48059 -47039 -55672 -92718 -137276 -111830 18268 -10733
147 -10733 -56835 -49666 67222 74565 -8672 -12675 -2557 23998 -25629 -21986 -23360 2229 34604
160 34604 48568 52197 20043 103893 114630 42008 -9250 26689 10468 -83897 -72543 -69107
172 -69107 -81043 -99693 -56658 -37014 -27273 10410 5900 49444 56879 33816 17558 50266 30133
185 30133 -21675 13311 9495 -13801 -8141 48368 23126 -7875 49254 53637 6351 -24274 4401
198 4401 -23013 -54269 -55952 -65239 -70509 -60266 -9674 -21798 -22151 22543 61347 50871 26591
211 26591 49685 56721 42989 -1518 -4751 8489 -3221 -15324 -17048 4602 -9514 1171 20316
$$ packed form
124f1732M9446q4797K1031J39672j02555n1295J49426J71362j72598o6621J40750
135A32089M1535p3172j07909J4623n5225J020q633l7046m4558K5446J30098k9001
147a0733m6102P169J16888P343q3237m003J0118K6555m9627L643j374K5589L2375
160C4604J3964L629l2154Q3850J0737p2622n1258L5939j6221r4365J1354L436
172f9107j1936j8650M3035J9644R741L7683m510M3544P435k3063j6258L2708k0133
185C0133n1808L4986l816k3296N660N6509k5242l1001N7129M383m7286l0625K8675
198D401k7414l1256j683r287n270J0243N0592j2124l53M4694L8804j0476k4280
211B6591K3094P036j3732m4507l233J3240j1710j2103j724K1650j4116J0685J9145
$$ plain form
224 20316 5 -23790 6007 21749 -45162 -60241 -23495 -7256 -38137 -45225 -13196 5674
236 5674 26013 23065 24112 37437 54386 40159 23145 18099 -1582 7416 4064 -20309 -33827
249 -33827 -8236 3120 -24535 -17624 7595 5648 -14752 733 -1227 -21669 -9722 -3276 -16209
262 -16209 -24236 826 5638 -6100 8471 30325 23976 11720 26675 22930 13024 5665 1410
275 1410 268 -11837 -17949 -16582 -7454 -12101 -14655 -3863 2636 -4853 -2730 15766 -2743 -12758
289 -12758 7904 10582 -11765 -13394 8265 5727 -4235 1028 9993 4901 6840 10584 -596 2952
303 2952 5219 481 -4078 -6888 -8716 -825 3623 -10666 -11435 6482 12054 -8951 -5350 16611
317 16611 4033 -6872 4663 6097 -7354 -1556 5938 -5631 -10135 -521 2944 -7558 -2974
$$ packed form
224B0316k0311k3795K9797J5742o6911j5079L6746J6239l0881p088L2029J8870
236E674K0339k948J047J3325J6949j4227j7014n046j9681Q998l352k4373j3518
249c3827K5591J1356k7655O911K5219j947k0400J5485j960k0442J1947O446j2933
262a6209q027K5062M812j1738J4571K1854o349j2256J4955l745r906p359m255
275A410j142j2105o112J367R128m647k554J0792O499p489K123J8496j8509j0015
289a2758K0662K678k2347j629K1659k538r962N263Q965n092J939L744j1180L548
303B952K267m738m559k810j828P891M448j4289p69J7917N572k1005L601K1961
317A6611j2578j0905J1535J434j3451N798P494j1569m504R614L465j0502M584
$$ plain form
330 -2974 -88 -3807 2659 5004 402 2500 7601 2695 3103 6563 3496 -1176 -916 2456 -1680 416
346 416 -1247 -7639 -554 5258 -5650 -7333 6234 499 -9361 -4592 -50 -7430 -9830 927 -2078
361 -2078 -5812 4352 10861 5255 7731 12671 9138 8640 4806 1544 1982 1431 -7635 -12764 -3388 -1900
377 -1900 -12365 -7691 4273 -3681 -4374 9226 3407 -8047 -2827 5023 -1648 -6050 -2134 -3565
391 -3565 -476 8509 5756 665 10272 11166 6647 11483 5025 -6283 -2205 2187 -10677 -19809 -12762
406 -12762 -5465 -5185 -4943 -5509 -3559 9554 13410 2855 697 4431 5830 5354 68 -6373 -5250
421 -5250 1658 7399 564 -6062 6025 16064 9049 -636 -2226 64 -503 -7737 -17179 -17805 -7153
436 -7153 -4409 -12013 -6329 3046 3470 13571 16510 2598 6545 19389 10112 -3356 -1902 -2338 -3529
$$ packed form
330b974K886l719O466K345m602K098N101m906M08L460l067m672K60L372m136K096
346D16j663o392P085N812j0908j683J3567n735r860M769M542p380k400J0757l005
361b078l734J0164O509n606K476M940l533m98l834l262M38n51r066n129R376J488
377a900j0465M674J1964p954o93J3600n819j1454N220P850o671m402L916j431
391c565L089Q985k753n091R607Q94m519M836o458j1308M078M392j2864r132P047
406a2762P297K80K42n66J950J3113L856j0555k158L734J399m76n286o441J123
421e250O908N741o835o626J2087J0039p015r685j590K290n67p234r442o26J0652
436g153K744p604N684R375M24J0101K939j3912L947J2844r277j3468J454m36j191
$$ plain form
451 -3529 1604 -2071 -13102 -1370 15192 3886 -8351 -5908 -2420 2455 -1087 -17665 -18940 -5988
465 -5988 -2455 -4283 -5839 -3400 6811 17867 17548 9584 10866 19277 18070 5874 -6415 -6466 508
480 508 -6541 -14319 -5725 -7176 -11449 1005 2733 -8321 -4147 2865 780 -2117 -10215 -16057 -2596
495 -2596 9499 -4601 -10147 10215 14703 7427 18753 20346 8165 10419 10624 -1881 -5815 -6201
509 -6201 -8537 -8608 -12456 -16993 -10279 -480 -1768 -5505 -236 6792 6391 -2123 -9311 937 9235 -3856
525 -3856 -6714 3631 -1863 87 18410 15795 682 2852 12344 13105 3124 -9586 -6262 7269
539 7269 -2901 -24229 -15472 -42 -10426 -9547 5761 -374 -7235 2797 6738 5655 5048 -590
553 -590 564 5389 -3556 -6797 8216 11007 -1919 275 8546 3887 2190 7047 3248 -1889 -7152
$$ packed form
451c529N133l675j1031J1732J6562j1306j2237K443L488M875l542j6578j275J2952
465e988L533j828j556K439J0211J1056l19p964J282Q411j207j2196j2289n1O974
480E08p049p778Q594j451m273J2454J728j1054M174P012k085k897q098n842J3461
495b596J2095j4100n546K0362M488p276J1326J593j2181K254K05j2505l934l86
509f201k336p1l848m537O714R799j288l737N269P028m01q514p188J0248Q298j3091
525c856k858J0345n494J950J8323k615j5113K170R492P61r981j2710L324J3531
539G269j0170k1328Q757J5430j0384Q79J5308o135o861J0032L941j083o07n638
553e90J154M825q945l241J5013K791j2926K194Q271m659j697M857l799n137n263
$$ plain form
568 -7152 -12608 -6958 -5373 -15640 -9138 3603 -1900 -5138 4954 9550 4913 4434 9263 10763 1793
583 1793 -9552 -4062 10674 4630 -9546 -4814 2180 182 3178 3559 72 4463 -410 -8767 -1819
598 -1819 -2354 -11680 -2800 5123 -9659 -9628 11085 8301 -5719 5119 14706 4759 853 199 -3182
613 -3182 4662 4602 -8125 -8727 -2881 -3953 -1206 2781 -2869 -5815 2461 6114 -1489 -4852 653 4603
629 4603 3625 -2699 -4696 2363 4635 1973 1654 853 3385 4797 -604 443 3185 -2715 -2437 1966
645 1966 -5540 -11033 -222 4905 -4574 -5347 105 -3629 636 9183 -530 -6028 3794 3901 1435
660 1435 3772 -2040 -3023 7774 5546 -6491 -3201 6931 2261 -4187 640 153 -2075 2179 -1077
675 -1077 -5191 345 2305 -1319 -4366 -5336 -419 4605 1457 -4808 -3909 4299 6230 565 -552 1427
$$ packed form
568g152n456N650J585j0267O502J2741n503l238J0092M596m637m79M829J500q970
583A793j1345N490J4736o044j4176M732O994j998K996L81l487M391m873q357O948
598a819n35r326Q880P923j4782L1K0713k784j4020J0838R587r947l906o54l381
613c182P844o0j2727o02N846j072K747L987n650k946Q276L653p603l363N505L950
629D603r78o324j997P059K272k662l19q01K532J412n401J047K742n900K78M403
645A966p506n493J0811N127r479p73N452l734M265Q547r713n498R822J07k466
660A435K337n812r83J0797k228j2037L290J0132m670o448M827m87k228M254l256
675a077m114N536J960l624l047r70M917N024l148o265Q99Q208J931n665j117J979
$$ plain form
691 1427 1124 1420 66 -2651 -3114 209 2716 -3532 -6246 1884 3534 902 4727 2315 -2058 3840
707 3840 5351 -2322 -2527 2532 -1870 -6782 -1225 -1214 -6062 1130 4906 -3317 -2900 2775 942 251
723 251 889 -2450 -2641 -92 -1700 -3420 387 3912 2821 4152 6249 2665 4373 8052 3939 -350
739 -350 -958 -2925 -5605 -6627 -6891 -4191 -2673 -3383 -5574 -3287 3595 3686 -503 1710 2387 -1404 -314
756 -314 1884 -1062 -1705 3651 5326 65 2870 10260 7438 3892 6142 3260 -1145 -2193 -5236 -8745
772 -8745 -7566 -6508 -8838 -9095 -5216 -2925 -708 4292 3833 1447 4742 5070 1714 1970 1730 212
788 212 554 412 412 3212 5943 5038 4100 5700 3196 -2294 -789 275 -7614 -11125 -8408 -8217 -9693
805 -9693 -7200 -2535 -1006 1189 6336 6760 5904 8077 6353 2965 4225 1870 -2345 -1345 274 -876
$$ packed form
691A427l03K96j354k717m63L323K507o248k714Q130J650k632L825k412m373N898
707C840J511p673k05N059m402m912N557J1m848P192L776q223M17N675j833o91
723B51O38l339j91K549j608j720L807L525j091J331K097l584J708L679m113m289
739c50o08j967k680j022k64K700J518p10k191K287O882R1m189K213O77l791J090
756c14K198k946o43N356J675n261K805P390k822l546K250k882m405j048l043l509
772h745J179J058k330k57L879K291K217N000m59k386L295L28l356K56k40j518
788B12L42j42%K800K731r05r38J600k504n490J505J064p889l511K717J91j476
805i693K493M665J529K195N147M24q56K173j724l388J260k355m215J000J619j150
$$ plain form
821 -876 -397 3024 3102 -916 1881 4619 -907 -3499 -2952 -5599 -7268 -7538 -8179 -5804 -2887 -768 1930
838 1930 4209 6109 7012 9201 9325 3528 2054 4274 -426 -4186 -3309 -4009 -4710 -3857 -1198 16 -518
855 -518 1301 2065 375 1010 -710 -4859 -4091 -2318 -4266 -3411 269 1839 1633 5372 8962 5892 5141
872 5141 7938 3918 356 18 -4063 -5571 -4545 -6964 -7456 -3928 -2456 -2691 1160 4092 29 -1114
888 -1114 4564 3220 -2217 -915 -136 -393 1052 1014 661 2710 4020 4701 4430 3161 1493 -17 50
905 50 -2588 -6737 -5549 -3475 -5230 -6079 -2888 -181 -1002 -360 4044 3092 823 4524 4657 479 2126
922 2126 2482 -1208 -129 2255 -801 -1122 2071 1170 -1120 2022 1387 -2606 -683 -337 -4446 -2250
938 -2250 -892 -4321 -2501 58 -2760 -387 3520 494 -1422 3945 5734 639 -951 1967 2261
$$ packed form
821h76M79L421P8m018K797K738n526k592N47k647j669k70o41K375K917K119K698
838A930K279J900R03K189J24n797j474K220m700l760Q77p00p01Q53K659J214n34
855e18J819P64j690O35j720m149P68J773j948Q55L680J570k06L739L590l070p51
872E141K797m020l562l38m081j508J026k419m92L528J472k35L851K932m063j143
888a114N678j344n437J302P79k57J445l8l53K049J310O81k71j269j668j510O7
905E0k638m149J188K074j755q49L191K707q21O42M404r52k269L701J33m178J647
922B126L56l690J079K384l056l21L193r01k290L142o35l993J923L46m109K196
938b250J358l429J820K559k818K373L907l026j916N367J789n095j590K918K94
$$ plain form
953 2261 1218 -1110 -2651 331 1595 -1000 -1151 -1877 -1911 1628 2322 -984 -1800 363 3732 3299 -1772
970 -1772 -2843 26 1387 -343 -1816 -3331 -3907 206 2694 -2448 -2478 3105 471 -1015 4106 847
986 847 -2504 2806 2070 -3779 -2055 1933 1417 1237 1986 883 3930 6394 41 -1112 4701 -24
1002 -24 -6018 -2426 -4762 -9417 -4706 -1980 -4913 -5203 -1069 3027 3641 2600 3195 5588 6490 1697
1018 1697 -1066 1750 2704 1906 1113 -780 573 3745 3553 4126 1935 -2034 805 605 -7394 -10435
1034 -10435 -7527 -7941 -7414 -7095 -9161 -5862 5228 7760 2989 8137 11187 5441 7423 10301 1807
1049 1807 -2285 1090 751 -2591 -4134 -2851 2872 4277 -962 -1273 3301 -268 -8605 -5479 -4056
1064 -4056 -11282 -11397 -7423 -9131 -5657 3010 7331 8904 8015 10305 15166 14650 8848 4359 2827 -539
$$ packed form
953B261j043k328j541K982J264k595j51p26l4L539O94l306q16K163L369m33n071
970a772j071K869J361j730j473j515n76M113K488n142l0N583k634j486N121l259
986H47l351N310p36n849J724L988n16j80P49j103L047K464o353j153N813m725
1002b4n994L592k336m655M711K726k933k90M134M096O14j041N95K393R02m793
1018A697k763K816R54p98p93j893J353L172j92N73k191l969K839k00p999l041
1034a0435K908m14N27L19k066L299J1090K532m771N148L050n746J982K878q494
1049A807m092L375l39l342j543J283N723J405n239l11M574l569q337L126J423
1064d056p226j15L974j708L474Q667M321J573q89K290M861n16n802m489j532l366
$$ plain form
1080 -539 -5252 -7232 -7239 -6438 -4027 -4026 -3461 53 -253 -70 1649 -2521 -6011 -4185 -6277 -8870 -5764 -3174
1098 -3174 -132 5848 7881 7075 12388 18593 14270 9301 8812 2516 -3858 -5032 -8966 -13329 -12927 -12718
1114 -12718 -9521 -4636 -4803 -2642 5302 5754 285 1845 4026 -1873 -4867 833 115 -3482 920
1129 920 6076 7941 10356 13082 14652 10478 4206 3018 1587 -6983 -14199 -15514 -16233 -17246 -14158
1144 -14158 -9859 -6858 -1474 4884 7362 8352 9429 8904 7836 5306 1201 1043 655 -2063 774 4552
1160 4552 4284 6685 8878 6197 4131 4354 -60 -7770 -11194 -14632 -18929 -17412 -13998 -13121 -8378 -2005
1176 -2005 2435 9516 14695 14287 14774 15398 10557 6243 4283 895 -2842 -3424 -1896 -2371 -1981 406
1192 406 3060 3077 815 -1409 -2575 -8496 -13788 -11766 -11548 -15598 -14067 -7526 -2300 2518 8962 15253
$$ packed form
1080e39m713j980pQ01K411JN65L514l06J83J719m170l490J826k092k593L106K590
1098c174L042N980K033q06N313O205m323m969m89o296o374j174l934m363M02K09
1114a2718L197M885j67K161P944M52n469J560K181n899k994N700p18l597M402
1129I20N156J865K415K726J570m174o272j188j431q570p216j315p19j013L088
1144a4158M299L001N384O358K478R90J077n25j068k530m105j58l88k718K837L778
1160D552k68K401K193k681k066K23m414p710l424l438m297J517L414Q77M743O373
1176b005M440P081N179m08M87O24m841m314j960l388l737n82J528m75L90K387
1192D06K654J7k262k224j166n921n292K022K18m050J531O541N226M818O444O291
$$ plain form
1208 15253 17229 17213 17545 16031 10446 4659 2429 -528 -8015 -11354 -7473 -7153 -8207 -2670 -216 -1720
1224 -1720 -1552 -471 -2750 -4695 -5869 -7510 -10750 -10463 -6615 -2325 1969 6767 11492 14723 16351
1239 16351 17404 16926 11729 7219 3558 -3653 -9348 -10936 -12741 -12953 -10803 -7277 -5133 -3814 -545
1254 -545 2402 3088 2198 -170 -1913 -2420 -5024 -4356 -733 734 2735 7057 9551 11920 13269 13451
1270 13451 12024 7017 1037 -3110 -6615 -10975 -14319 -13599 -12227 -13101 -9374 -2298 639 1758 5459
1285 5459 7376 6473 3530 2868 2411 -834 -1049 1372 108 -60 4305 7247 7611 7161 7850 5606 1080
1302 1080 -1768 -5030 -9537 -11424 -12359 -13614 -11637 -8554 -4688 389 4210 7613 9363 9241 8822 8501
1318 8501 6665 2957 -307 -582 -1445 -2448 -498 442 -55 1920 3968 1941 162 -999 -2564 -5572
$$ packed form
1208A5253J976j6L32j514n585n787k230k957p487l339L881L20j054N537K454j504
1224a720J68J081k279j945j174j641l240K87L848M290M294M798M725L231J628
1239A6351J053m78n197m510l661p211n695j588j805k12K150L526K144J319L269
1254e45K947O86q90k368j743n07k604O68L623J467K001M322K494K369J349J82
1270A3451j427n007n980m147l505m360l344P20J372q74L727P076K937J119L701
1285E459J917r03k943o62m57l245k15K421j264j68M365K942L64m50O89k244m526
1302A080k848l262m507j887r35j255J977L083L866N077L821L403J750j22m19l21
1318H501j836l708l264k75q63j003J950R40m97J975K048k027j779j161j565l008
$$ plain form
1334 -5572 -8631 -9261 -9345 -9227 -6907 -3566 -80 3536 6185 8601 10544 11033 8971 7293 5776 2698
1350 2698 -1183 -2472 -2979 -5491 -4378 -1995 -2716 -3090 -166 963 -392 -1703 -2178 -3386 -4857 -4841
1366 -4841 -4780 -4079 -2801 -1225 2125 5342 5514 7908 9422 8183 6414 6109 3144 -431 -2335 -3455
1382 -3455 -5229 -6467 -5447 -4049 -3503 -2094 -1506 -667 861 696 -819 -1389 -1410 -1009 -1821 -2341 397
1399 397 668 1186 4394 6002 4755 4888 5281 3987 2188 1041 -811 -3147 -3784 -4454 -4672 -3268 -3247
1416 -3247 -3926 -500 1048 -441 543 1938 1272 683 582 -181 -800 -162 189 68 1152 1287 684 2881
1434 2881 3470 848 933 1374 92 -789 -1446 -1919 -2342 -2689 -1126 -230 -1663 -1470 1052 2099 675 405
1452 405 1238 571 188 491 -968 -816 399 -1498 -1194 1135 -688 -803 1551 750 -766 488 1494
$$ packed form
1334e572l059o30q4J18K320L341L486L616K649K416J943M89k062j678j517l078
1350B698l881j289n07k512J113K383p21l74K924J129j355j311m75j208j471J6
1366d841O1P01J278J576L350L217J72K394J514j239j769l05k965l575j904j120
1382c455j774j238J020J398N46J409N88Q39J528j65j515n70k1M01q12n20K738
1399C97K71N18L208J608j247J33L93j294j799j147j852k336o37o70k18J404K1
1416c247o79L426J548j489R84J395o66n89j01p63o19O38L51j21J084J35o03K197
1434B881N89k622Q5M41j282q81o57m73m23l47J563Q96j433J93K522J047j424k70
1452D05Q33o67l83L03j459J52J215j897L04K329j823j15K354q01j516J254J006
$$ plain form
1469 1494 154 91 1169 102 -330 947 -39 -12 871 -885 -1317 1152 86 -1582 -916 -332 6 465
1487 465 -187 -1171 -1145 -428 -183 -235 -137 -963 -616 395 1231 1493 1540 1153 2219 2341 935 1529 653 -1500
1507 -1500 -386 -279 -3013 -2870 -1363 -1751 -1627 -185 -398 -544 1673 1414 -429 871 1076 -1586 -147
1524 -147 771 -1307 352 2189 249 941 3039 1902 721 2291 1400 -1141 -1305 -1761 -4267 -3608 -2606
1541 -2606 -3118 -2118 -869 -462 807 2310 2220 3409 3141 1769 280 812 1017 135 -1537 -1263 -249
1558 -249 71 245 1584 1533 -285 -78 1050 -1354 -2737 -1660 -3824 -4523 -1847 -2240 -2455 715 1587
1575 1587 2040 5166 5403 2414 2696 4341 1867 -259 376 -1794 -4054 -1899 -1958 -2525 -178 -631 -1602
1592 -1602 719 1293 -860 -808 -390 -2092 -2671 -2020 -1416 -1663 230 1891 2630 4214 4460 4432 5378 3810
$$ packed form
1469A494j340o3J078j067m32J277r86K7Q83j756m32K469j066j668O66N84L38M59
1487D65o52r84K6P17K45n2R8q26L47J011Q36K62M7l87J066J22j406N94q76k153
1507a500J114J07k734J43J507l88J24J442k13j46K217k59j843J300K05k662J439
1524a47R18k078J659J837j940O92K098j137j181J570q91k541j64m56k506O59J002
1541b606n12J000J249M07J269J503r0J189k68j372j489N32K05q82j672K74J014
1558b49L20J74J339n1j818K07J128k404j383J077k164o99K676l93k15L170Q72
1575A587M53L126K37k989K82J645k474k126O35k170k260K155n9n67K347m53r71
1592a602K321N74k153N2M18j702n79O51O04k47J893J661P39J584K46k8R46j568
$$ plain form
1610 3810 1945 1414 -348 -2619 -4261 -4103 -2693 -4027 -4996 -1996 -282 -1159 -64 1825 301 -977
1626 -977 823 1149 -2140 -903 474 -789 843 3310 2608 3695 4932 3552 3637 4223 956 -1483
1642 -1483 -1200 -2195 -4593 -4967 -4905 -5452 -3489 -714 -1262 58 1418 215 1428 3269 1814 205 475
1659 475 506 -416 251 2005 1418 889 2651 3219 2497 1861 1242 743 -713 -2691 -3252 -4349 -4299 -3646 -4016
1678 -4016 -1940 -95 -1495 -382 3053 3133 1934 2890 2880 -105 -247 1566 499 -1150 300 387 70
1695 70 949 923 1496 2273 78 -1115 -173 -1569 -3569 -2677 -1610 -2887 -3166 -978 -415 117 2683 3205
1713 3205 1534 2025 2189 1180 645 842 -359 -1096 -970 -1083 -1772 -460 843 526 -401 616 386 -948
1731 -948 -735 123 -253 -1497 -1097 -1143 -1292 -167 1177 1443 2092 1747 378 1158 1868 669 494 75 -1740
$$ packed form
1610C810j865n31j762k271j642J58J410j334r69L000J714q77J095J889j524j278
1626i77J800L26l289J237J377j263J632K467p02J087J237j380Q5N86l267k439
1642a483K83r95k398l74O2n47J963K775n48J320J360j203J213J841j455j609K70
1659D75L1r22O67J754n87n29J762N68p22o36o19m99j456j978n61j097N0O53l70
1678d016K076J845j400J113L435Q0j199R56j0k985j42J813j067j649J450Q7l17
1695G0Q79k6N73P77k195j193R42j396k000Q92J067j277k79K188N63N32K566N22
1713C205j671M91J64j009n35J97j201p37J26j13o89J312J303l17r27J017k30j334
1731i48K13Q58l76j244M00m6j49J125J344K66O49l45j369P80P10j199j75m19j815
$$ plain form
1750 -1740 -2885 -1314 -566 -1527 -1348 -473 -359 77 569 125 1166 1512 -486 91 535 -300 -984 731
1768 731 1132 -118 56 954 554 -30 1020 1350 -569 -918 -709 -791 -1314 -1384 -324 -693 -1393 -793 -199
1787 -199 389 1119 923 703 1127 230 227 1431 910 -72 -52 253 -297 -339 227 -40 -402 246 -166 -840 164
1808 164 -350 -723 552 -56 -1475 -744 21 186 -1000 -59 849 -83 96 517 584 733 572 227 210 -235
1828 -235 -755 -166 -294 -55 -448 -869 241 -140 -279 1295 763 -246 -173 679 608 -563 -384 92 -614
1847 -614 -782 -409 -684 -131 -224 -398 781 125 -212 571 763 -394 -674 418 50 -753 -217 977 -81
1866 -81 -30 1128 935 711 825 525 536 360 -572 -1168 -1674 -1197 -937 -1560 -1238 -768 -453 57 788 671 341
1887 341 626 991 582 -365 517 729 -54 97 178 731 780 519 1179 1195 365 -482 131 -220 -1526 -2013 -1489
$$ packed form
1750a740j145J571P48r61J79Q75J14M36M92m44J041L46j998N77M44q35o84J715
1768G31M01j250J74Q98m00n84J050L30j919l49K09q2n23p0J060l69p00O00N94
1787a99N88P30j96k20M24q97lJ204n21r82K0L05n50m2N66k67l62O48m12o74J004
1808A64n14l73J275o08j419P31P65J65j186R41R08r32J79M21O7J49j61l45j7m45
1828b35n20N89j28K39l93m21J110l81j39J574n32j009P3Q52p1j171J79M76p06
1847f14j68L73k75N53r3j74J179o56l37P83J92j157k80J092l68q03N36J194j058
1866h1N1J158j93k24J14l00J1j76r32n96n06M77K60o23L22M70L15N10P31j17l30
1887C41K85L65m09r47Q82K12p83J51Q1N53M9k61O60J6q30q47O13l51j306m87N24
$$ plain form
1908 -1489 -1964 -2171 -784 -836 -1080 294 694 1248 1505 802 405 1686 1148 -51 50 587 139 -100 1038
1927 1038 1471 61 327 949 757 -76 -1114 -955 -1105 -2294 -2345 -1269 -1857 -1753 -291 397 150 598
1945 598 1714 2246 1412 930 649 868 879 -295 -439 48 -545 -551 152 60 217 -123 -685 305 -130 -1381
1965 -1381 -1478 -579 -1541 -1546 -503 65 -743 -26 1260 1253 1190 1656 1307 1327 993 -470 98 -24 -1375 -1113 -358
1986 -358 -511 -904 -160 330 95 150 11 200 479 -277 -1185 -517 330 -931 -275 419 23 589 1454 1507
2006 1507 891 239 684 654 -297 -1174 -943 -1112 -1432 -1357 -780 -739 -393 302 619 514 791 478 297 929 -73
2027 -73 -490 404 -35 -572 613 793 -7 -71 820 748 43 339 -654 -991 -543 -1209 -1656 -531 -1455 -1364 237
2048 237 320 110 1133 1112 626 687 1393 569 -151 391 161 15 429 111 -115 228 -137 -198 456 -232 -501
$$ packed form
1908a489m75k07J387n2k44J374M00N54K57p03l97J281n38j199J01N37m48k39J138
1927A038M33j410K66O22j92q33j038J59j50j189n1J076n88J04J462O88k47M48
1945E98J116N32q34m82k81K19J1j174j44M87n93oP03r2J57l40n62R90m35j251
1965a381r7Q99r62nJ043N68q08P17J286po3M66l49K0l34j463N68j22j351K62P55
1986c58j53l93P44M90k35N5j39J89K79p56r08O68Q47j261O56O94l96N66Q65N3
2006A507o16o52M45l0r51q77K31j69l20P5N77M1L46O95L17j05K77l13j81O32j002
2027g3m17Q94m39n37J185J80q00o4Q91p2p05K96r93l37M48o66m47J125r24R1J601
2048B37Q3k10J023k1m86O1P06q24p20N42k30j46M14l18k26L43l65o1O54o88k69
$$ plain form
2069 -501 -530 -1115 -592 -482 -1104 -1024 -803 -242 355 625 405 61 697 1266 1074 711 661 -71 499 193 -352
2090 -352 281 140 -1058 -120 476 -292 -833 -84 130 -794 -171 -111 -736 -717 139 -180 -65 -99 -588 727
2110 727 887 -339 177 1118 -160 -647 621 682 -147 -401 385 200 -110 -377 -573 -100 83 -25 211
2129 211 65 -563 -329 371 316 -37 -68 -334 -251 -842 -215 322 -636 -1032 -367 342 524 590 565 334 568 1092
2151 1092 138 444 800 -114 -546 687 250 -898 -200 276 -24 59 385 -128 -622 -299 -503 -516 -858 -1823
2171 -1823 -1896 -242 -205 -871 999 1543 207 1060 2175 2096 1148 975 1240 162 -616 -705 -614 -342 -536 -209
2191 -209 124 -447 -449 162 403 -276 -964 -1216 -1248 -1727 -1405 -205 -120 -389 528 1407 1825 2177 2280 2063 1487
2212 1487 1126 461 -1121 -953 -955 -1720 -1112 -1047 -1599 -858 138 306 231 289 7 -372 -587 -606 -661 -996 -689 -661
$$ packed form
2069e01k9n85N23J10o22Q0K21N61N97K70k20l44O36N69j92l63n0p32N70l06n45
2090c52O33j41j198R38N96p68n41P49K14r24O23O0o25J9Q56l19J15l4m89J315
2110G27J60j226N16R41j278m87J268O1q29k54P86j85l10k67j96M73J83j08K36
2129B11j46o28K34P00n5l53l1k66Q3n91O27N37r58l96O65P09J82O6k5k31K34N24
2151A092r54L06L56r14m32J233m37j148O98M76l00Q3L26n13m94L23k04j3l42r65
2171a823p3J654L7o66J870N44j336Q53J115p9r48j73K65j078p78q9R1K72j94L27
2191b09L33n71kO11K41o79o88k52l2m79L22J200Q5k69R17Q79M18L52J03k17n76
2212A487l61o65j582J68kp65O08O5n52P41R96J68p5N8k82l79k15j9n5l35L07K8
$$ plain form
2234 -661 534 1723 1504 2291 3406 2234 1654 1513 687 -278 -1625 -1854 -2553 -3152 -2704 -2039 -1265 -677
2252 -677 183 867 1319 1084 712 1406 874 15 -453 -292 -360 -819 385 2037 1617 1136 2207 1966 1166
2271 1166 608 100 -1456 -2929 -3250 -3309 -4328 -3393 -2137 -957 156 870 1931 3130 2930 2795 2655
2288 2655 1707 646 77 -336 -607 -762 -329 -220 319 1330 828 462 743 97 -1625 -2548 -3040 -3817 -3994
2307 -3994 -3258 -2186 -1838 -479 1506 2650 3376 4322 4683 4078 3001 1942 978 -24 -1229 -2122 -1877
2324 -1877 -1784 -1462 -1532 -260 278 -232 -109 -486 -1448 -2085 -2691 -2664 -3023 -2642 -1271 98 1159 2425 3429
2343 3429 5204 5106 4101 4216 3363 952 104 -862 -2778 -3853 -3318 -2960 -2731 -1974 -1125 -381 -424 393 356
2362 356 -254 -1279 -1422 -1446 -1273 -837 -103 741 1885 2970 3458 3951 4770 4224 2574 1579 587 -1303 -2833
$$ packed form
2234f61J195J189k19P87J115j172n80j41q26r65j347k29o99n99M48O65P74N88
2252f77Q60O84M52k35l72O94n32q59m68J61o8m59J204J652m20m81J071k41q00
2271A166n58n08j556j473l21n9j019R35J256J180J113P14J061J199k00j35j40
2288B655r48j061n69m13k71j55M33J09N39J011n02l66K81o46j722r23m92p77j77
2307c994P36J072L48J359J985J144P26R46L61o05j077j059r64j002j205q93K45
2324a877R3L22p0J272N38n10J23l77r62o37o06K7l59L81J371J369J061J266J004
2343C429J775r8j005J15q53k411q48r66j916j075N35L58K29P57Q49P44m3Q17l7
2362C56o10j025j43k4J73M36P34Q44J144J085M88M93Q19n46j650r95r92j890j530
$$ plain form
2381 -2833 -3255 -3710 -4584 -3933 -2845 -1819 -888 89 767 1320 1074 1207 962 -272 -611 -313 214 110 409
2400 409 1379 2182 2644 3381 2948 2522 1934 424 -1211 -1833 -3189 -4333 -3939 -3982 -3588 -2666 -836 365
2418 365 1038 1993 2744 2514 1901 1752 1641 299 -542 -538 34 -120 193 1260 1469 1536 1351 799 672 -269
2438 -269 -1690 -1973 -2808 -3633 -3339 -2749 -2139 -1248 -39 1379 2106 2747 3106 3266 3022 2170 704 742 197
2457 197 -1493 -1516 -691 -763 -937 -446 428 224 69 7 -363 -1293 -1397 -1919 -2105 -1823 -1944 -785 526 1059
2477 1059 1719 2559 3126 2941 2520 2268 1597 236 -755 -947 -1303 -1766 -2042 -1708 -1088 -827 -545 -142 366
2496 366 140 -652 -674 -169 -844 -952 -108 -408 -388 858 1334 1377 2220 2533 2243 1671 1581 602 -322 -394 -1513
2517 -1513 -1928 -1505 -1589 -2202 -872 -614 -664 30 334 413 153 261 208 -106 -204 346 -264 165 409 665 1348
$$ packed form
2381b833m22m55q74O51J088J026R31R77O78N53k46J33k45j234l39K98N27j04K99
2400D09R70Q03M62P37m33m26n88j510j635o22j356j144L94m3L94R22J830J201
2418C65O73R55P51k30o13j49j11j342q41MN72j54L13J067K09O7j85n52j27r41
2438b69j421k83q35q25K94N90O10Q91J209J418P27O41L59J60k44q52j466L8n45
2457A97j690k3Q25p2j74M91Q74k04j55o2l70r30j04n22j86K82j21J159J311N33
2477A059O60Q40N67j85m21k52o71j361r91j92l56m63k76L34O20K61K82M03N08
2496C66k26p92k2N05o75j08Q44l00K0J246M76M3Q43L13k90n72r0r79r24p2j119
2517a513m15M23q4o13J330K58n0O94L04P9k60J08n3l14r8N50o10M29K44K56O83
$$ plain form
2538 1348 1462 1145 844 951 766 -4 -558 -420 -1130 -1751 -1381 -684 -1086 -870 -175 -319 116 953 519 47
2558 47 395 396 110 382 243 -434 69 565 -330 208 802 261 77 414 556 167 -131 -278 -695 -241 -32
2579 -32 -687 -375 -350 -320 -114 566 -197 -570 313 227 -217 -177 406 -113 -732 -59 671 -115 -210 449 242 107
2601 107 350 197 -42 499 353 254 299 372 -374 7 363 -475 -1066 74 -481 -833 -360 21 -518 -401 -54
2622 -54 172 52 363 -37 -39 778 124 -227 437 168 -544 239 961 590 237 438 393 153 379 68 -848
2643 -848 -824 -694 -1147 -522 -520 -1156 -589 109 279 327 359 942 360 156 506 554 -148 -164 -82 -4 318 388 251
2666 251 289 -12 163 160 382 -270 -846 -295 -726 -1566 -1213 -196 -558 -315 978 966 339 1047 1224 821 710
2687 710 459 -158 -511 -623 -860 -504 -204 -298 -97 305 155 -15 218 62 -315 -551 -430 -698 -819 -551
$$ packed form
2538A348J14l17l01J07j85p70n54J38p10o21L70O97m02K16O95j44M35Q37m34m72
2558D7L48Jk86K72j39o77N03M96q95N38N94n41j84L37J42l89k98j47m17M54K09
2579c2o55L12K5L0K06O80p63l73Q83q6m44M0N83n19o19O73P30p86r5O59k07j35
2601A07K43j53k39N41j46r9M5P3p46L81L56q38n91J140n55l52M73L81n39J17L47
2622e4K26j20L11m00kQ17o54l51O64k69p12P83P22l71l53K01m5k40K26l11r16
2643h48K4J30m53O25Ko36N67O98J70M8L2N83n82k04L50M8p02j6Q2P8L22P0j37
2666B51L8l01J75lK22o52n76N51m31q40L53J017l62K43J293j2o27P08J77m03j11
2687G10k51o17l53j12k37L56L00r4K01M02j50j70K33j56l77k36J21k68j21K68
$$ plain form
2707 -551 -320 -134 587 532 688 995 1522 1423 735 424 75 -522 -765 -772 -1164 -1204 -636 -663 -419 145 322 67
2729 67 412 330 92 -157 -149 -215 -321 503 159 -124 626 636 874 1180 1532 807 85 89 -135 -573 -1374 -1469 -1589
2752 -1589 -1357 -1361 -1005 -423 -116 -110 643 716 338 438 488 339 -54 6 398 51 304 704 666 743 961 886 570
2775 570 153 -183 -570 -1191 -1673 -1612 -1613 -1333 -1057 -532 -472 333 652 723 1116 1180 1083 650 527 195 30 -12 -94
$$ packed form
2707e51K31J86P21n5J56L07N27r9o88l11l49n97k43pl92m0N68k7K44N64J77k55
2729F7L45q2k38k49Qo6j06Q24l44k83P50J0K38L06L52p25p22Mk24m38q01r5j20
2752a589K32mL56N82L07OP53P3l78J00N0j49l93O0L92l47K53M00l8P7K18p5l16
2775E70m17l36l87o21m82O1jK80K76N25O0Q05L19P1L93O4r7m33j23l32j65m2q2
$$ [...]
8191I4
##END NTUPLES=NMR FID
##END=
