##TITLE=1H_Pr Bzt-AmF
 CDCl3
 8 sc, 
 11.05.2022
##JCAMPDX= 6.0         $$ Bruker NMR JCAMP-DX V2.0
##DATA TYPE= NMR FID
##DATA CLASS= NTUPLES
##ORIGIN= UXNMR, Bruker Analytische Messtechnik GmbH
##OWNER= root
$$ XWIN-NMR		Version 3.5
$$ Wed May 11 10:56:01 2022 Russian Standard Time (UT+4h)  she@DPX200
##.OBSERVE FREQUENCY= 200.1313499996
##.OBSERVE NUCLEUS= ^1H
##.DELAY= (6, 6)
##.ACQUISITION MODE= SIMULTANEOUS
##.ACQUISITION SCHEME= undefined
##.AVERAGES= 8
##.DIGITISER RES= 18
##SPECTROMETER/DATA SYSTEM= spect
##.PULSE SEQUENCE= zg30
##.SOLVENT NAME= CDCl3
##.SHIFT REFERENCE= (INTERNAL, CDCl3, 0, 15.7039)
##AUDIT TRAIL= $$ (NUMBER, WHEN, WHO, WHERE, WHAT)
$$ ##TITLE= Audit trail, XWIN-NMR		Version 3.5
$$ ##JCAMPDX= 5.01
$$ ##ORIGIN= Bruker BioSpin GmbH
$$ ##OWNER= she
$$ F:/spectra/data/she/nmr/H-F/1/audita.txt
$$ ##AUDIT TRAIL=  $$ (NUMBER, WHEN, WHO, WHERE, WHAT)
(   1,<2022-05-11 10:54:37.85 +0400>,<she>,<DPX200>,
      <created by zg, POWCHK disabled, PULCHK disabled
       configuration hash MD5:
       00 E9 B6 7A A2 85 ED C7 34 08 36 98 17 FE 4E 26
       data hash MD5: 16K
       2F 9E 77 A0 E3 A7 CC BA EA 72 A7 6D 58 7A 78 A7>)
$$ ##END=
$$ 
$$ hash MD5
$$ A0 4C 9D 1D 6D 3A 14 08 39 A8 72 04 7E 2A 95 BA
##$RELAX= 
##$RELAX= 
##$RELAX= 
##$RELAX= 
##$RELAX= 
##$RELAX= 
$$ Bruker specific parameters
$$ --------------------------
##$DU= <F:/spectra>
##$EXPNO= 1
##$NAME= <H-F>
##$PROCNO= 1
##$TYPE= <nmr>
##$USER= <she>
##$AMP= (0..31)
100 100 100 100 100 100 100 100 100 100 100 100 100 100 100 100 100 100 
100 100 100 100 100 100 100 100 100 100 100 100 100 100 
##$AQSEQ= 0
##$AQ_mod= 1
##$AUNM= <au_zg>
##$AUTOPOS= <>
##$BF1= 200.13
##$BF2= 200.13
##$BF3= 200.13
##$BF4= 200.13
##$BF5= 200.13
##$BF6= 200.13
##$BF7= 200.13
##$BF8= 200.13
##$BYTORDA= 1
##$CFDGTYP= 0
##$CFRGTYP= 5
##$CHEMSTR= <none>
##$CNST= (0..31)
1 1 145 1 1 1 1 1 1 1 1 1 1 1 1 1 1 1 1 1 1 1 1 1 1 1 1 1 1 1 1 1 
##$CPDPRG= <>
##$CPDPRG1= <>
##$CPDPRG2= <>
##$CPDPRG3= <>
##$CPDPRG4= <mlev>
##$CPDPRG5= <mlev>
##$CPDPRG6= <mlev>
##$CPDPRG7= <mlev>
##$CPDPRG8= <mlev>
##$CPDPRGB= <>
##$CPDPRGT= <>
##$D= (0..31)
0 1.2 0 0 0 0 0 0 0 0.06 0 0.03 0 0 0 0 0.0002 0 0 0 0 0 0 0 0 0 0 0 0 
0 0 0 
##$DATE= 1652252077
##$DBL= (0..7)
120 120 120 120 120 120 120 120 
##$DBP= (0..7)
150 150 150 150 150 150 150 150 
##$DBP07= 0
##$DBPNAM0= <>
##$DBPNAM1= <>
##$DBPNAM2= <>
##$DBPNAM3= <>
##$DBPNAM4= <>
##$DBPNAM5= <>
##$DBPNAM6= <>
##$DBPNAM7= <>
##$DBPOAL= (0..7)
0.5 0.5 0.5 0.5 0.5 0.5 0.5 0.5 
##$DBPOFFS= (0..7)
0 0 0 0 0 0 0 0 
##$DE= 6
##$DECBNUC= <off>
##$DECIM= 32
##$DECNUC= <off>
##$DECSTAT= 4
##$DIGMOD= 1
##$DIGTYP= 9
##$DL= (0..7)
0 120 120 120 120 120 120 120 
##$DP= (0..7)
150 150 150 150 150 150 150 150 
##$DP07= 0
##$DPNAME0= <>
##$DPNAME1= <>
##$DPNAME2= <>
##$DPNAME3= <>
##$DPNAME4= <>
##$DPNAME5= <>
##$DPNAME6= <>
##$DPNAME7= <>
##$DPOAL= (0..7)
0.5 0.5 0.5 0.5 0.5 0.5 0.5 0.5 
##$DPOFFS= (0..7)
0 0 0 0 0 0 0 0 
##$DQDMODE= 0
##$DR= 18
##$DS= 0
##$DSLIST= <SSSSSSSSSSSSSSS>
$$ [...]
##$SUBNAM2= <"">
##$SUBNAM3= <"">
##$SUBNAM4= <"">
##$SUBNAM5= <"">
##$SUBNAM6= <"">
##$SUBNAM7= <"">
##$SUBNAM8= <"">
##$SUBNAM9= <"">
##$SW= 18.0517283424761
##$SWIBOX= (0..15)
0 0 2 0 0 0 0 0 0 0 0 0 0 0 0 0 
##$SW_h= 3612.71676300578
##$TD= 16384
##$TD0= 1
##$TE= 0
##$TE2= 300
##$TE3= 300
##$TEG= 300
##$TL= (0..7)
0 120 120 120 120 120 120 120 
##$TP= (0..7)
150 150 150 150 150 150 150 150 
##$TP07= 0
##$TPNAME0= <>
##$TPNAME1= <>
##$TPNAME2= <>
##$TPNAME3= <>
##$TPNAME4= <>
##$TPNAME5= <>
##$TPNAME6= <>
##$TPNAME7= <>
##$TPOAL= (0..7)
0.5 0.5 0.5 0.5 0.5 0.5 0.5 0.5 
##$TPOFFS= (0..7)
0 0 0 0 0 0 0 0 
##$TUNHIN= 0
##$TUNHOUT= 0
##$TUNXOUT= 0
##$USERA1= <user>
##$USERA2= <user>
##$USERA3= <user>
##$USERA4= <user>
##$USERA5= <user>
##$V9= 5
##$VALIST= <valist>
##$VCLIST= <CCCCCCCCCCCCCCC>
##$VD= 0
##$VDLIST= <DDDDDDDDDDDDDDD>
##$VPLIST= <PPPPPPPPPPPPPPP>
##$VTLIST= <TTTTTTTTTTTTTTT>
##$WBST= 1024
##$WBSW= 4
##$XGAIN= (0..3)
0 0 0 0 
##$XL= 0
##$YL= 0
##$YMAX_a= 139566
##$YMIN_a= -188388
##$ZGOPTNS= <>
##$ZL1= 120
##$ZL2= 120
##$ZL3= 120
##$ZL4= 120
##$ABSF1= 10
##$ABSF2= 0
##$ABSG= 5
##$ABSL= 3
##$ALPHA= 0
##$AQORDER= 0
##$ASSFAC= 0
##$ASSFACI= 0
##$ASSFACX= 0
##$ASSWID= 0
##$AUNMP= <proc_1d>
##$AZFE= 0.1
##$AZFW= 0.1
##$BCFW= 1
##$BC_mod= 2
##$BYTORDP= 1
##$COROFFS= 0
##$CY= 11.3945322036743
##$DATMOD= 1
##$DC= 2
##$DFILT= <>
##$DTYPP= 0
##$F1P= 2.36226072786647
##$F2P= -0.459571619588291
##$FCOR= 0.5
##$FTSIZE= 0
##$FT_mod= 4
##$GAMMA= 1
##$GB= 0.15
##$INTBC= 1
##$INTSCL= 1
##$ISEN= 128
##$LB= 0.24
##$LEV0= 0
##$LPBIN= 0
##$MAXI= 10000
##$MC2= 0
##$MEAN= 0
##$ME_mod= 0
##$MI= 1.114404
##$NCOEF= 0
##$NC_proc= 0
##$NLEV= 6
##$NOISF1= 3.799351
##$NOISF2= 2.8
##$NSP= 1
##$NTH_PI= 0
##$NZP= 0
##$OFFSET= 15.70392
##$PC= 1
##$PHC0= -18024.21
##$PHC1= 6.80075
##$PH_mod= 1
##$PKNL= yes
##$PPARMOD= 0
##$PSCAL= 0
##$PSIGN= 0
##$REVERSE= no
##$SF= 200.130013532006
##$SI= 16384
##$SIGF1= 3
##$SIGF2= 2
##$SINO= 400
##$SIOLD= 16384
##$SREGLST= <1H.CDCl3>
##$SSB= 0
##$STSI= 0
##$STSR= 0
##$SW_p= 3612.71676300578
##$SYMM= 0
##$S_DEV= 0
##$TDeff= 0
##$TDoff= 0
##$TI= <>
##$TILT= no
##$TM1= 0
##$TM2= 0
##$TOPLEV= 0
##$USERP1= <user>
##$USERP2= <user>
##$USERP3= <user>
##$USERP4= <user>
##$USERP5= <user>
##$WDW= 1
##$XDIM= 8192
##$YMAX_p= 0
##$YMIN_p= 0
$$ End of Bruker specific parameters
$$ ---------------------------------
##NTUPLES= NMR FID
##VAR_NAME=  TIME,          FID/REAL,        FID/IMAG
##SYMBOL=    X,             R,               I
##VAR_TYPE=  INDEPENDENT,   DEPENDENT,       DEPENDENT
##VAR_FORM=  AFFN,          ASDF,            ASDF
##VAR_DIM=   8192,          8192,            8192
##UNITS=     SECONDS,       ARBITRARY UNITS, ARBITRARY UNITS
##FACTOR=    0.0002768,     1,               1
##FIRST=     0,             0,               0
##LAST=      2.2672688,     0,               0
##MIN=       0,             -188388,         0
##MAX=       2.2672688,     139566,          0
$$ Real data points
##PAGE= N=1
##DATA TABLE= (X++(R..R)), XYDATA
0 0 0 0 0 0 0 0 0 0 0 0 0 5 -8 8 -8 8 -16 16 -16 24 -26 32 -40 48 -56 64 -73 88 -97 113 -129 149 -169 193
34 193 -217 241 -273 305 -343 383 -425 474 -524 580 -642 709 -784 865 -953 1049 -1156 1273
52 1273 -1404 1549 -1710 1893 -2101 2337 -2614 2940 -3329 3804 -4401 5176 -6228 7744 -10127
67 -10127 14449 -24831 106636 29778 -135787 42321 97909 33588 -103159 -50239 43981
78 43981 5935 8909 20008 -68011 -17681 42491 18580 -50934 -88812 29740 88047 -40396
90 -40396 -41129 14215 15508 20555 -17499 -21323 -1883 -6223 59788 24477 -58617 15203 51994
103 51994 818 -27902 -30641 23901 8787 -27106 31095 2139 -34808 28836 21116 -19111
115 -19111 -32718 -9283 45051 -12427 -42541 38808 15069 -30482 -152 15738 7 -52580
127 -52580 -13480 73351 -9416 -60712 31788 55880 4438 -44939 -14425 47691 -8927 -33818
139 -33818 17028 2364 4913 19601 -911 -4253 -16697 5454 20309 -36512 -17856 30758
151 30758 5309 -7115 -8960 3890 12699 -23399 -5288 11434 -20335 8497 24883 -4295
163 -4295 -5804 1589 19652 -2755 -39542 8308 21437 -15540 -1209 9259 10908 6239 -7477
176 -7477 11614 -4043 -19894 20466 6893 -22873 -3573 13396 14988 -23433 -29365 26027 5801
189 5801 -31055 -2938 14340 12615 -6804 -8298 22156 -1393 -14700 10416 -5176 -4626 8694
202 8694 2133 8180 -429 7479 18270 -16464 -8374 14917 -6396 -10161 -8021 4440 13575 -17824
216 -17824 -6874 12690 -11978 -5337 62 -6100 2321 -3743 11127 10080 -19039 6920 15225
229 15225 -10481 -3037 -1610 8303 11963 -7069 10198 7424 -9785 12288 -789 -14731 187
242 187 -936 9939 -4351 -18987 16951 6203 -18354 -3735 -5045 3853 -1495 -14637 12793
255 12793 3493 -7696 14255 -4593 -5250 7875 -4439 5696 -2258 -2799 19789 -4427 -4462 15026
269 15026 -5657 -1025 -951 -6414 10181 -10288 -5720 15969 -9387 -4688 3979 -6987 3852 -10960
283 -10960 -6307 13969 -10824 -293 10967 -9463 4755 1162 -5597 6507 -9361 4808 13158
296 13158 -11580 8307 9348 -5461 7953 -5577 -763 8100 -12588 6627 5829 -12600 8174
309 8174 -24 -4821 2391 -14143 4818 4511 -16995 6582 1867 -5661 8893 -7564 304 4828
323 4828 -9475 9062 -873 -8041 16017 1 -1176 7435 -5506 9031 169 -11074 10887
336 10887 -2157 -3450 8320 -7911 3257 1624 -10117 6290 -8030 -7423 10252 -7804 -1752
349 -1752 4631 -5940 6680 -5143 -6996 9379 -7375 365 9011 -5691 7730 3863 -3057
362 -3057 8647 -6429 -471 8328 -8032 3979 3310 -4549 8744 -4208 -3148 5272 -10136 1517
376 1517 1622 -10766 3471 -2445 -2622 4214 -9121 2954 4934 -8016 5136 -599 -2892 8433
390 8433 -3496 1626 5357 -4573 7692 1039 -4830 7039 -2500 1895 4745 -7132 4418 1601
404 1601 -5810 3035 -6950 -2460 4883 -6475 489 -146 -2542 6918 -6550 -5158 5693 -3958 792
419 792 206 -2747 9386 816 -1438 5043 -3887 3292 2268 -6487 4319 -313 510 7276 -5014
434 -5014 545 4419 -2930 2931 -4350 -3912 5970 -4406 -957 225 -8322 3589 -423 -5520 2148
449 2148 -5159 2010 5396 -5138 2320 -59 -345 9135 -2733 -946 6127 -157 7268 659 -5497
464 -5497 5620 -445 401 1710 -9569 531 2235 -3336 1766 -9710 -2913 10437 -3314 -5093
478 -5093 -4373 -1569 10828 -3963 -8858 4048 1027 7494 1999 -9417 4786 3849 2172 5349
492 5349 -8672 1653 11439 651 910 -7771 -4268 11633 -4455 -7182 -1506 -3698 10171 951
506 951 -10621 1889 -1293 2631 2357 -12750 253 3531 -2315 5676 -7089 -4068 9828 -291
520 -291 3451 24 -4977 12064 3368 -3368 2986 -6009 4376 5878 -7219 2202 -2996 -3006 10288
535 10288 -5463 -6864 299 -2682 8702 -4268 -12093 6617 1759 1364 1595 -10850 4719 7181
549 7181 -3625 2089 -8128 -586 12244 -4499 -2252 -149 -693 13748 -1327 -7944 5415 -736
563 -736 5305 1869 -11567 4165 4231 -706 2750 -11026 -641 7867 -7636 -2123 -4373 -3923 9468
578 9468 -3916 -4672 3475 -2617 7572 2101 -7374 7388 2275 1205 4158 -6994 3612 4968
592 4968 -6063 3757 -1014 -1619 6439 -4786 606 2199 -6994 3438 -2058 -6301 4243 -4568
606 -4568 -421 3254 -5875 4148 1000 -3767 6189 -2843 -220 5182 -4960 2970 1655 -3741 5902
621 5902 -1924 -1497 6128 -3412 1775 1951 -3636 5299 -1986 -2996 5379 -4402 -628 1146 -5144 2867
637 2867 -2709 -4639 3983 -2880 -277 1187 -4848 4825 750 -4433 3929 -562 2642 4561 -4529
652 -4529 3762 3754 -1057 3230 -3213 1121 5137 -3917 678 -308 -3977 3778 -2915 -4003 1575 -3673
668 -3673 1835 -66 -4989 2657 -1227 -1232 2885 -4740 449 2859 -2019 3338 -1405 -226 6030 -1995
684 -1995 794 2120 -1784 5059 -923 -2526 4445 -1776 371 989 -4176 2825 -1063 -3495 1875
699 1875 -3859 -291 1074 -5057 2129 -241 -3679 2890 -2396 136 2795 -3619 3007 1623 -1646
714 -1646 4657 -1214 420 4632 -2470 2881 1527 -2413 4245 -1429 -1237 3133 -4403 1141 752 -5005
730 -5005 2757 -2807 -2467 3186 -5105 -481 1308 -4070 3043 -1877 -2387 4728 -3080 845 3471 -3250
746 -3250 4701 854 -2293 5349 -1904 926 3777 -3811 3692 960 -3670 3976 -2945 -1043 2809
761 2809 -5961 1399 839 -4963 3058 -2971 -2276 3516 -4918 1276 1801 -4547 4772 -863 -2478 5317
777 5317 -3162 1628 3208 -3895 5084 690 -1963 5712 -2915 163 3902 -4589 3406 -131 -4795
792 -4795 4869 -3469 -2183 2985 -5352 2068 279 -5267 3968 -2549 -2298 3949 -5394 1439 2648
807 2648 -4494 4541 -725 -1559 5709 -3658 1785 4247 -3662 4566 161 -2708 5599 -3011 83
822 83 3361 -5171 2338 -188 -4307 3827 -3755 -1686 3458 -5553 1010 589 -4246 3939 -2521 -2307
838 -2307 4394 -3499 1569 2023 -3889 4763 274 -1383 5227 -2407 2068 3669 -4225 3209 -10
853 -10 -2893 3724 -3247 94 2730 -4937 2386 -537 -4476 2844 -3134 -1487 2221 -5091 1409 839
869 839 -4162 3212 -1366 -621 4603 -2885 2680 2755 -2551 3880 -701 -1680 4194 -2161 1181 2095 -3051
886 -3051 3704 -933 -2808 2812 -3177 -963 1339 -4246 1216 -1058 -3027 2814 -3126 -1151 2641
901 2641 -2407 1685 -263 -1875 4161 -1321 -851 3294 -1761 3100 1696 -1250 3237 -1403 445
916 445 3119 -3908 569 1293 -1892 1755 -2520 -1553 2457 -3317 -226 487 -3461 2227 -1017 -1620
932 -1620 1758 -3196 1235 2289 -2921 2037 272 -283 3526 -1908 241 1901 -1395 3384 -189
947 -189 -1747 3961 -1074 -69 1463 -3211 1442 -690 -1859 2406 -3764 -1393 2883 -2632 -782
962 -782 -2168 -1935 4368 -2857 -2569 3041 -1433 1513 354 -1937 3706 -1236 650 4873 -3064 481
978 481 3076 -322 2490 -3096 -623 5591 -3213 -1004 828 -3044 2763 -2456 -3656 2624 -3487
993 -3487 270 2281 -4052 1874 -117 -1540 3650 -3166 -154 3543 -2169 3137 66 -2660 5316
1008 5316 -862 -1249 2728 -2269 1928 -77 -3464 4064 -2273 -2493 3992 -1924 168 -224 -2843 4537
1024 4537 -2841 -4978 4060 -2021 -800 752 -2866 4144 -1367 -2517 6016 -2122 -1274 3714 -1233
1039 -1233 2841 -1119 -2583 6043 -1979 -2224 3524 -2230 2060 393 -3456 4284 -1687 -2131 3295
1054 3295 -4391 281 1623 -4267 2673 -1465 -2650 3540 -3313 445 2030 -3984 3650 1176 -2789
1069 -2789 3700 -868 1107 2290 -3985 4218 1843 -3839 3347 -179 -146 1733 -3974 2925 1096
1084 1096 -5189 3258 -1001 -2880 1498 -3396 1469 -135 -4809 3913 -560 -3373 3081 -1096 1169
1099 1169 1335 -2861 4182 374 -2269 4332 -1231 215 2824 -1940 2991 170 -2249 3805 -1956
1114 -1956 -1382 2201 -3444 173 -131 -3235 1841 -2860 -1893 2969 -3521 18 1607 -2640 2162 -378
1130 -378 -544 2849 -2532 1676 2902 -2816 2325 1424 -205 2696 -1735 1879 2516 -3168 1767 331
1146 331 -2573 1187 -2141 -316 537 -4321 1236 13 -3785 1555 -795 -519 1198 -2556 2398 731
1162 731 -2157 3049 -296 -797 2342 -832 1775 982 -1029 3825 -220 -1083 2594 -1360 100 98 -1967
1179 -1967 1897 -2223 -2091 2017 -2783 -565 720 -1968 1255 -1159 -661 2393 -2341 345 1960
1194 1960 -2285 1140 260 -693 2221 -1557 1409 2514 -2408 2134 1356 -1246 1959 -1222 249 1241
1210 1241 -3248 1420 549 -2937 1199 -986 -502 1034 -2768 1653 117 -3242 2321 -1048 -1672 1498
1226 1498 -1934 1031 476 -2261 3132 -439 -1172 3295 -1207 904 1770 -1725 3018 -472 -1621 3351
1242 3351 -2012 -337 1770 -2250 1498 -1128 -2151 2616 -2704 -1307 2209 -3253 666 -113 -2756
1257 -2756 2257 -2163 -446 2865 -2729 1512 2106 -1670 3051 -428 -115 3315 -2440 1510 2049 -2810
1273 -2810 2286 -409 -1733 2504 -2788 206 1695 -4230 1748 -148 -3025 1768 -2576 -475 1350
1288 1350 -3403 1914 503 -2360 3677 -626 -156 3106 -1622 2191 1305 -2231 3862 -707 -1504 3037
1304 3037 -2230 753 891 -2931 2528 -1024 -2448 2676 -2756 -747 1113 -3603 1640 -890 -2301
1319 -2301 2800 -2267 -349 2537 -2463 2027 773 -1479 3452 -1101 -350 2897 -2230 1586 1547 -2014
1335 -2014 2521 -870 -684 2627 -2570 508 1451 -3252 1240 -930 -1282 1899 -2808 56 1139 -3229
1351 -3229 1686 -245 -1799 2509 -1424 326 2114 -2481 1744 867 -1620 2661 -963 -37 2415
1366 2415 -1869 1094 814 -1903 2349 -700 -700 1890 -2028 128 278 -2512 1339 -1151 -1644 1561
1382 1561 -2107 31 662 -1842 1573 -493 -895 2363 -1161 331 1752 -1389 1994 532 -1340
1397 -1340 2360 -815 438 1711 -1597 1153 79 -1244 1775 -1632 -918 1261 -2005 375 -256
1412 -256 -1971 1522 -1343 -1054 1176 -1710 812 663 -1299 1809 -651 -323 2239 -1181 709 1348
1428 1348 -900 2267 -235 -643 2117 -1034 539 781 -1438 1251 -537 -1573 1325 -1758 -737
1443 -737 481 -1974 774 -970 -1509 1688 -1177 -391 817 -1309 1473 -24 -1094 2258 -377 564
1459 564 1659 -1272 1748 488 -1412 2522 -750 -626 1660 -1576 812 66 -1888 1955 -1261 -1599
1475 -1599 1010 -1660 473 130 -2318 1334 -862 -1243 1714 -1444 305 801 -1644 2023 -252 -990
1491 -990 2856 -743 595 1647 -1634 2034 -77 -1596 2264 -1114 -338 1322 -2419 635 68 -2308
1507 -2308 1688 -1621 -1175 1263 -2459 1013 643 -2465 2009 -251 -930 1840 -1670 1315 1511 -1919
1523 -1919 2566 278 -1094 2180 -1073 921 1370 -2219 2038 91 -1975 2065 -1281 -296 599 -2692
1539 -2692 1136 -38 -2935 1854 -1295 -668 1295 -2111 1311 583 -2124 2407 -385 -926 2702 -1176
1555 -1176 952 1512 -1919 2329 239 -862 2231 -1605 306 1273 -2261 1207 -354 -1780 1718
1570 1718 -2193 -720 1457 -2455 673 48 -1880 1451 -1121 -492 1824 -2340 976 1233 -1659 1882
1586 1882 49 116 2395 -1482 1276 1500 -1798 1772 20 -1002 1547 -1667 308 1071 -2403 1121
1602 1121 -164 -1846 1412 -1518 -157 753 -2375 1125 -249 -1939 1794 -655 -521 1321 -1188
1617 -1188 1579 826 -983 2176 -285 -7 2206 -819 613 638 -1280 1566 -669 -721 1719 -1614
1633 -1614 -439 576 -1360 787 -854 -1128 1411 -1629 -415 891 -1721 507 -25 -956 1267 -1066
1649 -1066 470 1553 -1276 953 709 -534 1546 -270 253 1329 -1592 827 489 -1141 875 -530
1665 -530 -379 520 -1769 559 254 -1967 714 -653 -1019 763 -1478 866 308 -1475 1571 -72
1681 -72 -763 1629 -320 745 909 -984 1852 246 -702 1792 -616 -6 637 -1191 1257 -666 -1277
1698 -1277 1380 -1352 -761 485 -1919 -135 -374 -1235 1209 -1286 102 1484 -1426 736 593 -549
1714 -549 1471 -531 590 1709 -1214 1179 1034 -1184 1399 -170 14 1253 -1690 850 654 -2004
1730 -2004 900 -232 -1149 610 -1784 194 139 -2001 1227 -275 -1656 1320 -714 323 1036 -1591
1746 -1591 1867 291 -1176 2320 -410 37 1348 -972 1334 294 -1312 1489 -1057 -777 1555
1761 1555 -1642 261 142 -1687 1211 -1171 -1293 1504 -2060 224 687 -1750 1336 -667 -659 2059
1777 2059 -1638 413 1499 -1383 1300 322 -684 2267 -915 647 1868 -1669 824 346 -1198
1792 -1198 1164 -1097 -548 1259 -2253 483 277 -2423 1013 -602 -609 1337 -1961 509 713 -2116
1808 -2116 1461 -205 -707 1647 -777 852 1230 -1422 1838 249 -966 1924 -665 -3 931 -1775
1824 -1775 1032 190 -1627 1527 -868 -930 1002 -1679 61 80 -1676 1228 -1060 -818 1497 -1490
1840 -1490 426 1026 -1045 1525 -137 -573 1677 -1155 309 1610 -1276 1286 -58 -443 1749 -1271
1856 -1271 239 1153 -1506 401 74 -1236 712 -1468 -378 763 -2006 647 -84 -1429 1001 -430
1872 -430 -287 1272 -1153 756 940 -1132 1472 265 -314 1384 -440 936 737 -1409 1067 17
1888 17 -643 1147 -691 -39 440 -1243 307 -245 -1072 1023 -1075 -96 689 -1098 654 -125 -940 1334
1906 1334 -561 -142 1392 -594 721 620 -596 1325 -286 46 1484 -701 727 235 -579 1139
1922 1139 -613 -709 839 -1456 88 171 -1417 648 -774 -798 893 -1289 -55 375 -1149 1303 -105
1939 -105 -279 1672 -433 763 895 -746 1384 252 -476 1494 -645 80 691 -1200 746 -264
1955 -264 -1319 1112 -1129 -276 572 -1312 583 -56 -1438 1052 -595 -363 1009 -1098 667 246
1971 246 -741 1386 -352 -168 1769 -1135 851 834 -907 1619 -377 -803 1387 -837 154 528 -1481
1988 -1481 1145 -396 -1201 752 -1252 -262 492 -1656 466 -390 -1216 1575 -1078 -342 1015 -1057
2004 -1057 819 449 -941 1795 -485 -332 1586 -968 1012 553 -954 1465 -417 -605 1355 -1405
2020 -1405 305 578 -1843 962 -533 -1279 885 -1270 -242 1003 -1625 1065 95 -1024 1493 -721
2036 -721 357 1414 -1051 1564 635 -1268 1754 -488 -79 1401 -1456 979 482 -1377 1501 -321
2052 -321 -1013 928 -1614 208 446 -2019 1058 -487 -1423 1261 -1265 153 864 -1509 1257 94
2068 94 -868 1793 -617 -155 1146 -1129 1030 470 -1090 1489 -489 -324 1466 -1071 576 489 -1527
2085 -1527 1104 -606 -724 1387 -1775 312 575 -1658 857 -592 -581 1319 -1120 204 1120 -1495
2101 -1495 973 589 -324 1423 -567 468 1384 -1105 984 598 -862 1280 -719 -52 916 -1392
2117 -1392 438 289 -1386 960 -378 -678 953 -1162 647 391 -1196 699 -253 -440 996 -1238
2133 -1238 150 692 -1028 1165 68 -658 1165 -534 530 868 -780 969 -294 -735 1258 -772
2149 -772 -338 518 -1449 410 -232 -1077 764 -1070 -324 812 -1124 164 197 -797 840 -391 56
2166 56 1395 -898 740 636 -670 1215 -206 -34 1024 -901 843 537 -1203 773 -201 -434 654
2183 654 -1233 149 221 -1330 693 -666 -915 877 -1005 259 624 -970 903 -16 -634 1486 -765
2200 -765 484 1135 -834 1069 372 -555 1168 -425 108 1051 -1058 1009 -47 -843 1193 -1167 -610
2217 -610 685 -1314 296 35 -1075 792 -725 -638 1141 -1166 316 471 -707 1237 -57 -10 1143
2234 1143 -838 688 907 -831 1144 -40 -516 995 -765 278 801 -1190 687 -326 -1271 1096
2250 1096 -787 -356 733 -1586 575 69 -1467 1048 -671 -366 1145 -1015 579 436 -1022 1359
2266 1359 -302 -316 1308 -848 582 726 -1065 1390 -158 -956 1568 -1073 45 617 -1354 867
2282 867 -322 -1516 1117 -1281 -534 788 -1757 641 385 -873 1381 -735 -335 1475 -1336 859
2298 859 757 -682 1281 -434 -274 1520 -1022 539 988 -1113 818 -373 -656 930 -1310 66
2314 66 807 -1527 753 -25 -1089 765 -993 -380 858 -1478 661 318 -970 1120 -529 142 1186
2331 1186 -909 827 789 -888 1337 -91 -362 1195 -897 338 393 -1225 888 -623 -973 899
2347 899 -1059 -154 357 -1488 565 -256 -733 1289 -571 33 769 -781 705 320 -503 1310 -284
2364 -284 147 1223 -607 907 352 -410 1097 -487 -179 773 -1274 89 332 -1238 455 -450 -480
2381 -480 851 -1070 168 310 -1185 715 -256 -443 870 -534 22 481 -545 802 112 -562 1024
2398 1024 -583 197 696 -630 711 -95 -560 771 -1043 -292 228 -852 609 -247 -753 577 -992
2415 -992 -559 423 -705 459 27 -744 886 -638 -171 1005 -593 474 428 -741 1159 -205 -407
2432 -407 973 -539 777 325 -1025 837 -14 -685 730 -664 -6 139 -1153 734 -250 -651 645
2449 645 -711 -210 168 -1037 828 -62 -551 1080 -605 257 965 -638 938 431 -825 1001 -267
2466 -267 -233 759 -752 537 251 -1004 971 -316 -538 705 -1016 235 280 -1329 660 -629 -829
2483 -829 782 -790 358 545 -866 1175 151 -481 1313 -688 211 1066 -943 1056 169 -534 1266
2500 1266 -637 -11 810 -1308 707 7 -1052 940 -725 -490 548 -1411 127 132 -1226 551 -439
2517 -439 -375 844 -602 503 769 -870 1050 -135 -433 1084 -604 375 616 -884 984 81 -652
2534 -652 1058 -851 -89 431 -1413 457 100 -892 713 -990 -627 570 -1354 500 397 -965 921
2551 921 -261 -389 1438 -809 320 732 -807 788 -72 -507 1110 -541 163 637 -826 722 -200
2568 -200 -948 618 -908 20 438 -1131 420 47 -902 740 -539 -151 1002 -945 67 462 -652
2585 -652 850 -267 -316 803 -569 468 291 -612 1041 -167 -360 1143 -837 208 454 -1011 735
2602 735 -173 -781 571 -952 -417 286 -981 81 -214 -774 743 -567 -22 763 -502 416 225 -378
2620 -378 1128 -286 13 957 -653 278 623 -576 597 -313 -337 908 -642 123 431 -751 599
2637 599 -327 -561 565 -372 78 281 -655 602 -181 -559 731 -553 -66 503 -395 566 -8 -427 986
2656 986 -242 22 675 -556 624 522 -303 784 -330 -242 623 -691 194 -192 -585 330 -757 -366
2674 -366 567 -1186 21 13 -699 461 -286 -148 1002 -507 244 569 -402 732 67 -199 750 -578
2692 -578 319 547 -843 557 -191 -491 547 -804 19 262 -1035 563 -93 -737 488 -566 -179
2709 -179 510 -487 325 244 -991 809 -156 -104 552 -314 459 271 -698 1261 -181 -167 895 -845 584
2728 584 -72 -740 711 -357 -607 605 -1058 -101 440 -781 596 -359 -573 891 -842 -85 586
2745 586 -823 499 249 -729 908 -436 131 1214 -709 620 201 -333 773 -322 -392 773 -839
2762 -839 407 464 -1010 674 -369 -592 433 -1037 51 264 -1098 742 -203 -661 867 -541 -9
2779 -9 703 -846 848 229 -526 1078 -277 123 784 -691 503 368 -693 1088 -348 -360 852 -728
2797 -728 96 -74 -1125 591 -431 -614 649 -781 -20 255 -726 723 -92 -618 1061 -483 442
2814 442 916 -629 194 527 -243 1022 -534 246 764 -705 256 230 -523 583 -589 -194 837 -931
2832 -931 -26 437 -903 498 -483 -446 556 -742 375 443 -652 706 71 -110 645 -341 226 538
2850 538 -532 944 283 -239 850 -321 4 534 -667 407 -312 -782 549 -665 -256 272 -969
2867 -969 138 79 -884 763 -220 -97 793 -637 265 411 -225 913 -13 -96 871 -260 193 324 -344
2886 -344 526 -367 -530 442 -691 -136 20 -630 71 -312 -207 256 -672 21 257 -1072 189 87 -621
2905 -621 515 -265 -60 519 -584 605 260 -636 824 20 282 675 -354 479 463 -292 400 -589 -242
2924 -242 311 -557 112 -101 -603 486 -275 -362 537 -762 -40 -164 -519 355 -78 -509 632 -410 204
2943 204 365 -389 674 159 -130 641 -158 95 570 -680 534 15 -382 395 -580 -60 231 -596 368
2962 368 -88 -499 375 -395 -320 586 -780 89 330 -696 656 -255 -112 721 -448 189 372 -317 587
2981 587 -274 -191 768 -660 429 453 -717 497 -111 -513 435 -626 98 96 -662 121 -250 -816 598
3000 598 -377 -37 366 -764 649 197 -630 971 -161 19 1003 -639 860 258 -535 914 -7 -84
3018 -84 793 -639 120 360 -757 593 -420 -695 648 -740 32 469 -926 344 81 -423 684
3035 684 -620 -281 738 -575 578 149 -371 788 -333 -196 789 -806 392 424 -493 664 -220
3052 -220 -171 572 -757 -31 279 -644 260 -269 -607 539 -854 51 375 -710 352 102 -521 587
3070 587 -311 -41 572 -373 624 362 -480 978 -465 9 604 -591 67 259 -736 526 -294 -486 470
3089 470 -735 -87 170 -625 362 -267 -509 765 -601 -183 347 -364 572 59 -214 762 -191 -19 601
3108 601 -331 481 223 -209 783 -387 125 614 -516 196 70 -659 351 -559 -337 334 -663 374 138
3127 138 -476 545 -459 -273 487 -300 271 385 -548 435 45 -53 673 -422 74 387 -755 308 -54
3146 -54 -142 462 -417 44 217 -584 113 44 -545 382 -456 -220 259 -669 142 -100 -164 355 -411 220 606
3167 606 -484 278 72 -459 980 212 28 704 -250 569 245 -295 562 -115 -134 350 -386 174 11 -593
3187 -593 413 -616 -561 594 -218 3 123 -413 471 148 -302 781 -187 -5 217 -391 451 101 -384
3206 -384 838 -159 323 389 -793 111 210 -350 723 -344 -46 394 -604 93 36 -708 408 -175 -265 383
3226 383 -688 275 155 -635 724 -17 -249 1085 -461 109 610 -257 555 32 -262 969 -441 -202
3244 -202 330 -395 359 -143 -467 577 -373 -205 369 -673 2 -45 -836 475 -328 -245 523 -768 243
3263 243 294 -486 839 -17 -97 598 -730 219 693 -541 738 128 -414 520 -496 98 628 -547 387
3282 387 118 -583 807 -696 -295 263 -825 136 20 -730 555 -463 -144 613 -580 447 289 -564
3300 -564 632 244 -322 645 -510 209 442 -465 559 -68 -618 622 -690 -130 287 -611 174 15
3318 15 -583 527 -471 -374 565 -588 10 -60 -583 528 -248 164 518 -475 370 110 -657 653 -144 -242
3338 -242 665 -558 175 334 -773 280 -361 -615 411 -526 -75 326 -933 400 -453 -525 362 -387
3356 -387 167 430 -482 171 -83 -384 523 -353 -88 687 -229 395 212 -401 737 -78 -219 382 -416 276
3376 276 16 -528 115 -425 -267 308 -591 2 334 -711 167 -264 -282 623 -353 382 180 -325 163 -16
3396 -16 -190 590 -299 274 190 -314 442 250 -227 614 23 -219 461 -458 187 -62 -696 454 -392 -241
3416 -241 138 -676 274 170 -429 449 -424 -218 562 -319 175 200 -502 542 182 -14 471 -176 163 324
3436 324 -454 539 -45 -383 355 -357 -62 267 -810 533 26 -494 459 -351 69 407 -664 566 76
3455 76 -305 726 -154 -43 301 -495 662 260 -38 724 -380 108 561 -319 92 290 -516 232 -168
3474 -168 -17 246 -553 96 287 -656 273 -252 -297 313 -512 204 400 -654 482 13 -108 628 -506
3493 -506 -106 589 -169 282 118 -219 703 -207 -29 571 -500 190 202 -397 597 -219 -352 296 -814 139
3513 139 13 -598 480 -247 -229 279 -345 116 538 -449 150 138 -412 848 44 -147 534 -352 437 -71
3533 -71 -337 449 -239 -84 355 -701 217 -152 -532 408 -491 -346 419 -667 203 136 -534 487 -51 -514
3553 -514 392 -546 170 168 -291 673 -63 -175 740 -254 104 289 -594 280 -121 -380 677 -661 -126 439
3573 439 -344 18 -3 -470 517 -182 -289 573 -199 34 69 -404 449 -302 -208 644 -157 201 549 -255 748
3594 748 121 -245 562 -388 71 303 -499 200 -7 -308 280 -214 -158 192 -456 254 5 -499 161 -77
3614 -77 -184 293 -354 309 288 -291 609 -135 -111 475 -494 116 35 -277 267 42 -99 186 -609 153 30
3635 30 -395 389 -322 -162 84 -444 46 401 -864 365 -8 -114 292 -46 127 484 -197 395 36 -161
3655 -161 287 -504 165 136 -344 317 279 -318 376 -177 11 231 -443 248 202 -317 153 -254 -347 115 -394
3676 -394 30 -208 -545 267 -84 -326 300 -211 249 393 -387 527 -142 -336 397 -271 120 101 -238 303
3696 303 -364 -243 200 -284 95 341 -310 139 107 -311 294 -599 -77 180 -534 260 144 -161 350 11
3716 11 -267 155 -224 108 508 -347 361 -216 -83 566 -360 367 337 -544 210 -10 -417 491 -194 283 221
3737 221 -487 194 70 -379 628 -340 -250 378 -484 240 -57 -329 255 -381 108 357 -441 258 235 -1
3757 -1 397 -223 -190 421 -256 49 60 -587 337 -437 -373 270 -304 -128 90 -582 181 -296 -511 500 -206
3778 -206 -120 307 -252 232 149 -163 270 -271 -79 670 -93 226 167 -377 463 -25 -116 322 -646 -22 152
3799 152 -413 239 50 -298 407 -396 -23 193 -493 253 92 -399 574 -251 53 658 -383 334 21 -174
3819 -174 621 -71 20 313 -369 35 208 -255 143 -30 -18 236 -405 207 1 -210 238 -274 -536 285 -350
3840 -350 -106 426 -147 23 -48 21 187 48 105 250 -215 206 150 -310 572 -344 73 345 -117 223 290 -144
3862 -144 430 -216 -162 324 -532 -126 65 -44 41 -18 -111 90 -550 39 294 -64 452 -35 -251 452 -250
3883 -250 61 131 -33 284 86 -30 605 -206 37 51 -143 148 -249 -251 212 -396 -56 190 -459 436 -4
3904 -4 -54 140 42 -41 70 -352 181 27 29 381 -91 55 409 -79 405 273 -323 434 -461 -162 395 -414
3926 -414 85 199 -356 75 -312 -306 -43 -70 110 -1 -437 362 -113 -425 407 -171 123 505 -13 333 117
3947 117 -154 434 -174 207 224 -119 12 -103 -106 347 -89 -44 186 -89 -5 -317 -430 181 -1 -174 334 -200
3969 -200 337 -29 -255 281 -98 -29 362 -321 212 507 -110 393 -226 -39 289 -27 -31 347 -426 442 60
3990 60 -250 114 -154 -93 -15 -511 371 138 -467 196 -272 -163 296 -475 240 106 -302 448 -293 118 316
4011 316 -225 340 177 -305 419 65 -12 420 -134 378 36 -582 499 -196 -394 99 -269 22 262 -280
4031 -280 177 8 -355 340 -122 -55 176 -223 315 329 -215 465 -101 -218 420 -112 330 326 -397 258 -24
4052 -24 -84 99 -385 -80 296 -251 270 110 -388 121 -163 -58 102 -340 34 73 -344 409 -16 -101 106
4073 106 -552 248 -52 -315 201 -338 -91 207 -180 189 42 -113 222 -97 -189 173 -290 -144 262 -240
4093 -240 233 -162 -203 74 -175 68 75 -298 121 137 -74 255 -103 186 346 -195 149 104 -46 614 147 28
4115 28 274 -286 236 13 -315 152 -205 107 313 -566 96 121 -519 47 -284 -310 213 -358 102 174 -283
4136 -283 159 -191 -94 179 -39 157 273 -279 352 -187 -115 329 -99 -51 140 -318 411 -125 -273 72 -302
4157 -302 -247 280 -222 39 15 -422 97 -65 12 22 -409 177 168 -240 316 64 -8 102 -162 170 151 -161 266
4180 266 -156 -97 386 -416 -104 -63 -454 155 -153 -411 201 -85 -20 197 -309 256 -105 -158 329 -313 109
4201 109 99 -348 311 165 -16 381 190 48 413 -465 118 -1 -403 505 -199 -66 124 -492 -71 -14 -180
4222 -180 101 -179 -278 129 -316 -39 111 -235 358 -40 -328 324 -269 256 270 -7 612 188 -208 142 -474
4243 -474 -133 213 -435 342 155 -250 194 -79 -32 253 -324 -32 143 -552 218 -297 -167 322 -373 23
4263 23 127 -270 246 -241 -38 302 -271 413 316 105 436 147 -123 376 -352 -308 152 -333 112 141 -426
4284 -426 286 50 -101 -87 -428 54 58 -242 120 -177 -95 315 -550 28 145 -251 -109 -41 -153 188 -164 227
4306 227 238 37 171 -5 -94 64 -29 7 294 -53 100 -179 -464 110 -301 15 239 -422 126 -36 -236
4327 -236 363 -253 -265 290 -341 -98 87 -297 510 -48 -40 406 -332 65 212 -303 273 -8 -203 -31 -46
4348 -46 -203 285 -261 223 -210 -57 122 -65 256 107 -225 13 179 41 428 -131 -86 197 -365 230 15
4369 15 -16 180 168 84 251 -146 338 173 -318 -125 -88 -72 124 -155 -141 68 -205 263 -233 -272 188 -270 -226
4392 -226 437 152 -12 56 -110 154 -222 57 294 69 444 302 -50 310 -146 -105 114 -262 83 55 -68
4413 -68 232 -148 57 38 -351 1 6 -360 48 -231 193 364 -109 144 197 155 286 -98 -56 207 -364 -72
4435 -72 248 -13 150 88 -61 465 -187 179 359 -354 246 -109 -292 237 -169 -224 288 -398 120 118 -113 200
4457 200 -207 -214 139 -110 -37 -44 -252 540 -177 50 317 32 76 103 -334 25 -47 -95 130 -315 135 104 -98
4480 -98 104 -237 -223 79 -252 -14 98 -359 234 -2 -369 306 -167 -24 186 -269 69 161 -258 217 -28
4501 -28 -89 -184 -142 -8 316 -200 160 26 -181 180 -162 192 -33 -230 278 74 -179 128 -265 46 287
4522 287 -152 324 92 -34 349 -172 134 279 -138 108 -75 -167 453 -51 -67 377 -342 13 151 -55 381
4543 381 26 -182 307 -591 99 95 -89 169 -462 -34 315 -220 55 163 -206 233 -124 -199 527 4 135
4564 135 269 -121 72 -150 -44 47 -239 -116 -26 -401 -32 158 -171 16 -310 56 50 -320 -17 94 -304
4585 -304 225 -4 -378 260 -204 359 218 -306 216 219 -215 186 -145 -50 -107 -368 223 -143 69 79 -282 -150
4607 -150 172 -177 -56 -288 -62 208 -72 -63 307 -117 110 55 -42 60 57 -99 467 -194 245 -117 -85 288
4629 288 -4 33 377 -230 190 103 29 198 -188 -129 160 -189 -97 -116 -230 8 16 -52 -148 -99 -67 60 -373 73
4653 73 -66 -88 296 -122 56 10 -107 40 105 6 -2 91 137 233 74 43 196 190 266 -148 -243 -11 -292 22 200
4678 200 -179 82 111 -118 247 34 23 -77 -378 160 36 -138 172 -59 155 139 -78 170 42 -130 264
4699 264 -295 -108 -57 -107 127 -27 -280 286 -121 -118 191 -297 108 213 -18 94 28 -102 383 -489 275 267
4721 267 -226 133 152 -188 184 -92 377 176 -414 212 88 -172 51 -145 -180 -32 -485 51 -30 -241 166
4742 166 -74 -184 356 -228 154 34 -289 -168 108 -75 383 -240 192 149 -8 16 -250 27 15 82 75 195
4764 195 -389 223 -298 -25 157 -286 26 250 -230 154 162 -197 115 72 40 226 -146 107 -26 -408 -62
4785 -62 -57 -143 215 -1 -108 47 -142 557 99 1 269 29 -167 244 -369 99 1 -123 195 102 -95 -97 -200
4808 -200 41 -5 -166 372 1 103 241 -233 -124 -36 74 -217 -151 133 411 -165 137 343 -112 -60 13 -91
4830 -91 305 -257 57 110 -117 331 102 -168 -25 -160 85 111 -186 -92 -59 -81 33 -184 11 -14 -227 87
4852 87 18 -307 144 -73 110 -32 -60 29 54 -165 69 83 13 514 -56 158 43 -54 -57 137 -13 -96 -198 -94
4876 -94 333 -208 217 -4 -87 42 -240 156 173 -123 80 -24 -67 213 62 -21 -1 -389 20 33 -90 192
4898 192 54 127 209 -249 251 -41 -363 161 -121 -5 140 -170 -79 -72 23 15 -238 -23 70 -156 442 35 -397
4921 -397 232 15 -142 -57 -264 57 -92 -153 212 -352 -186 -63 -122 -52 154 54 136 -15 -232 330 -132 -101
4943 -101 210 -15 -7 -127 40 113 -87 -184 89 18 34 -64 26 192 -55 -65 290 -104 242 -14 -389 78 2
4966 2 -112 148 -1 -215 79 -381 214 -24 -147 16 -167 25 248 -49 237 181 -4 109 -300 166 157 -27
4988 -27 93 120 -14 228 -249 -55 317 -325 248 60 -348 371 242 139 233 -259 60 2 -378 334 -79
5009 -79 -306 125 15 115 -45 -1 250 -86 315 226 147 -46 576 -128 36 72 -28 125 -29 -5 123 -12
5031 -12 87 -100 -304 355 16 265 321 -356 -117 -202 -154 186 47 275 322 -214 -143 115 13 447 178 -57
5053 -57 140 86 -56 -99 -124 -381 -41 61 97 -227 25 110 -103 0 -81 -36 245 17 80 56 -11 274 87 110
5077 110 216 -230 128 -32 -28 -141 172 -128 259 32 -419 18 -197 -118 28 -183 -166 -102 -95 226 -261 -188 68
5100 68 -145 103 29 -237 -74 -193 202 92 -148 42 31 57 96 -112 -42 185 -53 27 -33 155 63 -129 -154
5123 -154 78 -79 56 171 -61 117 114 -236 208 -175 -47 61 -240 59 -67 -65 224 157 300 50 -80 159
5145 159 -133 -125 -1 -240 -237 54 -281 -83 64 162 251 -23 -44 367 -113 17 132 -87 69 -93 -274 90
5167 90 -340 140 103 -142 117 27 -92 222 -295 30 95 -39 -4 35 99 192 29 133 -31 -159 240 -216 -350
5190 -350 82 -35 33 270 -218 119 -268 -134 81 -257 -328 190 37 424 53 -206 148 -42 68 55 -137
5211 -137 169 -108 -331 256 -266 -16 12 14 -105 216 -100 207 10 5 165 -310 182 91 -158 22 188 -231
5233 -231 184 -228 -43 -19 -274 -46 93 -148 255 -22 -15 69 -105 84 75 -130 242 -136 -48 79 -158 -77 -131
5256 -131 -113 -2 66 -60 -138 -407 -54 42 -233 3 -45 21 226 -171 99 -11 -354 132 54 -28 195 -203 176
5279 176 329 200 -1 52 -374 -23 21 -192 -249 -232 158 119 -221 369 -262 -66 -59 -318 76 222 -213 68
5301 68 -103 -56 96 -371 -288 368 207 111 -130 -93 77 93 -36 203 -121 -11 5 -236 -21 -157 -228 -34 -40
5324 -40 294 33 -96 226 126 132 234 -143 -93 95 -213 273 95 37 -66 -66 79 88 -344 -56 69 100 141 110
5348 110 -212 -89 -163 136 -40 -102 123 -148 -151 -40 -89 267 -247 -185 290 155 -1 154 -21 -46 -89 -165 58
5371 58 -106 46 -108 -62 162 -9 -19 -169 -89 262 196 54 143 39 -317 209 239 151 37 -63 106 -226 46
5394 46 92 -170 -258 435 75 8 107 -14 112 -2 486 -59 36 -70 90 -171 156 175 91 -37 -336 -59 11
5417 11 -464 -1 -48 -130 -51 -158 -92 -152 -74 389 -74 140 153 -17 -301 117 -124 293 95 -295 261 2 -88
5440 -88 199 -53 -26 -218 127 153 101 -132 -13 -95 -87 56 -26 182 -96 -89 86 0 -43 168 -60 46 88 -199
5464 -199 149 -122 -181 59 -19 -289 242 -289 -144 -14 -102 115 -115 186 -8 -223 -123 19 -103 -19 -341
5485 -341 -131 107 17 -157 -81 -89 204 -51 -72 14 -22 128 15 -117 102 -89 37 -7 -216 -215 -132 191 228 31
5509 31 -307 -11 185 81 40 -91 -279 -176 -55 197 -26 -196 -8 73 132 -232 -271 60 -47 -51 -46 -3 301
5532 301 -69 -176 196 140 -104 223 -188 4 46 -55 104 108 -48 2 -81 -38 9 -28 8 -31 25 161 -133 -52
5556 -52 139 -246 128 168 -266 386 -79 -60 -2 -109 33 -350 -84 348 -83 99 200 -87 1 83 -189 84
5578 84 -145 169 60 -281 210 -186 41 -32 -353 0 -18 -181 -32 44 -120 69 -34 -60 94 144 90 151 -187
5601 -187 -23 24 -50 71 -68 -96 23 -16 101 153 -177 250 -78 -215 162 -211 159 29 -56 20 -142 78
5623 78 -83 -254 -114 72 -57 -85 -23 72 189 -36 156 -23 -377 126 170 -147 -156 34 -45 -194 -172 89 -314
5646 -314 83 97 130 -35 134 -201 0 38 -61 -130 -41 -151 143 -71 42 -17 76 93 -137 -127 407 22 -20 -46
5670 -46 -109 312 -301 -45 -26 52 48 -122 46 -38 -13 -60 339 157 30 -208 -217 201 -88 -163 171 -93 -180 46
5694 46 1 -33 -154 22 -364 -45 211 -230 -212 49 2 72 26 -120 -110 -57 -36 33 4 -260 68 15 -228 -144 -105
5719 -105 12 -36 23 94 -27 49 56 -34 130 247 -139 -147 113 15 65 -75 95 -284 169 121 -200 -205 95 -189 -111
5744 -111 -16 -255 -233 -189 19 7 -225 55 141 -183 79 340 -86 67 152 -45 102 -6 128 -146 -129 -43 -90
5767 -90 -75 131 -121 174 21 -223 97 -44 -121 169 -66 172 35 19 -168 115 205 -94 -95 -69 8 -39 -45 0
5791 0 -91 -223 196 -167 153 -41 126 -51 -100 20 -36 260 105 -227 -89 -185 -34 -88 -156 -204 48 -4 -47 19
5815 19 13 -111 331 397 -74 173 15 123 -68 -195 -65 -44 -163 81 -145 -180 -33 87 20 85 305 -92 -276
5838 -276 -46 -33 25 -85 -129 -323 -90 -52 240 -95 -85 83 -350 62 13 87 51 -162 108 -92 170 16 5
5861 5 -360 31 -91 -31 55 60 74 -198 -272 283 182 -238 191 69 81 -138 106 71 69 -67 185 -73 221 195
5885 195 -168 243 140 -248 219 -109 69 -273 -203 50 -20 27 -133 -25 -106 -221 133 -5 -197 0 77 281
5907 281 -279 4 -39 -191 -83 -231 -75 -218 45 302 53 -119 162 -359 -89 -16 -57 42 -34 64 4 -308
5929 -308 -84 120 5 102 -129 76 -301 -56 -231 -27 -144 -65 28 -92 439 -40 52 -333 -28 2 -16 -169
5951 -169 -187 -144 169 -4 -9 -139 -25 77 -104 5 8 127 -14 -36 -139 34 316 36 -59 120 -166 77 23
5974 23 170 96 -69 -94 23 -184 37 231 -163 130 -115 207 53 -16 169 148 -52 16 174 190 -17 108
5996 108 157 -144 -4 -166 -188 -119 -25 -119 -184 -88 -108 -24 89 -242 70 120 47 -108 -45 61 -60 18 61 -25 -179
6021 -179 -35 -151 -11 153 -322 138 -118 104 -56 30 -97 -95 -255 -118 218 63 25 51 150 -75 147 115
6043 115 125 -105 67 -54 123 223 -90 -52 59 -7 -57 2 -157 316 -107 -41 -153 -310 312 87 -175 -45
6065 -45 153 69 -10 -85 229 -33 -4 280 -20 -127 -97 15 -38 -43 180 29 -22 -210 93 -168 36 28 -137 137
6089 137 95 -127 -341 -8 -5 44 158 146 -42 -90 -148 -110 -7 -62 69 -9 78 -362 -66 -256 110 10 124 -11
6113 -11 -163 56 -7 -134 -64 -355 -106 62 202 -152 -179 -59 -99 17 344 270 -70 -28 -226 -107 -249 -21
6135 -21 -28 -53 168 -27 -149 14 93 232 108 -165 155 52 -104 -177 -176 -31 51 36 5 -195 252 -98 -170 87
6159 87 25 -126 -107 87 225 -97 -92 89 154 128 -111 -19 96 112 27 -118 349 67 11 -81 147 73 -279 263
6183 263 -24 17 96 226 6 -91 -154 -29 -62 -73 -87 0 -218 26 -163 108 -27 -29 309 -43 253 -32 -48 123
6207 123 149 125 63 -188 -31 168 -170 -116 -17 -28 -197 -101 62 -288 -89 302 52 -41 44 36 65 -52 44 235
6231 235 278 -277 60 24 -55 312 -136 30 267 155 343 -113 138 349 41 63 -69 -41 -95 15 210 -227
6253 -227 14 237 79 53 -128 -37 91 184 155 114 125 234 -159 -52 114 16 -201 133 28 12 44 24 65 -71
6277 -71 -98 -51 116 -189 171 8 -14 122 40 -165 -120 -204 -163 143 -197 -40 -59 107 193 40 -317 42 -22 -136
6301 -136 65 82 -100 -56 -80 -46 -82 29 -166 -211 118 -171 -4 -158 -122 50 316 -43 56 157 -37 15 -151
6324 -151 -26 123 29 87 -287 -4 80 -155 173 -414 -281 29 -153 64 181 337 -25 -97 215 -78 -30 50
6346 50 -254 -51 -20 -108 82 23 -223 17 -76 -88 89 -148 147 -49 -129 -180 -60 -14 68 -62 -252 -34 -43 27
6370 27 -199 -41 81 -156 310 -77 114 123 -96 -185 -156 100 203 27 21 88 6 -205 -16 89 13 64 36 202
6394 202 41 36 -3 289 219 27 -18 65 51 175 -73 -31 -93 -131 274 -143 -8 300 -52 145 72 -48 -16 -211
6418 -211 0 36 -90 149 275 -116 -109 -31 25 -160 56 195 53 109 28 94 131 191 -83 -59 272 -39 84 71
6442 71 49 96 138 85 -68 -113 286 -33 -71 -159 -142 158 60 -122 -318 32 116 83 35 -136 184 111 95 125 -17
6467 -17 -124 105 -10 70 -74 201 -188 102 -31 180 94 -66 -168 -96 -171 148 63 -46 -286 -246 -10 -87 70
6490 70 -170 297 -33 -26 66 -139 123 97 42 -17 202 -122 -72 336 340 -176 -105 -12 174 40 8 -112 -154 -96 110
6515 110 320 203 4 3 -137 3 324 8 96 184 25 50 -199 167 -84 106 -7 -49 -136 -159 57 118 9
6538 9 77 -11 248 -47 191 -90 22 10 -143 248 -162 41 120 -229 -173 -111 154 130 232 -239 -238 21 227 382
6562 382 -155 -134 -43 -147 -15 -38 106 94 -147 16 288 -188 159 -81 -96 -240 -193 154 -187 -21 -81 -84 133
6585 133 270 -95 46 107 102 -188 -393 -46 -44 97 -241 -5 153 -218 108 -253 190 -242 -155 -112 -6 -85 -301
6608 -301 -13 -121 123 -207 54 -178 82 -289 -115 37 65 -184 -229 -31 148 -165 46 68 62 32 -127 123
6630 123 99 116 -338 -1 44 52 -41 101 127 144 -70 -142 112 -105 107 -63 -162 75 -129 56 71 220 205 -25
6654 -25 -195 -141 -21 -186 -17 71 93 109 -71 -73 -60 -33 162 56 -156 -8 87 149 -64 -61 250 -25 -275 -122
6678 -122 40 5 41 -88 -11 68 109 -148 -289 103 -20 -184 72 64 -285 117 20 72 20 -155 125 232 -279
6701 -279 69 151 133 -185 -173 149 -26 23 106 -79 199 -121 278 -141 -125 -44 -64 -53 -120 23 -103 -86 49 172
6725 172 131 157 195 -258 -185 163 36 35 80 -70 -123 33 86 -217 -70 59 -84 -123 -11 -82 -131 -175 -31 191
6749 191 -135 -84 -71 -141 -140 -24 -173 73 -79 -10 -17 -107 -145 -48 -39 199 -256 180 -229 52 225 145 147 240 -192 -126
6775 -126 -13 -21 -23 -206 84 -58 71 85 160 309 -3 62 -50 59 113 131 -252 137 4 127 -72 27 190
6798 190 -52 104 44 76 -2 63 -12 32 150 -134 -429 242 -159 -65 -15 16 -78 -470 -155 49 80 -57 -112 332
6822 332 201 -166 219 48 -24 -1 -96 -92 -118 127 247 168 186 158 -175 -163 61 -73 -106 -110 21 52 -129 71 -136
6847 -136 179 -112 41 -87 -213 69 10 207 -309 199 -15 119 -124 327 -12 176 -144 -144 -88 76 118 -198
6869 -198 -122 -95 -150 -273 78 90 180 60 63 -17 -225 60 -8 -167 82 145 143 272 -25 154 281 17 99 57 28
6894 28 23 -140 -28 21 -85 -11 -31 166 -32 -142 68 49 12 -78 -54 9 105 16 -38 -128 9 25 50 -130 -31 258
6920 258 87 -118 -151 -85 -82 -154 75 -155 -199 -106 -51 -352 -21 -247 144 -14 -68 206 -34 -11 -27 -59 -38 41 -103
6945 -103 154 -38 84 -24 157 -278 -76 245 -69 -201 -205 39 -328 -33 28 -251 -85 -116 206 -6 185
6966 185 51 -22 -102 -18 134 46 49 134 -17 141 11 232 59 -45 -94 -129 128 -4 31 56 24 3 121 -283
6990 -283 -50 31 64 -32 -186 -180 -167 74 -32 -2 19 -92 223 -328 -21 60 -103 -101 21 -165 -45 -75 7 158
7014 158 -38 61 -46 -168 105 46 -160 56 93 263 112 -125 -177 -211 -30 -47 -38 -15 -256 81 -126 -127 -15 127
7038 127 -321 4 -295 -23 -20 22 41 -60 159 208 -153 81 111 -313 72 207 135 -145 -95 14 84 -55 54
7061 54 -162 -225 95 70 135 14 -104 -304 56 14 -198 17 -196 207 100 249 -110 192 124 -10 -109 120
7083 120 -69 7 -124 92 257 59 320 -68 12 34 181 -128 -90 22 56 159 90 48 117 -59 113 195 74
7106 74 -16 209 -23 58 -27 133 51 131 226 -144 86 115 272 -58 112 -267 -45 -23 -229 -132 -46 -45 265 55
7130 55 13 61 -64 87 -35 115 325 -22 -179 -317 67 343 -359 83 -102 213 -374 -184 -166 272 191 -37
7152 -37 110 -111 -31 60 51 -19 -15 -110 144 -181 -42 98 -68 -93 -70 136 109 86 51 -119 -65 203 7 -135 -134 10
7178 10 -101 -192 -157 -135 91 62 109 53 167 -212 167 12 -55 124 120 -262 139 6 55 -42 -92 270 92 22 -183
7203 -183 -38 -165 -118 -108 -219 -98 -64 298 -146 -103 -116 12 -122 -142 8 -240 93 19 -247 45 262 -103
7225 -103 181 -2 -191 -100 -93 13 -240 -69 105 88 40 154 -49 174 130 -46 -11 151 16 238 -152 -137 175
7248 175 -68 -83 -122 112 -1 -106 -5 -21 137 -3 122 81 -9 196 39 -222 -120 -110 63 -39 88 -138
7270 -138 1 -10 -35 -108 -120 58 75 191 -193 20 -189 20 74 -69 286 -251 -154 27 29 105 -49 -10 99 62
7294 62 -36 -10 -142 46 -173 -43 -167 -5 58 120 -58 -193 -220 -278 60 -35 57 -132 -132 -45 218 5 -5 -44 -92
7319 -92 -24 -138 50 -84 -30 -91 12 -13 -292 270 163 -118 -285 140 49 121 -60 -65 -27 196 -37 94 142 -15
7343 -15 -159 -14 -44 5 26 157 57 -66 20 -190 71 -185 69 84 153 -210 19 -236 57 -54 -96 153 62
7366 62 122 102 92 162 58 -17 93 -247 -98 78 79 -77 24 139 3 113 -146 81 59 68 92 -217 20 -145
7390 -145 -57 17 288 -182 1 -73 108 148 110 57 -48 -86 -148 128 -74 -97 120 141 82 -60 -95 -62 -194 -33
7414 -33 -65 296 -19 -439 19 131 66 -39 -76 -197 73 -47 -46 -211 -126 37 107 28 -130 -74 -55 -119 45 22
7438 22 10 73 33 30 -73 -259 32 -27 -153 -36 -92 -89 -175 291 112 343 -282 -263 -174 11 94 90 -374 -96 99
7463 99 -58 -93 8 -16 120 -26 91 -96 120 -115 -192 -138 -66 87 67 73 119 86 80 -30 200 39 -8 1 -54 47
7489 47 17 -229 -186 -104 68 117 -164 102 79 143 159 78 286 39 2 -48 -47 -322 -98 -95 -58 -239 -89 54 -144
7514 -144 45 86 13 191 87 -70 46 39 85 103 -149 124 125 29 27 1 280 61 0 -127 -331 -5 -182 -120 -33
7539 -33 -72 53 -149 -141 63 274 -118 -112 42 -48 159 -36 -107 -50 -138 -53 -6 -25 -41 125 -109 -129 292 -192 -14
7564 -14 20 107 177 219 155 -109 -105 235 -167 144 -4 72 18 -114 26 -88 57 -166 -1 -82 79 -97 3 -170
7588 -170 84 9 21 266 83 -274 131 -179 -390 -6 -94 4 -153 17 124 -269 114 65 11 -53 -139 30 -286
7611 -286 -257 12 -143 287 66 214 118 150 -140 -83 -105 205 -10 -19 -31 -49 -38 8 134 -187 251 161 -45 -140
7635 -140 -23 406 -102 -116 167 53 107 112 -304 277 30 21 119 56 175 -88 -127 -91 -207 32 146 -97 -220
7658 -220 13 -96 213 -49 -143 54 -54 67 -72 123 134 -5 -147 -131 26 -130 -136 -2 3 200 283 -268 40
7681 40 -45 260 7 -111 53 -50 71 37 155 11 21 -6 37 264 -124 -124 96 -82 169 -143 -256 70 27
7704 27 -253 -91 -35 -61 49 -124 111 53 -167 -66 -53 -81 -166 -105 150 -62 7 35 54 41 -167 -77 228 124
7728 124 -154 -30 -113 -40 188 49 241 -82 -26 158 44 13 -61 241 90 -198 135 59 175 -307 -95 -32
7750 -32 -311 98 -123 251 86 92 8 114 12 201 -14 -214 -110 159 -183 23 -18 -145 -181 -40 -103 -71 318
7773 318 -150 203 -45 -86 -33 111 -88 -149 105 24 290 193 100 63 37 249 -30 111 -73 168 474 160 -130
7796 -130 -273 -34 -125 -29 -124 -231 -132 113 46 53 171 -19 -284 -137 30 -40 -22 -44 -32 -122 -159 -100 -110 116 -115
7821 -115 -88 -100 45 -137 -158 -182 -152 -14 25 -34 -135 12 -215 -67 60 -55 84 -35 -106 -39 83 -80 -154
7844 -154 -91 180 -327 -135 -355 -205 27 -156 40 211 10 -123 -39 -139 66 -77 99 1 8 259 32 44
7866 44 -296 207 108 -34 -55 43 -50 241 155 -260 257 106 -153 -151 -47 -21 92 -184 4 69 -125 -22 -127
7889 -127 2 -200 -3 -23 203 316 20 27 -170 -117 264 63 13 -92 -124 -8 -133 -100 -4 41 3 -38 331 -12
7913 -12 -119 89 -32 -122 -90 110 -261 80 -107 -198 -89 -113 33 -87 -214 25 98 -72 -323 241 -93 32
7935 32 23 -188 176 -25 -268 -158 -185 134 -81 -26 -68 -151 271 -145 -119 102 -159 28 -123 -8 93 -111 -187
7958 -187 40 85 139 -23 208 229 -32 20 -204 84 48 -126 -238 1 171 -71 238 -127 -69 -126 -19 -32 -223
7981 -223 181 -287 -84 -11 214 -82 30 313 154 -160 99 -107 36 -154 -386 206 -80 196 35 -115
8001 -115 190 37 -27 -55 -88 -173 -44 155 -79 121 -128 -71 247 -149 115 155 -270 -103 5 -396 -168 -214
8023 -214 -139 -49 -164 123 23 -86 -261 26 59 127 197 2 37 -42 125 66 57 -102 162 98 -6 107 -44 -119
8047 -119 -3 123 1 6 86 159 21 -115 139 -188 -34 272 83 -183 72 -111 -24 83 35 -144 91 222
8069 222 203 91 22 8 -87 97 -20 51 72 16 -127 100 -66 121 -355 75 -28 -61 -25 3 68 9 244 -92
8093 -92 -10 -38 40 1 -9 29 -113 215 137 -102 -69 -103 3 14 -107 201 -147 -149 -18 130 148 -157 129 139 53
8118 53 245 221 179 -84 -29 104 17 -79 43 -369 51 86 248 -17 -127 -42 -2 -182 -24 84 78 -189 95 129
8142 129 -62 -78 -137 -294 -100 113 -70 62 38 19 191 -61 -202 -20 56 -103 35 -173 32 206 -63 -309
8164 -309 -39 -101 50 77 96 -127 -30 76 105 133 45 -19 -2 267 -13 -233 -47 -224 -153 109 6 -174 82
8187 82 -251 -134 -293 -194
8191a94
$$ Imaginary data points
##PAGE= N=2
##DATA TABLE= (X++(I..I)), XYDATA
0 0 0 0 0 0 0 0 0 0 0 0 0 0 0 0 0 0 8 -8 8 -8 8 -8 16 -16 16 -23 24 -29 32 -37 42 -48 53 -61 69 -77 85 -96
38 -96 109 -119 134 -147 161 -181 197 -220 240 -265 292 -323 354 -390 430 -475 528 -584 651 -727
58 -727 820 -929 1064 -1233 1452 -1749 2172 -2817 3919 -6135 12244 -61283 -188388 41075
72 41075 139566 37867 -63854 -16433 99356 44601 -16536 12404 -48421 -20834 59713 13483
84 13483 -43656 -51119 38254 96990 -41725 -74744 20730 10914 -7474 -27557 -36878 6704 4430
97 4430 32182 24263 -61596 -1663 59650 -12275 -36779 -16329 27431 32156 -20727 19380 22990
110 22990 -36191 15931 23781 -33144 -26390 1259 42715 8463 -41542 33914 33177 -38264 -6405
123 -6405 14982 -7515 -35439 -14052 62780 1089 -73686 22049 53938 -18560 -49724 -13659
135 -13659 49177 7622 -41215 19383 19895 -6609 12451 -6509 -12122 -4990 3720 24875 -17716
148 -17716 -17681 40835 11722 -18270 -6285 -801 9882 -17375 -15323 17381 -12131 -3260 25175
161 25175 -8731 -13012 4092 10610 342 -31866 4191 32630 -15233 -10405 12997 2536 -614
174 -614 -12553 -17 4119 -16173 18258 21350 -16699 4684 23360 10719 -16588 -27586 21260
187 21260 13603 -35711 -5640 20066 5395 -9138 -14179 12570 2068 -24121 5767 3002 -9825
200 -9825 9597 1853 -318 463 -2953 11805 -10167 -11506 23890 5846 -6477 6564 9290 14628
214 14628 -11613 -14287 14733 -7153 -12065 6020 -4379 992 530 708 7052 -19601 -5716 16027
228 16027 -14360 -10514 4042 2743 9704 -7736 -198 11833 -10106 5725 8449 -13583 6246
241 6246 10155 7053 4388 -13793 12882 15298 -20643 -4454 4339 54 2677 -13561 5141 8587
255 8587 -15540 4264 -1500 -15295 5819 -3677 -2500 3083 -6401 13810 502 -13674 13572
268 13572 -849 -7034 7361 -2405 10213 2771 -7428 18212 -1472 -11607 8926 -4723 -528
281 -528 -1338 -8741 14088 -3183 -9822 12285 -8989 -5506 4702 -10566 2144 -3576 -3927 13655
295 13655 -10407 -3162 13043 -9434 1243 1682 -5268 11690 -3982 1689 15058 -9720 4270
308 4270 8950 -8595 3789 -5554 -80 12433 -13057 1425 10377 -10341 3145 -4117 -8894
321 -8894 6389 -9450 304 4849 -12448 9963 3370 -11481 5824 -3640 843 6088 -10810
334 -10810 9410 8008 -6629 10359 -1148 -1626 8346 -8321 3860 2744 -9168 11128 -887
347 -887 -7655 7875 -5518 172 -85 -11797 6653 -2895 -8598 8831 -6642 -1441 6399 -7772
361 -7772 4212 -1010 -5894 10632 -4318 -1258 8853 -4260 6255 2468 -6213 8674 -3075
374 -3075 -1320 9462 -6813 2837 5601 -5230 3445 -6592 -4988 5909 -9948 -1271 3589 -6548
388 -6548 6099 -952 -5538 4517 -6199 322 3473 -7449 5970 3366 -1598 7632 -3519 1348
402 1348 7080 -5581 3234 1040 -3370 8105 -2792 -2666 3927 -4084 3406 -2642 -8680 6321
416 6321 -1203 -4899 1509 -5587 3542 976 -7500 3676 -1102 -593 5308 -5681 1470 3877 -2962
431 -2962 5436 -2800 -3484 7534 -1303 1288 1570 -2865 8660 1517 -2496 4621 -4468 1213 2921
446 2921 -7772 407 -1734 -2605 5211 -6014 -3233 1343 -5019 2984 -4071 -7948 5657 473 2375
461 2375 3768 -5329 6247 5180 -1714 4166 -3785 1285 9289 -1640 1525 -2665 -4035 10573
475 10573 -2185 -9859 -724 -874 7493 -1608 -13062 3855 2099 -1151 234 -11505 1066 7045
489 7045 -3102 1901 -6035 -2347 12847 41 -2534 -613 -1267 13889 1521 -9870 3334 402
503 402 5413 3541 -12452 1599 5506 -206 4060 -9179 -2032 8926 -4106 -186 -4595 -9383
517 -9383 7460 -1301 -6540 -65 -6667 6947 6650 -7650 3429 571 1528 8599 -6622 -608
531 -608 4527 -2358 10022 238 -8497 5112 559 3507 -727 -13490 5650 6686 -5002 836
545 836 -7718 569 9760 -6724 -2320 -2627 -3523 11406 -3690 -9160 2488 -2226 6618 283 -12474
560 -12474 6386 4903 1001 4749 -8903 2560 10461 -2946 1521 -3806 -1191 12944 -3616
573 -3616 -4998 2276 -3804 6411 -2078 -11325 2822 -1987 -656 1645 -10679 3069 5591 -4090
587 -4090 3851 -3124 353 8867 -5800 205 3590 -3664 6435 -540 -1821 7131 -3522 2128
601 2128 4263 -6628 3855 -133 -4635 4397 -5146 -1263 3127 -6516 2371 -231 -4645 5781
615 5781 -2723 -860 4786 -4866 2411 716 -5441 5248 -1591 -2142 4936 -3110 3377 2493 -4491
630 -4491 5913 -56 -2668 5043 -2416 1786 2370 -5146 3766 -262 -4368 2049 -4897 565 2146
645 2146 -7240 930 679 -2560 2432 -5257 -528 5330 -3194 1249 319 -775 6826 -1258 -640 4760
661 4760 -1572 3865 1377 -4194 3550 -675 -654 2274 -5099 1088 1718 -3790 1826 -3648 -2911 3621
677 3621 -3750 -969 -453 -3356 4181 -1669 -3307 3079 -1769 2413 2005 -3768 4712 1747 -1238 3729
693 3729 -1938 2213 3588 -3299 3134 771 -1537 3540 -3711 197 2473 -5128 1038 -680 -3279
708 -3279 2297 -3594 -1097 2010 -4670 1405 -219 -3524 4158 -1968 -587 3995 -3058 3196 2160
723 2160 -2598 4904 -623 -167 4718 -2953 2407 2114 -3509 3965 -1732 -2823 3678 -4050 124 590
739 590 -4938 2906 -2164 -3671 3212 -4303 -116 2173 -5143 3073 396 -2618 4942 -2428 1104
754 1104 4588 -3612 3664 1766 -2345 5191 -2406 -389 4789 -4310 1910 1277 -4539 3766 -2751
769 -2751 -2377 3268 -5085 846 1384 -5843 3272 -1179 -3161 3863 -4328 576 2982 -4707 4202 406
785 406 -2764 6091 -2133 832 4271 -4413 4551 1598 -3758 5115 -2033 -569 3957 -5562 2192
800 2192 1151 -4694 3981 -2853 -2547 4388 -5582 3 1383 -5265 3647 -1790 -2981 4967 -3243
815 -3243 719 3255 -4279 4502 957 -2575 5907 -2269 614 4596 -3964 3319 842 -3725 5135
830 5135 -2726 -1778 3691 -4551 1597 373 -5274 3417 -1779 -3050 3012 -4937 908 1655 -4849 3096
846 3096 -531 -1765 5097 -3162 1183 4108 -3279 3544 589 -2225 4745 -2452 381 4045 -3712
861 -3712 2551 1178 -3028 3844 -2527 -1579 2893 -5110 335 -150 -4441 2161 -2720 -2096 3699 -3464
877 -3464 1348 2056 -3328 3529 -244 -1668 3730 -1827 1939 2810 -2768 4048 936 -1831 3656 -2287
893 -2287 159 2251 -3039 2191 -1153 -3809 2692 -2389 -1509 467 -3612 2244 -399 -4013 2538
908 2538 -1620 -902 2594 -2846 1779 1367 -921 4070 -1545 -529 4460 -1293 1210 524 -2023 4133
924 4133 -792 -1651 2435 -2870 881 1164 -3152 1337 -1784 -1467 2622 -3732 -945 1084 -2703 2241
940 2241 -1259 -2343 2865 -1831 782 1101 -3136 3805 1305 -1344 3333 -984 899 2742 -1830
955 -1830 2428 -630 -2311 4661 -759 -2103 447 -1929 2795 -1389 -5306 2757 -695 -1810 814
970 814 -3457 1177 -420 -2653 3482 -2404 -2340 4447 -627 713 -299 -1664 6049 -170 -2552 3857
986 3857 -560 2312 1388 -3725 2871 -662 -2386 2959 -3811 -988 1976 -3263 1660 -1627 -3817
1001 -3817 3650 -2341 -1107 1484 -3899 3265 1420 -3743 3444 -475 412 2843 -3116 3155 1570
1016 1570 -4193 3998 21 -2496 2266 -1907 3409 1294 -5307 4024 979 -3556 1012 -2943 1063
1031 1063 752 -5522 3740 -417 -4713 3816 -521 -730 1093 -3255 4909 734 -4658 4281 -337
1046 -337 -343 2636 -3475 3135 2101 -3357 4214 -839 -1464 3676 -3167 960 1462 -4141 3100 -1533
1062 -1533 -3006 2699 -4074 -80 2248 -4872 1579 676 -2048 2620 -3300 977 3981 -4749 1821
1077 1821 2732 -2008 2767 -1869 903 4280 -4144 2360 3159 -3196 2152 -187 -595 2055 -4365 1397
1093 1397 1800 -5398 1605 61 -2311 1370 -3326 1078 1858 -4541 2686 668 -2879 3005 -1396
1108 -1396 382 2564 -2647 3245 1368 -2393 4232 -302 -119 3079 -2212 1600 177 -2943 2823
1123 2823 -1896 -2339 2689 -2946 -436 492 -2823 1591 -2208 -1635 3103 -3256 -621 2495 -1860 1392
1139 1392 -641 -348 3751 -2059 695 3533 -1716 2112 1056 -696 2368 -2035 705 2293 -3736
1154 -3736 422 481 -2181 1047 -2313 -254 1387 -3641 1166 496 -2897 1708 -691 -676 1059 -2086
1170 -2086 2017 1181 -2516 3116 439 -474 2427 -617 1800 737 -2012 2755 -386 -2011 2264
1185 2264 -1702 -119 98 -1914 1863 -1161 -1857 2471 -2147 -760 1125 -2255 988 -1042 -1230 2249
1201 2249 -2494 141 2663 -1688 1535 813 -553 2657 -1614 633 2910 -2303 1385 842 -1571
1216 -1571 1744 -1618 -30 1877 -3146 1212 1180 -2856 1213 -1159 -1100 1337 -2854 982 775 -3571
1232 -3571 2188 -782 -1701 2431 -1398 1107 1626 -2015 3179 326 -1623 3170 -1051 319 1690
1247 1690 -2036 2676 29 -2319 3263 -1560 -862 1953 -2830 1101 -504 -2830 2314 -2910 -1898
1262 -1898 2340 -3099 414 766 -2160 2789 -831 -642 3711 -2099 970 2340 -1882 2638 -38
1277 -38 -591 3608 -2660 579 2659 -3130 1504 -58 -2104 1956 -2715 -505 1709 -4039 1049 403
1293 403 -3295 1870 -1589 -699 2441 -2615 1879 1651 -2500 3261 -65 -777 2945 -2099 1292 2128
1309 2128 -2558 2870 103 -1515 2864 -2135 35 1371 -3274 1455 -549 -2965 2200 -2321 -814
1324 -814 1441 -2956 1218 325 -2307 2931 -1171 -569 3060 -2158 1307 1505 -1904 3041 -859 -707
1340 -707 3528 -2036 736 1826 -2154 2145 -751 -1350 2600 -2365 -444 1600 -2823 1052 -528
1355 -528 -2078 1890 -2230 -296 2006 -2601 1253 242 -1605 2682 -1336 -273 2404 -1727 1446
1370 1446 1361 -1983 2579 -139 -511 2301 -1774 967 716 -2002 1510 -822 -1557 1779 -1661 -361
1386 -361 636 -2508 1451 -604 -1537 1458 -1626 -144 1116 -1820 1272 94 -1157 2286 -691 301
1402 301 1707 -1144 1759 552 -1223 2267 -789 -189 1266 -1748 1018 381 -1697 1234 -1344 -951
1418 -951 1109 -2342 136 -45 -2060 1295 -1040 -1215 1292 -1314 562 777 -1499 1945 219 -493
1434 -493 2120 -850 1035 1428 -1392 1863 -12 -897 1935 -1138 248 619 -2105 1209 -497 -2002
1450 -2002 1020 -1556 28 688 -2456 1012 204 -1480 1472 -1016 172 1433 -1675 1607 870 -1135
1466 -1135 2251 -261 58 1639 -1359 1823 987 -1968 1702 -324 -913 1615 -2104 862 713 -2557
1482 -2557 1055 -843 -1686 1119 -1952 308 608 -2517 1561 -134 -1592 1956 -1438 629 1828
1497 1828 -1865 1847 912 -975 2648 -979 164 2216 -2015 1359 331 -1866 1752 -1302 -819
1512 -819 1573 -2786 394 490 -2459 966 -1016 -960 1549 -2314 424 1470 -2468 1574 294 -1026
1528 -1026 2327 -1600 1056 2186 -1962 1813 927 -1336 2059 -1062 375 2068 -2817 1365 440
1543 440 -2125 1585 -1356 -908 1274 -2564 888 498 -2773 1358 -838 -1510 1782 -1926 738 1183
1559 1183 -2048 2221 104 -808 2754 -886 506 1872 -1628 1538 7 -1496 2371 -1477 -841
1574 -841 1688 -2253 784 -181 -1906 1586 -1605 -1116 1843 -2196 70 417 -1752 1607 -966 -590
1590 -590 2220 -1641 397 1618 -1369 2097 -18 -465 2232 -1516 277 1781 -1904 1174 308 -877
1606 -877 1500 -1484 -217 1138 -2099 790 390 -2134 742 -1064 -626 1101 -2149 734 266 -1742
1622 -1742 1374 -299 -476 1629 -772 1212 863 -1047 2081 105 -616 1799 -845 558 844 -1224
1638 -1224 1434 -449 -1104 1492 -1475 -461 519 -1617 712 -606 -1462 1305 -1246 -440 1319 -1228
1654 -1228 615 19 -401 1431 -726 198 1709 -933 995 794 -550 1314 -593 241 1580 -1606
1670 -1606 591 743 -1433 504 -668 -574 535 -2033 105 285 -1987 782 -345 -775 1177 -1243
1686 -1243 526 580 -1325 1785 171 -860 1499 -522 834 1000 -845 1696 -94 -694 1393 -633
1702 -633 -7 553 -1334 667 -615 -1579 1149 -1570 -920 831 -1549 70 -219 -1111 1318 -969 -271
1719 -271 1694 -1147 715 746 -652 1684 -479 324 1793 -1099 623 1181 -1307 1372 -110 -300
1735 -300 1168 -1831 206 740 -2337 703 -307 -1351 889 -1844 103 733 -1812 804 186 -1468
1751 -1468 1619 -775 24 1532 -1429 1439 799 -1577 1971 16 -191 1433 -1255 985 304 -1614
1767 -1614 1624 -742 -1144 1614 -1452 -110 627 -1858 1403 -801 -1573 1535 -1335 -124 1062 -1681
1783 -1681 1143 -145 -1123 2124 -1125 0 2106 -1071 1354 761 -1043 1939 -951 -277 1914 -1890
1799 -1890 543 785 -1743 1201 -830 -761 1449 -2271 130 768 -2303 725 -313 -1089 959 -1291
1815 -1291 498 1704 -1933 1676 585 -973 1689 -587 536 1637 -1686 1294 911 -1583 1840
1830 1840 -411 -378 1472 -1640 583 154 -1969 1006 -1042 -1300 867 -1457 72 296 -1524 1159
1846 1159 -282 -1223 1493 -1160 94 1064 -1138 1202 1 -710 1880 -493 -6 1482 -1243 726
1862 726 321 -855 1465 -1103 -200 1298 -1621 65 159 -1390 532 -928 -745 976 -1491 289
1878 289 555 -1047 1191 -244 -340 1397 -1170 616 1145 -1040 1258 74 -464 1208 -546 482
1894 482 979 -1245 809 245 -966 1157 -1121 -66 477 -1437 705 -184 -1146 959 -1053 -586 850
1911 850 -1237 651 136 -909 1250 -273 -160 1189 -639 860 767 -359 1276 -68 -78 1124 -909
1928 -909 270 424 -1200 881 -612 -939 628 -1481 -175 276 -1671 804 -579 -881 986 -730
1944 -730 317 705 -1096 796 328 -244 1638 -509 362 1209 -851 1329 304 -957 1251 -747
1960 -747 -437 916 -1259 718 131 -1407 957 -845 -679 652 -1610 361 272 -1315 1233 -768
1976 -768 -471 1190 -955 973 889 -1186 1628 -98 -338 1563 -809 671 1121 -1188 988 75 -883
1993 -883 1537 -1039 -9 868 -1964 966 -150 -1433 1160 -894 -494 946 -1798 737 62 -1356
2009 -1356 1494 -741 -245 1538 -1281 779 848 -1200 1675 71 -305 1703 -1062 493 797 -1579
2025 -1579 1139 -28 -981 1365 -1344 -68 902 -2071 979 -239 -1412 1101 -1300 -305 1373 -1609
2041 -1609 956 551 -971 1618 -301 -73 1449 -991 1111 992 -1419 1437 -316 -420 1227 -1426
2057 -1426 596 825 -1898 1130 -235 -1073 1032 -1454 -479 671 -1896 564 93 -1476 1226 -962
2073 -962 -136 946 -1278 762 491 -1107 1538 -543 -310 1309 -944 924 842 -1281 1554 -120
2089 -120 -592 1484 -1242 27 389 -1617 864 -902 -945 1290 -1506 -243 834 -1353 533 -247
2105 -247 -833 1533 -1261 141 1372 -928 911 178 -472 1406 -522 172 1399 -1313 666 514
2121 514 -925 1257 -665 -524 779 -1246 10 265 -1657 771 -448 -967 866 -1176 -96 489
2137 489 -1278 764 -220 -624 1194 -712 72 890 -894 1422 262 -545 1539 -399 -26 886 -1012
2154 -1012 893 -32 -960 1026 -871 -461 516 -1015 283 -170 -894 846 -944 -392 586 -779 80
2171 80 282 -423 1180 -183 -171 1033 -729 669 681 -714 983 -312 -282 1254 -1138 672 319 -1182
2189 -1182 538 -438 -592 423 -1196 5 264 -1579 777 -432 -760 821 -1124 -31 857 -875
2205 -875 1087 59 -1005 1311 -378 127 946 -831 1216 275 -850 1335 -524 -307 1002 -1182
2221 -1182 399 -131 -1139 631 -692 -863 703 -1302 110 312 -1315 681 -228 -628 1209 -678
2237 -678 191 597 -841 1150 39 -440 1539 -881 294 1220 -983 952 110 -706 1188 -933 -388
2254 -388 833 -1394 470 202 -1596 1238 -911 -664 929 -1586 566 470 -1294 1165 -541 -584 1465
2271 1465 -1153 507 947 -1435 1504 246 -418 1668 -755 113 894 -1388 1130 53 -1129 1162
2287 1162 -778 -499 790 -1475 342 162 -1158 1428 -757 -486 960 -1166 461 490 -833 1173
2303 1173 -598 -429 1428 -849 371 1142 -516 1208 -28 -614 1692 -852 -170 812 -1399 537
2319 537 -240 -901 1007 -1331 -409 992 -1351 576 -85 -1218 1095 -820 -206 787 -984 492 542
2336 542 -1046 1286 -235 -352 1411 -573 799 777 -1060 1162 10 -802 976 -900 134 380
2352 380 -1295 916 -195 -1114 1132 -745 -312 401 -1167 338 42 -645 1038 -576 -206 827 -630
2369 -630 995 153 -531 1357 -197 -102 1066 -715 512 35 -956 861 -479 -674 741 -1148 -33
2386 -33 380 -837 595 -228 -735 836 -1117 124 428 -1101 797 -142 -358 630 -404 281 905 -690
2404 -690 804 255 -390 861 -475 52 664 -848 668 120 -808 742 -266 -394 547 -822 362
2421 362 80 -899 120 -934 -403 607 -882 147 223 -844 863 -223 -213 950 -325 430 608
2438 608 -681 1233 172 -296 1222 -754 225 496 -800 651 -289 -421 433 -1091 -265 182 -1204
2455 -1204 390 -207 -1113 683 -550 -98 853 -795 962 177 -477 793 -140 83 857 -849 883
2472 883 531 -846 992 -450 -144 882 -927 515 400 -1134 869 -482 -1008 376 -1096 126
2488 126 449 -1085 763 -24 -698 1077 -1036 90 792 -1076 681 376 -645 1167 -374 105 1283
2505 1283 -787 510 385 -655 1080 -512 -204 850 -866 452 233 -1341 725 -871 -809 830
2521 830 -1200 52 345 -1178 734 -309 -504 1313 -885 467 1032 -973 720 63 -600 1416
2537 1416 -486 -367 782 -955 586 277 -879 1098 -642 -573 918 -1184 12 207 -1078 729
2553 729 -584 -718 861 -867 95 517 -1181 808 -77 -252 1281 -758 340 896 -975 754 178
2570 178 -465 1216 -426 -105 917 -1323 524 165 -769 980 -682 -300 483 -588 157 160 -1073 645
2588 645 -321 -490 713 -654 336 278 -722 898 -94 -124 1076 -217 195 705 -363 927 176 -725
2606 -725 897 -469 -283 329 -1178 163 -216 -1024 644 -554 -572 626 -669 40 223 -581 953
2623 953 -178 -95 801 -415 341 511 -223 933 -181 -284 1100 -552 406 482 -693 805 -97 -233
2641 -233 892 -708 150 83 -743 419 -93 -590 349 -787 -18 301 -919 424 -198 -439 611 -348
2659 -348 28 444 -584 703 170 -365 955 -218 -13 695 -428 703 261 -477 828 -350 -390 541
2677 541 -741 21 -145 -945 579 -661 -416 621 -795 285 436 -569 647 -220 -240 890 -449
2694 -449 377 422 -630 618 67 -400 958 -477 -259 557 -791 253 -25 -614 768 -579 -312 385
2712 385 -1173 499 -7 -1088 657 -556 -440 764 -742 197 271 -874 966 -134 -231 1171 -534
2729 -534 560 452 -444 1010 52 -450 593 -744 55 159 -877 523 -257 -1035 451 -514 -128 162
2747 162 -924 276 -154 -549 722 -542 -274 978 -666 742 604 -645 933 -532 -126 1275
2763 1275 -369 455 782 -741 582 -167 -343 891 -816 8 522 -1276 352 -255 -573 795 -849
2780 -849 -101 589 -1020 490 8 -722 887 -545 79 713 -873 764 256 -774 1035 96 -175
2797 -175 979 -927 515 350 -1048 620 -183 -574 759 -886 -47 294 -921 738 -622 -747 427
2814 427 -697 -292 535 -327 709 67 -505 1079 -265 67 804 -663 431 235 -776 830 -366
2831 -366 -141 843 -551 300 244 -900 620 -139 -477 723 -761 87 229 -1017 359 -152 -462 456
2849 456 -536 51 712 -546 812 232 -229 917 -123 168 605 -727 571 212 -444 870 -206
2866 -206 -169 137 -663 33 -66 -860 243 -485 -451 524 -915 228 53 -779 335 -215 -430 639 -526
2885 -526 232 445 -495 556 -80 -26 510 -335 -107 461 -676 366 -109 -685 699 -192 -242 248 -632
2904 -632 223 63 -322 501 -348 -189 297 -900 204 146 -312 628 -255 -152 705 -483 520 400 -539
2923 -539 750 -43 230 530 -377 255 343 -640 260 32 -389 378 -761 -23 233 -773 205 -45 -516
2942 -516 403 -726 -79 458 -667 859 -92 -165 583 -57 358 462 -320 550 -72 -511 458 -317 -65
2961 -65 511 -553 177 31 -636 806 -576 -139 461 -866 268 99 -630 474 -238 -444 573 -822
2979 -822 362 398 -654 735 119 -390 829 -341 437 643 -575 691 180 -227 587 -361 -60 883
2997 883 -719 311 60 -663 588 -577 -315 404 -836 353 93 -611 609 -209 -190 1127 -405
3014 -405 245 323 -633 1106 -133 -18 1131 -417 435 765 -853 598 -163 -570 769 -815 -142 568
3032 568 -772 627 19 -656 493 -770 -284 457 -835 442 294 -429 674 -109 -110 617 -703 377
3050 377 323 -646 745 28 -171 966 -518 321 548 -585 258 -124 -415 669 -699 -232 210 -869
3068 -869 263 -106 -615 636 -258 -251 709 -604 541 417 -304 704 -44 45 577 -576 448 104 -626
3087 -626 564 -235 -578 759 -581 115 162 -649 534 24 -307 299 -365 -199 232 -718 557 -130 -479
3106 -479 678 -263 34 513 -559 491 183 -515 717 0 29 587 -200 483 164 -284 667 -232 -369
3125 -369 520 -578 225 310 -586 322 -396 -297 159 -604 -124 123 -782 566 -334 -302 627 -225 192 701
3145 701 -331 770 120 -355 717 32 165 153 -558 549 115 -532 393 -174 -85 140 -686 -28 -161
3164 -161 -776 321 -284 -105 403 -862 241 87 -628 569 -158 107 691 -164 412 547 -505 574
3182 574 113 -84 629 -316 247 106 -650 414 -121 -289 387 -759 -196 153 -807 404 -55 -617 394
3201 394 -477 -292 132 -552 220 -32 -232 902 -62 163 774 -362 508 538 -377 718 -249 -185 370 -546
3221 -546 256 278 -683 379 -435 -453 571 -838 56 72 -816 527 -195 -328 601 -491 97 200 -491
3240 -491 618 183 -444 524 -605 238 638 -685 716 79 -372 695 -118 -89 504 -575 -85 190
3258 190 -622 295 -487 -423 262 -870 -87 108 -1004 415 -302 -352 795 -492 59 575 -422 432 6
3277 6 -189 807 -400 130 618 -763 326 115 -452 603 -571 -211 382 -673 108 70 -736 452 -412
3296 -412 -391 418 -553 2 153 -462 647 -113 -134 534 -605 -30 363 -687 726 71 -368 881 -535
3315 -535 8 440 -532 228 -47 -471 333 -355 -223 441 -891 118 -42 -606 438 -232 -305 425 -621
3334 -621 148 249 -578 622 18 -254 616 -248 -154 359 -370 568 -222 -499 753 -503 114 165 -742 311
3354 311 -251 -788 515 -464 -129 217 -697 487 -43 -568 139 -155 -198 119 -388 474 421 -405 616 -97
3374 -97 72 470 -327 -12 214 -256 477 -116 -40 436 -468 52 263 -353 171 -362 -416 72 -360 159 78
3395 78 -512 278 -30 -193 707 -555 128 549 -466 456 150 -219 468 -241 -177 473 -615 176 311 -364
3415 -364 241 -288 -240 349 -639 230 180 -550 219 -441 -533 302 -420 98 76 -283 237 85 139 596 -197 407
3437 407 374 -485 757 89 -237 478 -258 188 78 -582 90 -193 -266 450 -336 -188 466 -336 385 -39
3457 -39 -458 276 -389 -84 380 -451 387 -10 -378 643 -104 -74 959 -517 82 170 -270 640 -294 -303 568
3478 568 -430 26 314 -535 329 -232 -485 529 -298 -268 496 -713 127 12 -553 558 -224 -278 302 -500
3498 -500 471 178 -488 712 -494 -112 612 -589 178 19 -435 475 -319 -193 279 -301 315 74 -827
3517 -827 331 63 -307 409 -326 -285 105 -806 117 0 -501 592 -125 160 758 -602 320 49 -173
3536 -173 679 -86 -17 417 -604 420 78 -610 468 -73 71 423 -506 171 346 -902 375 -378 -525
3555 -525 261 -328 -35 353 -575 271 16 -628 732 -342 68 570 -374 610 112 -243 504 -266 87
3574 87 549 -245 226 100 -579 386 -301 -344 434 -581 289 195 -485 271 -125 -301 340 -378 403 167 -94
3595 -94 792 -76 -45 696 -527 147 457 -368 878 39 -268 255 -43 147 148 -498 232 51 -355 71 -43
3616 -43 -444 354 -490 -112 -38 -397 506 35 -285 207 -237 288 -24 -177 485 -117 -38 273 -117 431 246
3637 246 -219 416 -118 -274 338 -533 -45 350 -379 98 -142 -76 291 -175 -169 41 -484 300 -84 -603 549
3658 549 -358 97 560 -263 86 156 -57 352 182 138 460 -465 185 84 -294 341 -191 134 198 -95 48
3679 48 0 -583 323 -423 -159 242 -380 -227 410 -339 213 -264 -236 380 -345 -229 220 -537 300 185 -183
3700 -183 525 -254 -86 230 -168 177 58 -353 210 -435 -136 245 -234 169 -14 -589 287 -101 -212 139
3720 139 -327 351 295 -265 370 0 -140 342 106 314 275 -330 399 25 -6 116 -329 20 285 -745 309
3741 309 48 -413 580 -182 -56 128 -441 65 375 -655 488 -450 -218 3 -582 29 -190 -285 291 -118
3761 -118 -168 602 -109 122 28 -114 183 -133 -386 606 -452 23 279 -457 315 -95 -373 580 -203 76
3781 76 256 -484 111 8 -161 407 -421 -82 352 -561 365 88 -119 530 -280 -50 94 -329 217 78
3801 78 -360 220 -318 -241 415 -378 239 328 -334 166 -52 -277 151 -332 -107 256 -267 272 -98 -473 681
3822 681 166 -73 339 -215 399 75 -107 590 -176 46 230 9 -49 19 -194 353 -338 -145 205 -345 194
3843 194 24 -401 268 -154 -138 367 -290 102 352 -319 182 -62 -107 336 -82 21 356 -222 402 -9 -185
3864 -185 221 -114 -268 367 -209 327 184 -119 106 -269 -75 -10 -519 -27 266 -297 297 -300 29 396
3884 396 -571 141 289 -299 188 -413 -173 104 -283 -136 166 -33 200 -265 -18 549 -316 -93 -32 -306
3904 -306 413 -41 -205 107 -391 -224 -184 -256 -56 -294 -376 345 -180 -10 226 -94 250 134 -1 616 263
3925 263 -236 325 -270 494 107 -244 164 110 -496 224 -115 -38 146 -337 145 -550 39 -114 -640 139 214
3946 214 -272 335 59 -153 421 -97 -5 11 -333 387 213 -118 300 -258 105 210 -434 144 179 -247 285
3967 285 -286 -222 227 -413 4 -23 -561 448 -596 -419 336 -227 79 81 -263 438 102 75 552 -282 117
3988 117 361 -268 269 298 -342 195 -135 -96 173 -481 257 208 -518 345 -269 -148 42 -388 145 75 -402
4009 -402 323 -293 -216 404 -453 15 13 -535 248 -258 -178 458 -334 -150 51 -97 484 -20 -38 511 -286 18
4031 18 181 -285 65 -60 -489 -66 -242 14 274 -154 -37 -145 -295 387 -190 81 382 -111 248 422
4051 422 -243 400 105 -119 291 -204 64 387 -261 122 -157 -276 463 -361 40 -18 -119 24 80 -108 283
4072 283 13 -180 235 -326 73 35 -225 208 -83 -152 270 -311 276 -56 -206 471 65 -26 621 -320 -38
4093 -38 226 -80 97 -55 -77 -78 -365 42 -5 -169 24 -71 -439 97 -125 -3 276 -317 287 93 -350 118
4115 118 -181 -42 139 -289 153 165 -217 324 -167 41 403 -295 211 159 -395 265 -429 -183 -71 -131 -210
4136 -210 -2 -392 113 -107 -366 334 -376 168 98 -276 6 221 5 369 116 193 402 -302 345 28 54
4157 54 428 -160 82 492 -189 -80 -244 -377 30 -233 110 197 -356 393 -238 -279 145 -238 128 227 -147
4178 -147 183 378 -130 276 195 -19 325 -129 6 200 -278 105 -39 -233 94 -92 37 267 -83 -133 -93
4199 -93 -265 213 -209 76 163 -285 193 -5 -204 182 -69 -174 20 -104 260 -37 -71 434 141 68 479
4220 479 -20 72 -186 54 331 -147 -168 155 -129 14 304 -301 66 -131 -311 140 -347 133 120 -163 126
4241 126 66 -442 192 17 92 417 -186 251 302 -98 368 66 -259 345 46 -36 -156 -400 206 -320 -151
4262 -151 319 -225 105 217 -631 114 -114 -160 589 -191 105 -48 -95 250 344 -41 403 -58 2 98 -80 307
4284 307 -92 -317 422 -330 -154 265 -197 306 -196 -449 307 -223 -222 213 -171 -152 42 -23 140 29 129
4305 129 532 -395 -44 254 -325 370 6 -528 395 111 199 416 -396 61 -112 -546 317 23 -244 -171 -269
4326 -269 191 22 -320 8 -192 -277 341 -219 -64 55 -134 302 -29 72 363 -196 145 213 -230 310 51
4347 51 -238 209 -45 163 13 15 145 -37 -115 251 -123 36 68 -309 -78 75 -325 106 -98 -211 121 -282
4369 -282 194 -33 -211 284 -38 -102 213 -125 26 47 -48 550 52 133 370 4 85 -16 -342 218 -169 -319
4391 -319 205 -141 -169 -6 -351 135 13 -268 132 -263 -34 269 -267 385 70 -82 154 -175 110 73 -52
4412 -52 315 110 -122 354 -99 -37 186 -401 -94 -36 -304 393 42 -170 -32 -70 134 238 -46 479 -342
4433 -342 -157 343 -167 93 316 -218 456 100 -144 371 10 192 141 -98 145 -26 -195 229 55 -172
4453 -172 97 -421 175 111 -318 119 -219 -88 116 -126 -11 242 -206 363 64 233 204 -372 151 320 -187
4474 -187 322 -108 84 370 -330 30 335 -497 554 38 -218 196 -357 90 12 -424 204 32 -202 97
4494 97 -257 -16 260 -382 59 -146 -210 -11 -27 11 242 -190 212 415 -136 303 -145 -19 53 -322 170 92
4516 92 -141 144 -139 -159 115 -187 158 60 -185 348 15 -246 317 -182 -143 175 -163 245 -131 -266 402
4537 402 -412 -116 453 -306 243 -53 -329 208 -124 12 148 -332 13 -73 -136 139 -171 -48 116 -40 -149
4558 -149 261 -402 61 -28 -169 488 -267 297 233 -337 246 -7 -88 339 -102 176 215 -134 308 91 -249
4579 -249 342 -312 90 121 -255 87 79 -104 140 69 -14 -15 -221 -5 5 -371 142 -63 -96 58 -156 14 107
4602 107 -122 201 90 -48 178 -215 -61 339 -93 169 70 -23 -132 -160 -57 34 -259 10 -80 -25 324 -53
4624 -53 -114 -37 -138 356 177 44 139 -1 120 18 64 69 10 26 130 -118 -197 431 -432 265 49 -331 248
4647 248 -177 -282 37 -120 -72 105 -142 158 25 -223 186 -138 -9 76 -75 342 88 132 95 21 42 234
4669 234 79 323 62 -324 25 -95 -59 98 -8 180 106 23 247 -35 -54 178 -133 122 34 -433 445 -172
4691 -172 -204 -15 -64 -89 141 -173 304 285 -269 362 131 52 112 143 305 -152 -310 294 168 95 148 -146 -96
4714 -96 -31 -85 201 -367 -266 258 -146 136 13 -195 252 -36 122 201 57 46 193 -434 301 -74 -249 395
4736 395 -232 -184 301 -209 340 98 -353 295 -186 53 -146 -355 107 -92 -174 114 -72 211 243 -179 -15
4757 -15 209 -261 124 6 184 389 -89 -45 175 30 300 -63 34 193 -127 419 27 -325 113 -68 -217
4778 -217 104 -238 -26 237 -400 155 65 -262 224 -103 128 427 -127 62 129 -332 244 51 -305 173 186
4799 186 156 -9 46 291 -385 -41 193 -86 117 198 -364 3 -185 -67 116 -336 -218 14 -91 36 141
4820 141 31 212 -8 -170 210 -122 160 75 -91 161 -255 -135 333 -142 -122 5 48 214 -70 -233 137
4841 137 -364 -244 -29 -135 197 -233 -79 -114 -245 -326 206 -198 36 -100 -14 338 -249 210 354 -320 115
4862 115 317 119 170 -94 185 50 40 225 -22 -31 182 -179 46 164 -264 -49 -173 -184 128 -96 -212 -109
4884 -109 -89 34 286 166 387 -134 -37 -31 16 -51 376 -374 171 93 24 51 -103 -63 194 10 35 339 -206 319
4908 319 -425 154 -3 -165 -89 -35 -120 128 48 -146 169 -457 -71 -83 75 109 -181 -11 362 -7 188 164
4930 164 -122 11 -333 -6 87 124 61 118 -137 52 68 -549 -34 -38 158 134 -269 85 -150 -2 188 -133 99
4953 99 -40 -171 115 -24 4 17 137 79 227 -296 -11 236 -242 34 -78 118 208 -253 -43 -146 -294 131
4975 131 67 -279 -13 -123 -40 313 -207 143 262 -266 287 -250 66 136 -298 47 154 -220 369 -182 -149
4996 -149 142 -174 94 -125 -65 139 -26 -334 -34 0 482 296 -82 -2 -47 -264 412 -156 -49 298 -52
5017 -52 106 5 51 296 -153 139 44 -142 315 219 -257 379 24 427 106 -353 260 -32 -441 72 19 24
5039 24 248 -51 -230 -12 -153 238 -316 -60 -50 53 110 10 42 368 229 -100 372 -134 -186 52 -127 98
5061 98 124 -246 192 -267 -103 -55 19 52 129 -274 104 -108 -39 -188 -256 196 -57 -56 316 -42 -90 73 -16 75
5085 75 114 -177 97 243 144 304 -74 -20 24 -191 7 -128 19 199 -228 14 -21 -88 70 107 200 197 109 54
5109 54 174 -84 61 75 -49 52 -148 328 -166 -61 -124 -8 93 302 44 -113 172 -222 -117 59 -258
5130 -258 282 259 -36 5 -154 -48 65 45 135 121 40 -18 -60 -86 204 -52 198 4 -79 149 169 120 174 -88
5154 -88 189 -70 -261 -28 -355 100 -186 77 -72 -103 -142 -118 -55 304 129 -99 -48 -27 -39 101 -168 -220 236
5177 236 -35 -2 -16 1 11 -61 163 20 -39 61 -171 -126 27 -39 -34 166 -21 163 444 -44 138 -106 -49 172
5201 172 -181 -283 81 -121 -28 -15 -185 328 -164 -241 315 123 -58 228 -91 36 30 36 145 -341 245 -43
5223 -43 -247 158 81 199 -12 -126 -291 -74 169 68 -33 -251 -34 -213 51 248 -131 -27 105 -157 3
5244 3 -307 145 132 -33 -95 111 132 220 -66 49 137 -232 -7 -72 -248 120 131 -286 185 -158 145 -74 -50
5267 -50 8 -233 -7 200 -213 -165 401 56 71 53 78 422 43 83 -137 -31 253 -86 207 20 112 -86 86
5290 86 27 -67 153 -327 168 -152 -132 216 63 -12 72 -236 -39 -115 9 194 -136 -53 33 -95 268 59 -146
5313 -146 253 -7 -141 432 -61 -4 2 -391 132 -79 -10 -34 128 -69 71 28 41 -110 17 42 5 113 -21
5336 -21 -52 93 -306 -351 213 -155 91 87 -128 49 21 -49 45 102 233 -48 -227 53 -53 -159 27 134 15
5359 15 88 -353 100 64 -13 96 -176 -11 10 -268 116 94 -123 30 7 -93 384 -147 31 144 163 -10 -69
5382 -69 -228 22 94 -67 -299 -112 -35 -199 -279 -150 39 105 130 41 61 -84 -217 87 183 156 152 -111 -18 170
5406 170 -54 88 -50 39 -33 -285 36 4 -123 59 -52 -134 49 115 62 -237 -299 -95 174 -23 97 -133
5428 -133 -17 -108 -58 227 -82 -50 144 181 -148 -33 226 194 0 -104 295 -178 125 92 11 -58 119 246 -18
5451 -18 -102 -21 -152 148 -82 -76 -238 149 -16 36 388 -108 81 96 -33 164 -162 133 -75 -252 -66 193
5473 193 -24 206 -36 -55 -85 -237 91 71 -429 201 -162 133 340 -233 156 307 -331 -45 -57 -126 332 -198
5495 -198 -192 53 91 280 -55 -17 216 92 -183 116 -6 65 148 -254 311 57 -17 82 -238 19 134 -158 -113
5518 -113 -155 -321 65 -167 301 -116 -131 95 -290 -48 -104 35 -66 150 -218 -160 268 -96 79 10 152 63
5540 63 65 176 -39 -144 77 -115 110 -82 -100 -34 11 -77 -120 -72 -249 -96 -49 -133 40 5 82 136 -122 -363 -266
5565 -266 -55 -9 -57 68 -58 34 34 -42 79 60 223 81 -18 112 176 67 -20 11 -277 -61 44 -68 142 -199
5589 -199 -421 186 -294 195 -34 125 139 -20 16 62 -221 -8 133 -92 56 -81 -5 -129 17 14 155 144
5611 144 -124 -180 -238 -96 -144 179 -60 12 -143 87 -36 83 80 -231 191 -77 177 -41 44 -2 195 -13 143
5634 143 -57 237 27 -150 95 -50 27 -10 -63 -16 252 20 167 -17 77 132 24 -279 145 85 61 -182 38
5657 38 189 82 77 -132 -8 11 48 -89 154 -4 36 -143 -14 -15 -16 -157 73 -129 12 28 98 158 -46 -8 222
5682 222 44 137 -157 -205 -91 72 160 412 -32 93 -159 122 173 -202 -70 65 -179 -209 13 -231 154 31
5704 31 -247 -79 -130 295 47 -25 -36 80 -249 198 154 -186 10 -14 188 -92 -188 -211 94 -360 121 -3 20
5727 20 244 79 32 51 -191 112 0 0 123 106 82 -188 -153 -120 111 -186 247 -117 161 -159 109 -8 -39
5750 -39 171 -74 -262 184 -22 -37 175 140 -203 -103 26 46 -54 -238 66 102 12 19 180 33 287 -49 220
5773 220 83 -61 28 -151 -171 194 -243 -173 -44 -189 78 -153 26 -40 -36 -26 192 -133 -43 -53 -84 138 240
5796 240 206 80 44 -157 122 190 -140 41 236 50 -305 -27 237 -64 309 -122 -299 -30 -161 27 95
5817 95 -85 -49 31 -44 -46 68 229 83 125 -16 -53 10 74 -155 113 127 -105 209 92 -49 -24 -6 156 -57
5841 -57 -45 37 107 -39 -70 -136 -17 89 62 -10 -187 -84 4 -16 -65 -10 -125 157 -24 80 -60 78 128 -158
5865 -158 -19 -171 71 25 -126 -55 -67 18 138 -360 76 49 -92 24 6 -50 170 -33 169 -18 99 -10
5887 -10 -75 -73 -195 -92 87 -58 304 186 -23 52 -285 9 77 25 32 211 -94 69 188 181 -17 36 4 63 17
5912 17 216 -131 -161 14 -8 123 47 -118 -67 -14 -26 -243 -188 -77 -100 107 7 216 298 261 -147 -79 108 -208
5936 -208 420 136 129 61 -9 -32 -56 93 -55 95 -89 -63 -5 185 31 -103 -126 -20 -272 35 -117 -47 451
5959 451 97 -87 161 -153 -302 -117 -56 -33 -47 147 86 -117 -97 437 -136 113 -191 97 99 -108 116 70 102
5982 102 133 202 -72 -63 -59 45 -70 15 -167 210 -85 -69 -89 67 51 96 227 -54 -85 -239 -118 122 18 -215
6006 -215 -211 -169 151 205 -59 122 41 -354 -61 36 -264 82 -211 -84 166 -18 -94 -36 -202 -51 -82 -203 219
6029 219 3 -142 -227 -39 -224 -104 -26 -19 173 -32 -94 -375 4 215 -67 -140 -148 -59 217 -8 -124 81 85 130
6053 130 124 58 57 -33 98 36 -9 105 -87 -72 34 141 121 57 -135 69 1 16 20 -277 21 2 -115 -300 66
6078 66 -27 63 115 90 -120 65 -9 -199 107 78 -75 97 139 -21 79 -21 28 58 -81 -115 76 117 -38 129
6102 129 -179 235 11 159 205 -108 -194 170 34 -197 -96 102 8 25 -35 132 -87 254 44 -122 237 201
6124 201 173 -105 -150 90 196 -68 80 157 -135 -203 -76 -55 75 225 32 -17 39 -75 -192 132 -130 -294
6146 -294 -17 3 -16 155 -298 234 123 -111 -24 167 -89 106 -56 -25 198 35 258 -51 177 18 -245
6167 -245 -79 -171 270 84 -126 18 52 32 105 -3 -145 -66 -64 264 40 -97 8 102 -98 172 125 122 -150 -200
6191 -200 11 108 232 -51 -315 87 32 -3 54 213 -32 -18 40 191 194 156 263 52 -117 -25 -28 -112 43 -51 -13
6216 -13 191 -59 -31 30 -50 6 -225 -110 364 -44 19 141 117 -104 -171 -181 237 -222 281 241 -77 130 272
6239 272 -186 -89 59 -136 309 -27 -117 -115 -96 193 51 33 129 53 -126 48 -17 -174 70 -43 305 -175 88
6262 88 29 -61 -132 158 119 -172 -22 -62 -71 -100 -61 122 -117 102 -189 41 20 -152 -129 196 131 -238 207 -248
6286 -248 91 66 37 -160 31 -50 -61 -28 114 58 -56 35 -113 -330 214 164 -186 -225 -65 -144 -199 3 233 -132
6310 -132 -44 -125 -10 229 84 16 225 -39 -166 -90 -324 -215 -43 -70 144 -95 281 17 276 58 105 169
6332 169 143 -43 121 471 173 43 -127 -76 47 -235 138 95 -6 -40 80 146 257 -18 54 71 -157 58
6354 58 -204 315 112 -215 14 -84 -13 -11 144 122 65 -124 -213 -76 88 -43 36 14 54 224 -144 -119 85 164
6378 164 -13 55 110 227 60 312 -316 148 167 -252 153 112 -113 -156 -177 -95 -80 -191 58 -105 -180 -91 56
6401 56 188 -37 167 343 -113 -335 131 -157 -188 -138 127 24 224 1 -96 183 16 21 127 -137 16 24 93
6424 93 -150 -72 170 -64 7 28 -88 -47 -5 237 90 -197 1 -53 -36 288 88 -287 321 -195 2 162 1
6447 1 -148 -89 139 136 -113 -141 -105 153 -63 12 -199 154 229 -16 186 200 -19 -197 33 -67 34 366 161
6470 161 152 -93 -15 -95 -114 -208 -12 -201 132 163 112 132 -28 167 -55 78 87 -63 53 -53 47 -7 -188 -60
6494 -60 -188 198 89 9 -161 -266 -239 -121 -77 -138 55 -76 79 303 197 39 123 -88 -14 -133 -218 240 -335
6517 -335 -135 45 -38 190 -193 47 -17 -141 163 -135 -17 180 -100 63 -172 96 53 197 -28 231 -135
6538 -135 -25 -250 -65 206 15 -92 74 196 343 -2 -158 -42 46 -52 633 480 219 100 -703 190 79
6559 79 -145 -246 106 23 145 137 -201 111 -296 104 -67 -104 31 -25 63 -176 -133 79 8 -132 -250 79 -159
6582 -159 217 336 105 55 -70 -21 -2 -119 47 -61 18 -346 -289 294 -319 -71 203 171 79 -53 -18 37 79
6605 79 -242 -138 4 194 -24 -205 -32 -171 124 9 -167 21 64 9 219 -58 -155 10 26 96 7 5 77
6628 77 12 -181 51 56 -261 -109 -181 -325 118 -88 -69 -321 17 159 85 -153 280 72 321 200 -62 97
6650 97 68 -17 97 97 -96 91 -32 -211 15 -66 -82 -19 -108 106 -150 35 -128 189 278 -166 45 344 163
6673 163 152 100 -166 -5 -98 159 -364 -280 210 -62 44 69 -175 -5 -24 228 13 -275 89 65 118 162 -38
6696 -38 -54 -219 47 108 7 -51 -25 -96 77 105 167 -151 34 -28 167 -179 47 23 -51 -164 310 -27 -79 14
6720 14 30 -154 -84 83 27 -187 -253 -17 23 213 -21 114 155 -54 -128 14 66 -22 -72 -53 169 -135 -187 -224 -29
6745 -29 215 7 172 118 -169 162 204 5 -152 -14 -131 258 -36 -392 -217 -6 83 193 119 199 61 102
6767 102 81 30 -34 -58 48 -73 39 226 182 429 -26 161 4 -90 -152 172 -17 -93 52 -53 88 77 -39
6790 -39 -131 -46 -13 9 39 -221 147 79 -38 85 15 -127 164 -48 -112 53 -82 63 -119 -133 150 150 -5 12
6814 12 34 163 -5 0 -196 -185 -66 115 -36 -143 -92 -69 11 -102 27 164 261 -93 9 49 13 -56 -103 124
6838 124 71 87 159 55 148 -74 0 8 -59 -95 -296 23 -180 -23 51 188 -88 -96 316 -215 20 -57 82 36 -192
6863 -192 55 79 -7 151 197 -147 -9 -196 -38 168 -233 -62 -12 4 134 -58 -68 135 38 -111 -8 -309
6885 -309 75 5 -123 -22 234 -101 -13 -53 239 -12 -289 25 -96 57 -19 -154 20 33 263 -115 -166 -155
6907 -155 -50 -122 -195 82 -113 -180 41 47 -129 67 -162 -57 -32 38 -258 -106 37 -39 210 -124 -253 -207 185
6930 185 186 -68 208 79 65 -148 123 -219 -74 240 -4 -52 142 -99 -80 57 -166 157 -18 -98 86 69
6952 69 -75 -75 27 89 19 32 87 -6 146 185 -40 -168 -209 142 113 -265 -20 284 31 -187 -119 -47 -74 134 230
6977 230 -194 3 138 144 148 -373 -128 15 78 45 174 36 -64 110 140 -229 24 -38 -10 64 176 -31 -91 68
7001 68 -97 87 -11 77 -121 17 49 37 152 87 -42 -64 -75 -208 -82 -86 103 9 49 95 42 289 -34 -44 -6
7026 -6 17 221 12 126 180 -122 39 38 40 34 292 77 122 207 -193 44 184 -165 -6 116 8 92 -29 -25 -97
7051 -97 87 -54 228 -162 301 158 -183 22 -14 235 285 132 102 -67 -5 320 -141 74 -319 -52 -153 186
7073 186 -66 17 -92 -83 -92 -160 152 -258 277 207 49 71 110 -27 -38 261 13 137 278 -188 151 -337 245
7096 245 -103 -20 -127 43 159 11 -102 130 144 47 -184 313 -330 248 -5 -86 -197 -244 93 -72 121 -196
7118 -196 10 53 -148 50 -57 74 138 0 -197 93 215 237 18 103 -167 125 -280 -23 194 -12 6 129
7140 129 -128 24 12 229 -179 -59 -96 5 -322 -169 5 -203 96 227 -240 75 125 41 -185 16 236
7161 236 -242 88 134 92 155 96 -414 225 -219 64 -16 -143 142 132 -79 217 -29 -46 114 -208 105 17 175
7184 175 -80 111 -117 -79 -227 39 -12 -59 -177 -2 173 -51 154 210 112 -50 -220 -137 23 34 -125 7
7206 7 -119 118 122 13 104 23 94 56 -85 -89 70 343 -103 50 -335 25 63 121 -15 -99 35 -147 -226 -60 -162
7231 -162 -353 -123 -117 124 -48 258 141 14 80 10 108 -128 -30 -150 -233 47 119 41 59 -206 -98 149 -76
7254 -76 -60 -190 -33 -83 24 -15 126 -215 95 110 -18 266 -64 58 37 -310 -122 200 -133 128 -107 -6
7276 -6 -41 -19 -106 82 -25 149 32 -17 114 162 167 6 -43 66 -62 38 9 -169 59 66 193 117 49 67 -90
7301 -90 -114 85 279 -56 -81 -4 -69 90 299 -123 -72 -147 254 -103 -65 79 318 61 -34 -153 243 172 1
7324 1 -29 266 72 40 68 -43 152 -12 131 10 -119 -53 -59 89 -66 -201 8 -20 110 17 107 -125 11 -6
7348 -6 27 -43 -45 -43 92 35 96 -42 2 -151 -6 82 40 -118 -242 -240 41 61 -175 26 -55 187 -88 63 53 -97
7374 -97 154 122 -107 -194 10 -60 -177 89 -239 -177 -90 47 -5 105 -116 -93 -84 1 -30 -13 171 -6 -88 -24 -139
7399 -139 8 -286 52 190 58 144 147 -63 -54 -5 -101 40 48 52 163 15 240 -171 -63 346 -186 201 49 -32
7423 -32 -26 121 -253 -114 -246 -235 -31 -49 -139 75 107 148 -18 234 53 108 17 95 -53 -161 158 -167 106 59
7447 59 226 -93 -148 37 -74 125 17 44 -108 120 -52 141 -5 199 114 24 29 78 103 200 135 -83 -69 -17
7471 -17 -28 -252 -78 -82 -212 38 -53 -47 14 20 192 138 122 138 89 -209 -75 117 93 193 -21 -188 -256 -124 193
7496 193 -106 211 30 250 84 -163 -72 167 173 -140 -193 -4 177 -194 242 15 52 -326 11 34 15 -183
7518 -183 169 200 15 127 -105 -60 -16 122 -82 6 156 119 -66 79 5 16 89 36 156 55 44 -99 -23 105
7542 105 55 -154 -53 -267 75 142 25 196 -98 87 -155 -164 -236 153 -173 -27 166 -356 75 167 -147 -76
7564 -76 -102 -116 -47 176 -227 34 124 107 180 -89 -11 23 -64 20 -26 -378 76 154 275 -56 -76 85 -34 292 247
7589 247 -131 7 119 113 313 169 -66 -23 -54 210 26 17 -94 -53 108 -221 107 22 -54 120 113 -71 53 180
7613 180 249 9 97 38 242 -23 52 255 -195 -70 -110 51 -19 -72 83 -94 -12 -28 -233 59 96 170 -112 121
7637 121 83 -21 -10 95 -199 221 112 50 77 -38 114 -76 -61 -99 78 -31 20 -133 -118 -4 42 -82 -106
7660 -106 100 -153 -122 36 -50 -45 78 164 204 78 -79 -128 -99 -89 -194 -279 195 -90 85 -1 133 -157 -221 -223 -85
7685 -85 158 -16 65 -31 -117 -159 152 48 64 -64 62 83 -207 -57 147 32 -123 134 113 -288 21 -108 -32
7708 -32 1 -131 -97 -59 211 46 -87 31 321 48 -193 14 30 -31 -63 -235 -70 88 -11 -169 125 135 -68
7731 -68 -168 -40 261 90 245 -137 -2 110 -360 239 -146 -64 101 -121 -128 35 199 -125 -215 -140 -115 33
7753 33 -46 193 114 27 -214 244 -91 85 21 -9 -81 -7 0 202 46 -195 -5 -103 -48 75 -32 -42 -12 -12 -137
7778 -137 327 -78 53 -116 -251 180 -24 -28 -38 -186 186 127 -4 35 -83 201 -36 -20 -171 2 -13 27 149
7801 149 154 61 282 273 -187 -59 -157 -66 -53 -103 76 -155 33 -203 -307 -157 -165 43 31 -170 -13 -63 -145 -81 -176
7826 -176 34 108 287 -38 -166 -157 -26 111 -42 20 -135 194 104 8 171 90 94 158 94 -80 -93 159 -95 -28
7850 -28 204 183 132 142 208 214 -150 225 -81 168 -90 -187 7 -56 -100 -120 -28 22 54 -146 101 -54 -218 -52 22
7875 22 42 132 183 102 253 -64 -6 -8 -11 -288 -2 184 77 103 -85 -36 11 -139 71 -372 -190 83 32 150 16
7900 16 192 -202 -163 148 170 -68 45 -33 -215 -1 200 -1 -17 -98 37 -19 74 38 -245 11 39 -9 148 135
7924 135 51 105 -42 -230 -9 155 38 -281 -120 18 206 85 -110 -144 -121 157 -70 15 104 -96 -71 129
7946 129 31 -110 -98 39 -218 103 67 86 113 16 9 -108 31 -29 175 -85 70 -29 354 -35 50 -83 283 -45
7970 -45 -196 69 -45 170 -157 146 -5 123 153 -292 156 -88 123 136 76 218 -83 23 232 -10 65 57
7992 57 118 162 -132 34 223 152 130 -41 1 -179 -26 -137 76 52 -77 109 -172 2 168 4 -1 59 177
8015 177 11 -2 -68 71 33 -172 69 -127 -5 54 103 189 58 36 -40 -116 21 -95 -79 19 -57 22 105 158 214
8040 214 43 -57 -25 180 -21 47 -233 61 126 139 214 166 189 120 -92 312 -111 244 -48 -5 32 -3 4 63 -59
8065 -59 -97 59 83 47 -177 -292 -136 -94 13 -25 25 -50 -218 154 99 -194 -283 260 103 -4 -58 117 43 102
8089 102 -128 -159 109 -146 -48 238 -256 102 -22 -93 103 -160 156 -132 175 -53 -52 -105 302 -76 -470 -123
8111 -123 50 -98 113 -260 -277 32 220 137 25 -20 -22 25 11 18 -81 20 -133 157 86 -15 10 -138 -14 146
8135 146 -222 -72 47 -212 -7 60 -115 -281 -115 21 -20 -139 -77 -46 47 89 50 -11 50 173 -52 -89 -57 -119
8159 -119 71 -140 111 113 -98 3 -196 -165 -29 -127 -20 -29 -101 -57 23 -58 53 48 44 -81 122 -19 72 58 -247
8184 -247 -195 97 29 -123 203 -178 -203
8191b03
##END NTUPLES=NMR FID
##END=
