##TITLE=1H_Pr Bzt-Am
 CDcl3,8 sc, 
 12.03.2021
##JCAMPDX= 6.0         $$ Bruker NMR JCAMP-DX V2.0
##DATA TYPE= NMR FID
##DATA CLASS= NTUPLES
##ORIGIN= UXNMR, Bruker Analytische Messtechnik GmbH
##OWNER= root
$$ XWIN-NMR		Version 3.5
$$ Fri Mar 12 10:12:17 2021 Russian Standard Time (UT+4h)  she@DPX200
##.OBSERVE FREQUENCY= 200.131506
##.OBSERVE NUCLEUS= ^1H
##.DELAY= (6, 6)
##.ACQUISITION MODE= SIMULTANEOUS
##.ACQUISITION SCHEME= undefined
##.AVERAGES= 8
##.DIGITISER RES= 18
##SPECTROMETER/DATA SYSTEM= spect
##.PULSE SEQUENCE= zg30
##.SOLVENT NAME= D2O
##.SHIFT REFERENCE= (INTERNAL, D2O, 0, 15.7039)
##AUDIT TRAIL= $$ (NUMBER, WHEN, WHO, WHERE, WHAT)
$$ ##TITLE= Audit trail, XWIN-NMR		Version 3.5
$$ ##JCAMPDX= 5.01
$$ ##ORIGIN= Bruker BioSpin GmbH
$$ ##OWNER= she
$$ F:/spectra/data/she/nmr/H-F/1/audita.txt
$$ ##AUDIT TRAIL=  $$ (NUMBER, WHEN, WHO, WHERE, WHAT)
(   1,<2021-03-12 10:11:06.03 +0400>,<she>,<DPX200>,
      <created by zg, POWCHK disabled, PULCHK disabled
       configuration hash MD5:
       00 E9 B6 7A A2 85 ED C7 34 08 36 98 17 FE 4E 26
       data hash MD5: 16K
       6E D1 C8 B5 27 FA D7 F0 A8 9F 4B 7A 4C 2B 91 3E>)
$$ ##END=
$$ 
$$ hash MD5
$$ BA 0C 04 F2 A6 83 4B DC CF 13 45 BA 8E 1F 80 54
##$RELAX= 
##$RELAX= 
##$RELAX= 
##$RELAX= 
##$RELAX= 
##$RELAX= 
$$ Bruker specific parameters
$$ --------------------------
##$DU= <F:/spectra>
##$EXPNO= 1
##$NAME= <H-F>
##$PROCNO= 1
##$TYPE= <nmr>
##$USER= <she>
##$AMP= (0..31)
100 100 100 100 100 100 100 100 100 100 100 100 100 100 100 100 100 100 
100 100 100 100 100 100 100 100 100 100 100 100 100 100 
##$AQSEQ= 0
##$AQ_mod= 1
##$AUNM= <au_zg>
##$AUTOPOS= <>
##$BF1= 200.13
##$BF2= 200.13
##$BF3= 200.13
##$BF4= 200.13
##$BF5= 200.13
##$BF6= 200.13
##$BF7= 200.13
##$BF8= 200.13
##$BYTORDA= 1
##$CFDGTYP= 0
##$CFRGTYP= 5
##$CHEMSTR= <none>
##$CNST= (0..31)
1 1 145 1 1 1 1 1 1 1 1 1 1 1 1 1 1 1 1 1 1 1 1 1 1 1 1 1 1 1 1 1 
##$CPDPRG= <>
##$CPDPRG1= <>
##$CPDPRG2= <>
##$CPDPRG3= <>
##$CPDPRG4= <mlev>
##$CPDPRG5= <mlev>
##$CPDPRG6= <mlev>
##$CPDPRG7= <mlev>
##$CPDPRG8= <mlev>
##$CPDPRGB= <>
##$CPDPRGT= <>
##$D= (0..31)
0 1.2 0 0 0 0 0 0 0 0.06 0 0.03 0 0 0 0 0.0002 0 0 0 0 0 0 0 0 0 0 0 0 
0 0 0 
##$DATE= 1615529465
##$DBL= (0..7)
120 120 120 120 120 120 120 120 
##$DBP= (0..7)
150 150 150 150 150 150 150 150 
##$DBP07= 0
##$DBPNAM0= <>
##$DBPNAM1= <>
##$DBPNAM2= <>
##$DBPNAM3= <>
##$DBPNAM4= <>
##$DBPNAM5= <>
##$DBPNAM6= <>
##$DBPNAM7= <>
##$DBPOAL= (0..7)
0.5 0.5 0.5 0.5 0.5 0.5 0.5 0.5 
##$DBPOFFS= (0..7)
0 0 0 0 0 0 0 0 
##$DE= 6
##$DECBNUC= <off>
##$DECIM= 32
##$DECNUC= <off>
##$DECSTAT= 4
##$DIGMOD= 1
##$DIGTYP= 9
##$DL= (0..7)
0 120 120 120 120 120 120 120 
##$DP= (0..7)
150 150 150 150 150 150 150 150 
##$DP07= 0
##$DPNAME0= <>
##$DPNAME1= <>
##$DPNAME2= <>
##$DPNAME3= <>
##$DPNAME4= <>
##$DPNAME5= <>
##$DPNAME6= <>
##$DPNAME7= <>
##$DPOAL= (0..7)
0.5 0.5 0.5 0.5 0.5 0.5 0.5 0.5 
##$DPOFFS= (0..7)
0 0 0 0 0 0 0 0 
##$DQDMODE= 0
##$DR= 18
##$DS= 0
##$DSLIST= <SSSSSSSSSSSSSSS>
$$ [...]
##$SUBNAM2= <"">
##$SUBNAM3= <"">
##$SUBNAM4= <"">
##$SUBNAM5= <"">
##$SUBNAM6= <"">
##$SUBNAM7= <"">
##$SUBNAM8= <"">
##$SUBNAM9= <"">
##$SW= 16.9725357007746
##$SWIBOX= (0..15)
0 0 2 0 0 0 0 0 0 0 0 0 0 0 0 0 
##$SW_h= 3396.73913043478
##$TD= 16384
##$TD0= 1
##$TE= 0
##$TE2= 300
##$TE3= 300
##$TEG= 300
##$TL= (0..7)
0 120 120 120 120 120 120 120 
##$TP= (0..7)
150 150 150 150 150 150 150 150 
##$TP07= 0
##$TPNAME0= <>
##$TPNAME1= <>
##$TPNAME2= <>
##$TPNAME3= <>
##$TPNAME4= <>
##$TPNAME5= <>
##$TPNAME6= <>
##$TPNAME7= <>
##$TPOAL= (0..7)
0.5 0.5 0.5 0.5 0.5 0.5 0.5 0.5 
##$TPOFFS= (0..7)
0 0 0 0 0 0 0 0 
##$TUNHIN= 0
##$TUNHOUT= 0
##$TUNXOUT= 0
##$USERA1= <user>
##$USERA2= <user>
##$USERA3= <user>
##$USERA4= <user>
##$USERA5= <user>
##$V9= 5
##$VALIST= <valist>
##$VCLIST= <CCCCCCCCCCCCCCC>
##$VD= 0
##$VDLIST= <DDDDDDDDDDDDDDD>
##$VPLIST= <PPPPPPPPPPPPPPP>
##$VTLIST= <TTTTTTTTTTTTTTT>
##$WBST= 1024
##$WBSW= 4
##$XGAIN= (0..3)
0 0 0 0 
##$XL= 0
##$YL= 0
##$YMAX_a= 434743
##$YMIN_a= -205713
##$ZGOPTNS= <>
##$ZL1= 120
##$ZL2= 120
##$ZL3= 120
##$ZL4= 120
##$ABSF1= 10
##$ABSF2= 0
##$ABSG= 5
##$ABSL= 3
##$ALPHA= 0
##$AQORDER= 0
##$ASSFAC= 0
##$ASSFACI= 0
##$ASSFACX= 0
##$ASSWID= 0
##$AUNMP= <proc_1d>
##$AZFE= 0.1
##$AZFW= 0.1
##$BCFW= 1
##$BC_mod= 2
##$BYTORDP= 1
##$COROFFS= 0
##$CY= 11.3945322036743
##$DATMOD= 1
##$DC= 2
##$DFILT= <>
##$DTYPP= 0
##$F1P= 15.9154993809931
##$F2P= -4.1035820241983
##$FCOR= 0.5
##$FTSIZE= 0
##$FT_mod= 4
##$GAMMA= 1
##$GB= 0.15
##$INTBC= 1
##$INTSCL= 1
##$ISEN= 128
##$LB= 0.24
##$LEV0= 0
##$LPBIN= 0
##$MAXI= 10000
##$MC2= 0
##$MEAN= 0
##$ME_mod= 0
##$MI= 1.114404
##$NCOEF= 0
##$NC_proc= 0
##$NLEV= 6
##$NOISF1= 3.799351
##$NOISF2= 2.8
##$NSP= 1
##$NTH_PI= 0
##$NZP= 0
##$OFFSET= 15.70392
##$PC= 1
##$PHC0= -11125.13
##$PHC1= 24.40094
##$PH_mod= 1
##$PKNL= yes
##$PPARMOD= 0
##$PSCAL= 0
##$PSIGN= 0
##$REVERSE= no
##$SF= 200.130013532006
##$SI= 16384
##$SIGF1= 3
##$SIGF2= 2
##$SINO= 400
##$SIOLD= 16384
##$SREGLST= <1H.CDCl3>
##$SSB= 0
##$STSI= 0
##$STSR= 0
##$SW_p= 3612.71676300578
##$SYMM= 0
##$S_DEV= 0
##$TDeff= 0
##$TDoff= 0
##$TI= <>
##$TILT= no
##$TM1= 0
##$TM2= 0
##$TOPLEV= 0
##$USERP1= <user>
##$USERP2= <user>
##$USERP3= <user>
##$USERP4= <user>
##$USERP5= <user>
##$WDW= 1
##$XDIM= 8192
##$YMAX_p= 0
##$YMIN_p= 0
$$ End of Bruker specific parameters
$$ ---------------------------------
##NTUPLES= NMR FID
##VAR_NAME=  TIME,          FID/REAL,        FID/IMAG
##SYMBOL=    X,             R,               I
##VAR_TYPE=  INDEPENDENT,   DEPENDENT,       DEPENDENT
##VAR_FORM=  AFFN,          ASDF,            ASDF
##VAR_DIM=   8192,          8192,            8192
##UNITS=     SECONDS,       ARBITRARY UNITS, ARBITRARY UNITS
##FACTOR=    0.0002944,     1,               1
##FIRST=     0,             0,               0
##LAST=      2.4114304,     0,               0
##MIN=       0,             -205713,         0
##MAX=       2.4114304,     434743,          0
$$ Real data points
##PAGE= N=1
##DATA TABLE= (X++(R..R)), XYDATA
$$ [...]
1697A61p72N70N18k46l97P9N2R3L90p8p00j05Q43l67j77O5J74j00L19J24n95j57
$$ 161 -611 -41 477 231 -166 -87 -35 58 448 370 -330 -435 408 41 -136 -71 103 3 322 446 -149 -306
1719c06L70K26m33k41K12k9K15J11k25p23N45O53o78l8J93Q9k15M89j12n71J31
$$ -306 64 290 -143 -384 -172 -201 14 125 -100 -823 -278 375 -303 -341 -148 -59 -274 215 103 -468 -337
1740c37M62N7l64K61l23n7M89N12q40k13N46L11k11m8k37k30L65J89l88m12N04
$$ -337 125 182 -182 79 -244 -301 188 700 -140 -353 193 504 293 245 8 -222 143 332 -56 -468 36
1761C6J08j26K6J0l29P5N80l87n20l3N89j48l1K47l97j34M48J34l77q8O10j98
$$ 36 144 18 44 54 -275 -200 380 -7 -527 -560 29 -119 -150 97 -300 -434 14 148 -229 -317 293 95
1783I5R7J37k56m98O89J15l61k80K89l1J7L22m12l54K11M20j12l68J34n9qK12
$$ 95 192 329 73 -425 264 379 18 -262 27 -4 13 335 -77 -431 -220 200 88 -280 -146 -205 -213 -1
1805aj13n03K3N99M9k24j3N2K31OJ91l24k40M07N79l56l23J61k74q4N81q3n50
$$ -1 -114 -617 -594 5 54 -170 -183 -131 100 106 297 -27 -267 140 719 363 40 201 -73 -157 424 341 -209
1828b09K8N18j40l06P7k94K04L42l37j74k4M05j08lJ94j50k99M30L66k66k21k3
$$ -209 -181 337 197 -109 -32 -326 -122 220 -117 -291 -315 90 -18 -21 173 23 -276 154 520 254 33 10
1850A0K49P9k44L77k21j0M69k54m44J33K91k1j01m7n43J69K86O5o06K38MP7K7
$$ 10 259 338 94 471 250 240 709 455 11 144 435 414 313 266 -277 -108 178 243 -363 -125 -121 -44 -17
1873a7jr3k04N12j93j36m25L39K7K32n2J46k43K21K32k63j58M4J30Q4N3J67n73
$$ -17 -18 -111 -315 197 4 -132 -557 -218 -191 41 -11 135 -108 113 345 82 -76 -32 98 182 235 402 -171
1896a71L7M17Q6l86J96n25J95rJ83l14k66O92N7m35j46K27J89l5K33k45n46O87
$$ -171 -134 283 369 -17 179 -346 -151 -160 23 -291 -557 135 192 -243 -389 -162 27 -8 225 -20 -566 121
1918A21J37k41k68K51j72R9N54k94j13q8K26K53l21n8j81K9K78j1l14j60K25O7
$$ 121 258 17 -251 0 -172 -73 481 187 74 -14 212 465 144 86 -95 -66 212 201 -113 -273 -48 19
1940A9j16K5J2l05R3L60m53k33M71l9J28o5j53RL21RJl74O5L76O9k23J89m44K13
$$ 19 -97 -72 -60 -365 -272 88 -365 -598 -127 -166 -38 -103 -256 -247 74 83 84 -290 -225 151 220 -3 186 -258 -45
1965d5R4K05k52M0J90j50j99K77j47k76N14N2l78k1j59K84o8R4K0k42M9K88k78
$$ -45 49 254 2 42 232 82 -117 160 13 -263 251 303 -75 -96 -255 29 -39 55 75 -167 -118 170 -108
1988a08k01J91L4L70J32j19m48J12M17l52J12k76O3J64lK4n7l29N59j10k16J69
$$ -108 -309 -118 -84 286 418 299 -149 -37 380 28 140 -136 -73 91 88 112 55 -274 285 175 -41 128
2010A28Ll95O2L66r3l82K55K99J5j78l07K9J65J92j83m71K78P9J00M0Lj33j09
$$ 128 131 -264 -202 164 71 -311 -56 243 258 80 -227 -198 -33 159 -24 -495 -217 -138 -38 2 5 -128 -237
2033b37L83j67j89K0K82J39p1j24j08R4r3K58k0n62K99J52N0j88N1j58L8J79O3
$$ -237 146 -21 -210 -190 92 231 160 36 -72 22 -71 187 167 -395 -96 56 106 -82 -31 -189 -151 28 91
2056I1l67M6L00q8J57m3l00P4K93p2q3k06K36J21k39K49M6m40J38K54k32J4O8
$$ 91 -276 -230 70 -18 139 96 -204 -130 163 91 8 -198 38 159 -80 169 215 -225 -87 167 -65 -51 17
2079A7M3P9r7J56l32J48K23k2j02k00o2M0L87k39q7M7P4Jk69Q6k2R1lL92n33P
$$ 17 60 139 42 198 -134 14 237 215 113 -87 -149 -109 278 39 -48 -1 73 74 -195 -109 -131 -40 -43 349 -184 -177
2105a77J15K53j92K5k88Q7J40J80o5l64j45M75J35j32K06l37m1J82J4k0j15k2
$$ -177 -62 191 -1 24 -264 -177 -37 143 78 -286 -431 44 179 47 253 -84 -125 57 71 51 -64 -86
2127h6J05K1k45J68j07N79k76j79N0k70K77r5J55k1l05L24M3l5k18K0p3K72Q7
$$ -86 19 40 -205 -37 -144 435 159 -20 30 -240 37 -58 97 76 -229 95 138 103 -115 -95 -168 104 191
2150A91l02L43j22j5K65m03r4Q3QL39k37J26k74J04L26k96J9j27l1J73J07l29
$$ 191 -111 232 110 95 360 -43 -137 -54 -46 293 56 182 -92 12 338 42 61 -66 -97 76 183 -146
2172a46k70M94O9p0m2l72L09r2O2L98m32k39K68J47l49J4J48L0K64j00k58J68
$$ -146 -416 78 147 77 35 -337 -28 -120 -58 340 -92 -331 -63 84 -265 -251 -103 -73 191 91 -167 1
2194Aj81M15l5o09K93J27m5K54j93q1k7l4R8PL7j56P8L56l78J18N3r0M9r7mj1
$$ 1 -180 235 200 -409 -116 11 -34 220 27 -54 -81 -115 -17 -10 27 -129 -51 305 -73 45 98 8 57 -40 -44 -55
2220e5j49R0J24k20K9J82j8r5R5l6rP4q1K25k56K9K16r6K22q6j27j06K03rM2j88
$$ -55 -204 -114 10 -210 -181 1 -17 -112 -17 -53 -62 12 -69 156 -100 -71 145 49 271 185 58 -48 155 146 188 0
2246@M6p8K64l58P9J49M1j33k97J5q1K40J82j67l51K36J5K47J01l87j16N63j65
$$ 0 46 -32 232 -126 -47 102 143 10 -287 -272 -353 -113 69 -98 -449 -213 -198 49 150 -237 -353 210 45
2269D5q2J63l26J67J51j8M5j76q4P5R1j55mNO6K21p0j14j44J87L11l08Mj75K0
$$ 45 -37 126 -200 -33 118 100 145 -31 -115 -40 51 -104 -108 -103 -37 184 114 0 -144 43 354 46 50 -125 -105
2294a05n1K24q0o5J9m4J77j79n5K64j63K02k10K64j96k4K17N1k45K26l2j57k0
$$ -105 -156 68 -12 -77 -58 -102 75 -104 -159 105 -58 144 -66 198 2 -22 195 246 1 227 195 38 18
2317A8j9J13j79j6J34j48m2R2L0j6NJ8k88L03j5o0J4j39l1K57Ll4J36o5k53K04
$$ 18 -1 112 -67 -83 51 -97 -139 -47 -17 -33 -28 -10 -298 5 -10 -70 -56 -195 -226 31 34 0 136 71 -182 22
2343B2no3O0J62K15p8k29o1p6K20Ko3p3K7J66q3Ol09qM90l39R4j72P7k12M13k00
$$ 22 17 -46 14 176 391 313 84 23 -53 167 169 106 33 60 226 143 149 -160 -168 322 -17 77 -95 -18 -230 183 -17
2370a7K19j90j67J0R6q4%K81j61J17Mo4K4j50L06j10p5RJ96Mm62J08lJ26k0k1
$$ -17 202 12 -155 -145 -49 -133 -133 148 -13 104 108 44 68 -82 224 114 39 48 244 248 -214 -106 -109 17 -3 -24
2396b4J05m79M26R0m0j33j47R9o0oJ00l5J4J89J46q6q5k06O3L03j62k24J28K7
$$ -24 81 -398 28 118 78 -55 -202 -103 -163 -169 -69 -104 -90 99 245 159 74 -132 -69 234 72 -152 -24 3
2420CJ71l30M2J75n6N0K2j49k30J51O9J60Kj37NJ48m7j36J76j79L04j76l9L6l76
$$ 3 174 -156 -114 61 5 55 77 -72 -302 -151 -82 78 80 -57 -52 96 49 -87 89 -90 214 38 -1 35 -341
2445c41K17J75n2Q3j30J67m5p7O6k52K27J76j79o5j57K25j84J91p1N5j64R1M1
$$ -341 -124 51 -1 82 -48 119 74 -3 63 -189 38 214 35 -30 -187 38 -146 45 -26 29 -135 -44 -3
2468ck9o7k0J60n0r8RJ28r4N0p8M2L3N1j88M05j93l19L80j3j47J15l1N9q4N7l
$$ -3 -32 -99 -119 41 -9 -107 -98 30 -64 -14 -92 -50 -17 34 -154 251 58 -261 119 106 -41 74 43 102 18 75 72
2495G2j80MJ09O8j3j40rJ46J2O7k60p1M43j49j04K28m60K77J82r1j20N8r4j97
$$ 72 -108 -104 5 73 60 -80 -89 57 69 136 -124 -195 248 99 -5 223 -237 40 222 131 11 69 -25 -222
2519b22J78n8K6J5J39l07L67lJ26k79r0L02N6l16l1K31m5j37J4M7N5q2N3N1k4
$$ -222 -44 -102 -76 -61 78 -229 138 135 261 -18 -108 194 250 -66 -97 134 89 -48 -34 13 68 -14 39 90 66
2544F6J04N4j60J77j95j14J38o8m9R0n4J64o5p3O4j56m7M7q0K76mj63P2p4j05
$$ 66 170 224 64 241 46 -68 70 2 -47 43 -11 153 88 15 79 -77 -124 -77 -157 119 115 -48 24 -50 -155
2569a55J07Q7j62J64J22l7k1P4j39q2j38L34j27kK58j86Kj5kK23l82j19Q1J26
$$ -155 -48 39 -123 41 163 126 105 179 40 -42 -180 154 27 25 283 97 99 84 82 305 -77 -196 -115 11
2593A1N6m4JL1o8l2K17k37oJ57rO8j84k09O56l64M8j08N3k42pL01j28O7J17r4
$$ 11 67 23 24 55 -13 -45 172 -65 -71 86 77 145 -39 -248 408 44 92 -16 37 -205 -212 89 -39 28 145 51
2619E1j29L9m3J29k0r5oQ8k70K97m2k04J39KL4j36L76j04k40K65q4q1j11PJ39
$$ 51 -78 -39 -82 47 27 -68 -74 14 -256 41 -1 -205 -66 -64 -30 -166 210 106 -134 131 47 -34 -145 -138 1
2644Ar5K9j42J76n0K02k31R2J25m1j07J48j46k34J54j12J78K73j54j00J27j95
$$ 1 -94 -65 -207 -31 -81 121 -110 -18 107 66 -41 107 -39 -273 -119 -231 -53 220 66 -34 93 -102
2666a02J57r6r8M01k76J05k78N5NJ2J11L5l14K38K41m2J44l67k2J05J75j57P6
$$ -102 55 -41 -139 262 -14 91 -187 -132 -127 -115 -4 31 -283 -45 196 154 298 -69 -91 14 189 32 108
2689A08rj12RP1n1N7r3K34j29kl7j39j41K52J74l00R7l30M15j56q3l6J16mK39
$$ 108 99 -13 -4 67 16 73 -20 214 85 83 46 -93 -234 18 192 -108 -11 -341 74 -82 -165 -201 -85 -89 150
2714A50m46J79L00Jl38L3K59l95K46J35jq4l29M44R2k67K41l33j55L67k39J62
$$ 150 -296 -117 183 184 -154 -121 138 -257 -11 124 123 39 -290 154 246 -21 220 -113 -268 99 -140 22
2736B2K39j21R7j47jj22JP6j01R6l59L23r7P0J79k72K7K56o1K5J0l39L04j65L8
$$ 22 261 140 237 90 89 -33 -32 44 -57 39 -320 3 -94 -24 155 -117 -90 166 105 130 140 -199 105 -60 -22
2761b2L4L4o7J81o2P7n1Q3j56P7j60J23j49K62j37j96J34j68J16j22O8J79m12
$$ -22 12 46 -21 160 98 175 124 207 51 128 -32 91 -58 204 67 -129 5 -163 -47 -169 -101 78 -334
2784c34M02K10m99K20k1m3J6Q7j43J60r8L7r1J69p0OJ97l30L03l2k34R9K25k34
$$ -334 68 278 -221 -1 -22 -65 -49 38 -105 55 -43 -6 -97 72 2 8 205 -125 178 146 -88 11 236 2
2808Bl8q5j42K11J14j31j40J57J90j91J3LJj51J47p9M3k8K48j24q9K09l05J99
$$ 2 -36 -121 -263 -52 62 -69 -209 -52 138 -53 -40 -37 -36 -187 -40 -119 -76 -104 144 20 -69 140 -165 34
2832C4K0L88n41N3mO5J69J23m84J80K11l29J35j80K26j48O5j61J91Oj86K23j9
$$ 34 54 442 -99 -46 -50 15 184 307 -177 3 214 -115 20 -160 66 -82 -17 -178 13 19 -167 56 37
2855C7m03L60J98j73j99K05K16k29j50J18P4l21L87k21K1Q0k33K03r2L0j78m7
$$ 37 -366 -6 192 19 -180 25 241 12 -138 -20 54 -267 120 -101 -80 0 -233 -30 -122 -92 -270 -317
2877c17L91p3N1j07r5J44p5K8Q3j51L69n75K16K01j55J80j02j78L01k33J54n0
$$ -317 74 1 52 -55 -150 -6 -81 -53 30 -121 248 -327 -111 90 -65 115 13 -165 136 -97 57 7
2899Gk75K42j87L3K86j49J63rj14J73k45J03n9k26Q5K48P2k1k6r9J78J87l96R0
$$ 7 -268 -26 -213 -180 106 -43 120 111 -3 170 -75 28 -31 -257 -172 76 148 127 101 2 180 367 -29 61
2923F1j09O8R4M8J36k02q4j01K50m49J14K15n0p8K22j73n1J08p6K56j33j6j79
$$ 61 -48 20 114 162 298 96 12 -89 161 -288 -174 41 -9 -87 135 -38 -89 19 -57 199 66 50 -129
2946a29p0K63Q2j29n9j35J22j4n2K38Mq8M1j24J74k78J06PK44k88j66M81k41k27
$$ -129 -199 64 146 17 -42 -177 -55 -69 -121 117 121 33 74 -50 124 -154 -48 -41 203 -85 -251 230 -11 -238
2970b38K96O2p3k9j8j11K61k34o2L14O6j73N6j36J45Pl15N14l49k2K82j45J14
$$ -238 58 120 47 18 0 -111 150 -84 -146 168 234 61 117 -19 126 133 -182 332 -17 -39 243 98 212
2993B12jl25K81k51L0J79%q9j19n6J95j35J42J58m69M52k30p2J73k59J97k29K12
$$ 212 211 -114 167 -84 -54 125 125 36 -83 -139 56 -79 63 221 -248 204 -26 -98 75 -184 13 -216 -4
3016dP2r7r9K8K15k14K27k45J52Q6Rj12N0J83k95p4O8J62j5k13K90N9j45j05N4
$$ -4 68 -29 -128 -100 115 -99 128 -117 35 121 130 18 68 251 -44 -118 -50 112 97 -116 174 233 88 -17 37
3041C7o6J87o6N1p3j41K0j78Q9l9K72n4L9j3N8m32K61M4J21j20M0nK27l62oO3
$$ 37 -29 158 92 143 70 -71 -51 -229 -140 -179 93 39 78 65 123 -309 -48 -4 117 -3 37 32 259 -103 -109 -46
3067d6J7J71N8K1o3j21L23k42j71K21j86P6Qk7K85l82K18k2M9m5j3M1r3j9N9k6
$$ -46 -29 142 200 221 158 37 360 118 -53 168 -18 58 66 39 324 -58 160 138 187 142 129 170 77 58 117 91
3093I1l32L82jk00Q9J16k20%J23Nj08j08M30j63j34qO4k64J79O9j78R9K01l6K3
$$ 91 -241 141 140 -60 29 145 -75 -75 48 53 -55 -163 267 104 -30 -38 26 -238 -59 10 -168 -69 132 96 119
3118A19m9k9J48k62J28k39Q9q9O5R3N9j81J86n3j13L12k61J16K12j76k1O8r4j40
$$ 119 70 41 189 -73 55 -184 -95 -184 -119 -26 33 -148 38 -15 -128 184 -77 39 251 75 54 122 28 -112
3142a12K25j14J54oq0pk21J58rj76M7J15L1O5l60L27j15J75kr1r6J49j01pr1M48
$$ -112 113 -1 153 147 67 60 -161 -3 -12 -188 -141 -26 5 70 -290 37 -78 97 95 4 -92 57 -44 -51 -142 306
3168C06l10k74J66L33k57q0m0L22k92mL5J58j39K26j81n9O8J97r2l34K36R0P2
$$ 306 -4 -278 -112 221 -36 -116 -156 166 -126 -130 -95 63 -76 150 -31 -90 -22 175 83 -251 -15 75 147
3191A47l40L34m4r9J36j86r2K72k49J80n5J47l83J72q7O0K96k06o5J11j46R5m3
$$ 147 -193 141 97 -2 134 -52 -144 128 -121 59 4 151 -232 -60 -147 -87 209 3 -62 49 -97 -2 -45
3214d5J61k75J91J02p3J38j82J29j74q4P9j34K60p1p2M7J4j0M7kK5k0K57l49J09
$$ -45 116 -159 32 134 61 199 17 146 -28 -112 -33 -167 93 22 -50 -3 11 1 48 46 71 51 308 -41 68
3239F8o0q7K09j02j2K9j21K0q4J97k4J35k3k78M4K2K16j24l1J59l54J97j32j31
$$ 68 8 -79 130 28 16 45 -76 -56 -140 57 33 168 145 -133 -89 -67 149 25 -6 153 -201 -4 -136 -267
3263b67N38m56N8J41j69K85p6j66K17J73k30n2J41r2J56k58Q3j47K0J98J0M5k40
$$ -267 271 -185 -127 14 -155 130 54 -112 105 278 48 -4 137 45 201 -57 26 -121 -101 97 107 152 -88
3286h8pO0l1M5O5J10k70K02l9k29L02l11k3K44m7j34K9J45K4r0n8K21k32M4R6
$$ -88 -95 -35 -66 -21 44 154 -116 86 47 -182 120 -191 -214 30 -17 -151 -122 23 47 -43 -101 120 -112 -68 28
3311B8j22N6p2K02j54K7L9J42J2k60L6J63m6j0n0M8k78K58J84j85J08L4l64L10
$$ 28 -94 -38 -110 92 -62 -35 4 146 158 -102 -66 97 51 41 -9 39 -239 19 203 18 126 160 -204 106
3335A06J8j78q1L25k54N0j7j41R1J69n5j72Q7j0J6P3q4J25j60J32j98L14k68K03
$$ 106 124 -54 -135 190 -64 -14 -31 -172 -81 88 33 -139 -52 -62 -46 27 -57 68 -92 40 -158 156 -112 91
3359I1j38j5m0K95j74n3Q0j09M38l19P3L4m66K23qL2K27M0j62r9L0o5J30J4j87
$$ 91 -47 -62 -102 193 19 -34 46 -63 375 56 129 163 -303 -80 -88 -56 171 211 49 -50 -20 -85 45 59 -128
3384a28J45j10K1K68o8p2k27O7L19l84M09j56J0n9J54j89m0J60r0J03l66L3L19
$$ -128 17 -93 -72 196 128 56 -171 -104 215 -169 240 84 94 35 189 0 -40 120 30 133 -233 -200 119
3407A19k53K51j26k23L03k43n5O8K70j44J49J60l76J17j16K16j99K00k29RK74
$$ 119 -134 117 -9 -232 71 -172 -227 -159 111 -33 116 276 -100 17 -99 117 -82 118 -111 -102 172
3428A72k64J89l00K96k3j57K68r4Q1q8P3k03K14j08l9K08k13j17R0NQ6j33R8j22
$$ 172 -92 97 -203 93 70 -87 181 87 168 80 153 -50 164 56 17 225 12 -105 -15 -10 76 -57 41 -81
3452h1M1J26m0O3N8m33K29j21MJ47K8P1J04k07J47l58R4J04J07o0k8j52O2J17
$$ -81 -40 86 46 109 167 -266 -37 -158 -154 -7 21 92 196 -11 136 -222 -128 -24 83 23 -5 -157 -95 22
3476B2jr5J24p6k99J74K31k20K7J3k1o3QR2q9M86k71p6L3j39M3N5K95k89J69r0
$$ 22 21 -74 50 -26 -325 -151 80 -140 -113 -100 -121 -184 -176 -84 -173 313 42 -34 -1 -140 -97 -42 253 -36 133 43
3502D3o6J20J0K9j22lj24J41j24K25k01M5q9J10l2m5M5J09N0k20m7J26p9M04n08
$$ 43 -23 97 107 136 14 11 -113 28 -96 129 -72 -27 -116 -6 -38 -83 -38 71 121 -99 -146 -20 -99 305 -203
3527b03M01j2l69J84P3k12J30J53j73j25L10j71qj41L81k02Q4J95k28l2J0n2j44
$$ -203 198 186 -183 1 74 -138 -8 145 -28 -153 157 -14 -22 -163 218 16 100 295 67 35 45 -7 -151
3550a51J0J54K75j57l5O5j31Q7J95m10K0j58j01K83j9Q9Q8j43K9K67l86K67j29
$$ -151 -141 13 288 131 96 161 30 117 312 -98 -78 -236 -337 -54 -73 16 104 -39 -10 257 -129 138 9
3573IrL9R4j71j03J60j20R1R5Q2j45J10j65j6J6l8N2q4N8J8P2R2L9k36P1n9q1
$$ 9 0 39 133 -38 -141 19 -101 -10 85 167 22 132 -33 -49 -33 -71 -19 -103 -45 -27 45 137 176 -60 11 -48 -129
3600a29RJ84l08J69J90O2j43k6j4J03j46n9J02l05L51J13j90j69K39j20o3R4J11
$$ -129 -120 64 -244 -75 115 177 34 8 -6 97 -49 -108 -6 -311 40 153 -37 -206 33 -87 -150 -56 55
3623E5O5l34J65qk18M13q1N2J0n6Q2n7r1k9n7j32L46m24K46mo5R5J31j29J02j29
$$ 55 120 -214 -49 -57 -275 138 57 109 119 63 145 88 -3 -32 -89 -221 125 -299 -53 -57 -122 -27 104 -25 77 -52
3649e2J12K9J0l3j22K21j19Nr6J02j40J66j26J46j1j67k5J26j62Q7K47j52jP3
$$ -52 60 89 99 66 -56 165 46 51 -45 57 -83 83 -43 103 92 -75 -100 26 -136 -49 198 46 45 118
3673A18k49J14n8J64j22O0k22qK05o9J0J9j39K84K0nl8q1J70k58l6J93L24m37
$$ 118 -131 -17 -75 89 -33 27 -195 -203 2 -67 -57 -38 -177 107 127 122 84 3 173 -85 -121 72 396 -41
3697d1J63K25j96j81k96L59q9J25o4k01K69k30N7n1K62m3j62J15k5k17L78q3R5
$$ -41 122 347 151 -30 -326 33 -56 69 5 -196 73 -157 -100 -151 111 68 -94 21 -4 -221 157 74 169
3720A69J01l21J73k18J80l1k08K96k50J13J0n2Qm2j85N02j31j58P6N4k51Q5o8
$$ 169 270 -51 122 -96 84 53 -155 141 -109 4 14 -38 -30 -72 -257 245 114 -44 32 86 -165 -80 -148
3743a48J49j78Q9n4J37r3j24M62q7L8j84n9n0J27J81p0k35K93qp5n3k53K71j77
$$ -148 1 -177 -88 -142 -5 -98 -222 240 153 191 7 -52 -102 25 206 136 -99 194 186 111 58 -195 76 -101
3767a01L5N7j22J12J10j10O8k8l6Q6q1n5L03k21n0J72j55k06K31N0j7p1K3J61
$$ -101 -66 -9 -131 -19 91 -19 49 21 -15 71 -10 -65 238 17 -33 139 -16 -222 9 59 42 -29 -6 155
3791A55o3k39J35j8k2r5Q9j35K23n3R5p1k56K76j33K05j29j02Q9J88k95Ll4J52
$$ 155 92 -147 -12 -30 -52 -147 -58 -193 30 -23 72 1 -255 21 -112 93 -36 -138 -49 139 -156 -153 -187 -35
3815c5J08K7j9j97J60Q5j02n0L42n17J33m3K29j63m8J19L6l2p8J45o3j60K03K1
$$ -35 73 100 81 -116 44 129 27 -23 319 -198 -65 -108 121 -42 -90 29 65 33 -45 100 37 -123 80 101
3839A01m3rK3j01K4j10J15M1j38q6J48M0K00j84k70N83n32J56k28K12K22j77J52
$$ 101 58 49 72 -29 -5 -115 0 41 -97 -183 -35 5 205 21 -249 334 -198 -42 -270 -58 164 -13 139
3862A39j01j48q3K15M4j99j05K56j8k2knp8K03Nj40L4J4J76k32m7L52k42N7o1
$$ 139 38 -110 -193 22 66 -133 -238 18 0 -22 -24 -29 -107 96 101 -39 -5 9 185 -47 -94 258 16 73 12
3887A2j45l1M28m23J14P5j7K9o3n9R2J3j5j12J72q4lo7lr4L83k16J08j20o4Q5
$$ 12 -133 -164 264 -159 -45 30 13 42 -21 -80 12 25 10 -102 70 -14 -17 -84 -87 -181 202 -14 94 -26 -90 -5
3913em0L19r9k36L05j43N7j35PO0k88P4K07j30j37L29l49J82M7j28m4J77m5R6
$$ -5 -45 274 175 -61 244 101 158 23 30 90 -198 -124 83 -47 -184 145 -204 -22 25 -103 -147 30 -15 81
3937H1O0l01L20j01m8nJ28q9Q1j52J58l63J06J25L2J67j77j56J72J1K71l16Kq2
$$ 81 141 -160 160 59 11 6 134 45 126 -26 132 -231 -125 0 32 199 22 -134 38 49 320 4 6 -76
3961g6mL05l18J1O3L1m6N2J30k33o0O2L33j33J4k77K16J05j57n4k23L53k95M76
$$ -76 -80 225 -93 -82 -19 12 -34 18 148 -85 -145 -83 250 117 131 -146 70 175 18 -36 -259 94 -201 275
3985B75l05o9K03J3j99P7J1j48K97k23K58K1M3k42J86q5k14L4L08k31k9K9j96
$$ 275 -30 -99 104 117 -82 -5 6 -142 155 -68 190 211 254 12 198 113 -101 -67 241 10 -19 10 -186
4008a86J91J29Pl51K84j89Q3j32L24p3r1j11K32k01J8n8K74k17Q9r1l5o3L8K77
$$ -186 5 134 141 -210 74 -115 -32 -164 160 87 -4 -115 117 -84 -66 -124 150 -67 22 -69 -104 -167 -129 148
4032A48j18P6j82M8J96k70J42l0J11r4j8M7L1j07J24j03l2K67l88p1J11P0Q1k86
$$ 148 30 106 -76 -28 168 -102 40 10 121 27 9 56 87 -20 104 1 -31 236 -152 -223 -112 -42 39 -247
4056b47J58K67k95K0j25P9L33j48j79J61j50L48l14K66k3J8j92J23j89R5J02j27
$$ -247 -89 178 -117 -97 -222 -143 190 42 -137 24 -126 222 -92 174 151 169 -23 100 -89 6 108 -19
4078a9P6O9j46J85q1P0k4l3q3J90K4k72K8P6j78K36j82Q0j57k53L94j21Q2o5K05
$$ -19 57 126 -20 165 84 154 130 97 14 204 228 -44 -16 60 -118 118 -64 16 -141 -394 0 -121 -39 -104 101
4103A01n2P0q2n1r0j3J19L2j31J91j18K05l1k8k35J97m4N9k22q6K93j68K18k79
$$ 101 49 119 37 -14 -104 -117 2 34 -97 94 -24 181 150 122 -113 84 40 99 -123 -209 84 -84 134 -145
4127a45J08k31K11j04K23j42K35k05J28j11N5K7p5RN8k11L53j74m1J33k62J11
$$ -145 -37 -268 -57 -161 62 -80 155 -50 78 -33 22 49 -26 -17 41 -170 183 9 -32 101 -161 -50
4149e0l9J36QQl04L35l4J98k20k80J04J54o5J0kk19L27J90l52J49k58K63k66j00
$$ -50 -89 47 55 63 -241 94 60 258 38 -242 -138 16 -49 -39 -41 -260 67 257 -95 54 -204 59 -207 -307
4173c07L87m6J20j82r5J97LO0J29k93J55J71j82k72m0K71j37K02m13L37j14K29
$$ -307 80 34 154 -28 -123 74 77 137 266 -27 128 299 117 -155 -195 76 -61 141 -272 65 -49 180
4195A80n2k02M4L9j18m2Q8J57j30Q9j22P3M1j40K60k94J82k66K14K00k38q1k05
$$ 180 128 -74 -30 9 -109 -151 -63 94 -36 53 -69 4 45 -95 165 -129 53 -213 1 201 -37 -118 -323
4218c23K98L5o5Kl57M44p0N3M3O3r2J7j00J86N3l65K49l57M52j17j66%K45J5k83
$$ -323 -25 10 -55 -53 -410 34 -36 17 60 123 31 48 -52 134 187 -178 71 -286 166 49 -117 -117 128 143 -140
4243a40L43j89j30l09L70K14k43J88k31r4J63J58j5J6r1k9J31J72m50J97%p5m0
$$ -140 203 14 -116 -425 -55 159 -84 104 -127 -221 -58 100 85 101 10 -19 112 284 -166 31 31 -44 -84
4266h4K45k62J60o3l7O3K1q1K26j83j0o8J24Q0j16J33m07J43R2j66L51k3k8n2
$$ -84 161 -101 59 -4 -41 22 43 -38 188 5 -5 -73 51 131 15 148 -259 -116 -24 -190 161 138 110 58
4290E8j63o4R2J99Mj73Rj19p6K07K36l40L74l24K88Q4l86J82j0M3m4N3j77J35
$$ 58 -105 -169 -77 122 126 -47 -38 -157 -233 -26 210 -130 244 -80 208 292 -94 88 78 121 77 130 -47 88
4314H8k12J17K18m01J47R3J51k63M8l5o8K31q1o6j33J13J37r8j01J78j03J1K16
$$ 88 -124 -7 211 -190 -43 50 201 -62 -14 -49 -117 114 33 -33 -166 -53 84 -14 -115 63 -40 -29 187
4337A87K1k66J16j74mJ05p8K02l50K00J9O6j24K15r0k91J37K56j2n0J54k31P1
$$ 187 208 -58 58 -116 -120 -15 -93 109 -241 -41 -22 44 -80 135 45 -246 -109 147 135 85 239 8 79
4360G9l67L61j32J58j06j3Q0J9p3J09k16L9j23M07m25J44J56k39J7M7k08J70q
$$ 79 -288 73 -59 99 -7 -20 60 79 6 115 -101 -62 -185 222 -203 -59 97 -142 -125 -78 -286 -116 -124
4383a24J99n2p6R4l10K29lJ32k01J19K50j0k86J83p4O9k43K22j04O5kj77K29m24
$$ -124 75 23 -53 41 -269 -40 -43 89 -112 7 257 247 -39 144 70 139 -104 118 14 79 77 -100 129 -295
4407b95K58M04m54J93j84K12J57k73N1p3j65J16k2k44K24K9J72L6l53J87j18L20
$$ -295 -37 367 -87 106 -78 134 291 18 69 -4 -169 -53 -75 -319 -95 -66 106 142 -211 -24 -142 178
4429A78j84m18L61K77j63j08J13q0K5qJ09k58M3J13k1MJ4L3K48jk20j71K77k85
$$ 178 -6 -424 -63 214 51 -57 56 -24 1 -7 102 -156 -113 0 -21 -17 -3 30 278 277 57 -114 163 -122
4453a22K39J32l80J61J9k35R7k4J0L07l89L51l92K97j66m6O2K22j96L3k06L04
$$ -122 117 249 -131 30 49 -186 -89 -113 -103 204 -185 166 -226 71 -95 -141 -79 143 -53 -20 -226 78
4475G8R3j58j64J06K3PK61l0j90l0M5k58J50m3O5J68k02J19J10m5n8j24J4k24
$$ 78 171 13 -151 -45 -22 -15 246 216 26 -4 41 -217 -67 -110 -45 123 -79 40 150 105 47 -77 -63 -287
4499b87N05k30J20k52J06K42j85J31k69n7J79n2K24P9k83M18k83k37J31k06K36
$$ -287 218 -12 108 -144 -38 204 19 150 -119 -176 3 -49 175 254 -29 389 106 -131 0 -206 30
4520C0J96n00L07j29K18M9l6k37L20m13K13P7j97L03l35K08J4r1km6J69j89k28
$$ 30 226 -274 33 -96 122 171 135 -102 218 -195 18 95 -102 201 -134 74 88 -3 -5 -51 118 -71 -299
4543b99M45k58J20R5k99J58J13m3J40j78N6j4j7j5j23J51P5l30J36k30O31k40
$$ -299 146 -112 8 103 -196 -38 75 32 172 -6 50 36 19 4 -119 32 107 -223 -87 -317 314 74
4565G4k53J12j24L80k60J47K7l16J96J21k68K81j38j08Q3n0k5n5L28p2m6j45j8
$$ 74 -179 -67 -191 189 -71 76 103 -213 -17 104 -164 117 -21 -129 -46 -96 -121 -176 152 80 34 -111 -129
4588a29J68P1r3l3L4j22j1J70j96N7O7N3M1k45J25J19j51k2Jl2K15k12M28k76
$$ -129 39 110 17 -16 18 -104 -115 55 -141 -84 -17 36 77 -168 -43 76 -75 -97 -96 -128 87 -125 303 27
4612B7k18L02k72J10o6r3L28k15O4K8l2j56K99j8R7p9j50K63k47mJ93j67j90k9
$$ 27 -191 111 -161 -51 -117 -210 118 -97 -33 -5 -37 -193 106 88 185 106 -44 219 -28 -32 161 -6 -196 -225
4636b25L76l17K00J31l31J35k5K2R2R2k83K15p8R3j15P8k16J28M8j0R9j02m8P
$$ -225 151 -166 34 165 -166 -31 -56 -34 58 150 -133 82 4 97 -18 60 -156 -28 20 10 109 7 -41 -34
4660c4l6K00j67o4L9J25j31K6J37l07J68P5j88j28K93p7J79k64O3K24l67K15j99
$$ -34 -70 130 -37 -101 -62 63 -68 -42 95 -212 -44 31 -157 -285 8 -69 110 -154 -91 133 -234 -19 -218
4683b18O1O7J63j07K00k89L61j97L6Q9%n3j64J25j80K31j12j02J02J49l11K11
$$ -218 -157 -90 73 -34 166 -123 238 41 77 166 166 113 -51 74 -106 125 13 -89 13 162 -149 62
4705F2J0j34J11R4k74J76n4j03J74K63l52M3j52K42p8Q3j85J08Q8r4K12j76j11
$$ 62 72 -62 49 143 -131 45 -9 -112 62 325 -27 16 -136 106 28 111 -74 34 122 28 240 64 -47
4728d7J2j11J80j51J36n9j80J79k21P4K87n0k0r3J66l01P1K27j96m3J40K9p8o7
$$ -47 -35 -146 34 -117 19 -40 -220 -41 -262 -188 99 49 29 -64 102 -199 -128 99 -97 -140 0 29 -49 -116
4752a16j9J31J01K8R6l25P9K49m92M53k4k71J91j34J20j00J13N5k36M7J8K2pk91
$$ -116 -135 -4 97 125 221 -104 -25 224 -268 185 161 -110 81 -53 67 -33 80 135 -101 -54 -36 -14 -21 -312
4776c12O37l41J00l05J06j84K03P7O2J22j44O8m1Q5l94L64m1r1j29J81N1j6R8
$$ -312 325 -16 84 -221 -115 -299 -96 -19 43 165 21 89 48 133 -261 103 62 -29 -158 23 74 58 156
4799A56l83K87m6j59K4J9j41J57J41qN8k8j13J39n7j03K4J85k16N7l2Kj38K57
$$ 156 -227 60 14 -145 -121 -102 -243 -86 55 47 105 77 -36 103 46 -57 -33 152 -64 -7 -39 -37 -175 82
4823H2k21R1K16n8j95j04m0J19K7M17k15jm5l9qk5O1m9k27L02j58N1K21k40J73
$$ 82 -139 -48 168 110 -85 -189 -229 -110 -83 334 119 118 73 34 26 1 62 13 -214 88 -70 -19 202 -38 135
4848A35p5l45O40n29N9K41j92jJ27j14mk7J41O4j24j34J01r3L0L21l15n2J22m
$$ 135 60 -285 355 -174 -115 126 -66 -67 60 -54 -58 -85 56 120 -4 -138 -37 -130 -100 221 -94 -146 -24 -28
4872b8J59j35r8K80j90m5K36k15J4R0Nm3j51L55j73N4m13N12j67j89J18pM9J98
$$ -28 131 -4 -102 178 -12 -57 179 -36 -22 68 73 30 -121 234 61 115 -298 214 47 -142 -24 -31 18 216
4896B16k59m8j92K47o4K31L0k05k1L7J7J57j41M9J31l30K19j53J23J61k17j38
$$ 216 -43 -91 -283 -36 -100 131 161 -44 -65 -28 -11 146 5 54 185 -145 74 -79 44 205 -12 -150
4918a50Q5J40j96L22n36K72l9J51o2P5q1k18L85q1J02k20L9J71j08j21J32j26
$$ -150 -65 75 -121 201 -335 -63 -102 49 -13 62 -19 -237 148 67 169 -51 -12 159 51 -70 62 -64
4940f4J10r6K03k09R0J8j29J90M7j13Q4l19K80j90J20j73J34Lj1J6ok0J02k28
$$ -64 46 -50 153 -56 34 52 -77 113 160 47 131 -188 92 -98 22 -151 -17 -14 -25 -9 -15 -35 67 -161
4964a61L04j00R7j3k17J22j39J25j35J74MJ08P5n11L97j08j03K22j24r6Q6m8L60
$$ -161 143 43 140 127 -90 32 -107 18 -117 57 61 169 244 -267 130 22 -81 141 17 -79 7 -41 319
4987C19m25N2P1M2r6J13j47J45m1K5J0j60P1j74K58m5p6N4J08r5o1lP2r2J23j30
$$ 319 -106 -54 17 59 -37 76 -71 74 33 58 68 -92 -21 -195 63 18 -58 -4 104 9 -52 -55 17 -75 48 -82
5013h2k9L6J14n0R6o6P8k53L4J3J87J44l86J60p0l9O7K97q1j82J80j85J82j64
$$ -82 -111 -75 39 -11 85 19 97 -156 -122 -109 78 222 -164 -4 -74 -113 -46 251 170 -12 168 -17 165 1
5037AJ85j26l66M97k50J43j48j51L55k13j14R0K6J51K62l20k01K76k49Q0p3J86
$$ 1 186 60 -306 191 -59 84 -64 -215 140 -73 -187 -97 -71 80 342 22 -179 97 -152 -72 -145 41
5059D1J12R2j84r1j59K15k2j50L30k34K93k32O2k05M2J8k2k9J60oj43J94k34J60
$$ 41 153 245 61 -30 -189 26 4 -146 184 -50 243 11 73 -132 -90 -72 -94 -123 37 31 -112 82 -152 8
5083Hj10J78q6J2j19K09R5m60K61J25j48j07J89k9o4J30L9q9k26J22J19q5P5k38
$$ 8 -102 76 -10 2 -117 92 187 -273 -12 113 -35 -142 47 18 -46 84 123 34 -192 -70 49 -36 39 -199
5107a99K47k4J98l67j49K50N7J14j26o0N9O5j09K0j43K03P1n3j74N2J31j1rl9
$$ -199 48 24 222 -145 -294 -44 13 127 1 -59 0 65 -44 -24 -167 36 107 54 -120 -68 63 52 43 4
5131DJ70j83M0k32M39k31m7N8o0J46k02j29J88k56J34J16J44k90K08jl22K54j97
$$ 4 174 -9 31 -201 238 7 -40 18 -42 104 -98 -227 -39 -295 -161 -45 99 -191 17 16 -306 -52 -249
5154b49L43k2j35k08K17K67k29j79K02m0o9J61k7j17J56qn6j95K87O9l32J79K07
$$ -249 94 72 -63 -271 -54 213 -16 -195 7 -33 -102 59 32 -85 71 63 7 -188 99 168 -164 15 222
5177B22k72J10p6M3K3l14L54P7k33J63k09J56Q9j20j32mJ75j31j13J93j42K33
$$ 222 -50 60 -16 27 50 -264 90 167 -66 97 -112 44 133 13 -119 -123 52 -79 -192 1 -141 92
5199I2j48J54l1j14L01q0k29J82j32n5P7J10p9k38J64K94l79J22j77K82K35k89
$$ 92 -56 98 67 -47 254 174 -55 127 -5 -60 17 127 48 -190 -26 268 -111 11 -166 116 351 62
5221F2N0j96J65k00K47l2M5p5j3R7j33J60r3L1j15P0p2L5J7k13j5J13J17j13Q8
$$ 62 112 -84 81 -119 128 96 141 66 53 150 17 177 84 115 0 70 -2 33 50 -163 -178 -65 52 -61 27
5246B7l3K42k63R4j50J52J6k62K14k0%R5k1J51l29J15%L3J21r7k03J79q0K37j3
$$ 27 -6 236 -27 67 -83 69 85 -177 37 17 17 112 91 242 -87 28 28 61 182 85 -118 61 -19 218 205
5271B05l08R4oK6P5j30M5K3P7j22j67K76k02K7J16j35MK30oj55N5j06q2J55N8
$$ 205 -103 -9 -15 11 86 -44 1 24 101 -21 -188 88 -114 -87 29 -106 -102 128 122 -33 22 -84 -166 -11 47
5296D7r2L35l78Q2p7J64n5P8j05M6L30l51J2p4m4J01o17O79k05O7j43J23O5l6
$$ 47 -45 290 -88 -6 -83 81 26 104 -1 45 375 24 36 -38 -82 19 -598 81 -124 -57 -200 -77 -12 -48
5320d8k52K68M2m5L38k48p0j70O9J99j74K18j86m1p4J28o7K75k10o7m6J77o9J13
$$ -48 -300 -32 10 -35 303 55 -15 -185 -116 83 -91 127 -59 -100 -174 -46 -113 162 -48 -115 -161 16 -53 60
5344F0k31N4pM26r5k58K29k33J02O3Pj08J06k77q0N19k99l6J47k09L46k96J15
$$ 60 -171 -117 -124 302 207 -51 178 -55 47 110 117 9 115 -162 -242 277 -22 -58 89 -120 226 -70 45
5367D5J58Q3m45N43m86J39o6k49L65P6j21K05o2k77J1Qj21L53j61K1j99J75l2
$$ 45 203 286 -159 384 -102 37 -29 -278 87 163 42 247 185 -92 -81 -73 -194 159 -2 19 -180 -5 -37
5390c7J25K1Q4l2l88L45j18j38K15j40KJ75k70k04K67j39k1K44j03R8n5j53J35
$$ -37 88 109 193 161 -227 118 0 -138 77 -63 -61 114 -156 -360 -93 -232 -253 -9 -112 -14 -69 -222 -87
5413h7O7P6j27K10j76q0J04J62l04K59p7l29K89J9J44k37J80l1k97K86r5J44q4
$$ -87 -20 56 -71 139 -37 -117 -13 149 -155 104 27 -302 -13 6 150 -87 93 62 -235 51 -44 100 16
5436A6j77J4M6n4J41L7n5J86l15J42j5J14q6J8l60L32N3o2k9k0Q0q6J05Ok58J78
$$ 16 -161 -147 -101 -155 -14 23 -32 154 -161 -19 -34 80 -6 12 -348 -16 37 -25 -54 -74 6 -80 25 31 -227 -49
5462d9J50j8j92oK27j90K42j54R7J02j87k2J9q3K37k01k1K03j91R8rj87P3l29
$$ -49 101 83 -109 -115 112 -78 164 10 107 209 22 0 19 -64 173 -28 -49 154 -37 61 52 -135 -62 -391
5486c91K87R1J50j36J84j92n3n3K37j78J83j09J68q1k85M1J16j92K38J32j84k2
$$ -391 -104 -13 137 1 185 -7 -60 -113 124 -54 129 20 188 107 -178 -137 -21 -213 25 157 -27 -49
5508d9K44l77K73m2O3k49J38k36M39j27m28O05k65l6K07j70j1K21j73k32L37j20
$$ -49 195 -182 91 49 112 -137 1 -235 204 77 -351 254 -11 -47 160 -10 -21 200 27 -205 132 12
5530A2O8j72J16Q9n4J10k74K72Nj04J75r9j18J05j47l2J74m87L64m9o1J22Mj34
$$ 12 80 -92 24 113 59 169 -105 167 172 68 243 144 26 131 -16 -48 126 -361 3 -46 -107 15 19 -115
5554a15J9Q0J37l4l9K23l7m63K13j75Q6L46k51j82nK38J58j70m6N5k77J28J48
$$ -115 -96 -16 121 87 48 271 234 -229 -16 -191 -105 241 -10 -192 -197 41 199 29 -17 38 -239 -111 37
5577C7j90K51J4k01J74l0q4j29K63l0j00L0J85k62j49K92J54k45j06j18J22P9
$$ 37 -153 98 112 -89 85 55 -29 -158 105 75 -25 5 190 -72 -221 71 225 -20 -126 -244 -122 -43
5599d3Q8k12J67j99K47k03m6N3O5m7L5J70o3p4J14J7j66J70m8n6J4k0K45j86p
$$ -43 45 -167 0 -199 48 -155 -201 -148 -83 -130 -95 75 12 -62 52 69 -97 73 25 -31 -17 -37 208 22 15
5624A5L1j49J99j19j6N7p6J7j20K83K8k07j53K35k1n3M02l91N7l60J92K07n4K3
$$ 15 46 -103 96 -23 -39 18 -58 -41 -161 122 150 -57 -210 25 4 -49 353 -38 19 -341 -149 58 4 27
5648B7j3N1k17J51JQ0l42K61j43N7N0M0J19j36l24K42J97Q2R3j78oj57J69r2M5
$$ 27 14 65 -152 -1 0 80 -262 -1 -144 -87 -37 3 122 -14 -338 -96 101 183 276 98 92 -65 104 12 57
5673E7k0j20K41k61J35J09J0k79N1K22r0K1l52N43l02o7j26kL65J53k73p4Nn4
$$ 57 37 -83 158 -103 32 141 151 -128 -77 145 55 76 -276 267 -35 -102 -228 -230 135 288 15 -59 -54 -108
5697a08n2O33m78l6Q1J02j52J19o0J5k0J26o7k62K57j11P8l6l5p5J19j26J34j08
$$ -108 -160 473 -5 -41 40 142 -10 109 49 64 44 170 103 -159 98 -13 65 29 -6 -81 38 -88 46 -62
5721f2Q7j6K39l14K78k16K53k00j47J63j12J58J44n00K59K21l04j05M3n0K29n1
$$ -62 25 9 248 -66 212 -4 249 49 -98 65 -47 111 255 -245 14 235 -69 -174 -131 -181 48 -3
5743clo3J10l25K32J16j14q9JJ25J08k30Q5J87j95R8J4p9q7J24q6K7OP6Q7j06
$$ -3 -6 -69 41 -284 -52 64 -50 -139 -138 -13 95 -135 -50 137 -58 40 54 -25 -112 12 -74 -47 -41 35 122 16
5769A6l9j53l3Q8L24k55j17K35J09j86J1K2k02q2L48J1k82M09k00N2J27k69j9
$$ 16 -23 -176 -209 -121 203 -52 -169 66 175 -11 0 22 -180 -262 86 97 -185 224 24 76 203 -66 -85
5792h5p2J38j72l5J81L5m4k38K83Pj09j7L71m25J66j09J93Q8p1J16k08J1Q7j05
$$ -85 -157 -19 -191 -226 -45 -10 -54 -292 -9 -2 -111 -128 243 -182 -16 -125 68 156 85 201 -7 4 91 -14
5816a4L09l31J92k24K76j46j05J41j85M8J07J31l78K19K03k79k06K85j19J63J00
$$ -14 295 -36 156 -68 208 62 -43 98 -87 -39 68 199 -179 40 243 -36 -242 43 -76 87 187
5837A87j67J15k51k3J22k17J69j14K70j88l0J89r3J71J2p2k2j02k28L28J52j69
$$ 187 20 135 -116 -139 -17 -234 -65 -179 91 -97 -127 62 -31 140 152 80 58 -44 -272 56 208 39
5859C9m0j98L00j79J93j80j04K09J62j27k37J56J66m52K16J74k3j68P5q7J49m2
$$ 39 -1 -199 101 -78 115 -65 -169 40 202 75 -162 -6 160 -292 -76 98 75 -93 -18 -105 44 2
5881Bk10K5M53j71j47J09j06J57p6j19j49J47o8J36L1m4m3n0P1M1K49n2j96J01
$$ 2 -208 -183 270 99 -48 61 -45 112 36 -83 -232 -85 -153 -17 14 -30 -73 -123 -52 -11 238 186 -10 91
5905I1k7n9R5j18j03kL8O6l2j71J04m7k07N73k62J13q5O6l5J55j72n3J8m4K79
$$ 91 64 5 100 -18 -121 -123 -85 -19 -51 -222 -118 -165 -372 201 -61 52 -33 33 -2 153 -19 -72 -54 -98 181
5930A81m1lk77K19k3j16J46k04K22k28J15n6O9j21J62p6J03j81OL21L6l89q0K05
$$ 181 140 137 -140 79 56 -60 86 -118 104 -124 -9 -65 4 -117 45 -31 72 -109 -103 218 254 -135 -215 -10
5954a0J36p7r3j48K88j04j97L43m16M24l8k1j51K65l19P6L1j51K59j35N3p1m2
$$ -10 126 49 -44 -192 96 -8 -205 138 -278 146 108 87 -64 201 -118 -42 -11 -162 97 -38 15 -56 -98
5977i8K75k10j16l9Q8K51Jq0J66r8k75k5J50j6j29J67M7k3k00J29K43k49q0K61
$$ -98 177 -33 -149 -188 -100 151 152 72 238 140 -135 -160 -10 -26 -155 12 59 36 -164 -35 208 -41 -121 140
6001A40j27j62k8J84M7J51j8j8m1n9k39J55K0L6J14n1j00M2l73M93N7l59j46L6
$$ 140 13 -149 -177 7 54 205 187 169 128 69 -170 -15 5 41 155 104 4 46 -327 166 223 -136 -282 -246
6025b46L11m9Q4j31J33l06J6K11r7lK25j71K2o3k03L87j9k01K2J07J40j83L5o7
$$ -246 65 16 100 -31 102 -204 -188 23 -74 -77 148 -23 -1 -64 -267 120 101 -100 -78 29 169 -14 21 -46
6049d6J77k8l40K61J53m24K68L8k1q4L5Q6o0j3R6j5K93j28l58K30k26r7K98r7
$$ -46 131 103 -237 24 177 -247 21 59 38 -46 -11 75 15 2 98 83 376 248 -110 120 -106 -203 95 -2
6073bj06J31j21Pj88J29J65j8Q8J13n1l39J54j98K86j39Q0N0m4j28L6J39j24J86
$$ -2 -108 23 -98 -91 -279 -150 15 -3 85 198 147 -192 -38 -236 50 -89 -9 41 -3 -131 -95 44 -80 106
6097A06j63K6k8m9L4j33m4J06K88k6%k21K44q3m0Kn5k6K71k88O9NM4O9R7r8k18
$$ 106 -57 -31 -59 -108 -74 -207 -251 -145 143 117 117 -104 140 57 17 19 -36 -62 209 -79 -10 -5 39 108 205 107 -111
6124a11J95Rk28P1l8O2j1J32j95J88J24j71L5N4M8k35k15K49J20j71J32R1k89
$$ -111 84 93 -135 -64 -102 -40 -51 81 -114 74 198 27 62 116 164 -71 -286 -37 83 -88 44 135 -154
6147a54l7J50n3P9J68j18O2N3Jk90K49J8K8j46J10j56j7l6Nj0n5n7J12k0J37r
$$ -154 -191 -41 -94 -15 153 35 97 150 151 -139 110 128 156 10 120 -36 -53 -89 -84 -94 -149 -206 -94 -114 23 14
6173A4L7o6O6j34j12J47j45J46L78l78L1K03j40l13K82j00k79N34j91J94j92j45
$$ 14 51 -15 51 -83 -195 -48 -193 -47 331 -47 -16 187 47 -266 16 -84 -363 171 -20 174 -18 -163
6195a63J61P6Q5l0j91J21J6j27jp7K47j06j27j99K78K3k5P9k8K58k73m3l0p2J27
$$ -163 -2 74 159 129 -62 59 75 -52 -53 -130 117 11 -116 -315 -37 -14 -39 40 12 270 -3 -46 -76 -148 -21
6220b1N5QR0k0j0j8k93J79j13J57k72N9K96j18J15k93J85J86j73J54O4k44M5J23
$$ -21 34 42 132 112 102 84 -209 -30 -143 14 -258 -199 97 -21 94 -199 -14 172 -1 153 217 -27 18 141
6244A41j47O3l2n9k2N9o4m9o0K80q3k6K6k85L14K4j80j0J65P1j93PJ67k04j21
$$ 141 -6 57 25 -34 -56 3 -61 -110 -170 110 27 1 27 -258 56 80 -100 -110 55 126 -67 -60 107 -97 -218
6269b18K40J16l1k03K53l13K84r4j12n5L07k04m6J29j47Q9Jl5q5K94k35K38q1
$$ -218 22 138 107 -96 157 -156 128 34 -78 -133 174 -30 -76 53 -94 -5 -4 -39 -124 170 -65 173 92
6292I2n5J66j76J74k90N1K7J01k55R8J11k28M29J42m73j01m5L06K32r4k68L3k6
$$ 92 37 203 27 201 -89 -38 -11 90 -165 -67 44 -184 245 387 -86 -187 -232 74 306 212 -56 -23 -49
6315d9r6R9k94Q0J17J46k14K89k21K59k30J31R2j68M0P9k51P4p2o7L45k33R3k1
$$ -49 -145 -46 -340 -260 -143 3 -211 78 -143 116 -114 17 109 -59 -19 60 -191 -117 -189 -256 89 -144 -51 -72
6339g2N13o96K55j24L2J91O5k60j70K73n3K68j98P8m06M39j04o6R4m99L44K40
$$ -72 441 -255 0 -124 -92 99 164 -96 -266 7 -46 222 24 102 -304 135 31 -35 59 -440 -96 144
6361A44j08o9J67J37k58J04m18L09J56o5O2k15oJ07k4K1j5%O7k16j1J74p2qJ27
$$ 144 36 -33 134 271 13 117 -301 8 164 99 161 -54 -60 47 23 44 29 29 96 -120 -131 43 -29 -37 90
6386I0l10K23n1kj66L49j17L08l39j24K79N0r3k32J07j11L87j01n6Q8k91O6J83
$$ 90 -220 3 -48 -50 -216 133 16 324 -15 -139 140 190 97 -135 -28 -139 248 147 91 179 -112 -46 137
6409A37m05L22o3j19m1K86l08K89N7j61M9M4J84l89J96L5j62J17p4M4mk6j05K02
$$ 137 -268 54 -9 -128 -169 117 -191 98 155 -6 43 87 271 -118 78 113 -49 68 -6 38 34 8 -97 105
6433A05k79J51J02m0q2J93l11M8K36k54K24L7l53K37J79k46L20k35o4j8Q7J00
$$ 105 -174 -23 79 39 -43 150 -161 -113 123 -131 93 130 -223 14 193 -53 267 32 -32 -50 37 137
6455A37n2j38K71l71m7P0j51L36m90O10m5k17L08k05j52P7k00O7L35j86L6j40
$$ 137 85 -53 218 -153 -200 -130 -281 55 -435 175 130 -87 221 16 -136 -59 -259 -192 143 -43 -7 -147
6477a47J78j26l0K51k42N4k8K8J66k66J99J40k20P0J01n6j44N6o8O8j30K26j84
$$ -147 31 -95 -125 126 -116 -62 -90 -62 104 -162 37 177 -43 27 128 72 -72 -16 -84 -16 -146 80 -104
6500a04J29n2L9o4m1l2J41N9n2QK58n36J14K75k22J34J33M9l35R5j16J42j01j4
$$ -104 25 -27 12 -52 -93 -125 16 75 23 31 289 -247 -133 142 -80 54 187 236 -99 -4 -120 22 -79 -93
6524i3r3RK32k56K29j75R2J38j28J4n0J50l31J23N8n0L8K08j57j64J26J02J85
$$ -93 -186 -177 55 -201 28 -147 -55 83 -45 -31 -81 69 -262 -139 -81 -131 -93 115 -42 -206 -80 22 207
6547B07k63o2J67j3Nq1j03J16k22L06NP9Q8m27J85R1k22Q9M0o7L07j15k5O0N3
$$ 207 -56 -118 49 36 41 -40 -143 -27 -249 57 62 141 229 -198 -13 78 -144 -55 -15 -82 225 110 85 145 198
6572A98j22J21k70J64k06J22J38j85L85l69K3k48j2M42k30j85L62O7j64o0M9k9
$$ 198 76 197 -73 91 -115 7 145 -40 345 -24 -1 -249 -261 181 -49 -234 128 195 31 -29 20 -9
6594il9o2K12l0j1l24L36l16R3R7J11K42l19K00j24j21l5m5K51k09J28R7J53j62
$$ -9 -48 -110 102 72 61 -263 73 -243 -150 -53 58 300 -19 181 57 -64 -99 -144 107 -102 26 123 276 114
6618A14j57J62K8j78P7m2m0J0J81q6j14K11l65q1O5J92J21j09j18j03K84L3M8
$$ 114 -43 119 147 -31 46 4 -36 -26 155 69 -45 166 -199 -280 -215 -23 98 -11 -129 -232 52 85 133
6641A33N0j65n6j08K98Ll90M73K4k47k15J96M7P8j95l8J8L2j94K87l76L28J82
$$ 133 183 18 -38 -146 152 155 -235 238 262 15 -200 -4 43 121 -74 -112 -94 -62 -256 31 -345 -17 165
6664A65m10J98J18K11k51nk79J66K91j22l12J89j8J11l6j05O2JK4o1K2J6J23m5
$$ 165 -245 -47 71 282 31 26 -253 -87 204 82 -230 -41 -59 52 16 -89 -27 -26 -2 -63 -41 -25 98 53
6688E3k28K17pj24J51n5k8L9J79j12m9j47L5l9K38j57J35l2P8L7%Q5k93j56J43
$$ 53 -175 42 35 -89 62 7 -21 18 197 85 36 -111 -76 -115 123 -34 101 69 147 184 184 269 -24 -180 -37
6713c7J55k52m0K91R1j74m9J17j77K9k41J60L63k77M1n3P7p4J8J75o7j89M3r8
$$ -37 118 -134 -174 117 208 34 -15 102 -75 -46 -287 -127 236 -41 0 -53 24 -50 -32 143 76 -113 -70 -168
6737a68L26l18J34j50L02j8l05j48K63L00l14K55j5j72JJ93k12J60j07J27l7j16
$$ -168 158 -160 -26 -176 126 108 -197 -345 -82 218 -96 159 144 -28 -27 166 -46 114 7 134 97 -19
6759a9J07j07r7K48L3q2K30l66J55k11P7J79l23J65m1P9P1j27J84j96j03R2r0
$$ -19 88 -19 -116 132 165 83 313 -53 102 -109 -32 147 -176 -11 -52 27 98 -29 155 -41 -144 -52 -142
6782a42j4R2Jj29Q7K77j25l30M77j71j13L08m55J53M10j04m3j83J72j33k4p3M
$$ -142 -156 -64 -63 -192 -105 172 47 -283 194 23 -90 218 -237 -84 326 222 179 -4 168 35 11 -62 -58
6805e8o1K61k36K22k70K37k26J95j17j35L47n6Pj18j03K95k91J4K31k2l18M87
$$ -58 -119 142 -94 128 -142 95 -131 64 -53 -188 159 103 110 -8 -111 184 -107 -93 138 116 -202 285
6827B85l50L8K4ml20J92K69l46J40j17J14L9K58l97J44M5j63n3K29M1o7q3J79
$$ 285 -65 -27 -3 -7 -327 -135 134 -212 -72 -189 -75 -36 222 -175 -31 14 -149 -202 27 68 1 -82 97
6850I7j4qk03K46o7k94J36Q4l6l9Q0r6k73N09J13j7k90lK95n7j21L9j14n1R6q4
$$ 97 83 75 -128 118 51 -243 -107 -23 -59 -98 -18 -114 -387 122 235 218 -72 -75 220 163 42 81 -33 -84 12 -72
6876g2J17k28M5J73j32Q5J15j41o6j31K44j24K82J11j76k21J04P1k39L59k22j95
$$ -72 45 -183 -138 35 -97 -12 103 -38 -104 -235 9 -115 167 278 102 -119 -15 56 -183 176 -46 -241
6898b41K17R3n6j51K35K3j27o1k9J07r5K65k15L09j26j80P9K5r8K85k66M5R3j94
$$ -241 -24 69 13 -138 97 120 -7 -68 -97 10 -85 180 -35 274 148 -32 47 72 -26 259 -7 38 131 -63
6922f3Om3R5j06K75j60M4n0l47J66J97l7L5j29L87m73L65l9k21J29m2K0M9p6K95
$$ -63 -57 -100 -5 -111 164 4 48 -2 -349 -183 14 -23 12 -117 270 -203 162 123 -98 31 -11 9 58 -18 277
6947B77k60Rp2q8J5J17k09J51K8O0L0L08m79O8L46m34L37j83j38j42K00j62M42
$$ 277 17 26 -46 -134 -119 -2 -211 -60 -32 28 58 366 -113 -45 301 -133 204 21 -117 -259 -59 -221 221
6970B21k15o0J03k34L08l4k50J55L1p0j87L75l04K62j92K78k69O1K18k36N8j52
$$ 221 6 -54 49 -185 123 89 -161 -6 25 -45 -232 143 -161 101 -91 187 -82 -21 197 -39 19 -133
6992a33j42L61P5j83J65j55J62q8l33R3J92p8n6qj3j18K13J80j39j9K9k46L52
$$ -133 -275 86 161 -22 143 -12 150 62 -271 -178 14 -64 -120 -128 -141 -259 -46 134 -5 -24 5 -241 111
7015A11j72j8l9J31lm6o6p7J61M5N9k0r2P8k28J16K47l06R1J76j40k41K43k5K36
$$ 111 -61 -79 -118 13 10 -36 -102 -179 -18 27 86 66 -26 52 -176 -60 187 -119 -28 148 8 -233 10 -15 221
7040B21k62J44j57L8J32k53K3M09k45o6Qj55J20J02n4n3M3J56m65K83J0Q8K0j62
$$ 221 -41 103 -54 -16 116 -137 -114 295 50 -16 -8 -163 -43 59 5 -48 -5 151 -314 -31 -21 67 87 -75
7064g5K28j50r0J26j29j74K27J78k39P9J04J28j70L5j86K40o9r7n0J45j36q3P4
$$ -75 153 3 -87 39 -90 -264 -37 141 -98 -19 85 213 43 78 -108 132 63 -34 -84 61 -75 -158 -84
7087h4J62q4P2m3j68N2L3J11q5K06k45m8L10k03n8q3j1J91k5q3M14j03j64j40
$$ -84 78 -6 66 23 -145 -93 -60 51 -34 172 -73 -121 189 -14 -72 -155 -166 25 0 -83 331 228 64 -76
7111g6j24K74l95L03j58J08rJ60Q2j6k12K64l42j55J46M17k85J54j68K3l5R1J18
$$ -76 -200 74 -321 -18 -176 -68 -77 83 165 149 -63 201 -141 -296 -150 267 -18 136 -32 -9 -44 47 165
7134A65m22N01l00O3Q0l31J37j67J96r2J17J32L2l6j89j27K74j42L04j79k1l3
$$ 165 -257 244 -56 7 87 -244 -107 -274 -78 -170 -53 79 111 75 -114 -241 33 -109 195 16 -5 -38
7156c8r9J35J26l06K06j72J96J48k71N5PJ12l31J80o9N4R1J32m59K57pR5q5N8
$$ -38 -137 -2 124 -182 24 -148 48 196 -75 -20 -13 99 -232 -52 -121 -67 24 156 -303 -46 -53 42 -43 15
7180A5J66q3k9k38J26Q3J05l58K08pj12PO0M0j07j22J99J02k23J04K07Kp7P0j76
$$ 15 181 98 69 -169 -43 40 145 -213 -5 -12 -124 -117 -57 -17 -124 -246 -47 55 -168 -64 143 145 68 138 -38
7205c8O3J41n9m5j8j82j08L2J18L4J77j23Q8N9m19P9N04m65K24k08p0K11O3j69
$$ -38 25 166 107 62 44 -138 -246 -214 -96 -62 115 -8 80 139 -280 -201 303 -162 62 -146 -216 -5 58 -111
7229a11Q9P7r9J19L7p5M3k68L03k56J74q4P2K4k98J77j65L72k53j10L43j44n2
$$ -111 -22 55 -44 75 112 37 80 -188 115 -141 33 -51 21 45 -253 -76 -241 131 -122 -232 111 -33 -85
7252h5J47q3m1J45O9k15j67J34lJ59j19K31n3J09k98R4j58j25K83k08L30k69K47
$$ -85 62 -21 -62 83 152 -63 -230 -96 -99 60 -59 172 119 228 -70 24 -134 -259 24 -184 146 -123 124
7275A24M4k05R4j84%K64r7lP2j50j05K82j66j66K61%r3KL2l0O5O5m9j15qK25k4
$$ 124 168 -37 57 -127 -127 137 40 37 109 -41 -146 136 -30 -196 65 65 -28 -26 6 -24 41 106 57 -58 -66 159 135
7302A35j07K64l19n4m0K70r6O6j15r8J03P6j30j8L90l48k07L08Ok12J09J66o1
$$ 135 28 292 -27 -81 -121 149 53 119 4 -94 9 85 -45 -63 327 -21 -228 80 86 -126 -17 149 88
7325H8R8o0j20M5m08K20K60k7n8J7rj73m7K70j91J10n8R2P6l96K35p3r2J95rr
$$ 88 186 126 6 51 -357 -137 123 96 38 55 46 -127 -174 96 -95 15 -43 49 125 -271 -36 -109 -201 -6 -15 -24
7351b4j92R5K06j08m3J30k42J34L35k54J13o6l6l0j55P9K7O7j32J72n9J91m78
$$ -24 -216 -121 85 -23 -66 64 -178 -44 291 37 150 84 48 18 -137 -58 -31 36 -96 76 17 208 -270
7374b70K94qJ30k71k7J54m2l9K04p5m0j05J74m3l4J40j57J02q2j60J30MJ1K23
$$ -270 24 16 146 -125 -152 2 -40 -79 125 50 10 -95 79 36 2 142 -15 87 5 -155 -25 -21 -10 213
7398B13j87l23M1L38q3r1J53J25M5k44j55K53j32O7Kn5j00J79J38j96J45k04L4
$$ 213 26 -297 -256 82 -1 -92 61 186 231 -13 -168 85 -47 20 22 -33 -133 46 184 -12 133 -71 -37
7421c7J49j54p9J76j13%L6j06K59k72Q8k5R2l0k15J95j9p1J65o1j9K6O0k5J12
$$ -37 112 -42 -121 55 -58 -58 -22 -128 131 -141 -53 -78 14 -16 -231 -36 -55 -126 39 -22 -41 -15 45 20 132
7446A32J1j81M8j3j56L83O8k92Rk58J80KQ6M5J93n74J31J74K5j4K17l49K75Mp5
$$ 132 143 -38 10 -3 -159 224 292 0 9 -249 -69 -67 19 64 257 -317 -186 -12 13 -1 216 -133 142 146 71
7471G1j09JK05J6R3o0l38l6K92k17K07j34J27K4j63m0L19l4l25J59j28J23J29
$$ 71 -38 -37 168 184 277 217 -121 -157 135 -82 125 -9 118 142 -21 -61 258 224 -101 58 -70 53 182
7494A82m01m0L15%J13k57J02r6mO8P8L7k86J18q6R2p0O4J32q6Q0Nj72Q6r0Q2o2
$$ 182 -219 -259 56 56 169 -88 14 -82 -86 -18 60 97 -189 -71 -157 -65 -135 -71 61 -25 55 60 -112 -26 -116 -34 -96
7521i6l2m9q3K26mo3K8j24J42RK05r2J21L6l95J78O1jr9Q4j65J71Q4ql34K72k9
$$ -96 -128 -177 -260 -34 -38 -101 -73 -197 -55 -46 159 67 188 224 -171 7 68 67 -32 52 -113 58 142 134 -200 72 43
7548D3K1j0K8j47J05j47j21K06N3K9q8P7J87j01j56j3k25J52P5K33j72N1j59K11
$$ 43 64 54 82 -65 40 -107 -228 -22 31 60 -28 49 236 135 -21 -34 -259 -107 -32 201 29 80 -79 132
7572A32k52j07L35o4l38M15o2k97K01jL3q5P6N0Q3j93q5N5K65k26J0k2N2K78j29
$$ 132 -120 -227 108 44 -294 121 59 -238 -37 -38 -5 -90 -14 36 119 -74 -159 -104 161 -65 -55 -77 -25 253 124
7597A24k58J43l1K27j78r4J42l7n8K84j87n2Q2o1j57P3J60j64O5l5J91k26l8K73
$$ 124 -134 9 -22 205 27 -67 75 38 -20 264 77 25 107 46 -111 -38 122 -42 23 -12 179 -47 -85 188
7621A88k8j81J28j75J00N3m4j9o9R2jr0K07k27r7K87k12K04j95O1J3j7n6L8N8
$$ 188 160 -21 107 -68 32 85 41 22 -47 45 44 -46 161 -66 -163 124 -88 116 -79 -18 -5 -22 -78 -40 18
7646A8k9RJ70j05n3m0P8k78J4L35n8P6k21q2M91m74L69Jj04Jj80J78k14J53k48
$$ 18 -11 -2 168 63 10 -30 48 -230 -216 119 61 137 -84 -166 325 -149 220 221 117 118 -62 116 -98 55 -193
7671a93N7J94l17J35j07J54n4pj39L12j99L5J50o5J31j63N6j1r9J78l74M20l1
$$ -193 -136 58 -259 -124 -231 -77 -131 -138 -277 35 -164 -129 21 -44 87 -76 -20 -31 -130 48 -326 94 63
7694F3Q1k80K08l55L41n1k96K69K2J34j19P8j69L3P3j40J2O3M0j10J37mn4J0Q8
$$ 63 144 -136 72 -283 58 7 -289 -20 2 136 17 95 -74 -41 32 -108 -96 -33 7 -103 34 30 -24 -14 74
7719G4j09j7j0jo9k2L07k7r4N9m9j30K06l15L38q3O6k13J54MJ40o6r2j98J70J38
$$ 74 -35 -52 -62 -63 -132 -154 153 126 32 91 42 -88 118 -197 141 58 124 -89 65 69 209 143 51 -147 23 161
7745A61j43K67j98j88rr4Q0J14l0j28R8K17j70J01j03j49L91j29o2M3P5o8m8j95
$$ 161 18 285 87 -101 -110 -204 -124 -10 -40 -168 -70 147 -23 78 -25 -174 217 88 26 69 144 76 28 -167
7769a67J59J05K0Nj88n6L08l96K66K00k39O7k7L6r4L8o6J96j76L1L7o0P8k45J43
$$ -167 -8 97 117 122 -66 -122 186 -210 56 256 17 84 57 93 -1 37 -29 167 -9 22 59 -1 77 -168 -25
7794b5L37l04j53O9J20N9j36J94k94J23k5J65j18J0N1R2k14N3J1l0j72J40L9J97
$$ -25 312 8 -145 -76 44 103 -33 161 -133 -10 -35 130 12 22 73 165 -49 4 15 -15 -187 -47 -8 189
7818A89j82l4j04jJ13j93J13J04j70J01r1k7J36j01L48l17L9J9j66J25j24L92
$$ 189 7 -27 -131 -132 -19 -212 -99 5 -165 -64 -155 -182 -46 -147 201 -116 -77 -58 -224 -99 -223 169
7840A69j04q0J56j90O8l5J55j94no6J06k3K63l11K71j78p9LpJ15r6O4j4K3J9k25
$$ 169 65 -15 141 -49 19 -16 139 -55 -60 -126 -20 -43 220 -91 180 2 -77 -74 -81 34 -62 2 -12 11 30 -195
7866a95L39k5o9j04J51q1P1k13k7q7J51l5J73J11k3j71J45j99K55K2j13J00k49
$$ -195 144 119 50 -54 97 16 87 -126 -153 -240 -89 -124 49 160 137 -34 111 -88 167 189 76 176 -73
7889g3J12j21M17k15j42k02O4K54n4j67M1P1j74J58j0J55K0k35L80j89k47L8J79
$$ -73 39 -82 335 120 -22 -224 -160 94 40 -127 -86 -15 -189 -31 -41 114 134 -101 279 90 -157 -119 60
7912F0n0N9p1l16O00l10m7L76l56N0K14J85n56K39j34m6K65r8j12K1PJ9K08l65
$$ 60 10 69 -2 -318 282 -28 -75 301 -55 -5 209 394 -162 77 -57 -103 162 64 -48 -27 -20 -1 207 -158
7936a58J70N0K64j53j41J10j71r7L82k55j45J21j07m3N2L67k18j26K26j11q1K04
$$ -158 12 62 326 173 32 142 -29 -126 256 1 -144 -23 -130 -173 -121 246 28 -98 128 17 -64 140
7958A40p4j4J11j19P4k38j13J50M7J7l4J02n4J10j07M6j28J57M5j30j7n5j2k39
$$ 140 66 52 163 44 118 -120 -233 -83 -36 -19 -53 49 -5 105 -2 44 -84 73 118 -12 -29 -84 -96 -335
7982c35M85l35K39j50J38n0k15K42j66J50j69J24J01j76J08J62k72n9L99l82J3
$$ -335 150 -185 54 -96 42 -8 -223 19 -147 3 -166 -42 59 -117 -9 153 -119 -178 221 -161 -148
8003a48l0J64j90K34J43k69j61L35j46K61k0k33J8r0K91k78N6K62k68o3J20K1
$$ -148 -178 -14 -204 30 173 -96 -257 78 -68 193 173 -60 -42 -132 159 -119 -63 199 -69 -132 -12 9
8025Io8L6J35j21m7k2K14j95J56p1m4J11k74k5l7L16l5j43J81M1o3l0Q6p2j19
$$ 9 -59 -23 112 -9 -56 -78 136 -59 97 26 -18 93 -181 -206 -243 73 38 -105 76 117 54 24 110 38 -81
8050h1K58k88J93j74J39J0r5k2o4l7L31k6r1N7r8O9j18j53K38l49J58j05K10J93
$$ -81 177 -111 82 -92 47 57 -38 -60 -124 -161 170 144 53 110 12 81 -37 -190 48 -301 -143 -248 -38 155
8074A55O5k75r2J84k5j35J40j61J08N6p6K26j99Q3n6N5j56K50j08J21j66q1J31
$$ 155 220 -55 -147 37 12 -123 17 -144 -36 20 -56 170 -29 54 -2 53 -103 147 39 160 -6 -87 44
8097D4l6k3j06K67k04R6O7N6Pj27k6M9l00K28l9L32l01j90K65M7O6j02o1O3j82
$$ 44 8 -15 -121 146 -58 38 105 161 168 41 15 64 -236 -8 -47 285 -16 -206 59 106 172 70 9 72 -110
8122a10J81J88l72J62qL2j00n1K12j62K0k24M08l80L3K6J54k18M62k37K13j33
$$ -110 71 259 -113 49 41 73 -27 -78 134 -28 -8 -232 176 -204 -171 -145 9 -209 253 16 229 96
8144I6j65r1L83j55j47J48M1p7k96K68J6r1L2N3J72l51J07L1R8r5Q3K50l51O1
$$ 96 -69 -160 223 68 -79 69 110 33 -263 5 21 -70 -38 15 187 -164 -57 -26 72 -23 60 310 -41 20
8168B0j1J1R2j88O4J14no7k48K0J42j21J91j5N4J07k52J51J33p3k47K58k16
$$ 20 9 20 112 -76 -12 102 97 30 -218 -198 -56 -177 14 -1 53 160 -92 59 192 119 -128 130 -86
8191h6
$$ Imaginary data points
##PAGE= N=2
##DATA TABLE= (X++(I..I)), XYDATA
0@%%%%%%%%%%qJ6j6K4l2L6m4N6p2Q8j04J21j45J76k08K41k81L27l76M32m96N67
$$ 0 0 0 0 0 0 0 0 0 0 0 -8 8 -8 16 -16 20 -24 32 -40 48 -56 65 -80 96 -112 129 -152 175 -201 231 -265 302
32C02o45P31q26R32j050J180j322J478j648J833k038K260k502K766l055L371l714
$$ 302 -343 388 -438 494 -556 624 -698 780 -868 965 -1073 1187 -1315 1451 -1604 1767 -1947
49a947M092m509M968n475O034o656P359q153R054j0093J1306j2740J4469j6599
$$ -1947 2145 -2364 2604 -2871 3163 -3493 3866 -4287 4767 -5326 5980 -6760 7709 -8890
63h890J9302k2868K7811l5168M7448p3021K21367k93334k8522N20683l98125j70974
$$ -8890 10412 -12456 15355 -19813 27635 -45386 175981 -117353 -145875 374808 -23317 -194291
75a94291L07833m4925k37667J53500J26292l9437j57438l256J65968n2164k03731
$$ -194291 113542 68617 -169050 -15550 110742 71305 -86133 -89389 76579 24415 -179316
86a79316J21691L1915j66650J27274J28585j60992M9925J19977o5240O2744N0710
$$ -179316 -57625 -25710 -192360 -65086 63499 -97493 -47568 72409 7169 69913 120623
97A20623j77998L5948J46563j05646p7637R2311M968n3478L9509R3151m8800j50551
$$ 120623 -57375 -21427 125136 19490 -58147 34164 39132 -14346 25163 118314 69514 -81037
109h1037J01753J51488k13134r8106K06440q4157j56774K09313J8636k18710J16103
$$ -81037 20716 172204 -40930 -139036 67404 -16753 -173527 35786 54422 -164288 -48185
120d8185J46664j22866j9940N5706n3211P202K7470k3767p440l7883L3226R5208
$$ -48185 98479 -24387 -44327 11379 -41832 -34630 -7160 -30927 -38367 -76250 -43024 52184
132E2184o9135m3998J10842n1507n4631J41679o6060j55984J43705O1106j53301
$$ 52184 -16951 -60949 49893 -1614 -56245 85434 19374 -136610 7095 68201 -85100
143h5100N4913Q6009j08012K0907J17541n6407p7373M3279L6294k1128l4404j34
$$ -85100 -30187 55822 -52190 -31283 86258 29851 -47522 -4243 32051 10923 -23481 -23615
155b3615J3462l0759K0282N7911n7503m3664P9801L237n0146L1648k3010m7463
$$ -23615 -10153 -40912 -20630 37281 -20222 -63886 15915 19152 -30994 654 -22356 -69819
167f9819O1497J9586o3543J0488L3296j2581J9193K0515k7113k0800K3008L4821
$$ -69819 -8322 11264 -52279 -41791 -8495 -21076 -1883 18632 -8481 -29281 -6273 28548
179B8548k0651n1537K3603L4031l9495J8832M3293o9340j0357R8914k7889p4368
$$ 28548 7897 -43640 -20037 13994 -25501 -6669 36624 -32716 -43073 55841 27952 -46416
191d6416N3250Q107n3763M4581K6308o7234k638O2986L222l2862M45K1006r226
$$ -46416 6834 14941 -38822 5759 32067 -35167 -37805 25181 28403 -4459 -4014 16992 7766
204G766j0009L2770q454o2342K4490O3018m5137l3687M9434j2457k7490N1345
$$ 7766 -2243 30527 22073 -40269 -15779 47239 2102 -31585 17849 5392 -22098 29247
216B9247j475o3569J9357L9143k3889j0962J1109j2853j145L2108O908l3466n455
$$ 29247 27772 -35797 -16440 22703 -1186 -12148 -1039 -13892 -15037 17071 23979 -9487 -14942
229a4942L9128N52k8030K0132R8m2375L2016M7918n8617k9973O4654j941m3753
$$ -14942 24186 24738 -3292 16840 16938 -25437 6579 54497 -4120 -34093 30561 28620 -15133
242a5133L3048J0750n5767J3029N3965l0048m7606K6180L0487k6310n946L0298
$$ -15133 17915 28665 -27102 -14073 39892 9844 -37762 -11582 18905 -7405 -13351 16947
254A6947k0654k9918M8853K1301o1354r33M6976k3041j4725L7503j9472l6375
$$ 16947 -3707 -33625 15228 36529 -24825 -25758 21218 -1823 -16548 20955 1483 -34892
266c4892M4740K5789m3631p740L0500j0641j2961K5535m155l9347J3542M6132
$$ -34892 9848 35637 -7994 -15734 14766 4125 -8836 16699 12544 -26803 -13261 32871
278C2871k2868l5650L2186J1436l3211K3040K6212n2569j0416N7878j0049m3738
$$ 32871 10003 -25647 6539 17975 -15236 7804 34016 -18553 -28969 28909 18860 -24878
290b4878K1816J6684k9005J2519K9577l0596k7248L6546J8993l4975m943K3509
$$ -24878 -3062 13622 -15383 -2864 26713 -3883 -31131 5415 24408 -10567 -15510 7999
302G999j5450r895L6051n959m3716K3455L6846k9279j3266K8185j5837j7542L7109
$$ 7999 -7451 -17346 18705 12746 -30970 -7515 29331 52 -13214 14971 -866 -18408 18701
315A8701L294m3141N800L6216j3641j8887J9606k221k5146K0633K5849l6328k0975
$$ 18701 21995 -21146 -15346 20870 7229 -11658 7948 5727 -19419 1214 27063 -9265 -30240
328c0240L7639N370k9548J4387J2604l1393Q952L8452k2035l1323K7845J4713
$$ -30240 7399 12769 -16779 -2392 10212 -21181 -12229 26223 4188 -27135 710 15423
340A5423k2935P024J3391k3559l979L5697k760l3938J0896K3234j7454l696K2844
$$ 15423 -7512 -488 12903 -10656 -14635 21062 18302 -15636 -4740 18494 1040 -2656 20188
353B0188j9245k2220L4371J4573l8511j968L0274j3059j2223K5602n838l2587
$$ 20188 943 -21277 13094 27667 -10844 -12812 17462 4403 -7820 17782 11944 -20643
365b0643J9195L0662k6003j9980K4146K924j8653J5902J0458l0069j065L5141
$$ -20643 -1448 29214 3211 -16769 7377 10301 -8352 7550 18008 -12061 -13126 22015
377B2015p860k7691J4802Q679j8093J1521J6176k6325j0915L1634K578k4917O997
$$ 22015 14155 -13536 1266 9945 -8148 3373 19549 -6776 -17691 13943 16521 -8396 -1399
390a399J1469j5650L014K2202j5296k3574K0817J8545k1247o677J7224r579r623
$$ -1399 10070 -5580 -2566 19636 4340 -19234 1583 20128 -1119 -7796 9428 -151 -9774
403i774K3335O35l0089P441K4432j3263j0866J3760p325j2037K2422N995k8810
$$ -9774 13561 14196 -15893 -8452 15980 2717 -8149 5611 -1714 -13751 8671 14666 -14144
416a4144J101K4044j0327j1480J7323o804k1249K0911J9547k8631j3311K8406
$$ -14144 -13043 11001 674 -10806 6517 -287 -21536 -625 18922 -9709 -23020 5386
428E386J265k0452J2286J1042k3941j107L1246n855k9347J0905K3239j3759r124
$$ 5386 6651 -13801 -1515 9527 -14414 -15521 15725 9870 -19477 -8572 14667 908 -8216
441h216J7977o252j7065J9554J3360k4723n152J8967n205o257J1035r698j3704
$$ -8216 9761 3509 -13556 5998 19358 -5365 -10517 8450 3245 -3012 8023 -1675 -15379
454a5379J9301N836k1273J854J0685j3336J443J8161j5251j8861J9397J3738j8460
$$ -15379 3922 9758 -11515 -9661 1024 -12312 -10869 7292 -7959 -26820 -7423 6315 -12145
467a2145n047J4483l879p582J3931O365j9731k226K4661L99j9069O382J2253j2218
$$ -12145 -17192 -2709 -6588 -14170 -239 6126 -13605 -15831 8830 9229 -9840 -3458 8795 -3423
481c423K283J8065j4764j6053K2529P284k2519N606R966j8518K985K2934j8290
$$ -3423 -1140 16925 2161 -13892 8637 15921 -6598 -992 8974 -9544 -6559 16375 -1915
494a915k1723K4014Q101k3095M866J3921j8459m303K4328l098k3301O611J9280
$$ -1915 -23638 376 8477 -14618 -9752 4169 -14290 -18593 5735 2637 -20664 -14053 5227
507E227n929r897R356L592r924N966J5655j0453j3297J4577J0362j0713p12O341
$$ 5227 -702 -10599 -1243 2349 -7575 -1609 14046 3593 -9704 4873 15235 4522 3810 10151
521A0151q305K858J3223j0416j1172J2496J70j0615J1728m27k2331Q621K2724
$$ 10151 1846 4704 17927 7511 -3661 8835 9005 -1610 10118 9691 -12640 -4019 18705
534A8705j9706j5348K0922K12j9048J3102J2641k3936m407K5412J17k0912M644
$$ 18705 -1001 -16349 4573 4785 -14263 -1161 11480 -12456 -16863 8549 8666 -12246 -7602
547g602J5276p332o100J3631P44j7638P535K1067j2650j5141J5761M489j4152
$$ -7602 7674 342 -5758 7873 8617 -9021 -1486 19581 6931 -8210 7551 12040 -2112
560b112R514P809j9634L19J9888q239j3713J0934L35j0434J0010M941j6770j741
$$ -2112 7402 15211 -4423 -4104 15784 7545 -6168 4766 5101 -5333 4677 9618 -7152 -8893
574h893J6202k875j0873O061K499q055N221R605j0256q097J2043N478r135N89
$$ -8893 7309 4434 -6439 -378 2121 -5934 -713 8892 -1364 -9461 2582 8060 -1075 -486
588d86M757n851N96J0874l740j2708O238J0452p961m053Q119n536p439J4151L724
$$ -486 4271 -1580 -984 9890 6150 -6558 -320 10132 2171 -1882 6237 701 -6738 7413 11137
603A1137j9388J528J6694q082q637J2866l221j4008J2321J0928j6034n696J3650
$$ 11137 -8251 -6723 9971 1889 -6748 6118 2897 -11111 1210 12138 -3896 -9592 4058
616D058k59p707M460K538q426J206J1240l525j0874M006Q013n604j381N484p157
$$ 4058 3799 -3908 552 3090 -5336 -4130 7110 3585 -7289 -3283 4730 -874 -2255 3229 -3928
631c928l518J1593K1j1408L098N744n230J382O099q170n261J1071L882j0816j32
$$ -3928 -7446 4147 4168 -7240 -4142 1602 -3628 -2246 3853 -4317 -9578 1493 5375 -5441 -5573
646e573P680l688k556Q475k363j1112P308J0289q800n440Q219j939m378Q423J84
$$ -5573 2107 -1581 -4137 4338 1975 -9137 -1829 8460 -340 -5780 2439 500 -3878 4545 4729
661D729j0927K592R322l623n537L721l3m333N256M114r317l571J0200J099q292
$$ 4729 -6198 -3606 5716 2093 -3444 277 244 -4089 1167 5281 -4036 -7607 2593 3692 -4600
676d600L477L139p766L268R762p790q753J0116M593q368J615M646o277o39R626
$$ -4600 -1123 2016 -5750 -2482 7280 -510 -9263 853 5446 -2922 -1307 3339 -2938 -3577 6049
691F049j875r587K991P724m075l185N203l048n243Q028L852j0549j141Q531k681
$$ 6049 4174 -5413 -2422 5302 1227 -1958 3245 197 -5046 2982 6834 -3715 -4856 3675 994
706I94l750N689k562o978O389O334q514l071O801k19l972M118O77p566J968R539
$$ 994 -2756 2933 371 -6607 -218 6116 -2398 -5469 1332 1113 -2859 1259 1936 -5630 -3662 5877
722E877m066p962N671L578n974K899N319q314k642J0693J58r059K348M918m529
$$ 5877 1811 -6151 -480 3098 -2876 23 5342 -2972 -5614 5079 5237 -3822 -1474 3444 -1085
737a085O29N769m839o125P004M814p244j999N525k237k591O480q67r127M218P452
$$ -1085 -456 5313 474 -5651 1353 6167 -1077 -3076 2449 212 -2379 4101 3234 -5893 -1675 5777
753E777n296l781M919j479l862O457J700q590M6Q360k157n632L971Q89n105L755
$$ 5777 481 -3300 1619 140 -3722 2735 4435 -4155 -4109 4251 2094 -3538 433 1322 -3783 -28
769b8N710p206m334P798J714o296K037K799n726J209P275l873p263N524M336n249
$$ -28 5682 -1524 -5858 1940 3654 -2642 -605 2194 -3532 -2323 4952 1079 -6184 -660 3676 -1573
785a573J13L262m223j773P375O4q069J822N918l107k295M415k419m629O072L668
$$ -1573 -1460 1802 -2421 -4194 3181 3245 -4824 -3002 2916 -191 -2486 1929 -490 -5119 953 4621
801D621p244j738O306r01l296L645j33n582L048O145m952m067M694J045l362K933
$$ 4621 -2623 -4361 1945 1044 -2252 1393 1260 -4322 -1274 4871 -81 -4148 546 1591 -1771 1162
817A162J670o127N61P072j731n842L099K522l637J874L710n187l153P091J446
$$ 1162 2832 -3295 -2734 4338 2607 -3235 -136 2386 -1251 623 4333 -854 -4007 3084 4530
832D530o543Q96L967l455n92N329k827n962M597M315m902j651L436j752j612M453
$$ 4530 -2013 -1117 2850 -605 -1197 4132 1305 -4657 -60 4255 -647 -2298 1138 -614 -2226 2227
848B227l85n512J231N715k455l077L104l75l078M141K338n725j298O305j90m667
$$ 2227 1842 -3670 -2439 3276 821 -2256 848 473 -2605 1536 3874 -1851 -3149 3156 2966 -1701
864a701K719J146m064J776N185m233m902N324K218m604P90K154l478n82N575j875
$$ -1701 1018 2164 -1900 -124 5061 828 -4074 1250 3468 -1136 -346 1808 -1670 -2252 3323 1448
880A448n347K701K731k648K17K025l228o60M728j17m312J383K946j587l63K518
$$ 1448 -3899 -1198 1533 -1115 -898 1127 -2101 -2761 1967 1850 -2462 -1079 1867 280 -83 2435
896B435j550l115M038L447m859k454N134k42l709L581J360o349J461O059l710
$$ 2435 885 -2230 1808 5255 396 -2058 3076 2834 -875 2706 4066 -2283 -822 5237 1527
911A527n007M196J031l759K104J985m998n93M994j055l288R65J464j443J275J870
$$ 1527 -3480 716 1747 -2012 92 2077 -2921 -3514 1480 425 -2863 -1898 -434 -1877 -602 1268
927A268k681j719L367J975l086K6J840j241R5L443j380m180K516L732l083k305
$$ 1268 -1413 -3132 235 2210 -876 -850 990 -251 -156 3287 1907 -2273 243 3975 892 -1413
943a413L082r43k719L669R58n577j21N147k001l135K951q30l017L686J576m905
$$ -1413 1669 726 -1993 1676 2634 -2943 -3064 2083 82 -3053 -102 -932 -3949 -263 1313 -3592
959c592m8L989q74j422J991p69j836K711K386k335k317K903J781k304lK246k412
$$ -3592 -3640 349 -525 -1947 44 -725 -2561 150 2536 201 -2116 787 2568 264 261 2507 95
976I5j564M813L95n870J276L968k987j138L083k249k940L802J499m363k33L026
$$ 95 -1469 3344 3739 -2131 -855 3113 126 -1012 2071 -178 -3118 684 2183 -2180 -2413 613
992F13j380p02J941j596j979K844K167k856r44K166n77o64K660o45l207J845L030
$$ 613 -767 -1469 472 -1124 -3103 -259 1908 -948 -1892 274 -303 -967 1693 1048 -2159 -314 2716
1009B716j560k051J505O90j723J112J547k860j808L862O45m097N95K642k556J0
$$ 2716 1156 -895 610 1300 -423 689 2236 -624 -2432 1430 2075 -2022 -1427 1215 -1341 -1331
1025a331L186k382l565M240J533l450N53J930k130J21K955j370k565K070K251
$$ -1331 1855 -527 -4092 148 1681 -1769 -1216 714 -1416 -1295 1660 290 -2275 -205 2046
1040B046j422r60J211m81j130K383J043l294n66L318m86k255J308J54k382J770
$$ 2046 624 -336 875 394 -736 1647 2690 -604 -1170 2148 1662 -593 715 869 -1513 257
1056B57K455l286j620K757M02j810O64P16k051P64K694j446k655K080J333j947
$$ 257 2712 -574 -2194 563 965 -845 -181 535 -1516 -752 1942 496 -2159 -79 1254 -693
1072f93P45J638k930qL474n60l048J126J892j732M55J228j883j311K422J263k700
$$ -693 52 1690 -1240 -1248 2226 1666 -1382 -256 1636 -96 359 1587 -296 -1607 815 2078 -622
1089f22p99J963l91j280J695j60k826J446K682k041j791K278l74j239J998L04
$$ -622 -1421 542 151 -1129 566 406 -2420 -974 1708 -333 -2124 154 -220 -1459 539 843
1105H43k791R60K507n53k147J033O50r21P90J597k467j077K576O89k330L80J209
$$ 843 -1948 -988 1519 966 -1181 -148 502 -419 371 1968 -499 -1576 1000 1689 -641 -261 948
1122I48j716N52K268j652k382K302J346j875k76J134j175KJ809l67k638Q77K376
$$ 948 -768 -216 2052 400 -1982 320 1666 -209 -485 649 -526 -524 1285 918 -1720 -843 1533
1139A533j148j412J785p16j491K068J140k752n73K546m93j024R74k1j921J509
$$ 1533 385 -1027 758 42 -1449 619 1759 -993 -1566 980 487 -537 437 416 -1505 4
1155DJ759j679j574J993M06j362O62M28j608k5K413n09k644J399J353j749N06
$$ 4 1763 84 -1490 503 909 -453 209 637 -971 -996 1417 908 -1736 -337 1016 -733 -227
1172b27J269k022o44K731J11k278J23J436r45R7J060r30j459J773J267j587q93
$$ -227 1042 -980 -1624 1107 1218 -1060 -937 499 -446 -349 711 -219 -1678 95 1362 -225 -1118
1189a118J571j87o46J013j11k002J091K184j543j434J625k49o96J478R5j923j05
$$ -1118 453 266 -380 633 522 -1480 -389 1795 252 -1182 443 194 -502 976 1071 -852 -957
1206i57J956k28j240N01M29j105O19J451j479j510K122O02j392k02R00j255J87
$$ -957 999 771 -469 32 461 -644 -25 1426 -53 -1563 559 1161 -231 -433 467 -788 -601
1223f01K094j305j731J372J057r95j52O72q65n06J873R2k296L05J931o70p86J043
$$ -601 1493 188 -1543 -171 886 -109 -261 411 -454 -960 913 1005 -1291 -986 945 275 -511 532
1241E32l01j559J628J295k479l07J871j84r06O51k03j194J027J471j114j508J193
$$ 532 231 -1328 300 1595 -884 -1191 680 496 -410 241 38 -1156 -129 1342 228 -1280 -87
1258h7O49j020J42R03j094o00K056k12j878N76J058j175M48Q58j146o11J819N80
$$ -87 562 -458 -316 587 -507 -1107 949 737 -1141 -565 493 -682 -234 624 -522 -1133 686 1266
1276A266j688j40J072l74j42J158o68j222P31J822j330q17R10k98n47J270k34
$$ 1266 -422 -562 510 136 -6 1152 484 -738 -7 1815 485 -332 578 280 -267 1003 769
1293G69j784N46J504o31r20N92l23m90J028P01j875m97J752K33j153J87M71q78
$$ 769 -1015 -469 1035 404 -516 76 -247 -737 291 992 -883 -1380 372 605 -548 -361 110 -768
1311g68L83J480j001j388J530Q25j238J15M91p99j27J664n09j276M49J193p68
$$ -768 -385 1095 94 -1294 236 1061 -177 -62 429 -370 -497 1167 658 -618 -169 1024 256
1328B56m55P13p37p44J624K19j798n5J143j86n93N97j11j254J305P93r44q25R95
$$ 256 -199 514 -223 -967 657 876 -922 -977 166 -20 -613 -16 -127 -1381 -76 717 -227 -1052 -57
1347e7L75o51N51K79j097N43J266m75j389O10J038n52m7M53j108m46J510K90j612
$$ -57 318 -333 218 497 -600 -57 1209 734 -655 -45 993 441 394 847 -261 -707 803 1093 -519
1366e19L3J082p88oJ011j308r13J476O45j342k54J046p87J54J083n68j296Q51
$$ -519 -486 596 -192 -198 813 -495 -1408 68 713 -629 -883 163 -624 -470 613 45 -1251 -400
1384d00J176o12o14L59J64k29P90J07r63k89J380n5j211L59M10q98N56R29j410
$$ -400 776 164 -450 -91 73 -156 634 741 -222 -511 869 814 -397 -38 372 -526 30 959 -451
1403d51n88J114K37j207N61K03j026O34Q63o31j127J262N09r98L53M84n26m1R43
$$ -451 -1039 75 312 -895 -334 -131 -1157 -523 340 -291 -1418 -156 353 -645 -292 192 -334 -375 568
1422E68O2j133L25R01l53j5M91o04n52J103K12j190j98R60O4o30L52j52j062P94
$$ 568 630 -503 -178 723 370 355 846 242 -310 793 1005 -185 -383 577 641 11 363 211 -851 -57
1442e7R79j022j133J133J99q70O93L89j566N99J459o18o45N47o9j14L91N16p34
$$ -57 922 -100 -1233 -100 99 -771 -78 311 -1255 -656 803 185 -460 87 18 -96 295 811 77
1461G7l43R37L17p49j90M39k85O1M40m87j054N98J004q65o90Q32m20k59Q14j25
$$ 77 -266 671 988 239 49 488 203 264 704 217 -837 -239 765 -100 -790 42 -378 -637 177 52
1481E2j229K96J343n10o86P58k67l78Q79M09j019J48P88j45l00J53nn18P39O18
$$ 52 -1177 -881 462 -48 -734 24 -243 -621 258 667 -352 -204 584 439 139 292 287 -231 508 1126
1501A126r05n82O44N93n63j97O78q69n4J093m95j075J94Q75l68m96Q89j040j33
$$ 1126 221 -361 283 876 313 116 794 -75 -129 964 469 -606 -412 463 95 -401 488 -552 -685
1520f85J008L90j431N4J145n49Q4K70m20k17M46O33p83j02J29L62l61L02K50q04
$$ -685 323 713 -718 -664 481 -68 16 286 -134 -351 95 728 -55 -157 -28 334 -27 275 525 -279
1540b79K27O85k44r03K85N1k16Q10Or84j44J104j65p76K70L28m71K47O47p78m75
$$ -279 -52 633 389 -514 -229 -178 -394 416 422 -562 -706 398 233 -543 -273 55 -416 -169 478 -300 -775
1561g75R55K83p96o6L51j05m7O12m10o88P79O62n91l83K42J12j68K14L88r28j55
$$ -775 180 463 -333 -399 -48 -153 -200 412 2 -686 93 755 164 -219 23 135 -33 181 569 -359 -514
1582e14P84K11q41N74J7n42M61M96j032l9Q38Kk88R3r0n89O58K10l83n90P16J61
$$ -514 270 481 -360 214 231 -311 150 646 -386 -425 413 415 127 220 130 -459 199 409 26 -564 152 313
1604C13l23K02j56l96J98N57k0q81M52L67j37k55M41m48k29O72O4o43rK79N1J47
$$ 313 -10 192 36 -360 -162 395 375 -506 -54 313 176 -79 362 -86 -315 357 421 -222 -231 48 99 246
1626B46pm42m49P44M22o85l15N35l35K58K28M7p77R9R39l34n74L63M2l11L91K86
$$ 246 239 -203 -652 92 514 -171 -486 49 -286 -28 200 247 -530 -431 508 174 -400 -37 5 -306 85 371
1648C71n67m19J024J27o59J33j0o9K92L49o29m82R41j89m9n30P75m42K5O05l17
$$ 371 -196 -615 409 536 -123 10 0 -69 223 572 -57 -539 402 213 164 -366 409 -33 -8 597 280
1669B80o52J34P52l50j88J40l67K24K86K85o57k92O52r0l66MK9k18L87M15l62
$$ 280 -372 -238 514 164 -24 116 -251 -27 259 544 -113 -405 247 157 -209 -205 -176 -394 -7 408 46
1690D6p69M46M47k96q9K90k63K5M08k9p70K73N25l70J56j15k53K68N02j50p62
$$ 46 -723 -277 170 -126 -215 75 -188 -163 245 216 -554 -281 244 -126 30 -85 -338 -70 432 282 -480
1711d80L20p3J14J6L98p01m92R59K19l43m28K16M7J39K69l43k04K56P72k69p22
$$ -480 -160 -233 -119 -103 295 -406 -898 61 280 -63 -491 -275 -228 -89 180 -163 -367 -111 661 392 -330
1732c30L63o9L9N14m87l49K09N85j03l81R2j60L0J65M67p29k77L77P21p60m8j6
$$ -330 33 -36 3 517 30 -319 -110 475 372 -9 83 -77 -47 118 585 -144 -421 -44 677 -83 -131 -147
1754a47q9L11M24j99p27M42K67l03l24J63L2R8L59n0o38K27N24l44J12P4K0l84
$$ -147 -236 75 499 300 -427 15 282 -21 -345 -182 -150 -52 307 257 -381 -154 370 26 138 212 232 -152
1776a52M17L94r69K04K52K02l62L2n7k80M11L05l32n95L53n7J64J02j69j78k00
$$ -152 265 659 -310 -106 146 348 -14 18 -39 -319 92 397 65 -530 -177 -234 -70 32 -137 -315 -515
1797e15N29j47k45j03N43l2J91k3l39j22O46R9m77j17O50j03k51M69l79n86L50
$$ -515 14 -133 -378 -481 62 30 221 198 -141 -263 383 482 5 -112 538 435 184 653 274 -312 38
1818C8M78l93l94L14j04J27J06j37l84M16K53k91j43k39L06l97N72j19j29l46
$$ 38 516 123 -271 43 -61 66 172 35 -349 67 320 29 -114 -353 -47 -444 128 9 -120 -466
1838d66Q35K4n75J40l3N9M72j07j82k16M41J01k07m46J56k92K37N28o21k33Q3
$$ -466 369 393 -182 -42 -75 -16 456 349 167 -49 392 493 286 -160 -4 -296 -59 469 -152 -385 -302
1859c02K29l4j23jNk79M24j41n25N52J17l2j9J17m13J41J22N34n12r0L16J94K40
$$ -302 -73 -107 -230 -231 -226 -505 -81 -222 -747 -195 -78 -110 -129 -12 -425 -284 -162 372 -140 -230 86 280 520
1882E20j42j48k26M7M91k17l72J23J88k19N8R9k84k3K48k24k43m3J87J59j88K03
$$ 520 378 230 4 51 542 325 -47 76 264 45 103 202 -82 -105 143 -81 -324 -367 -180 -21 -209 -6
1904fo4l15K65L02l30o9Q8oL78j58j1k48K72K64j11k38M3J90j10R2j24j11k50
$$ -6 -70 -385 -120 182 -148 -217 -129 -135 243 85 74 -174 98 362 251 13 56 246 136 228 104 -7 -257
1927b57N63j26j45o5j58j75L76Q5l71l68N97o9j5r2J36k40J98K17m16J44L26p1
$$ -257 306 180 35 -30 -188 -363 13 98 -273 -641 -44 -113 -128 -220 -84 -324 -126 91 -325 -181 145 74
1949G4PR7j33n6J93K8q8j2j90M12o4k40L14k52j66J06J27m12n6K50j82L95k83
$$ 74 81 178 45 -11 182 210 122 110 -80 332 268 28 342 90 -76 30 157 -255 -311 -61 -243 152 -131
1972a31K41m89L38K29k20j29N0L87l10M11k36k67O3K58nk37k0J27OK95l27q8l7
$$ -131 110 -379 -41 188 -32 -161 -111 276 -34 377 141 -126 -63 195 190 -47 -67 60 66 361 34 -54 -91
1995i1J74O2m5j41R7Q1k6j35o7l47K88N63p99L35j37L4L69O0k16j82K3K53j62
$$ -91 83 145 100 -41 56 137 111 -24 -91 -438 -150 413 -386 -51 -188 -154 215 275 59 -123 -100 153 -9
2018ik61J82j45J56K45L2n39J64L12J34l76Q6J37k63M02k21j90J56L9o5L33k29
$$ -9 -270 -88 -233 -77 168 200 -339 -175 137 271 -105 -19 118 -145 257 36 -154 2 41 -24 309 80
2040H0m27N23j66J8Q5k27M2M35l57k00LL9J32J10j50K3K11p6Q0k12K16k75q3K34
$$ 80 -347 176 10 28 113 -114 -72 363 6 -194 -191 -152 -20 90 -60 -37 174 98 178 -34 182 -93 -176 58
2064E8K16n06j77M03j31J78k21J33o8J52mJ87k24j07N5K25l82K54k67J34L5q8
$$ 58 274 -232 -409 -6 -137 41 -180 -47 -115 37 33 220 -4 -111 -56 169 -213 41 -226 -92 -57 -145
2086a45J85j79J5J93n9pj40J00J50j47k31J07m5L83j07j30j01O6N7J3O1O7q3k95
$$ -145 40 -139 -124 69 10 3 -137 -37 113 -34 -265 -158 -203 180 73 -57 -158 -92 -35 -22 39 106 23 -272
2110b72K51K1r0J02J46l1j8l6L4r2jK75j43l07J62Q2jl29Q1J50j46M31j47j08
$$ -272 -21 0 -90 12 158 127 109 73 107 15 14 289 146 -161 1 83 82 -247 -166 -16 -162 269 122 14
2134A4O4o6Q4j67J55l37N3K30J67j81j6P4j55L49k46J44k24r6N66q2m88j01K72
$$ 14 78 12 96 -71 84 -253 -200 30 197 16 0 74 -81 268 22 166 -58 -154 412 330 -158 -259 13
2157A3J47p4n5o8R0j20Q3J8k46K82j44O1J72jl16J22K4j32R1J1j58K01j97J65
$$ 13 160 86 31 -37 53 -67 16 34 -212 70 -74 -13 159 158 -158 -36 -12 -144 -53 -42 -200 1 -196 -31
2181c1k9l3jL62m21p4L63k72K81pk72J74j12R7J10J5ql05K98j2l22J59K11O5j77
$$ -31 -60 -93 -94 268 -153 -227 136 -136 145 138 -134 40 -72 25 135 150 142 -163 135 123 -199 -40 171 236 59
2206E9j22q3J49N0P8j34j97N9J64J19k56K23j42j30K02K19l22J04r2Q9M0pk76
$$ 59 -63 -146 3 53 131 -3 -200 -141 23 142 -114 109 -33 -163 39 258 -64 40 -52 37 77 70 -206
2229b06J70J12k0j34J05k23K62J63k96R2k87K30J44p9j43J71k86L50J1j22l03
$$ -206 -36 76 56 -78 27 -196 66 229 -67 25 -262 -32 112 33 -110 61 -225 125 136 14 -289
2250b89K99J72kk55j65J15J02J91j79P6O8o2R0M7j90m1r3K07R1J13r7j4k66K13
$$ -289 10 182 180 -75 -240 -125 -23 168 -11 65 133 71 161 208 18 -23 -116 91 182 295 198 184 -82 131
2274A31m5j61K24j29M4j18O3j26N3L0K76j29l43J22J15j53P2J44j22J32k9P8k74
$$ 131 86 -75 149 20 64 -54 9 -117 -64 -34 242 113 -230 -108 7 -146 -74 70 -52 80 51 129 -145
2297a45K57M6N6j49R0K9j25L82m49j46Q8N1j12L07l25r9K71J09k32J2L7n8mnj92
$$ -145 112 158 214 65 155 184 59 441 -8 -154 -66 -15 -127 180 -145 -244 27 136 -96 -84 -47 -105 -109 -114 -306
2322c06J12J28n1k0j1J06r4J35R4j03j23O7J72J99j22j00Np7j5J91j56j27K01
$$ -306 -194 -66 -117 -137 -148 -42 -136 -1 93 -10 -133 -66 106 305 183 83 88 11 -4 187 31 -96 105
2345A05k5l9k18N5Q7J62J23k24l74K52K5L97l79k2j85L49L3k66PJ24n0J51L5j
$$ 105 80 41 -177 -122 -35 127 250 26 -348 -96 -71 326 -53 -75 -260 89 122 -144 -137 -13 -63 88 123 122
2369A22L5p6n2J71M6m80J09K14J36j85k61M36k51k0P9l29L76j36K09j15o5n1O1
$$ 122 157 81 29 200 246 -234 -125 89 225 40 -221 215 -36 -56 23 -306 70 -66 143 28 -37 -88 -27
2392b7jJk5L1Kj4K8o1r4o2P6L02j24J17k81L08j10M9j99J3L2J07N0m42K99K97
$$ -27 -28 -27 -52 -21 -19 -33 -5 -66 -160 -222 -146 156 32 149 -132 176 66 115 -84 -71 -39 68 118 -324 -25 272
2418B72k51L0k80LK75L9L3k11mO6K78l28J57j53rL7J01K9q2j93J91Pr2J75l41
$$ 272 21 51 -229 -226 49 88 121 -90 -94 -28 250 -78 79 -74 -83 -46 55 84 2 -191 0 7 -85 90 -251
2443b51L97J7j59N3m4j74L93j74Jo7J29q8J02m8k54K28j24J65j46M3J0j37J19
$$ -251 146 163 4 57 13 -161 232 58 59 -8 121 33 135 87 -167 61 -63 102 -44 -1 9 -128 -9
2466iP2j65Q1k72L15l6L7j88P0K06p4K8j59k81K23O9kJ30j26K06j77l2p9J31n1
$$ -9 63 -102 -21 -293 22 -14 23 -165 -95 111 37 65 -94 -375 -152 -83 -85 45 -81 125 -52 -84 -163 -32 -83
2491h3L3K28j97J15M9l9Q8j55l1j82K47L2j35N7j2K08l40j3M54k01o7j67K10K0
$$ -83 -50 178 -19 96 145 106 194 39 8 -174 73 105 -30 27 15 223 -117 -130 324 123 56 -111 99 119
2515A19l78L25j24J39l81K55m3J08k55J21K93m27K88k12J19qQ1J14j9n8p3q3K05
$$ 119 -259 66 -58 81 -300 -45 -88 20 -235 -114 179 -248 40 -172 -53 -61 20 134 115 57 -16 -99 106
2538A06k1k7P0l62j1K11%p2K31l26K66j03l7M3j38N9L1Nqj64L2J48L09j81J03
$$ 106 85 58 128 -234 -245 -34 -34 -106 125 -201 65 -38 -75 -32 -170 -111 -80 -75 -83 -247 -215 -67 242 61 164
2563A64l05q7K18o0K28p0j43K1J87j58M6J35k90O5l7J2J62j01L0L7l44M49j50
$$ 164 -141 -228 -10 -70 158 88 -55 -34 153 -5 41 176 -114 -49 -86 -74 88 -13 17 54 -290 159 9
2586ILM2j45K10j27Q4r6l6n0J11J30J0p8J74k57j31J95k77K59m9q1J03Po8J09
$$ 9 12 54 -91 119 -8 76 -20 -56 -106 5 135 145 67 241 -16 -147 48 -229 30 -19 -100 3 10 -58 51
2611E1l3M5n5k5j32K44L1j00k3p2L2R3p9L41k52k70L54r7O0k42J5L76j68k72p8
$$ 51 18 63 8 -17 -149 95 126 26 3 -69 -37 56 -23 318 66 -204 150 53 113 -129 -114 262 94 -178 -256
2636b56L51K3L8o6k90lL37P2k39K9k12J90J44Q7m68L12j50K29q9O6j17j38r0J33
$$ -256 95 118 156 90 -200 -203 134 206 -33 -4 -216 -26 118 205 -263 49 -101 128 39 105 -12 -150 -240 -107
2660a07M9J45L0k22K82k30N1m3j96J92J12J65l47LK34N4j20k58J00L18l40j1n
$$ -107 -58 87 117 -105 177 -53 -2 -45 -241 -49 63 228 -119 -116 118 172 52 -206 -106 212 -128 -139 -144
2683a44J49q5R1Kn6K8n9Nl05M06Q7J90l32J86j06Rk07J63P5j36j31K25J03k51
$$ -144 5 -80 11 13 -43 -15 -74 -69 -374 32 119 309 -23 163 57 66 -141 22 97 -39 -170 55 158 -93
2707i3J00k00L24j45M0J5m6o6J96k3j60J47j75J04J36L1m6Oj6M3j9Ln10N60j57
$$ -93 7 -193 131 -14 26 41 -5 -71 125 102 -58 89 -86 18 154 185 139 145 129 172 153 156 -354 206 49
2732D9r7J51o4r8j76K11pJ55j1k69J60R0j54K01r2J00o2q8j13L94l70L50k98N4
$$ 49 -48 103 39 -59 -235 -24 -31 124 113 -156 4 94 -60 141 49 149 87 -1 -114 280 -90 260 -38 16
2756A6J96l10J23J32j13j06J86j14k12N03j41j59K02l25K51l66J63o2J23r5J01
$$ 16 212 -98 25 157 44 -62 124 10 -202 301 160 1 203 -122 129 -237 -74 -136 -13 -108 -7
2777gJ7K8J27j98PL4j85Q7K93j05j20K86k33kL7k42K17m6K22l32K53O4k84K50
$$ -7 10 38 165 -33 -26 8 -177 -90 203 98 -22 264 31 29 66 -176 41 -5 217 -115 138 202 -82 168
2801A68o2M9q2M6p4j54K37q1k39J02L7p2K01l10K4J52J04Qj31j63L25J5j25M4
$$ 168 106 155 73 119 45 -109 128 47 -192 -90 -53 -125 76 -234 -210 -58 46 54 -77 -240 85 100 -25 19
2825A9J98k36L17k88j3Q4j82J99k11J34q7m9J87O0n3p0q8r0J45Nn9M4L8j05r1
$$ 19 217 -19 298 10 -3 81 -101 98 -113 21 -66 -115 72 132 79 9 -79 -169 -24 -19 -78 -34 4 -101 -192
2850a92LJ31K6O5Pj51j49K76J05N1n2k36K95k49J31r8j22K38k47L35o3N0k72K27
$$ -192 -189 -58 -32 33 40 -111 -260 16 121 172 120 -116 179 -70 61 -37 -159 79 -168 167 104 154 -118 109
2874A09k35J89n7K19j63J58k56J71j01K06m20K29K4r1r7r4K96k45J53J55m4r7
$$ 109 -126 63 6 225 62 220 -36 135 34 240 -180 49 73 -18 -115 -209 87 -158 -5 150 106 9
2896Io4J00o2K31M8j71M8J0J23j20k05k3M9p8J80M0k19r7J81k8o2K71m18J53K09
$$ 9 -55 45 -17 214 262 91 139 149 272 152 -53 -76 -27 -105 75 115 -104 -201 -20 -48 -110 161 -257 -104 105
2921A05k67K12k59M45k82Q3l4l7J21l1j68K64l29n2K74K44r4j03k12K43j77m2
$$ 105 -162 50 -209 236 -46 37 3 -34 87 56 -112 152 -177 -229 45 289 195 92 -120 123 -54 -96
2943i6MJ22j1j06L03m42M31l25KJ94j30j50K16kk53J37J93k15N62o30L68l01J69
$$ -96 -92 30 19 -87 216 -226 205 -120 -118 76 -54 -204 12 10 -243 -106 87 -128 434 -196 172 -129 40
2966D0K11j37j78K80j90l3j03O7%L9q4Q3J66j86j92M42k13L4Q8Nk21K56j25m1
$$ 40 251 114 -64 216 26 -7 -110 -43 -43 -4 -88 -5 161 -25 -217 225 12 46 134 139 -82 174 49 8
2990Hj82J51j02P5k3o6J22q6J69R1j75o2J09j71J6l4K61j01j96L01K4j10j79L28
$$ 8 -174 -23 -125 -50 -73 -139 -17 -103 66 157 -18 -80 29 -142 -126 -160 101 0 -196 105 129 19 -160 168
3014A68r9N9R3k86P1q9K45J2Qk16J01L8k4j99q0K41J22j45k7O4j10o8J48J44j09
$$ 168 69 128 221 -65 6 -83 162 174 182 -34 67 105 81 -118 -198 43 165 20 -7 57 -53 -121 27 171 62
3039F2Q1j27J29j95k0K93k34J9R1p5j67J1K32l8k42J70K41q0j36J01j97k7L6k8
$$ 62 143 16 145 -50 -70 223 -11 8 99 24 -143 -132 100 62 -180 -10 231 151 15 116 -81 -108 -72 -100
3063a00QL3Q5q3J33k28J11j8R9J38k00j12K01j64l6L71l18J44n1kK82l64J14k82
$$ -100 -92 -59 26 -57 76 -152 -41 -59 40 178 -22 -134 67 -97 -133 238 -80 64 13 11 293 -71 43 -239
3087b39K83q4P5k31Q9J56o2J76j28Kl7K7j34J82j07J9j18K46k9J4J59k87J14j69
$$ -239 44 -40 35 -196 -107 49 -13 163 35 37 0 27 -107 75 -32 -13 -131 115 86 100 259 -28 86 -83
3111h3l26M09l15nK46K1P5Ql0K4j62k6K30J72k08K6k82J52J63J54k81M7j6N0r3
$$ -83 -409 0 -315 -320 -74 -53 22 30 0 24 -138 -164 66 238 30 56 -226 -74 89 243 -38 9 -7 43 -50
3136e0K4J70j53m0K0J18j27O6j22J76j61L2J41j01O1j68K60l3j41n2jL82m75J07
$$ -50 -26 144 -9 -49 -29 89 -38 28 -94 82 -79 -47 94 -7 54 -114 146 113 -28 -80 -81 301 -174 -67
3160f7J06m3r8N3r1J39J39j78p4J93j24qJ2q2J48J41j23J28k17j02m9K64j7j85
$$ -67 39 -4 -102 -49 -140 -1 138 -40 -114 79 -45 -53 -41 -123 25 166 43 171 -46 -148 -197 67 50 -135
3184a35L16k77K20k61K12k32r0R3L16k72KQ0j5J1q3J29j90L7K63k38J10K68j50
$$ -135 181 -96 124 -137 75 -157 -247 -154 162 -110 -108 -28 -43 -32 -115 14 -176 -139 124 -114 -4 264 114
3207A14j09R3l30K00L4M7qn6J20L9l58J55k01J63J70k66J66l16L98q8j70K92M5
$$ 114 5 98 -232 -32 2 49 41 -15 105 144 -214 -59 -260 -97 73 -193 -27 -343 55 -33 -203 89 134
3230A34k7q5p8j67J4J14j84O03k07k96J47L6R1j59K95j28Q1q3M1l7j75L63l49
$$ 134 107 22 -56 -223 -209 -95 -279 324 117 -179 -32 4 95 -64 231 103 184 101 142 105 -70 293 -56
3253e6J95k8j07J66j26k79L58j97l7J70m5j60K2L0K98m56N1L53k2k53K54m25K29
$$ -56 139 111 4 170 44 -235 123 -74 -111 59 14 -146 -124 -94 204 -252 -201 152 130 -123 131 -294 -65
3276f5j14J30j3K87k46j73L12p4M3o8l5P6J76m30M04j70j36M4J22k2k49J10K52
$$ -65 -179 -49 -62 225 -21 -194 118 44 87 19 -16 60 236 -194 210 40 -96 -52 70 48 -201 -91 161
3299A61m05L72r2j9j53j1K24j90J12j59K04j88K88k08k17J61K29j07j77K68k91
$$ 161 -244 128 36 17 -136 -147 77 -113 -1 -160 44 -144 144 -64 -281 -120 109 2 -175 93 -198
3320a98K38m9N7p6j60N9J86o7K06k69R2k9q8J5J76m9l00J95O5L05k81J22l87J8
$$ -198 40 -9 48 -28 -188 -129 57 -10 196 -73 19 -10 -98 -83 93 44 -256 -61 4 309 28 150 -237 -219
3344b19K86q6J86j42j6p8J30J25J68l15j91K09j58J00K31k62L01l44L9J32R4q5
$$ -219 67 -19 167 25 9 -69 61 186 354 39 -152 57 -101 -1 230 -32 269 -75 -36 96 190 105
3366A05J38k88j0Q0j11K80m9m2j99K89j15l9J07J69m01o4J88rr5J69j13j51J78
$$ 105 243 -45 -55 25 -86 194 145 103 -96 193 78 39 146 315 -86 -150 38 29 -66 103 -10 -161 17
3389A7j5o6OK45j08Q9j89J34j12j45L51m3k07O6n4kR1m4j49L03j02N2n9k57L02
$$ 17 2 -64 -58 187 79 168 -21 113 1 -144 207 164 -43 23 -31 -33 58 14 -135 168 66 118 59 -198 104
3414A04m3L8J42j28q2O3k5m12L52Kl7K06k38K00O3k61N4j04K7L42m44J51K11k32
$$ 104 61 99 241 113 31 94 69 -343 9 11 -26 180 -58 142 205 -56 -2 -106 -79 263 -181 -30 181 -51
3438e1K29l2j41P8O2j15m6J12o6p5r8N9L01l16J85p7l6j42L41K13k83J04j68j19
$$ -51 178 146 5 83 145 30 -16 96 30 -45 -143 -84 217 -99 86 9 -27 -169 172 385 102 206 38 -81
3462h1J35j76K70k1nQ2k79P2l12L61J27j35J2N2j22o3K00j61K5Lk9k8J99j66R1
$$ -81 54 -122 148 127 122 204 -75 -3 -315 46 173 38 50 102 -20 -83 117 -44 -19 -16 -45 -73 126 -40 51
3487E1j28P9k77K84J9j3j83L49j42j11m2J23j98O1J04q5L65j65j89O3M5j52J23
$$ 51 -77 2 -275 9 28 15 -168 181 39 -72 -114 9 -189 -128 -24 -109 256 91 -98 -35 10 -142 -19
3510a9j95K02J05J72l25J49r0O0k15J2J85Q8J52j80kk0l12L46j2j27P6j02P3k7
$$ -19 -214 -12 93 265 -60 89 -1 59 -156 -144 41 129 281 101 99 79 -233 113 101 -26 50 -52 21 -6
3534fQ3j13RJ20p3k30l9L07J30m66K95j0lJ7j32r0L10n4j85O8K16j49r0j74J87
$$ -6 77 -36 -27 93 20 -210 -249 58 188 -278 17 7 4 21 -111 -201 109 55 -130 -62 154 5 -85 -259 -72
3559g2r6K22o8j25K0J22k84J86N6j36L38J2j91m3k5J43K3l96L71p8J94j26J31
$$ -72 -168 54 -14 -139 -119 3 -281 -95 -39 -175 163 175 -16 -59 -84 59 82 -314 57 -21 173 47 178
3582A78k11J92k8k71O0r0J04o8L35j19j37N5J9j93L4oJ74Q4J14k35r3K30k75j2
$$ 178 -33 159 131 -140 -80 -170 -66 -134 201 82 -55 0 19 -174 -140 -146 28 112 226 -9 -102 128 -147 -159
3606a59K93k3n7k12J84j88K10j28K14j57o0j05N8K16n2J5p0N4j08P8K0j3l19N09
$$ -159 134 111 54 -158 26 -162 48 -80 134 -23 -83 -188 -130 86 34 49 -21 33 -75 3 23 10 -309 200
3630B00j57Q7j53J12q1J05lpj00m5O6J09j16M6J58k28o1k2Q1o5rJ14J03j66kJ77
$$ 200 43 130 -23 89 8 113 110 103 3 -42 24 133 17 63 221 -7 -68 -90 -9 -74 -83 31 134 -32 -34 143
3656A43l15K23o9r8J06j31M93k28k49J00P5O6j17N7M3j64j11K32n5j53J23m1J62
$$ 143 -172 51 -18 -116 -10 -141 352 124 -125 -25 50 116 -1 56 99 -65 -176 56 1 -152 -29 -70 92
3679I2J08j81j18J2K60m35K87j3j95J53rJ26q8l5k1J29j59NJ03l4o9R5o1J22j68
$$ 92 200 19 -99 -87 173 -262 25 12 -183 -30 -39 87 -1 -36 -57 72 -87 -82 21 -13 -82 13 -48 74 -94
3704i4L21k40M2o2J5K0p3K90m40J85j9J31k78K52P0o1j37J06K27r7k9j79j05J36
$$ -94 227 -13 29 -33 -18 2 -71 219 -221 -36 -55 76 -202 50 120 59 -78 28 255 158 129 -50 -155 -19
3728a9j32J72J66l99L50j54J09m1m1J73l12m0N1oJ1j45K65J08j03N9J84j24K8
$$ -19 -151 21 187 -212 138 -16 93 52 11 184 -128 -168 -117 -123 -112 -257 8 116 13 72 256 132 160
3751A60j54j01L29m16K23j02k93K58j11J21j0R5k28J13L2r0P0K45J81l92L63k63
$$ 160 6 -95 234 -182 41 -61 -354 -96 -207 -86 -96 -1 -229 -116 -84 -174 -104 141 322 -70 293 30
3773C0j57J19J68o8r4m0j47J78kJ23j18n0K4n3O2J04o8m7k4j4J85j76K2k10K29
$$ 30 -127 -8 160 92 -2 -42 -189 -11 -13 110 -8 -58 -34 -87 -25 79 11 -36 -60 -74 111 -65 -43 -253 -24
3798b4j68J04J43q8J41j84K29k00L0oj79M25j62k21K04K73n00L2Q9r4K20l72N02
$$ -24 -192 -88 55 -33 108 -76 153 -47 -17 -23 -202 223 61 -160 44 317 -183 -151 -62 -156 64 -308 194
3821A94j85j13K12l0R1j74K0j58m0J80j86J49K0J28j97M9k17L75j23J08k22K38
$$ 194 9 -104 108 78 169 -5 15 -143 -183 -3 -189 -40 -20 108 -89 -40 -257 118 -5 103 -119 119
3843A19k64o8J51O2j12R3N1j89RL74l43p7J22L1Q2J5Q4Qj59K0q9N3j36K68N9l35
$$ 119 -145 -213 -62 0 -112 -19 32 -157 -148 226 -117 -194 -72 -41 41 56 140 148 -11 9 -80 -27 -163 105 164 -171
3869a71J87J64o2k13J22r2K7k43K08l2l1J08J2k1J77k2l01J99P5j90J9L3O5q7
$$ -171 16 180 118 -95 27 -65 -38 -281 -73 -105 -136 -28 -16 -37 140 118 -183 16 91 -99 -80 -47 18 -69
3893f9K86m0j90j08J20l7K38j82l2J56j72j55K24m9J61o6l8k88K05R3Pj12l5J67
$$ -69 217 177 -13 -121 -1 -38 200 18 -14 142 -30 -185 39 -10 151 85 47 -241 -36 57 64 -48 -83 84
3917H4m4j41NK40k66K81o8k23K44L5j67K23p9k54L1j91J60L25k04N2o7j1k13K42
$$ 84 40 -101 -96 144 -122 159 91 -132 112 147 -20 203 124 -130 -99 -290 -130 195 -9 43 -24 -35 -248 -6
3941fj17K89l04l1J97J82j52j8j5k6J62l41K82j70k0l5K71j36J52k56p7J22J14
$$ -6 -123 166 -138 -169 28 210 58 40 25 -1 161 -180 102 -68 -88 -123 148 12 164 -92 -169 -47 67
3964F7k2j03j93K79J1m2R2m4j2n2j23J06o5K8J37P8k26P1j50J98j88K04P4j8k79
$$ 67 45 -58 -251 28 39 -3 89 45 33 -19 -142 -36 -101 -73 64 142 -84 -13 -163 35 -153 51 125 107 -172
3989a72K10k57M00k99K76k62r0RR9R4o9L07j59K8j78J03n4l6J16o9q5k25P9L5
$$ -172 38 -219 181 -118 158 -104 -194 -185 -86 8 -61 246 87 115 -63 40 -14 -50 66 -3 -88 -313 -234 -199
4013a99K06Q4o3L08l46J96J43m67j4J77K32j89j13J5q0Pj6K91l62J57J24j42L25
$$ -199 7 91 28 336 -10 186 329 -138 -152 25 257 68 -45 -30 -110 -103 -119 172 -190 -33 91 -51 274
4036B74l76K45l08K08L8O9n9j99P7K3Q2n6M3k95J89K39k05n7P2M2j30J35J95k33
$$ 274 -102 143 -165 43 81 150 91 -108 -31 -8 74 18 61 -234 -45 194 -11 -68 4 46 -84 51 246 13
4060A3K20k96JK05m54N63m01Q3J21k04o6N9L05k88O7n8M18l35M4o2K50k60j0P5
$$ 13 233 -63 -62 143 -311 252 -149 -66 55 -149 -215 -156 149 -139 -72 -130 288 -47 -3 -65 185 -75 -85 -10
4084a0K75l88J86J22j83k54K85p2l7m9L61m2j86Q2o8k47L24R7j50K13l91K56j20
$$ -10 265 -123 63 185 2 -252 33 -39 -76 -125 236 194 8 90 22 -225 99 196 46 259 -132 124 4
4107Dm0P0M6k7l7J08r1O2j50R8j20K48k85O6L22k05j28L4J93r9p0n7Q1j90K35
$$ 4 -36 34 80 53 16 124 33 95 -55 43 -77 171 -114 -48 274 69 -59 -25 168 69 -1 -58 23 -167 68
4132F8m1l32L20o4K54n12K79l9J27j35j21Q9l9J16J28k10K06o8k51K39R2l71N9
$$ 68 27 -305 15 -49 205 -307 -28 -67 60 -75 -196 -107 -146 -30 98 -112 94 26 -225 14 106 -265 -206
4155b06K00m9O5n0L3J04j70k7Q0l13N03k21j2O8K99l47jJ08LJ05R6m01j78K30
$$ -206 -6 -55 10 -40 -7 97 -73 -100 -20 -333 170 -51 -63 5 304 -43 -44 64 67 172 268 -133 -311 -81
4179h1Q6q0ok41N21k35p5L27m51Q3M8J70j03j96J77o3Q0N6J42j41j26J91j5m6
$$ -81 5 -75 -81 -322 199 -36 -111 216 -235 -152 -104 66 -37 -233 -56 -119 -39 17 159 18 -108 83 68 22
4203B2J08k4Qj28l4n6Q3O4k9L1K03r3j95j46K75j05j39Q1j14K45k26j75L87k72
$$ 22 130 106 114 -14 -48 -104 -21 43 14 45 248 155 -40 -186 89 -16 -155 -74 -188 57 -169 -344 43 -229
4227b29J88M3J22k99M1K0K57l61J93l9R8K69k76R9j10J7J4k1k40K54M2j13j08
$$ -229 -41 2 124 -175 -134 -114 143 -218 -25 -64 34 303 27 126 16 33 47 26 -214 40 82 -31 -139
4250a39L27j92J53l28K88K9j0rnk92J16L25k65j51J48%l6J50j78J03j8J03j63
$$ -139 188 -4 149 -179 109 138 128 119 114 -178 -62 263 -2 -153 -5 -5 -41 109 -69 34 16 119 -44
4273d4J1ML3k0Q8J52k88k5j69L00J58j01L0k54K92j79L0j72K50k2j4j09J29o5
$$ -44 -33 -29 4 -16 72 224 -64 -89 -258 42 200 99 129 -125 167 -12 18 -154 96 74 60 -49 80 15
4297A5q1L05l08K2N2R7j52M5J32q6Nm2m9J11p7q2O6R4j99J84k80L24j45j1J15
$$ 15 -66 239 -69 -47 5 102 -50 -5 127 41 46 4 -45 66 -11 -93 -27 67 -132 52 -228 96 -49 -60 55
4322E5K8k01P8n9j10L94k89J31%Q0j94j5K69l44J75N5N3k13R2J36l09J40J34j35
$$ 55 83 -118 -40 -99 -209 185 -104 27 27 107 -87 -102 167 -177 -2 53 106 -107 -15 121 -188 -48 86 -49
4346d9K70k84J24o6j60J02J06P0j66M4J16N4j39J38k53L5r5J69o4lJ73r4M9r0
$$ -49 221 -63 61 -5 -165 -63 43 113 -53 -9 107 161 22 160 -93 -58 -153 16 -48 -51 122 28 77 -13
4370a3k53M64k51l7J61o0j26O1N2J24j51k5J63k36P1n4J10K59j68m6j00K87k96
$$ -13 -266 198 -53 -90 71 11 -115 -54 -2 122 -29 -54 109 -127 -56 -110 0 259 91 45 -55 232 -64
4393f4K72l15k07L56%q6j04L18l58K46K7l94K8L37k09J87M6k44K33M5j57L2r5
$$ -64 208 -107 -314 42 42 -44 -148 170 -188 58 85 -309 -281 56 -153 34 80 -164 69 114 -43 -11 -106
4416a06J10K14k1j84p0J06Q4l1m8M6j56K76n5k74oj12J82l63K11M46K9R9k83j99
$$ -106 4 218 197 13 -57 49 133 102 54 100 -56 220 165 -109 -115 -227 -45 -408 -197 249 278 377 94 -105
4440a05J05J40K6r0k25K37q4Q7j62J82j06j56L6K32M5J10l30L9j85K69j48n7K36
$$ -105 0 140 166 76 -149 88 4 91 -71 111 5 -151 -115 117 162 272 -58 -19 -204 65 -83 -140 96
4463I6L8k58J49N9J32j44j1j89J16M6R4j19O1r6K24r4P7k91J95k02K03m9j11R4
$$ 96 134 -124 25 84 216 72 61 -128 -12 34 128 9 70 -26 198 104 181 -110 85 -117 86 37 -74 20
4487B0P1k21J59J22l30J68N1J86l08J61j15K82o56N71l82K66O1k02O7M92n13K4
$$ 20 91 -130 29 151 -179 -11 40 226 -82 79 -36 246 -410 161 -221 45 106 -96 -29 463 -50 -26
4509b6PJ14k37L12k27q2J57q2O3j9RP6j00l43M22N4Q2j37K7j57n3J92n8l2K43
$$ -26 -19 95 -142 170 -57 -139 18 -64 -1 -20 -11 65 -35 -378 44 98 180 43 70 -87 -140 52 -6 -38 205
4534B05l77R9L6j13K74j64m8K29k30O1J39k59K35l0O8m14M18q7J8l7J46j04l17
$$ 205 -172 -73 -37 -150 124 -40 -88 141 -89 -28 111 -148 87 57 125 -289 129 42 60 23 169 65 -252
4557b52K17K47l47J13L14l67K20k2o4J48k54j3m6K37k7k1o1j62M32j13k02j78
$$ -252 -35 212 -135 -22 292 -75 145 123 59 207 -47 -60 -106 131 104 83 22 -140 292 179 -23 -201
4579b01K48j14M9J73j87j42J10J53l8p7Om0O8J32k39J58J5L6j62P3j1L5L7Nk71
$$ -201 47 -67 -18 155 -32 -174 -64 89 51 -26 -20 -60 8 140 -99 59 74 110 -52 21 10 45 82 87 -184
4604a84J26J55j91j7R4o2N9J67j03Qo4pR6Q0l00K37j13q6K28k99qNJ59q0J0rl1
$$ -184 -58 97 -94 -111 -17 -79 -20 147 44 52 -12 -19 77 157 -143 94 -19 -105 123 -176 -184 -179 -20 -100 -90 -99 -130
4631a30k2P5J50k30K18K6j58m0J66J73j35j92J69j18j50K92j11j37J35oJ52r0
$$ -130 -152 -77 73 -157 61 87 -71 -111 55 228 93 -99 70 -48 -198 94 -17 -154 -19 -25 127 37
4653C7m5J0J12o5N4r2q1O2j99K83j68MK63k02M9jK36j59L9O8k50J15k18q2K35
$$ 37 -8 2 114 49 103 11 -70 -8 -207 76 -92 -88 175 -27 22 21 257 98 137 205 -45 70 -148 -230 5
4678Eo7j11J37k1O0J19N2j88J90r5o3j22K10P0j3l87Q1J34m53M60M6k2n5K28j25
$$ 5 -62 -173 -36 -57 3 122 174 -14 176 81 18 -104 106 176 163 -224 -143 -9 -462 -2 44 22 -33 195 70
4703G0j35K15p0j65L6p7M01k72J58J04k07l7j21k9J81rk30K98K0l29L38o6P0q0
$$ 70 -65 150 80 -85 -49 -126 275 3 161 265 58 21 -100 -129 52 43 -187 111 131 -198 140 74 144 64
4727F4q9J19n5j75J17j13J22L5P6mj49N5R0Qj78K65m7k91O1k5J54j33J31p5k3
$$ 64 -25 94 39 -136 -19 -132 -10 25 101 97 -52 3 93 101 -77 188 141 -150 -89 -114 40 -93 38 -37 -60
4752f0J44l16J45q3M92k1k70J06q8P4q8j92L33l45J16R2J86k00K6K4J3n4m8K34
$$ -60 84 -232 -87 -170 322 301 31 137 49 123 35 -157 176 -169 -53 39 225 25 51 75 88 34 -14 220
4776B20j96j10n0K83o9j52M6J16m6k09P4QP5L3j49J33K2p0j30J60R5k42J59L3
$$ 220 24 -86 -136 147 78 -74 -28 88 42 -167 -93 -85 -10 23 -126 7 29 -41 -171 -11 84 -158 1 34
4800C4L1j01L2J46j59K48m10L35q0q4n6R2j42l3L16k72J46k84J59J54j86J67j48
$$ 34 65 -36 -4 142 -17 231 -179 156 76 -8 -64 28 -114 -147 169 -103 43 -241 -82 72 -114 53 -95
4823i5l8K19k22K40k05J39L9k14J10J96p4k35K62q4j10k07P8M40j92j11J42k18
$$ -95 -133 86 -136 104 -101 38 77 -137 -27 169 95 -140 122 38 -72 -279 -201 239 47 -64 78 -140
4845a40RL12j03k10J17%ML6j07J35j14nP6M7q9L7n5L4L0K40k64M2j69L46k21j94
$$ -140 -131 181 78 -132 -15 -15 -11 25 -82 53 -61 -66 10 57 -32 5 -50 -16 14 254 -10 32 -137 209 -12 -206
4871b06J92L3K4k83J32P9J97l87K14j42J79j53K50j7l32M03j23j63J77q5p0j05
$$ -206 -14 19 43 -240 -108 -29 168 -219 -5 -147 32 -121 129 112 -220 183 60 -103 74 -11 -81 -186
4893a86L39j34j2P7p3l6M9j33R8R0l50J06J96J02j03lj37J98k02k47J57L07K40
$$ -186 153 19 7 84 11 -25 24 -109 -11 79 -271 -165 31 133 30 27 -110 88 -114 -361 -204 103 343
4916C43n19J49J35pj19K4J37k09J34p1P0p0k68K54j11J64k58J43Q6n5K04J7j30
$$ 343 -176 -27 108 101 -18 6 143 -66 68 -3 67 -3 -271 -17 -128 36 -222 -79 7 -48 156 173 43
4939D3L4n9L9J97k87J5J40k54Q0r5q1O4J72J14l91K10J73m8N7k08J08j5M7M4l43
$$ 43 77 18 57 254 -33 -18 122 -132 -52 -147 -228 -164 8 122 -269 -59 114 66 123 -85 23 8 55 99 -244
4964b44J81j04P4L4M0J88J2l23J41rK35m35R4K46m16K32J89k4j80p5K48k39L76
$$ -244 -63 -167 -93 -59 -19 169 181 -142 -1 -10 225 -210 -116 130 -286 -54 135 111 -69 -144 104 -135 241
4987B41j57J2j40J05j51J21l5K2j61J56p0J54L0j72M1p7K4J47j39PJ11l78M70
$$ 241 84 96 -44 61 -90 31 -4 18 -143 13 -57 97 127 -45 -4 -81 -57 90 -49 -42 69 -309 161
5010A61j06j4k49J99%K21j90j31Q9J22P6Lq5k1rJ18k70j09K94j13j33L17j44N9
$$ 161 55 41 -208 -9 -9 212 22 -109 -20 102 178 181 96 75 66 184 -86 -195 99 -14 -147 170 26 85
5034H5j27J19q0L0K24j25j52j5J7K86j81k66K99k70K75k19o2L69k55M39l27Kl5
$$ 85 -42 77 -3 27 251 126 -26 -41 -24 262 81 -185 114 -156 119 -100 -162 207 -48 391 64 66 31
5057C1j46n9n4L45Jl79L30J45r2k98K27k13N9J65k66M94l90k00N30j55j61K66
$$ 31 -115 -174 -228 117 118 -261 69 214 122 -176 51 -162 -103 62 -204 290 -100 -300 230 75 -86 180
5079A80q8k51n8M07l90m3o6M47k13Q9J05j00j17J72j03J54k05J24r3n5O3K44j54
$$ 180 92 -159 -217 190 -200 -243 -309 138 -75 14 119 19 -98 74 -29 125 -80 44 -49 -104 -41 203 49
5102D9j25N0O9P8P3l82J90k07L24R2L6l20J20R5j93Q6L5j12J75j72o9J73m4K13
$$ 49 -76 -26 43 121 194 -188 2 -205 119 211 247 -73 47 142 -51 35 70 -42 133 -39 -108 65 21 234
5126B34p9J01k87l9o1l2K38k26K44j5m8N5l10o9L04r0O9j29K18j38P4j48K22j69
$$ 234 155 256 -31 -70 -131 -163 75 -151 93 78 30 85 -225 -294 10 -80 -11 -140 78 -60 14 -134 88 -81
5150h1N23l89j43L01p2R8j85P9j01o1P0p2kj40j8K29j98L29j13K3k01K37k18l9
$$ -81 442 53 -90 211 139 237 52 131 30 -31 39 -33 -35 -175 -193 36 -162 167 54 77 -124 113 -105 -144
5174a44n2J66J46l42K07rq4J20J68l39K82L9j46j08K15k10J73J3j82o0R2J68j38
$$ -144 -196 -30 116 -226 -19 -28 -112 8 176 -163 119 158 12 -96 119 -91 82 95 -87 -147 -55 113 -25
5197b5K43k15O8j1O2j59L7K53l35J36l4k8J22n0j73%l0J83J60k24J46j98JK74
$$ -25 218 3 71 60 122 -37 0 253 -82 54 20 -8 114 64 -109 -109 -139 44 204 -20 126 -72 -71 203
5221B03K1k41R3j33j57J61J14j04j08k3J31m7k0J35j24L15p1k25K14J67p4j89
$$ 203 224 -17 76 -57 -214 -53 61 -43 -151 -174 -43 -90 -110 25 -99 216 145 -80 134 301 227 38
5243C8NO7j00j28M8j68J41j6Q9J36j18J07p2M1P3j22J86j14N5l8k61O5J55k14
$$ 38 43 110 10 -118 -70 -238 -97 -113 -24 112 -6 101 29 70 143 21 207 93 148 110 -151 -86 69 -145
5267a45J49j94K98l3k74J32Q2L1j4p4K73j53m8j50J50J9m9Mk5J26k20J84N9j34
$$ -145 4 -190 108 75 -199 -67 15 46 32 -42 231 78 30 -120 30 49 0 4 -21 105 -115 69 128 -6
5291fP7m3l7K30k49k1J11k02J31r5K77k96m3L56J03l70n7j48L79K7k03M5N3K08
$$ -6 71 28 -9 221 -28 -49 62 -140 -9 -104 173 -123 -166 190 293 -77 -134 -282 97 124 -79 -34 19 227
5315B27k29m1K06k34j71J94J31k04o7M57j26J11k25j88L35q5n2K84k31K0j04N1
$$ 227 -2 -43 163 -71 -242 -48 83 -121 -188 269 143 254 29 -159 176 91 39 323 92 112 8 59
5337E9k41R9J02n7O3Qj86j2J29K97k83K3k88L21M0q7K0j34J62n2l0J18j40K27
$$ 59 -182 -83 19 -38 25 33 -153 -165 -36 261 -22 1 -287 34 74 -13 7 -127 35 -17 -47 71 -69 158
5361A58k17J00J17q5R1k47L05m75K45J09j34R5J37l51J26J7O4m6r6J45o6m7J20
$$ 158 -59 41 158 73 164 -83 222 -253 -8 101 -33 62 199 -152 -26 -9 55 9 -87 58 -8 -55 65
5384F5k93J13M4J4K05p2l06J0L25j92m5K45l86L14j41J10M7j9J21J0j66j32K89
$$ 65 -228 -115 -71 -57 148 76 -230 -220 105 -87 -132 113 -273 41 -100 10 57 38 159 169 3 -129 160
5407A60j33N1K9j49k3J20J1K00k32o6j17J74j09k1J87n0J60l8qk23n0L15j65K2
$$ 160 27 78 107 -42 -65 55 66 266 34 -32 -149 25 -84 -105 82 32 192 154 146 -77 -127 188 23 45
5431D5m4j00K6rJ01n2J9J97j80j85K26J39m8Q1k98j30K50J06k06k2Q0M0j71K24
$$ 45 1 -99 -73 -82 19 -33 -14 183 3 -182 44 183 135 216 -82 -212 38 144 -62 -84 -4 36 -135 89
5455H9l65K67J06J75k76Q6J9r3q1q8l3K80k71J78j89J86j31J89j45oJ37j3K59
$$ 89 -276 -9 97 272 -4 82 101 8 -73 -161 -194 86 -185 -7 -196 -10 -141 48 -97 -103 34 21 280
5478B80k91j65L3N5J66K4j77J93j91P2J73P6k51p7J69j76J39m1k81J38L7J17L11
$$ 280 -11 -176 -143 -88 78 102 -75 118 -73 -1 172 248 -3 -80 89 -87 52 11 -270 -132 -95 22 333
5501C33p8m26P0J75o2p7J17j40L5L0J03LR8k07k2p8J8Q0J46kj78L25k40J12k24
$$ 333 255 -171 -101 74 12 -65 52 -88 -53 -23 80 83 181 -26 -48 -126 -108 -28 118 116 -62 263 23 135 -89
5526h9R5J6j26J66j18O4L8j69l5L87l07J50k10J51q0j41L0J53QM1j1k01M59k32
$$ -89 6 22 -104 62 -56 8 46 -123 -158 229 -78 72 -138 13 -67 -208 -178 -25 -17 24 13 -188 271 39
5550C9n6k1K9j1J2L2j06J5M8j88M9JQ0M2K7j07K28J0j02j48L3K10k9nj76K11O
$$ 39 -17 -38 -9 -20 -8 24 -82 -67 -19 -207 -158 -157 -77 -35 -8 -115 113 123 21 -127 -94 116 87 82 -94 117 123
5577A23p8j58j59J87pj56J75J53k89P8J61n6p9JK75m11J74M3N8O4P8k46K51k11
$$ 123 45 -113 -272 -85 -92 -248 -73 80 -209 -131 30 -26 -105 -104 171 -240 -66 -23 35 99 177 -69 182 -29
5601b9o2m0Q6O6j01L3K11j23m2N5j2j25P2j58K9P7K4R0P8k23K31j32M4j68K00
$$ -29 -91 -131 -45 21 -80 -47 164 41 -1 54 42 -83 -11 -169 -140 -63 -39 51 129 -94 137 5 49 -119 81
5626H1O0M5l68J83J61k96J32J16o5k20j0J73R3j45O0L8J00k22N9oj60J44L5m8
$$ 81 141 186 -182 1 162 -134 -2 114 49 -171 -181 -8 85 -60 0 38 138 -84 -25 -31 -191 -47 -12 -60
5650f0J90k28P3K8Q8J8l2k16J81M8L3JK20o04M32k51Q1m4k5q2K36k31R2J15k28
$$ -60 130 -98 -25 3 91 109 77 -139 42 90 123 124 344 -260 172 -79 2 -42 -67 -149 87 -144 -52 63 -165
5675a65K93Q5j53ll4jk23K41l9N7J8J74k35j93K58j0r9J60n5r1q9L5j48L24j40
$$ -165 128 213 60 57 23 22 -201 40 1 58 76 250 15 -178 80 70 -29 131 76 -15 -104 -69 -217 107 -33
5700c3K24j26r7M6p8m5o3J90q2L5k7M9q2M3m55M81P0P7j41L3N7o2j6M63j05n69
$$ -33 191 65 -32 14 -64 -109 -172 18 -64 -29 -56 -7 -89 -46 -501 -20 50 127 -14 19 76 14 -2 461 356 -213
5726b13K95k53P9M2J31J07Q5j87KL1k01M8K3M4J63j65k83L64j02k34K27n5J84
$$ -213 82 -171 -92 -50 81 188 273 86 88 119 -82 -34 -11 33 196 31 -252 112 10 -224 3 -52 132
5749A32j13j3J10j55k91L16J68l26L28j63j68J48J16k05R1J3N1j01K12j17M2o7
$$ 132 19 6 116 -39 -330 -14 154 -172 156 -7 -175 -27 89 -116 -25 -12 39 -62 150 33 75 8
5771Hn3K98j08j27j34J05L6J03l23k0K94q5j05K6k24M47j02K88l79K0q8R3K3j18
$$ 8 -45 253 145 18 -116 -11 25 128 -195 -215 79 -6 -111 -85 -309 138 36 324 -55 -35 -123 -30 -7 -125
5795a25K65q4Q1q8m03M13l8q2J69j9j58j26K70k57K34r9J31p0J03j33O3l3om3
$$ -125 140 56 137 49 -354 59 21 -61 108 89 -69 -195 75 -182 52 -47 84 14 117 -16 47 14 8 -35
5819c5J45jk39J52J20k66M25j91k48K05J71r4j14o7k03L39L3j39J61k15k7o6J2
$$ -35 110 109 -130 22 142 -124 301 110 -138 67 238 144 30 -37 -240 99 132 -7 154 -61 -88 -154 -142
5842a42L7R4l5K08j41j00J11k03L40P8n7j68r0No3M9J08l56M28j83R3j27L35k60
$$ -142 -105 -11 -46 162 21 -79 32 -171 169 247 190 22 -68 -63 -126 -77 31 -325 103 -80 13 -114 221 -39
5866c9n9o0J35J24k4J5J89l90K55j0k82J02j24J31J55k45J22J50k67J8J04M1J58
$$ -39 -98 -158 -23 101 77 92 281 -109 146 136 -146 -44 -168 -37 118 -127 -5 145 -122 -104 0 41 199
5889A99k43J58j75j69L08J48m61L1K84j62J59p5r9J0J47J2k8j26J52j77K02j24
$$ 199 -44 114 -61 -230 78 226 -235 -204 80 -82 77 2 -97 -87 60 72 44 -82 70 -107 95 -29
$$ [...]
8191D1
##END NTUPLES=NMR FID
##END=
