##TITLE=1H_Pr Bzt-Am-d
 CDCl3,8 sc, 
 12.03.2021
##JCAMPDX= 6.0         $$ Bruker NMR JCAMP-DX V2.0
##DATA TYPE= NMR FID
##DATA CLASS= NTUPLES
##ORIGIN= UXNMR, Bruker Analytische Messtechnik GmbH
##OWNER= root
$$ XWIN-NMR		Version 3.5
$$ Fri Mar 12 13:28:23 2021 Russian Standard Time (UT+4h)  she@DPX200
##.OBSERVE FREQUENCY= 200.131506
##.OBSERVE NUCLEUS= ^1H
##.DELAY= (6, 6)
##.ACQUISITION MODE= SIMULTANEOUS
##.ACQUISITION SCHEME= undefined
##.AVERAGES= 8
##.DIGITISER RES= 18
##SPECTROMETER/DATA SYSTEM= spect
##.PULSE SEQUENCE= zg30
##.SOLVENT NAME= CDCl3
##.SHIFT REFERENCE= (INTERNAL, CDCl3, 0, 15.7039)
##AUDIT TRAIL= $$ (NUMBER, WHEN, WHO, WHERE, WHAT)
$$ ##TITLE= Audit trail, XWIN-NMR		Version 3.5
$$ ##JCAMPDX= 5.01
$$ ##ORIGIN= Bruker BioSpin GmbH
$$ ##OWNER= she
$$ F:/spectra/data/she/nmr/H-F/1/audita.txt
$$ ##AUDIT TRAIL=  $$ (NUMBER, WHEN, WHO, WHERE, WHAT)
(   1,<2021-03-12 13:27:09.43 +0400>,<she>,<DPX200>,
      <created by zg, POWCHK disabled, PULCHK disabled
       configuration hash MD5:
       00 E9 B6 7A A2 85 ED C7 34 08 36 98 17 FE 4E 26
       data hash MD5: 16K
       BF AD 45 E6 A7 E0 71 38 2E 89 27 F5 BB CB 66 3F>)
$$ ##END=
$$ 
$$ hash MD5
$$ 24 94 39 6E 56 41 47 71 62 58 1D C1 A0 F2 55 E9
##$RELAX= 
##$RELAX= 
##$RELAX= 
##$RELAX= 
##$RELAX= 
##$RELAX= 
$$ Bruker specific parameters
$$ --------------------------
##$DU= <F:/spectra>
##$EXPNO= 1
##$NAME= <H-F>
##$PROCNO= 1
##$TYPE= <nmr>
##$USER= <she>
##$AMP= (0..31)
100 100 100 100 100 100 100 100 100 100 100 100 100 100 100 100 100 100 
100 100 100 100 100 100 100 100 100 100 100 100 100 100 
##$AQSEQ= 0
##$AQ_mod= 1
##$AUNM= <au_zg>
##$AUTOPOS= <>
##$BF1= 200.13
##$BF2= 200.13
##$BF3= 200.13
##$BF4= 200.13
##$BF5= 200.13
##$BF6= 200.13
##$BF7= 200.13
##$BF8= 200.13
##$BYTORDA= 1
##$CFDGTYP= 0
##$CFRGTYP= 5
##$CHEMSTR= <none>
##$CNST= (0..31)
1 1 145 1 1 1 1 1 1 1 1 1 1 1 1 1 1 1 1 1 1 1 1 1 1 1 1 1 1 1 1 1 
##$CPDPRG= <>
##$CPDPRG1= <>
##$CPDPRG2= <>
##$CPDPRG3= <>
##$CPDPRG4= <mlev>
##$CPDPRG5= <mlev>
##$CPDPRG6= <mlev>
##$CPDPRG7= <mlev>
##$CPDPRG8= <mlev>
##$CPDPRGB= <>
##$CPDPRGT= <>
##$D= (0..31)
0 1.2 0 0 0 0 0 0 0 0.06 0 0.03 0 0 0 0 0.0002 0 0 0 0 0 0 0 0 0 0 0 0 
0 0 0 
##$DATE= 1615541228
##$DBL= (0..7)
120 120 120 120 120 120 120 120 
##$DBP= (0..7)
150 150 150 150 150 150 150 150 
##$DBP07= 0
##$DBPNAM0= <>
##$DBPNAM1= <>
##$DBPNAM2= <>
##$DBPNAM3= <>
##$DBPNAM4= <>
##$DBPNAM5= <>
##$DBPNAM6= <>
##$DBPNAM7= <>
##$DBPOAL= (0..7)
0.5 0.5 0.5 0.5 0.5 0.5 0.5 0.5 
##$DBPOFFS= (0..7)
0 0 0 0 0 0 0 0 
##$DE= 6
##$DECBNUC= <off>
##$DECIM= 32
##$DECNUC= <off>
##$DECSTAT= 4
##$DIGMOD= 1
##$DIGTYP= 9
##$DL= (0..7)
0 120 120 120 120 120 120 120 
##$DP= (0..7)
150 150 150 150 150 150 150 150 
##$DP07= 0
##$DPNAME0= <>
##$DPNAME1= <>
##$DPNAME2= <>
##$DPNAME3= <>
##$DPNAME4= <>
##$DPNAME5= <>
##$DPNAME6= <>
##$DPNAME7= <>
##$DPOAL= (0..7)
0.5 0.5 0.5 0.5 0.5 0.5 0.5 0.5 
##$DPOFFS= (0..7)
0 0 0 0 0 0 0 0 
##$DQDMODE= 0
##$DR= 18
##$DS= 0
##$DSLIST= <SSSSSSSSSSSSSSS>
$$ [...]
##$SUBNAM2= <"">
##$SUBNAM3= <"">
##$SUBNAM4= <"">
##$SUBNAM5= <"">
##$SUBNAM6= <"">
##$SUBNAM7= <"">
##$SUBNAM8= <"">
##$SUBNAM9= <"">
##$SW= 16.9725357007746
##$SWIBOX= (0..15)
0 0 2 0 0 0 0 0 0 0 0 0 0 0 0 0 
##$SW_h= 3396.73913043478
##$TD= 16384
##$TD0= 1
##$TE= 0
##$TE2= 300
##$TE3= 300
##$TEG= 300
##$TL= (0..7)
0 120 120 120 120 120 120 120 
##$TP= (0..7)
150 150 150 150 150 150 150 150 
##$TP07= 0
##$TPNAME0= <>
##$TPNAME1= <>
##$TPNAME2= <>
##$TPNAME3= <>
##$TPNAME4= <>
##$TPNAME5= <>
##$TPNAME6= <>
##$TPNAME7= <>
##$TPOAL= (0..7)
0.5 0.5 0.5 0.5 0.5 0.5 0.5 0.5 
##$TPOFFS= (0..7)
0 0 0 0 0 0 0 0 
##$TUNHIN= 0
##$TUNHOUT= 0
##$TUNXOUT= 0
##$USERA1= <user>
##$USERA2= <user>
##$USERA3= <user>
##$USERA4= <user>
##$USERA5= <user>
##$V9= 5
##$VALIST= <valist>
##$VCLIST= <CCCCCCCCCCCCCCC>
##$VD= 0
##$VDLIST= <DDDDDDDDDDDDDDD>
##$VPLIST= <PPPPPPPPPPPPPPP>
##$VTLIST= <TTTTTTTTTTTTTTT>
##$WBST= 1024
##$WBSW= 4
##$XGAIN= (0..3)
0 0 0 0 
##$XL= 0
##$YL= 0
##$YMAX_a= 49183
##$YMIN_a= -79368
##$ZGOPTNS= <>
##$ZL1= 120
##$ZL2= 120
##$ZL3= 120
##$ZL4= 120
##$ABSF1= 10
##$ABSF2= 0
##$ABSG= 5
##$ABSL= 3
##$ALPHA= 0
##$AQORDER= 0
##$ASSFAC= 0
##$ASSFACI= 0
##$ASSFACX= 0
##$ASSWID= 0
##$AUNMP= <proc_1d>
##$AZFE= 0.1
##$AZFW= 0.1
##$BCFW= 1
##$BC_mod= 2
##$BYTORDP= 1
##$COROFFS= 0
##$CY= 11.3945322036743
##$DATMOD= 1
##$DC= 2
##$DFILT= <>
##$DTYPP= 0
##$F1P= 15.9154993809931
##$F2P= -4.1035820241983
##$FCOR= 0.5
##$FTSIZE= 0
##$FT_mod= 4
##$GAMMA= 1
##$GB= 0.15
##$INTBC= 1
##$INTSCL= 1
##$ISEN= 128
##$LB= 0.24
##$LEV0= 0
##$LPBIN= 0
##$MAXI= 10000
##$MC2= 0
##$MEAN= 0
##$ME_mod= 0
##$MI= 1.114404
##$NCOEF= 0
##$NC_proc= 0
##$NLEV= 6
##$NOISF1= 3.799351
##$NOISF2= 2.8
##$NSP= 1
##$NTH_PI= 0
##$NZP= 0
##$OFFSET= 15.70392
##$PC= 1
##$PHC0= -11279.45
##$PHC1= 14.80094
##$PH_mod= 1
##$PKNL= yes
##$PPARMOD= 0
##$PSCAL= 0
##$PSIGN= 0
##$REVERSE= no
##$SF= 200.130013532006
##$SI= 16384
##$SIGF1= 3
##$SIGF2= 2
##$SINO= 400
##$SIOLD= 16384
##$SREGLST= <1H.CDCl3>
##$SSB= 0
##$STSI= 0
##$STSR= 0
##$SW_p= 3612.71676300578
##$SYMM= 0
##$S_DEV= 0
##$TDeff= 0
##$TDoff= 0
##$TI= <>
##$TILT= no
##$TM1= 0
##$TM2= 0
##$TOPLEV= 0
##$USERP1= <user>
##$USERP2= <user>
##$USERP3= <user>
##$USERP4= <user>
##$USERP5= <user>
##$WDW= 1
##$XDIM= 8192
##$YMAX_p= 0
##$YMIN_p= 0
$$ End of Bruker specific parameters
$$ ---------------------------------
##NTUPLES= NMR FID
##VAR_NAME=  TIME,          FID/REAL,        FID/IMAG
##SYMBOL=    X,             R,               I
##VAR_TYPE=  INDEPENDENT,   DEPENDENT,       DEPENDENT
##VAR_FORM=  AFFN,          ASDF,            ASDF
##VAR_DIM=   8192,          8192,            8192
##UNITS=     SECONDS,       ARBITRARY UNITS, ARBITRARY UNITS
##FACTOR=    0.0002944,     1,               1
##FIRST=     0,             0,               0
##LAST=      2.4114304,     0,               0
##MIN=       0,             -79368,          0
##MAX=       2.4114304,     49183,           0
$$ Real data points
##PAGE= N=1
##DATA TABLE= (X++(R..R)), XYDATA
0 0 0 0 0 0 0 0 0 0 0 0 0 0 0 0 0 0 0 0 0 0 7 -8 8 -8 8 -8 8 -15 16 -16 16 -23 24 -24 31 -32 39 -42 47 -53 58 -63
42 -63 71 -78 86 -96 106 -116 128 -140 155 -171 190 -208 231 -256 286 -320 360 -408 469 -545 643
63 643 -776 964 -1258 1756 -2763 5532 -27149 -79368 27335 21322 -43144 4217 26757 -26509
77 -26509 -21657 7612 4354 -11715 -24977 -9831 11890 -6633 -12345 12810 -158 -22292 -1860
90 -1860 6980 -6187 -5352 2978 5653 3418 -6108 -2954 7185 -1983 -7089 3736 6942 99 -1589
105 -1589 4985 4605 -11194 -11402 12123 4736 -15151 2832 11163 -13292 -7707 12654 -6895 -18294
119 -18294 3576 6553 -7014 -1782 2342 -6198 -5919 -375 1106 -1936 -3877 1541 4564 -168 -920
134 -920 1230 -2830 -814 3838 681 402 3766 602 -1039 3280 -881 -4992 1097 3829 -2404 -2266
150 -2266 2641 -1589 -5410 -1145 573 -6229 -5582 3384 489 -7145 -1852 1271 -7230 -4019 3669
165 3669 -3285 -6160 2240 2409 -4159 -454 1581 -3593 -1789 4147 1367 -2601 1785 2848 -1221
180 -1221 -470 2545 -489 -2309 3403 4138 -1265 -575 3682 -33 -2112 2903 2303 -1763 1159 5133
196 5133 454 -1718 2558 1902 -1147 1951 3604 -627 714 3912 1280 -951 1555 1282 -979 2283
212 2283 3502 -1210 -1315 3690 824 -3405 1608 2217 -3451 -826 5291 -272 -5322 1551 3363 -3380
228 -3380 -2083 4469 104 -4085 2174 4282 -2948 -3415 3537 1530 -2864 845 3045 -1585 -1427 2310
244 2310 254 -1915 -520 376 -153 339 -664 -1926 261 565 -2057 -1318 1738 -1122 -2856 2298
260 2298 2513 -3636 -2268 4380 781 -3929 1975 4489 -2381 -1494 5767 1616 -4012 1643 5605 -569
276 -569 -1865 3907 2286 -2479 810 3890 -911 -2263 2029 1727 -968 -522 776 -795 -635 283
292 283 -614 -632 -137 -1026 -499 1477 -1085 -2783 953 1851 -2337 -1559 2901 -341 -3303 1558 2966
309 2966 -3365 -2699 3967 1052 -4070 132 3355 -2660 -3192 2977 878 -4542 -713 3268 -1546 -3086
325 -3086 1112 793 -2508 -624 1825 -940 -1693 842 900 -449 -23 222 -153 1260 939 -195 682
342 682 1899 -38 86 2618 888 -1635 1560 3509 -763 -1067 3031 1328 -1874 1267 3378 -1449
358 -1449 -1571 3297 1685 -2481 316 2770 -1015 -1212 2440 1087 -2281 322 2638 -656 -1134 1266
374 1266 489 -1296 912 1119 -1230 -594 1016 -154 -924 649 -463 -1490 546 790 -1752 -1079 1239
391 1239 -789 -1536 952 436 -2310 -208 2113 -1047 -1975 1194 851 -1810 305 1812 -1105 -1228
407 -1228 1645 992 -1601 171 1255 -738 -455 1333 -221 -1367 740 859 -1157 -186 1129 -658
423 -658 -1138 1477 402 -2098 28 1825 -1023 -1383 1784 498 -2033 559 2189 -1143 -1339 1911
439 1911 861 -1540 268 1521 -753 -645 1301 179 -1012 196 406 -811 -74 -51 -1302 -485 186
456 186 -1394 -1541 252 -908 -2435 -488 293 -2379 -2313 711 -376 -2946 -1018 1111 -1741 -2649 799
473 799 690 -2649 -1109 2004 -716 -2274 1008 1417 -1574 -611 1862 78 -974 881 1059 -475
489 -475 159 669 -44 335 267 -511 225 846 -784 -710 1146 -59 -1726 241 1416 -1462 -1310 1445
507 1445 278 -2140 -16 1786 -872 -1429 1344 1228 -1566 -189 2242 119 -1340 1281 1985 -787
523 -787 -255 2151 542 -1010 1052 1509 -668 -61 1256 13 -423 330 -133 -544 299 -377 -949 -22
541 -22 -313 -1442 -340 478 -1392 -1329 698 -25 -1769 -139 1240 -919 -1168 1342 991 -1535 16
558 16 2322 24 -1154 1675 1954 -850 107 2460 639 -865 1155 1988 -484 -245 1639 694 -585
575 -585 609 1133 -255 -162 763 289 -152 461 43 29 617 -71 -485 747 759 -737 185 1447 -279
594 -279 -735 1307 1066 -1087 -26 1635 -111 -982 973 1190 -1132 -274 1411 -85 -1349 560 861
611 861 -1218 -653 838 -267 -1228 82 162 -979 -550 299 -320 -609 210 -142 -626 73 192 -536 -271
630 -271 603 -341 -570 581 224 -927 143 850 -533 -578 654 136 -803 326 753 -493 -387 570
648 570 195 -540 322 469 -362 13 637 -66 -257 677 321 -383 473 704 -348 -179 1121 94 -733
667 -733 532 853 -609 -360 1054 -71 -988 358 608 -972 -593 583 -259 -1125 9 426 -831
684 -831 -597 209 -360 -857 -216 -41 -629 -263 -78 -387 -244 -44 -359 -308 254 -258 -493 323 278 -775 -157
705 -157 909 -454 -887 528 710 -1054 -259 1153 -229 -1180 672 883 -1055 -625 1225 279 -1050
722 -1050 363 1153 -567 -468 953 573 -593 193 895 -29 -107 408 557 95 187 310 402 238 -51 102
742 102 449 265 -329 258 700 -383 -554 581 534 -962 -208 1010 -294 -1150 445 819 -1050 -541
760 -541 942 -137 -1396 200 871 -881 -959 549 134 -1080 -181 642 -493 -732 246 179 -666 -299
778 -299 209 -127 -393 -106 15 5 -130 -307 -6 282 -321 -302 407 294 -597 58 721 -114 -563 576 777
799 777 -673 -115 960 188 -869 515 920 -463 -421 934 370 -747 257 923 -125 -400 558 405
817 405 -438 76 367 -107 -228 172 79 -270 52 -24 -208 7 -50 -297 -41 191 -322 -268 383 -42 -615 8
839 8 343 -380 -399 450 -33 -775 35 385 -591 -528 409 -4 -733 -56 120 -443 -397 347 -110 -527 129 245
861 245 -336 -186 430 -130 -236 312 221 -273 47 392 -149 -16 552 150 -184 409 484 -105 156 459 162
882 162 -183 323 474 -146 38 587 39 -198 330 189 -239 -14 216 -111 -147 296 -65 -358 199 91 -230
903 -230 32 408 -252 -228 541 191 -474 109 542 -366 -183 496 128 -590 82 586 -230 -364 379 34 -585
924 -585 -56 299 -444 -440 173 13 -558 -219 48 -149 -340 -55 71 -243 -18 48 36 0 24 -60 181 251 1
947 1 120 514 219 -153 479 593 -225 -12 729 391 -421 394 699 -261 -312 553 251 -499 89 503 -250
968 -250 -465 116 110 -526 -181 289 -120 -478 90 187 -185 -241 37 150 -99 -153 68 65 -67 -161 77 278 -156
991 -156 -247 201 358 -428 -334 340 17 -590 -11 291 -577 -658 369 -44 -891 -174 380 -437 -509 329 87
1012 87 -528 -251 338 15 -415 116 355 -85 -39 228 135 48 225 310 217 13 26 179 272 -109 -21 129 181
1035 181 0 -41 283 -18 -290 175 264 -271 -334 340 175 -400 80 484 -253 -370 442 190 -465 35 329
1056 329 -1 -288 152 231 -251 -59 219 38 -201 112 -1 -106 -142 -9 -66 -172 44 -136 -165 3 -88 -236
1078 -236 -3 -96 -312 -95 49 -17 -285 48 28 -206 -18 259 -79 -283 202 220 -159 -45 268 53 37 236
1100 236 96 -72 146 230 22 -47 202 142 -28 54 241 -49 10 299 24 -100 175 120 -149 73 188 -73
1122 -73 -156 194 142 -117 117 57 -24 -9 173 83 -167 79 70 -53 -67 97 0 -178 -25 -3 -119 8 -14 -98 16
1147 16 15 -101 -118 150 48 -293 -17 64 -176 -141 150 -19 -304 -21 197 -85 -204 203 112 -209 -31 275
1169 275 36 -217 148 146 -100 -95 295 156 -47 139 86 90 59 53 147 113 -1 44 62 67 108 55 159 17 -184 57
1195 57 243 -163 -148 283 73 -203 44 154 -190 -276 251 51 -253 -116 264 -8 -316 75 104 -280 -156
1216 -156 176 74 -216 -15 354 -123 -170 102 23 -170 -16 11 73 -107 -3 43 44 -17 -193 36 116 -224 -139
1239 -139 142 19 -135 28 181 -93 -215 189 193 -196 -33 182 -26 -182 86 212 -233 -110 234 77 -157
1260 -157 -3 280 2 35 118 167 18 16 182 81 -5 7 89 56 29 -133 -40 30 -10 -123 66 -9 -167 87 91
1285 91 -111 -173 9 20 -114 -5 151 -155 -270 97 37 -144 -137 123 -66 -152 30 109 -201 -113 48 10 -73 -51
1309 -51 51 -86 6 94 10 32 -1 7 -38 24 67 -106 7 46 -98 -122 -4 -36 7 -15 81 -24 -45 152 96 -44
1335 -44 14 191 13 3 122 54 29 190 140 13 -1 85 219 10 6 -30 -6 102 177 -81 -55 21 -156 -83 -20 -3
1361 -3 -163 -22 29 -18 -102 50 1 -177 -91 -32 -70 -216 61 52 -103 -60 157 100 1 -64 89 -21 -70 14 13 -1 -13
1388 -13 0 30 14 -59 -20 66 3 -62 21 16 -137 10 91 54 -54 -92 178 -7 -30 98 104 -103 -31 175 66 -103
1414 -103 202 185 -47 -68 124 100 -28 38 160 33 -37 83 122 -18 -109 -66 -19 -80 -72 -58 -26 -4 -67 8 21 -144
1440 -144 -118 104 -28 -137 -66 54 -108 -163 4 14 -15 -60 27 87 -131 17 78 -58 -24 83 59 -73 -42 85
1464 85 -63 -53 -47 46 -69 -78 -140 15 63 -25 83 -39 -76 65 38 -55 -46 24 113 54 11 -24 86 15 4 86 94 53 -40
1493 -40 54 -11 -38 -21 130 -48 18 140 64 -115 -24 132 -15 -53 13 -31 -89 -27 26 -55 -82 -74 34 -60 -27 -44 8
1520 8 13 -11 -7 21 -7 -69 -80 -120 -129 -116 15 0 -82 -19 39 -12 -117 -35 8 0 -21 36 -1 -78 43 38 -42 36 28 23 -22 -56 87
1553 87 -27 77 48 -51 87 69 -3 -41 67 37 -27 95 -68 -26 -127 44 -11 -52 37 32 -56 -77 77 100 11 -17
1579 -17 -2 37 40 -23 44 -63 13 52 -13 -1 90 -45 -71 -22 9 30 13 -38 -37 43 22 -41 -100 -11 2 -17 5 8 -1 -35 39
1610 39 70 -129 -28 -2 128 -53 -80 106 -128 -24 56 -12 -38 -42 2 -59 28 -60 43 6 74 102 37 -29 -92 5 140
1637 140 59 7 10 16 -13 -1 -11 36 -3 1 39 -61 -83 11 -39 37 84 137 65 -64 -63 15 -20 -49 95 -18 23 -69 52
1666 52 -43 -39 -29 -43 1 -1 -30 49 25 -27 4 60 61 -1 83 -11 44 -22 -11 30 39 -93 35 9 -65 73 -57 -44 -63 31
1696 31 -100 -36 2 6 107 35 54 55 9 -76 79 -41 -7 -26 45 -11 -9 44 8 -72 -47 23 41 8 -5 -53 96 4 35
1725 35 49 11 -21 78 40 33 103 38 26 -50 -10 -58 -37 -83 94 -15 4 31 115 -59 -22 2 -8 11 -26 21 23 -13 -27 -8
1755 -8 -119 -47 -54 -47 -93 -74 -146 -65 -9 20 76 -25 0 54 20 47 7 12 -12 18 -47 20 -48 -25 -13 65 17 13 -39 -23 9 80
1787 80 46 39 -57 -14 70 24 67 -11 106 -52 36 61 -5 -55 -101 -37 58 0 81 53 -42 66 -24 -128 -2 -120 -20
1814 -20 27 41 -65 -85 20 4 -47 70 35 -116 40 -10 1 -51 73 -5 -16 -73 18 51 6 -62 -77 61 63 31 -12
1841 -12 88 -4 -35 42 -87 -30 -33 115 73 -58 -17 15 36 54 71 -53 34 -72 73 -8 -90 -15 -23 33 5 88 -7 -52
1869 -52 -9 25 -2 -2 -29 -53 37 65 55 32 56 -65 -116 -40 -47 -165 -5 14 -2 48 -37 27 -11 -12 70 88 38 12 0 -5 -34
1900 -34 32 -15 -114 -58 26 103 10 33 -15 -111 -28 -35 -34 -18 78 47 21 -36 37 25 -25 -140 -21 -7 -10 -13 -14 77 19 -47 59
1931 59 -98 39 49 112 39 39 26 -35 -123 32 -38 34 75 -17 -27 -27 28 73 -126 26 -62 1 32 8 -29 7 -42 -18 33
1960 33 128 34 -114 83 -69 42 1 2 -64 -10 39 46 -93 25 -23 77 -73 44 -99 5 -7 51 17 29 -19 38
1986 38 37 -57 131 -80 100 -32 -4 72 -30 27 40 -64 -35 72 -30 -56 6 54 -39 -26 95 -31 25 -53 -15 8
2012 8 -2 42 -10 47 20 16 62 45 -20 -92 1 57 52 -76 -57 72 -94 -9 10 -42 29 4 -23 -73 -28 56 31 -47 -25 -9
2042 -9 -4 -43 -30 -19 -107 45 25 4 47 9 -74 -7 32 38 72 63 -10 -7 -17 8 28 -73 2 -46 45 47 61 -141 -8 -32 -25 -96
2074 -96 62 -16 103 118 34 8 4 -107 78 2 -102 -45 -9 -65 -57 9 -42 40 -33 0 -40 47 -33 66 51 18 42 -20 0
2103 0 -16 -47 -49 -11 -43 -108 5 -12 -29 -58 16 125 19 44 -67 5 -50 54 75 80 52 -22 -29 -26 -56 57 11 10 -92 2
2133 2 4 -50 6 -6 -70 30 5 77 79 75 -73 33 -16 59 22 -52 43 -65 -41 -36 18 -58 12 -72 -41 -25 -11 36 -27 -14 1
2164 1 -27 -26 67 -41 -16 -75 71 2 38 -6 -25 -18 -14 85 21 7 -8 21 38 10 -21 30 -35 -51 20 -9 -10 -24 -65 -4 82 105
2196 105 2 -19 5 71 -42 -56 -59 -2 -19 -101 0 126 -50 -22 48 -50 70 -22 78 83 28 80 17 48 -3 -31 1
2223 1 -22 -9 -8 31 -35 34 -28 -27 68 46 26 -48 -22 85 -19 20 -37 -51 83 -36 22 37 41 0 -138 -12 -34 -20 -27 17
2253 17 4 -22 -86 -46 44 -107 11 7 -42 11 -90 -60 82 20 2 33 28 -50 19 -33 -10 8 33 24 -98 -63 -7 -60 52
2282 52 93 48 10 39 4 -89 -13 24 -6 -67 -70 -70 -18 -59 -16 -9 13 -28 -41 39 5 -82 -19 55 -17 93 57 -10 16 12 24 -46
2314 -46 20 -107 -47 -45 -10 3 26 -37 0 54 6 68 -1 17 -82 -2 74 46 32 -57 -61 -39 -69 -45 12 -138 -80 14 24 -34
2344 -34 -85 -57 -26 -25 -19 -45 -76 -39 12 -69 4 48 -18 51 -74 -16 -18 -1 33 12 -74 -65 39 -52 -6 -14 -95 -84 -6 16 75 134
2376 134 -2 -101 -11 -73 49 -12 36 -10 19 48 -1 -10 -104 0 14 -79 -68 -37 50 85 -68 52 70 -40 -2 61 -24
2403 -24 -3 60 -75 20 -72 26 -73 15 -115 -53 -22 -19 37 -49 18 -69 -29 37 47 14 87 -22 -5 -5 -46 0 -50 -20 -10 54
2433 54 -62 26 -13 9 -2 90 -41 -16 9 -3 66 -70 93 9 26 -54 3 -79 -35 60 -50 24 -18 94 -29 5 -16
2460 -16 13 -45 43 -67 44 18 -9 -46 2 -17 -47 -3 -1 -8 -50 -48 57 33 -72 -120 -18 43 79 25 -42 2 -72 40 14
2489 14 -16 20 -54 -10 54 86 11 -58 23 33 -15 19 -5 82 -29 25 -7 14 -10 -38 -23 56 43 71 89 -28 76 -31
2517 -31 21 -18 -55 -24 62 42 72 23 68 92 -19 -5 50 40 -9 27 -55 -78 -30 52 25 -58 -45 -14 65 0 -54 39 -64
2546 -64 -9 -80 61 45 -58 5 84 -16 -41 30 -50 34 24 -42 23 56 30 16 43 -65 -23 -34 -3 -51 19 47 25 -6
2574 -6 50 53 51 92 23 49 58 28 -4 -29 67 -26 -2 57 -3 30 -59 3 -67 -17 -9 32 77 53 -99 -19 27 -14 -15 -26 -60 56
2606 56 25 -11 -70 71 8 -25 19 4 2 -9 36 66 45 -54 -47 -40 50 39 -20 37 26 43 -19 -46 -65 64 -80 51 -44 -18
2636 -18 14 -49 -8 -14 -49 14 67 -40 -77 -17 1 -27 61 -67 -97 78 -3 -16 -63 -57 107 -28 60 29 16 -115 -28 46
2664 46 42 57 48 3 15 65 5 -86 33 -14 -56 -42 19 35 -54 7 64 -39 -65 11 64 -27 -58 13 -6 -47 56 -13 15 -5
2694 -5 62 -34 -38 14 -10 -54 37 -48 -8 -23 -13 84 -81 -38 49 -27 -17 35 1 -26 18 -28 86 -117 -28 -21 90 49 -4 -38
2724 -38 -31 -54 9 46 -27 -6 -17 10 -17 47 169 39 48 50 15 -20 -96 82 -126 -25 29 -73 -32 -39 -13 18 -10 42 77
2753 77 -13 -49 66 -7 43 87 29 34 23 39 -3 -7 23 -101 -12 -67 0 32 -15 -92 2 3 65 54 89 2 14 28 -16 26 83
2784 83 -25 -2 39 41 32 12 19 -15 5 -82 50 -88 -27 -61 95 14 -18 10 17 -15 8 24 -61 -24 -93 64 49 -32 -7 4
2814 4 20 -74 28 24 19 50 -77 27 4 84 -27 50 44 22 -93 64 -42 44 35 -87 54 -74 -29 -33 41 -33 -84 9
2842 9 26 2 21 -27 40 -2 20 17 127 57 -42 16 53 1 -31 -56 28 116 23 23 -70 18 42 -33 8 16 -55 -2 57 -18 65 43
2874 43 -19 -57 10 19 -3 15 11 12 -87 -41 -44 19 -2 -39 -67 -61 -6 -25 -22 75 51 -22 -95 -4 28 2 95 -48 33 7 71 -8 -94
2907 -94 106 -7 -19 12 44 16 -13 -7 36 13 9 -41 11 -44 -74 5 69 -19 -54 -16 -44 -19 -56 -31 0 -15 30 -19 -23 27 96
2938 96 44 -26 -16 -17 100 28 -10 -87 21 75 26 18 21 12 72 28 -6 -5 -18 -42 -64 15 9 14 -102 56 95 -12 30 -30 -26 65
2970 65 -40 37 -42 -19 9 84 -49 -2 -54 -93 -6 33 -56 -71 62 24 59 46 -2 64 -1 56 27 36 7 -79 21 -11 159
2999 159 0 -57 -31 -28 -131 22 -27 11 21 11 95 15 -36 -44 92 -76 35 -20 -64 72 -52 23 42 40 -17 69 -42
3026 -42 -53 26 71 52 -96 61 -21 -90 32 -22 5 15 -45 8 4 -38 -26 27 -102 34 6 9 109 19 27 1 -7 -26 75
3055 75 -8 16 78 48 25 58 -23 -57 -14 -82 -30 -9 59 -33 16 -5 40 36 30 -41 46 -48 -33 -31 51 62 51 -31 -57 91 -49
3086 -49 17 -70 63 -72 25 7 -11 93 -57 61 16 49 71 21 24 -29 43 102 1 -35 -35 2 -37 -69 26 8 -24 -75
3114 -75 44 -32 10 24 -62 -19 -56 18 73 12 -13 25 -103 57 -115 -3 8 -75 -47 -56 21 11 -15 14 64 -34 72 -61
3142 -61 32 83 45 8 23 123 -78 -19 -63 -16 -48 34 47 -35 -55 -91 -20 -23 -69 9 -64 -39 -113 -55 56 62 0 12 -118
3171 -118 -35 -23 10 72 23 -91 -32 -61 -6 51 -3 -13 -8 -4 52 4 36 -39 40 -26 0 -33 -25 33 39 -74 -12 -45 -26 -24 -52
3202 -52 115 39 47 63 -18 60 67 55 85 8 -18 -12 -56 -11 21 65 -12 43 119 43 -3 25 25 -17 -53 -63 16 -34 34 102 -8
3233 -8 -47 10 48 24 -12 83 69 -10 -76 -18 -38 54 32 -37 -7 25 -20 12 -45 -39 -54 35 72 26 -18 -19 62 -37 -5 -3 -15 7
3265 7 60 23 -59 -31 -76 35 -49 -1 -39 -7 -53 -11 2 -65 27 87 59 -38 -72 -2 50 52 -42 19 15 -28 -5 39 -49 -78 11
3296 11 1 -24 89 -45 42 11 -70 77 13 53 12 75 -62 26 -20 22 7 -3 -69 -33 -96 -131 -76 -71 -48 15 -8 -60 -41
3325 -41 -56 59 -35 32 -58 46 60 5 -11 -34 -44 25 -59 53 28 9 114 53 132 -35 -41 44 -41 -38 -104 -6 20 -24 -56
3354 -56 -19 -109 -41 8 18 72 31 -24 -28 -72 15 4 5 -9 41 36 50 51 1 56 70 -40 80 71 92 64 84 -66 -27 33 -37
3385 -37 0 -8 -69 42 -3 71 9 -8 6 -12 22 5 4 -45 22 -33 22 -77 65 -7 -28 -171 -7 -11 56 49 51 27 42 7 -62
3416 -62 -32 51 60 -22 19 -39 -17 31 -24 70 46 -58 39 -156 27 -65 -50 76 27 84 24 19 32 -17 -74 35 10 21 -38
3445 -38 3 -42 -17 -58 -58 -5 25 23 -41 39 16 3 -49 10 72 82 -10 48 34 -126 50 2 -13 10 3 -76 -31 23 28 -122 77
3476 77 -69 -25 -10 -27 -163 21 -4 -16 32 -64 53 51 -7 4 -42 -88 71 8 -17 85 76 -30 -51 43 -10 -5 -67 -24
3504 -24 -13 45 -4 5 3 15 54 33 74 83 -16 51 23 -22 9 -26 15 -40 9 31 11 87 -44 -27 98 -41 22 8 -6 69
3534 69 -53 -46 59 -8 70 -5 25 -40 -49 -28 -30 18 30 43 54 -96 17 3 79 -12 -11 70 102 -45 -73 -64 -64 -58 44 17 -23
3565 -23 -15 0 -1 44 -141 25 7 -40 -7 51 31 45 25 3 36 -43 7 62 -66 30 -36 13 71 -8 60 -39 -48 -18 128 34
3595 34 -29 -41 -34 15 48 -56 11 73 70 5 20 83 20 -38 -69 10 -61 80 68 -6 -29 -32 69 114 -10 -17 33 -5 87 70
3625 70 -14 -22 8 42 23 -14 -51 -135 -57 -22 -39 -25 8 4 16 -44 -7 73 -10 -136 -112 54 66 -39 7 -66 10 -37 -23 -42
3655 -42 79 -46 -8 18 -61 -9 51 21 3 -29 14 0 84 -80 -40 61 -34 59 41 1 19 -49 59 -44 -108 -35 41
3682 41 71 2 -27 -3 118 -39 121 62 70 -5 43 -37 90 -63 -44 -32 -56 81 41 18 35 22 17 -50 -16 77 -45 -51
3710 -51 -75 -14 -29 -46 -19 8 24 30 -2 -125 0 -57 -57 -42 19 36 -3 -25 -17 103 60 60 -27 48 -12 -6 29 -38 14 22 -1 -48
3742 -48 -83 71 -26 -47 2 85 31 -49 12 50 58 47 -95 -8 -18 51 17 -67 -24 -37 -8 57 -144 -68 -44 -76 -8 -3 -18 33
3772 33 1 49 70 -80 50 -61 -42 23 5 -17 -11 100 39 -48 -4 -24 -61 -101 34 -25 -156 -65 -44 47 12 -94 -105
3799 -105 1 32 25 34 -35 11 -29 9 -108 55 9 -4 83 -40 78 65 62 -7 36 35 108 99 43 -16 -19 2 -62 6 43 53
3829 53 -11 -40 0 -18 1 -48 -4 3 -7 -49 8 56 -45 37 -31 -139 28 -15 24 -116 -79 -2 -44 50 -36 -67 -74 -18 79
3858 79 -37 49 42 -59 -58 -77 -76 113 -45 -36 -5 -94 -41 -113 33 14 -89 -30 16 -69 32 -63 103 39 71 -29 25 79
3886 79 3 75 44 -78 -47 -44 45 -66 -4 58 -66 -49 12 77 22 6 -30 21 3 -57 -34 53 -24 46 -22 -85 81 -30
3914 -30 16 23 -100 63 24 -4 44 -51 8 -15 -9 -47 -32 -52 -46 24 74 -46 -14 73 3 -60 48 -92 14 -10 -48 36 31
3943 31 49 -3 -6 -57 53 21 42 -21 -54 -74 39 -49 -40 90 -40 -2 -10 -15 27 -75 -23 65 60 122 -11 -45 -4 -1 -3 13 31
3974 31 5 90 -38 -12 -8 47 49 -19 -24 69 97 56 37 47 44 60 100 -11 -52 94 -58 82 107 -12 -42 1 19 -31 -20
4003 -20 -94 8 21 -6 -52 -13 27 -63 82 21 22 -18 -62 36 13 -21 100 -17 5 -131 -32 32 -54 -17 -6 43 -1 26
4031 26 115 -42 -112 -10 -75 -66 -33 42 -89 -104 -5 -17 34 -15 17 -12 -37 38 99 84 89 59 49 -32 15 -59 2 -3 -30 87
4061 87 -136 64 -4 23 -51 21 -34 55 6 44 15 -88 84 -12 -87 29 -64 -123 106 23 -57 -14 19 -28 -36 -9 31 74
4089 74 3 17 51 -67 46 -15 79 -31 -17 -65 12 -26 -54 -14 -36 9 74 -12 4 32 57 -45 -38 13 75 -18 -118 -5
4117 -5 33 -85 -23 56 34 47 18 -16 -25 10 63 -68 -80 -75 1 40 -2 38 -75 0 35 -42 49 125 67 139 -47 54 -66
4146 -66 -103 -8 33 20 29 -116 -19 18 -99 -58 -78 13 22 -72 21 15 53 42 56 -27 -40 89 16 22 -62 24 27 15 -63 21 -20
4177 -20 -32 -67 -12 36 -1 38 23 56 -55 -73 138 4 78 3 42 31 33 -26 20 -23 -35 -13 -66 -6 23 17 -43 46 -95
4206 -95 -19 35 -7 32 26 -66 -20 92 -50 -3 -55 -28 37 156 -68 56 -3 -99 68 35 -19 -43 -26 -13 -30 63 62 -32
4234 -32 39 -55 -22 -39 -35 95 -36 -69 -83 63 47 -19 -54 20 6 -13 16 62 -117 -24 -20 33 14 8 -36 33 -19 -2 -2 -4 48
4265 48 -68 -62 -49 35 -35 -3 -72 42 78 23 30 89 12 -42 88 -3 28 -8 -53 0 -26 -5 8 -83 73 6 116 10
4293 10 -57 -31 -86 10 7 -34 94 33 61 -23 42 -18 -69 66 49 -19 -37 29 -69 -49 -42 3 -79 33 103 2 -37 18 -17
4322 -17 -76 -5 -61 57 -33 86 -98 82 -35 -18 -106 -17 -34 -36 45 -113 52 48 93 -57 6 78 4 -16 3 4 -72 64
4350 64 15 -41 45 -68 19 42 51 -45 29 24 90 -10 60 -50 -50 -45 -73 1 13 98 53 70 16 -15 -143 -42 -46 104 4
4379 4 -26 -44 53 -53 -71 -42 -42 78 63 -16 -30 -111 -62 74 40 26 -21 88 -12 -25 -22 47 8 2 -21 55 73 -47 42
4408 42 70 -36 2 -40 6 -51 14 -64 26 1 29 71 83 -14 -14 32 -24 -81 -57 -28 30 50 68 29 28 113 6 48 -90 22
4438 22 -11 -26 -71 0 -59 92 19 -3 59 -56 -22 41 -33 89 -30 65 -22 19 17 -61 -11 8 77 -4 -24 30 78 -19 -84
4467 -84 53 -36 99 14 54 74 8 -21 58 66 0 5 -49 0 42 7 -31 -66 12 -28 32 74 -2 -13 91 -13 83 71 10
4496 10 -64 -4 -2 -21 -94 -32 8 22 56 -17 -24 130 28 4 20 -27 74 10 -42 8 -32 9 -31 -71 -41 25 19 26 37 -63
4526 -63 -70 -24 85 60 45 16 -51 -47 78 26 -76 50 26 -11 7 48 33 -25 -33 54 -28 -78 26 -19 -49 -80 -21 -41 -33 -6
4556 -6 -35 -43 7 50 40 28 75 2 -42 3 -102 -28 40 -15 -7 -20 -7 -22 24 -36 46 -25 44 44 -32 -45 -32 -22 -58 -36 -32 4
4588 4 57 0 100 -25 17 -29 -57 69 -2 -4 -88 88 29 -33 -68 -33 -32 10 -63 -38 -73 -10 19 28 4 7 23 -54 48 -30
4618 -30 52 -10 1 -30 41 30 51 -41 -9 25 47 -36 42 -23 23 -51 12 9 -54 18 -10 -37 -17 37 21 -92 -34 36 50 34
4648 34 48 39 45 -57 5 -50 -79 28 12 -8 -8 26 -4 -5 3 24 13 -16 0 26 87 4 -4 78 -50 -41 66 58 -61 19 56 3
4680 3 21 62 -23 -68 -108 86 0 38 -4 -34 77 11 -87 -45 28 13 -21 29 23 63 19 -23 -26 -29 -68 11 -50 20 -50 -13 -87
4711 -87 -81 0 -85 126 36 61 -12 -57 -44 -41 -9 27 88 11 -53 84 18 102 8 37 64 33 96 117 -46 -28 -53 85 40
4740 40 -6 -55 -18 -19 -112 34 -9 -49 66 55 -42 36 -127 -19 29 -86 18 -28 -29 77 101 -66 -22 85 -64 -45
4766 -45 35 1 -41 21 29 -5 -48 -86 -79 50 -38 -11 -31 4 65 -24 11 -13 46 -19 -35 -7 37 70 70 109 35 50 -25 -21 -79 43
4798 43 95 1 126 -31 29 23 14 3 -99 -68 -112 -28 76 -6 86 9 -52 15 38 44 97 8 48 28 -12 -18 15 35 -44 8
4828 8 70 19 -73 -88 0 6 65 -6 62 -1 -27 -73 -3 -54 -134 -9 47 -38 -113 -14 4 35 -76 22 2 25 -3 84 -32 54
4858 54 -48 -64 0 -13 10 -9 -41 -48 60 63 88 -23 36 -30 -45 57 106 -61 7 -62 33 -49 -81 -33 73 85 -28 -15
4886 -15 27 -86 51 -2 -78 22 12 32 43 -15 -17 -67 1 29 -112 71 -30 -93 -70 29 -38 -19 -23 -32 58 46 -45 -3 3
4915 3 -61 6 -9 105 -62 -10 24 -67 55 10 14 -81 3 -3 -66 38 70 72 -28 -7 95 88 6 30 8 11 33 50 -19 -66
4945 -66 128 19 76 2 11 4 -104 23 -38 -27 50 -1 -98 -43 27 -31 -67 -30 45 30 -7 62 18 -85 69 46 -49 -12
4973 -12 46 -89 -42 -8 -57 -16 113 108 7 42 -12 32 -45 -15 -65 -13 10 -37 32 -8 35 59 34 37 40 -37 -17 -6 -33 9
5003 9 -29 -51 -54 13 -89 62 -4 -49 -37 33 -48 -15 -10 -7 55 56 23 68 37 5 -25 -93 58 -8 -51 48 -8 26 -19 -105 15
5034 15 -27 -15 -56 42 44 45 -37 -19 -25 -73 -7 -111 11 -19 6 8 -1 23 98 10 -19 56 33 86 -37 -33 -48 59 -38 10 -4
5065 -4 17 -113 -19 -58 -64 88 -35 -56 -61 -81 110 12 42 36 -56 18 53 24 -14 -11 -60 68 -79 26 24 -31 -1 -17 81 6
5095 6 27 62 -5 -24 15 35 81 11 45 -8 -27 -37 14 37 -32 62 0 10 -45 -30 -32 67 53 16 8 -95 -87 55 -11 -6 -36 -26
5127 -26 -38 -41 32 -11 54 -8 17 20 22 -46 -33 -57 -71 -1 63 38 -20 18 1 37 -14 -12 36 -14 -8 44 64 -23 28 -26 -96 34
5159 34 91 -25 15 63 52 -21 48 49 -10 28 -106 -78 72 -55 -38 -34 24 18 23 -61 123 -27 24 -12 -17 -34 24 -103 -65
5188 -65 47 43 69 -122 21 22 74 -53 43 50 -97 -25 -73 66 -81 44 -2 11 74 27 -37 41 -89 -62 -50 -13 -70
5215 -70 -4 -76 14 -36 77 92 -19 22 16 37 -11 56 -66 103 -22 -25 16 57 -71 39 38 66 25 11 -35 -41 10 -7 -5
5244 -5 38 58 -27 15 35 35 -39 14 -27 56 -20 66 47 110 -22 -98 47 7 -63 -8 47 -51 -82 -80 -28 23 38 -47 -131 -105 -22
5275 -22 -43 25 -51 -44 -17 -8 -31 -53 89 -14 21 -42 -69 71 94 -1 -104 -24 -10 32 11 41 76 14 22 25 22 26 -40 34 6
5306 6 38 7 32 41 -41 -33 60 6 47 54 13 -15 -2 -29 -47 68 16 -77 80 -6 -75 3 22 87 -28 -11 -74 -65 16 22 48 5
5338 5 25 42 -73 47 60 85 -45 43 80 10 -67 -77 -7 -108 -76 47 50 122 23 -26 33 -88 93 2 125 55 15
5365 15 30 -33 76 -96 58 -34 52 24 -27 19 -15 30 -85 -46 42 54 25 41 -8 21 -16 -9 35 -30 -37 36 1 -4 3 9 53
5396 53 33 36 45 -20 -15 1 20 -82 -29 -13 30 6 -49 -33 -22 74 8 65 -32 42 56 -50 -17 -18 53 -67 29 135 66 102
5426 102 -103 -56 -32 51 -117 120 -7 -55 -15 77 -42 42 -30 -15 -27 60 35 47 -17 -14 -33 35 18 -13 40 -29 -22 41
5454 41 38 -28 5 -95 -57 35 -6 -2 -81 -73 -27 -6 -48 -18 8 -63 -1 -45 -24 -3 24 33 15 -9 -15 3 23 10 -3 64 107 162
5486 162 -32 100 103 -69 -6 -18 -5 61 42 -21 -26 91 19 34 17 -19 18 -3 14 -19 -24 -129 -66 25 -26 1 57 15 -3
5515 -3 17 -70 -31 -36 -34 1 -5 6 32 -52 -53 -63 23 61 47 77 99 15 26 -11 26 38 109 23 37 -121 -71 -70 99 -53 -89 38
5547 38 -51 80 -64 92 -94 -22 36 -12 60 -69 -58 40 -61 -22 -1 45 -36 21 -28 52 -29 -84 -23 90 -1 9 106
5574 106 -64 67 35 58 -93 -1 50 -69 -43 -75 -45 58 -14 -48 55 56 53 -12 -91 -90 36 -20 -26 -19 -69 -10 45 42 76
5603 76 64 -18 43 119 3 -45 -66 -7 5 -62 32 106 57 -72 2 -49 -36 -37 -127 -75 96 -84 0 78 -61 -18 -45 -7
5631 -7 -5 -3 -8 62 59 -62 33 -57 -74 7 -88 -8 41 -1 98 -170 -64 -67 -75 -59 1 121 -48 16 100 -19 92 -78 -43 22
5661 22 -1 37 -49 21 -75 15 64 -107 -82 -112 38 37 -114 -12 -26 -100 37 -50 49 34 -18 -94 -42 -19 5 21 -125 -58
5689 -58 -42 19 26 -71 -29 1 81 24 25 14 -30 22 3 21 55 76 16 26 -27 33 -6 32 126 82 -30 -26 -14 9 19 -61 -89
5720 -89 -46 -64 -144 2 -104 45 -110 -47 47 -78 27 -2 -23 -70 75 -110 34 33 47 -12 50 -52 -61 12 -60 0
5746 0 -23 73 -62 -11 33 22 -27 14 -16 34 30 -35 43 -59 -49 -28 157 -24 25 -11 -17 4 -3 5 -35 43 60 7 4 11 79 25
5778 25 65 -13 29 75 2 -118 -81 -29 -34 -13 -24 -44 -42 -110 0 -35 84 -17 121 -102 24 -11 0 81 -33 17 -32
5805 -32 -1 68 17 -2 -35 36 44 66 -8 -24 -13 -8 19 -10 11 -38 29 -144 -58 -24 37 -15 70 47 53 34 -69 24 -33 82
5835 82 -87 41 -60 -74 -11 38 -25 -8 -23 -28 -18 -5 31 -35 9 50 -31 18 6 -2 -14 12 -31 33 -13 59 -32 -74 24 11
5865 11 -15 13 -86 -5 -46 -30 50 -23 -81 -31 2 -10 18 -68 -60 -36 -68 19 -87 -7 28 -63 -37 32 -10 2 59 -41 -4 -38
5895 -38 18 -35 48 94 -1 98 -100 -34 -18 -28 46 -20 -22 -24 -9 -77 -38 64 36 34 -138 30 -82 -50 -17 39 89 1 36
5924 36 -3 -19 -49 12 -103 69 22 -5 73 78 -49 20 68 36 49 53 -68 55 -52 -26 -4 -60 108 20 67 37 51 58
5952 58 -49 -18 -20 45 -5 154 -30 -25 -135 -1 45 62 39 31 53 -23 60 -36 11 34 15 -52 -17 34 -57 108 -6 -38
5980 -38 -25 -20 80 39 87 26 -21 -103 22 -14 35 -50 54 -53 -16 54 -59 -40 -91 -31 -31 9 -70 -4 77 9 -19 11 5
6009 5 -32 15 -1 -57 -75 34 43 112 -43 89 -67 -48 6 -69 -2 30 52 23 -20 -38 -115 -32 15 46 -3 42 53 -31 -4
6038 -4 -71 -25 8 -67 -31 -77 -27 -4 7 29 1 96 -2 43 90 -28 21 -63 -28 -6 -4 -19 88 9 -43 21 -98 -23 14 -157
6068 -157 -1 -16 5 27 36 -21 40 -9 -23 13 47 14 -70 66 59 -49 -38 -11 -52 -44 24 -96 -13 67 -18 22 -61 1 39
6097 39 32 86 -33 -4 -62 -26 -51 -110 -112 32 -15 14 32 29 -16 -42 -10 -108 -86 33 63 30 -21 -102 -26 -67 -35 48 -74 29
6127 29 -45 -3 -6 -22 -73 82 15 -121 -8 -37 -13 14 -62 -32 92 136 -23 29 3 -12 2 73 75 -18 -5 -68 -129 -74 -34
6156 -34 -95 -19 8 -114 -108 51 57 -62 -96 32 17 76 -43 39 -73 58 47 -53 -22 -69 10 -32 58 97 26 16 -88
6183 -88 10 11 -66 -44 -46 -46 24 61 -30 -36 38 47 -41 -16 -32 53 -39 88 64 63 69 -19 -14 76 28 -1 36 -52 -46 58 50 -47 20 10
6217 10 -18 19 -40 -62 37 24 19 -46 -47 86 -1 -16 47 -25 31 -30 -87 -50 -12 27 71 -42 -13 8 -11 -48 67 88 -11 -68
6247 -68 79 -30 -35 56 35 79 -30 -34 -27 68 32 19 12 -55 11 69 -18 13 24 105 -5 21 -11 57 8 -28 -65 1 -48 13
6277 13 -9 -91 -50 123 -109 63 -35 38 7 -27 -8 -78 -3 62 22 -92 129 -34 51 32 -64 9 39 -8 -120 -85 -23
6304 -23 -30 -43 -83 0 53 43 19 10 -4 5 11 8 -20 -55 -41 -13 8 40 -48 -83 -100 78 -27 26 -37 93 24 1 -19 7 29
6335 29 -60 11 50 -41 -103 -8 -18 -31 36 4 24 -19 51 64 27 47 -89 -24 24 -100 -67 -3 -42 21 20 -23 -36 19 9 -56
6365 -56 68 35 -35 96 14 53 66 -8 -44 -11 38 24 33 57 -32 -6 31 -60 1 23 -38 -64 -61 52 -75 75 -5 -12 28
6394 28 32 -14 12 44 12 -30 67 -2 -80 3 -81 97 -40 2 1 -38 7 -98 66 40 19 39 -18 55 1 41 30 -39 0
6423 0 94 20 -17 -56 14 34 -112 -91 3 -59 -33 -8 7 23 19 30 27 75 -19 47 42 64 37 -80 17 -46 26 3 -4 53 -22 -14
6455 -14 103 -87 1 -3 -3 -104 21 91 17 -5 37 41 -70 -27 -11 23 -24 -4 -40 39 58 14 -30 34 134 14 -15 -46
6483 -46 52 -13 49 136 -28 -78 80 16 -60 42 -84 23 -34 -15 -58 -18 32 -16 1 -4 -36 -127 -25 79 51 -4 3 -64
6511 -64 -32 21 11 85 -102 -49 0 -101 -52 -29 46 13 -52 -104 -44 24 34 -4 87 -46 37 26 -2 9 50 -27 9 -49 10
6540 10 7 -23 63 -24 -29 10 112 62 7 -1 -8 2 -16 23 48 51 8 -4 -30 5 24 18 56 26 -21 69 -44 36 63 30 -45 41
6572 41 -2 25 31 3 37 -49 -17 39 7 24 58 -31 -41 -52 4 -130 27 -40 62 83 -18 36 -29 1 -1 64 -71 -123 -6
6601 -6 -100 21 -17 0 -57 50 9 9 -46 16 29 14 104 20 26 -19 37 65 -63 -49 -65 -17 -5 -86 -6 -47 -21 -69 4 -17
6631 -17 -9 -76 -42 -3 -7 -33 21 55 37 84 60 -6 -56 25 20 -7 -16 50 -12 3 9 1 -43 0 80 -55 -64 1 -15 10 -6 -36 -52
6664 -52 19 -43 9 16 -46 -33 -15 47 -24 70 55 45 61 -52 -30 -9 -64 13 -4 19 -46 36 36 66 -2 -27 3 91 -140 -27
6694 -27 -66 -58 24 -17 -25 1 76 -41 32 -61 44 19 22 6 -86 -81 22 -76 -15 35 -40 -22 -111 90 20 25 -80 -40 -15 -20 45
6725 45 -48 46 -94 -25 81 50 41 23 -63 72 44 19 83 -15 40 91 13 -26 -50 -38 3 -54 -40 34 8 -42 -29 38 -23
6754 -23 59 2 -27 -41 -50 36 -57 6 27 34 22 79 -23 -33 132 7 -36 -54 43 54 -17 15 -3 64 -55 -21 -23 -116 115
6783 115 29 17 44 -6 1 -83 -66 -2 -43 -92 20 -14 -3 1 -2 41 -18 17 -14 -95 -80 -79 111 -10 70 -11 11 40 104 -32
6813 -32 -11 7 21 -60 26 85 -56 8 10 -24 -41 86 14 -94 -85 -81 40 26 -63 -5 60 -19 -56 21 -1 30 34 -23 -42 -96
6843 -96 -118 -34 28 114 107 -23 3 -75 40 -19 50 115 -26 -21 -15 11 17 -17 22 -23 -26 -21 14 -70 -73 -4 5 40 14 -70 40 -54
6875 -54 -71 8 -29 64 35 48 20 4 52 -100 23 55 -21 58 78 31 -67 -19 -12 -53 -13 132 -72 -87 6 68 57 11 -87
6904 -87 -39 -9 -63 -21 -46 -24 39 17 -60 55 -61 -51 36 11 -4 -5 2 -28 29 16 -77 43 -20 -8 -60 -9 51 -6 50 -3
6934 -3 29 60 -72 28 -28 -77 -25 11 2 31 27 -9 53 -6 -31 13 61 16 -2 -48 47 13 -26 53 -48 -51 55 24 -38 -23
6964 -23 -120 35 -63 -55 2 8 30 28 -21 -94 -97 15 62 -12 -27 9 32 9 125 -45 21 -12 -25 59 -69 31 38 4 17 -28
6994 -28 -41 61 -55 -77 23 -77 -23 -112 17 43 41 86 31 -25 -54 9 33 -39 15 13 84 67 -3 -42 -94 -65 45 29
7022 29 24 -146 -53 50 17 -13 -50 -33 -72 32 -102 -36 3 -8 17 53 5 91 -76 -51 -90 20 -14 43 -3 -118 15
7049 15 76 16 90 104 57 26 5 -22 52 5 18 -73 6 72 9 21 38 -104 16 43 49 -34 -83 -57 -12 -87 63 86 -81
7078 -81 -96 -16 56 -65 -15 24 15 22 -46 -32 -22 54 -6 -53 129 36 99 22 -14 105 -37 2 -59 -49 -37 33 -101 92
7106 92 33 54 -13 43 -47 -57 -11 59 79 65 -18 25 -31 -72 -3 24 96 -55 9 -63 39 36 -75 -21 0 -24 -79 -18 77
7135 77 32 42 -6 -97 -14 -46 -52 20 36 -189 -67 -5 -104 24 -1 -75 -3 -38 100 6 53 -66 -31 -17 25 -30 -12 -3 -73
7164 -73 82 -26 -31 -20 -78 -39 -49 -4 -15 43 33 -10 25 12 -78 61 -62 24 5 54 70 -52 -115 -68 12 2 9 4 -64
7193 -64 -86 -8 -16 -12 -11 -1 -87 -11 14 29 -46 14 51 46 101 -22 -31 11 18 28 29 -1 -21 -41 -33 -12 37 -38 83 -59 -40 3 -96
7226 -96 -96 -21 -89 72 -62 -118 3 41 -2 -23 -5 -22 -11 35 20 -63 65 -70 -20 -34 -32 84 -26 -5 -17 -45 -70 -51
7254 -51 -27 23 8 -53 -64 -23 -15 -101 -92 -26 -74 80 -114 17 1 -14 -61 4 -87 21 -85 53 40 -51 -47 -77 1 25 7
7283 7 -34 77 43 54 -115 8 -51 -20 -1 -45 -30 38 -27 -101 -32 8 -92 -66 12 -60 10 8 18 -103 -21 -24 15 -11 -71
7312 -71 -60 5 25 27 -40 32 -40 114 -54 10 29 -43 5 -39 -100 23 24 -13 136 17 -2 -16 10 -15 -4 21 -9 12 -7
7341 -7 -18 -2 -46 -36 16 -65 -46 71 -3 22 8 -29 -40 -65 -39 -73 54 -67 -51 -106 -28 35 -39 -32 -49 -29 -16 18 -42 -24
7371 -24 61 -49 -17 -2 3 96 -5 -10 38 18 43 3 -57 -11 53 42 -3 -126 30 -92 -20 -26 -47 9 47 14 5 19 12 38
7401 38 85 108 -58 -4 46 33 10 27 -54 -41 3 -11 -8 61 -15 -32 -58 -39 -56 25 -3 39 88 5 -121 37 -115 -82 66
7430 66 -26 -88 3 -31 3 -83 50 -36 -30 -97 -38 81 29 9 8 -28 -26 9 -62 -21 -52 32 0 65 10 67 -46 -13 46 62
7460 62 -105 -19 -17 -14 109 33 14 -13 -31 -41 56 79 21 91 -25 13 25 -10 -63 51 0 -84 41 81 112 -4 -7 -45 4
7489 4 -34 50 -58 -15 46 16 39 12 46 -90 -65 61 -26 -31 18 39 -52 3 -6 -63 -97 -74 -37 -30 -114 -122 -60 72 69 -12 -54
7520 -54 -57 70 -28 -53 -9 51 9 -15 -32 7 -29 16 -111 -6 -22 37 12 20 98 137 -37 -53 -37 9 -49 -37 75 -2 36
7549 36 -21 -34 -41 -5 31 -29 -73 38 -86 -44 -23 -36 48 -63 -50 -94 3 -15 -151 -63 8 36 -45 64 -5 27 -61 10
7577 10 -35 51 -23 -78 38 -47 49 35 11 -66 13 -13 149 11 -39 14 23 -30 78 -24 94 -19 67 22 -32 -6 43
7604 43 57 69 -30 -54 -55 36 14 -10 -8 -48 -119 31 -29 -90 94 -11 -37 -69 102 13 54 1 22 40 3 -33 28 -29 21
7633 21 -63 44 -45 -34 35 34 2 -9 90 -56 -31 -27 -38 -17 -15 44 -11 -50 38 -45 -67 -7 -5 34 -15 8 47 -84 -32 -12 -8
7664 -8 -65 -73 -102 9 -57 6 14 -80 64 -47 -46 -90 -49 32 -86 -2 2 -30 36 -61 14 -35 80 -62 -12 -144 3 26 -102
7693 -102 58 19 -65 105 -5 -76 -78 10 -53 -37 45 99 -92 113 -29 -71 -43 -108 -66 -38 58 -50 16 -84 -5 -13 -3
7720 -3 -41 14 -14 55 152 4 77 39 15 -100 2 50 27 34 3 -38 16 100 -30 75 53 -114 43 -17 -76 -16 -90 -41
7748 -41 85 -22 26 40 97 72 -24 18 65 91 75 19 -43 86 -22 15 38 -34 -1 -90 -34 -3 73 66 18 -41 -57 41 55
7777 55 -24 -91 10 -61 -44 -19 -24 -130 -27 95 -76 6 101 42 -83 11 -71 -9 30 3 26 129 24 37 -1 -44 97
7804 97 66 -15 -22 36 -30 -16 -11 10 -26 -34 -52 -73 -20 -40 -1 46 -70 -86 84 25 23 14 -32 -13 2 -53 15 29 -13 25 -29 -118
7836 -118 -59 -8 23 25 -22 -48 -1 -3 -8 65 72 -28 -81 32 -42 12 -81 4 -4 12 -76 -75 -30 23 -11 -17 44 -14 -17 -46 19 -28 -19
7869 -19 -23 61 4 28 59 18 -8 117 16 88 81 -18 22 41 22 44 -48 -38 56 -8 -42 52 -1 65 -16 15 44 -56 -86 -65
7899 -65 -53 74 -26 -39 75 26 1 64 -66 -16 26 46 -14 -12 4 -19 91 -33 -11 -6 -13 26 28 55 -20 -40 54 1 34
7928 34 -108 -37 -23 -31 15 11 45 22 45 -19 11 0 42 -4 12 41 72 -96 59 29 -34 65 42 43 3 27 0 -80 27 -21
7958 -21 -22 -13 82 46 -10 100 -55 55 0 -57 28 0 2 45 66 104 75 74 -47 42 10 4 -24 99 -20 -40 -44 40 -48 -59
7988 -59 -38 36 -53 7 1 54 -14 29 62 -7 -10 -121 33 5 7 43 47 32 2 -5 80 43 50 114 90 -6 -46 -40 -16 45 23 -10 4
8021 4 91 -118 -1 -20 -29 -28 -10 8 -27 -37 85 31 -40 -46 58 5 49 25 -15 26 49 -55 11 59 40 32 34 -2 5 66 36
8052 36 -11 82 46 7 30 14 -71 24 92 32 120 -67 -1 122 36 -18 10 13 39 125 55 -82 -42 54 -22 1 50 16 -49
8081 -49 60 39 77 105 -21 20 -3 -34 77 122 -2 5 94 26 72 4 -9 -90 27 29 5 -25 -2 1 66 -44 -50 66 -135
8110 -135 32 -47 119 24 13 -34 135 12 -15 -38 17 119 39 -25 25 32 5 54 -24 31 -10 31 6 40 -9 34 52 -36
8138 -36 93 50 5 33 -41 5 30 112 -17 -45 -20 95 -66 -120 -5 42 -3 7 -33 4 -119 -120 76 -29 6 -9 -44
8165 -44 -7 23 -30 -30 -18 -8 -9 -22 -29 30 69 -57 25 47 62 41 1 39 -26 157 -46 -8 -60 90 69 -24
8191b4
$$ Imaginary data points
##PAGE= N=2
##DATA TABLE= (X++(I..I)), XYDATA
0 0 0 0 0 0 0 0 0 0 0 0 0 0 0 0 0 -8 8 -8 8 -8 9 -16 16 -17 24 -25 32 -38 40 -48 56 -64 72 -81 91 -104 116
37 116 -129 145 -161 180 -201 223 -246 271 -302 333 -367 405 -446 491 -540 596 -658 727 -804
56 -804 892 -994 1110 -1247 1412 -1615 1865 -2193 2634 -3265 4261 -6037 10229 -43367 3078
71 3078 49183 -49057 -9135 27529 -21809 -30477 16416 6761 -10296 -16300 1525 20507 6150
84 6150 -10760 13152 8032 -16074 2011 19000 773 -1164 8170 7983 1706 -4795 -4447 6579
98 6579 -449 -8181 2184 6170 -3283 -6027 -659 -411 -10897 -10964 9777 7534 -15527 -2322 12376
113 12376 -9392 -10763 13461 702 -15035 7749 15244 -3053 -1674 6837 -1291 -2328 4996
126 4996 5204 1444 -730 3289 5525 -64 -2798 715 -1241 -1336 3816 517 -2040 921 -774 -4023
142 -4023 58 -961 -5175 724 4421 -1649 -3104 2604 264 -4132 460 3234 -1797 -2396 5813
157 5813 4109 -4520 -646 5003 -1981 -1984 6818 1410 -3981 3835 5378 -2603 -806 3773 -591 -56
173 -56 5700 3602 -1666 2090 4592 252 337 3890 2167 -303 4262 5443 -369 -735 3947 1775
189 1775 -1673 2866 3393 -1204 408 4295 -100 -3686 865 1399 -2214 -271 2110 -1850 -1970 1799
205 1799 -644 -3247 -652 658 -1745 180 2234 -1966 -2676 2204 1102 -3562 661 3175 -2269
220 -2269 -1244 4676 293 -5630 809 4093 -2838 -3105 3515 631 -4952 411 3393 -3338 -4813
235 -4813 2563 1998 -3868 -897 2469 -1729 -2715 1717 430 -2179 -116 1372 668 345 239 -822
251 -822 994 1893 -654 -391 2620 890 -1667 2403 3064 -2514 -1979 4450 1937 -4024 981 4426
267 4426 -2128 -3163 4252 1521 -5112 38 4873 -1012 -3770 2309 2001 -3451 -892 2862 -1114
282 -1114 -3432 1403 1799 -1939 -1667 497 -623 -1195 182 -722 -1022 -400 -822 -984 591 -1025 -2919
299 -2919 462 1736 -2096 -2229 2313 381 -3421 728 3041 -2474 -2967 3887 2098 -3759 -42 4114
315 4114 -940 -3001 3314 2476 -3453 -453 4402 -196 -2995 1700 2157 -1603 -421 2582 23 -1451
331 -1451 1256 1704 -301 14 878 343 1048 1184 -146 452 1674 205 -354 2129 996 -1650 835
348 835 3105 -718 -2150 2125 1292 -2468 -77 2504 -1545 -2819 2064 1165 -3505 -1507 1937 -1382
364 -1382 -2782 1029 339 -3215 -1139 1868 -1324 -2552 463 406 -1837 -161 995 -1523 -1107 886
380 886 76 -1251 264 171 -1245 401 896 -1393 -1148 1287 -121 -1673 565 652 -1936 -835 2003
397 2003 -752 -2486 827 1257 -1669 -374 1777 -850 -1601 1310 1215 -1587 -294 1624 -330 -656
413 -656 1155 154 -1300 620 1207 -991 -618 925 -307 -1336 843 458 -2005 -486 1649 -782
429 -782 -2010 952 604 -2134 -345 1765 -1088 -2222 1373 796 -2000 -467 1284 -878 -1367 862
445 862 -94 -1403 -309 231 -911 -726 -266 -1297 -789 137 -1009 -1638 357 -218 -1886 -322 959
462 959 -1279 -1756 1413 801 -1900 -198 2340 28 -1380 1941 2315 -1007 -58 3343 1188 -1168
478 -1168 1786 2782 -319 -22 2594 1078 -779 1017 1523 -262 -261 895 -56 -149 269 -481 -185 466
496 466 -623 -1090 842 339 -1574 -13 1601 -669 -1187 1774 1198 -1353 322 2620 234 -960
512 -960 1845 1996 -679 -201 2531 741 -1378 892 1978 -800 -1065 1572 321 -1881 80 898
528 898 -1272 -1238 587 -510 -1297 -274 -267 -962 -134 -68 -899 193 385 -621 103 1316 -231 -569 1625
547 1625 1255 -684 494 2266 242 -535 1854 1822 -823 -12 2523 281 -1377 1191 1842 -1052 -719
564 -719 1945 315 -1548 276 1411 -917 -1162 1068 233 -1222 -149 773 -625 -820 475 15 -558
581 -558 8 -9 -409 405 -107 -773 260 382 -923 -413 957 -577 -1339 469 530 -1608 -817 1133 -454
600 -454 -1772 82 820 -1450 -1104 934 -145 -1688 -133 863 -1127 -1058 707 91 -1170 48 581
617 581 -704 -438 482 -14 -587 219 264 -516 104 396 -369 -258 648 -67 -574 639 516 -689 -41 1008
637 1008 -223 -605 800 483 -645 115 877 -294 -339 681 411 -525 178 745 -362 -153 410 -95
655 -95 -516 333 248 -677 24 435 -446 -661 564 -31 -1090 48 530 -922 -885 682 -113 -1287 50
674 50 658 -903 -905 715 -20 -1090 -47 679 -672 -626 519 -1 -539 3 380 -296 -151 304 -54 -59
694 -59 234 23 -102 438 200 -298 467 653 -331 38 1123 71 -678 650 998 -521 -266 1366 190
713 190 -1033 590 1286 -602 -585 1209 512 -1034 156 1159 -363 -712 822 663 -753 -163 852
730 852 -60 -572 164 294 -287 -72 186 46 -44 -274 -173 137 -39 -464 -266 380 -486 -842 222 452
750 452 -1008 -522 834 -263 -1246 121 729 -1049 -880 875 132 -1245 -38 901 -705 -978 725
767 725 576 -801 -39 976 -155 -559 404 619 -333 -150 602 217 -203 228 347 193 147 32 117 284
787 284 -72 -130 359 416 -347 -121 779 -37 -493 434 865 -587 -302 942 361 -800 140 953 -490 -590
807 -590 724 432 -923 -128 885 -329 -664 225 282 -657 -233 372 -239 -412 -21 75 -392 -83 -47 -184
827 -184 -44 38 -283 -220 183 -225 -176 329 83 -483 119 503 -199 -372 444 178 -615 39 576 -328 -384 428
849 428 297 -490 75 564 -218 -338 455 293 -273 240 651 -53 21 612 237 -129 357 389 21 205 617
870 617 137 -59 550 143 -236 288 604 -250 -222 372 68 -442 -84 161 -395 -369 233 -148 -526 -17 38
891 38 -451 -235 135 -16 -230 33 -66 -378 65 72 -238 -22 395 -148 -297 456 260 -366 -79 502 -278 -470
913 -470 416 144 -643 -76 489 -366 -598 251 29 -593 -216 202 -264 -471 164 179 -267 -64 247 163 25
934 25 99 277 126 95 338 155 179 206 86 306 327 71 25 377 117 -308 104 402 -296 -310 389 -24 -718
957 -718 -78 387 -455 -633 189 88 -901 -209 466 -378 -671 153 302 -468 -291 260 -69 -341 -2 260
977 260 -137 -241 99 259 -50 -199 -9 80 -20 -182 -58 167 -150 -387 -15 154 -568 -400 232 22 -628
998 -628 -38 423 -349 -541 475 197 -666 -62 672 22 -438 386 506 -384 5 558 121 -218 269 407
1018 407 -54 -47 385 137 11 213 195 -8 -98 -19 139 10 -97 -213 73 139 -277 -153 168 38 -413 -95
1040 -95 271 -279 -378 166 184 -470 -183 377 -206 -408 333 246 -406 -116 350 4 -383 60 166 -318 -35
1061 -35 79 -136 -299 -77 93 -135 -141 -20 -126 -84 90 -178 -1 -52 78 7 177 62 -155 129 229 142
1083 142 -120 163 290 -132 25 297 127 -162 366 260 -181 -96 239 78 -127 256 191 -77 66 202 -68
1104 -68 -72 203 59 -142 39 126 -171 -199 213 -69 -253 21 96 -184 -122 84 -150 -319 1 168 -288 -95
1126 -95 102 -142 -77 0 127 -265 -134 56 -37 -132 -20 -27 -222 -6 -128 -33 -79 -51 -89 -66 168 -29 -218 103
1150 103 113 -243 -80 167 -103 -77 263 186 -214 9 317 128 -196 144 218 -80 -4 230 45 -97 123 395
1172 395 17 21 198 137 -113 23 148 -74 -68 -4 81 64 -8 -1 94 -8 -139 -69 47 -70 -213 -13 190 -161
1196 -161 -205 189 -7 -302 -125 148 -139 -353 171 98 -378 -167 244 -4 -367 -81 229 -234 -169 151 -62
1217 -62 -193 49 172 -12 -138 10 115 5 -79 -19 60 -4 -14 81 69 68 -10 140 175 -61 -1 164 63 -129
1241 -129 105 247 -91 -152 186 334 -181 -56 185 5 -171 92 228 -3 -7 251 59 -148 -37 152 -58
1262 -58 -182 147 92 -223 -65 127 32 -53 9 -40 -12 -57 -93 -15 -6 -107 -139 49 -66 -141 -127 88 -77 -138 -30
1287 -30 79 -78 -56 137 -54 -131 73 164 -84 -49 133 36 -87 69 164 -16 -86 225 -25 -6 11 139 11
1310 11 152 5 9 -4 56 91 56 18 23 -15 -15 148 21 4 72 -7 -162 166 127 -33 -69 257 -1 -84 54 86 40
1337 40 35 154 -7 1 126 69 -66 -52 -5 -114 4 -70 -58 -117 -39 -22 -99 -71 -37 58 -93 22 12 -102 -53 -16 -26
1364 -26 -116 48 77 -88 26 151 45 -25 51 191 -27 -109 136 -12 -80 -3 29 -75 -32 143 -48 4 9 -49 73
1389 73 1 -67 -59 13 -2 67 -61 48 -51 -126 132 116 -12 27 119 18 -89 150 102 -11 -43 131 99 -150 -50
1414 -50 96 -44 -129 7 13 -120 -163 84 62 -128 -77 32 -88 -32 18 -43 -67 -21 -90 1 -153 -35 -70 -32 -91 -145
1440 -145 89 -67 -88 8 176 -14 -172 26 192 -153 -81 116 68 -98 48 86 36 -115 78 49 -109 -15 89
1463 89 -15 -74 61 51 -43 -45 166 49 -37 103 153 66 37 -98 140 -8 -75 -107 48 59 -78 -1 78 27 -153
1488 -153 112 4 -93 43 115 -25 -75 -153 -18 -88 -129 41 33 -61 -101 -45 3 -176 59 42 -164 -41 -18 26 -85
1513 -85 43 6 -66 -33 -48 -33 15 -30 -11 21 -128 22 -71 67 -25 48 -35 89 -31 18 59 54 -112 71 88 -20
1539 -20 35 71 68 28 1 117 -26 48 39 -25 72 41 -25 -8 -78 46 15 38 95 -72 -5 14 -55 0 3 -42 -21 -86 22
1568 22 -112 -31 -63 11 -13 -67 5 -65 -41 6 -14 37 -58 -81 22 -64 -61 35 -94 -53 41 87 91 -24 -29 -13 -5 32 4 -29
1598 -29 -13 73 -143 -6 -62 -33 -12 102 27 55 -6 63 -27 -105 92 64 -9 55 67 21 -16 12 93 13 46 -15 81 -41
1626 -41 -11 86 74 68 -54 40 -31 -81 28 42 7 -61 45 -72 63 95 -1 38 -47 16 -15 23 34 -36 44 21 -70 108
1654 108 -30 -39 84 -9 36 -51 24 58 -40 -63 -11 -18 -70 -32 29 -1 29 -47 107 -23 1 70 12 -42 -63 38 13 -39
1682 -39 -35 -3 49 -36 -33 -2 -6 -8 75 1 -63 -38 149 23 -120 23 129 48 -63 58 80 -44 65 47 -72 -37 -21
1709 -21 81 49 -53 -61 -33 -84 -58 18 -4 -47 61 39 -100 -16 91 -45 -26 68 -23 59 -14 -7 96 58 10 -41 -10 -110
1737 -110 -37 -26 108 -10 30 -37 66 -1 -32 -17 -33 27 -36 -25 62 -28 -25 -120 10 -57 57 -63 12 -13 17 38 28
1764 28 69 14 -12 -12 70 42 18 7 26 -62 -91 -62 2 -65 -19 -16 -2 -17 -14 20 61 -2 56 37 22 -89 56 -26 -5 32 54
1795 54 -26 -125 24 -192 68 -76 25 -21 -12 -70 -72 -7 -42 -100 -34 68 47 -43 -35 14 91 -66 18 -84 -33 16 -17 -43
1823 -43 -35 44 -43 15 -27 -55 48 27 -2 31 88 69 -21 12 -27 -50 -65 2 -63 -26 21 30 56 21 -42 42 -6 -68 102 24
1853 24 54 -34 -48 116 -63 21 -21 59 -15 -23 93 -23 13 111 76 93 -9 -11 -79 -95 2 3 85 12 -33 28 -67 26 -22
1882 -22 6 -12 9 56 -85 -61 -53 -27 51 -68 -80 -21 18 21 -44 95 28 -25 67 -74 -115 22 88 -104 -23 13 -5 47
1910 47 5 -3 45 4 -2 -41 -54 -28 109 36 -20 -123 82 -44 -102 2 42 81 -63 13 38 -64 5 19 -19 -53 6 -16
1938 -16 -107 -16 8 91 -49 9 12 56 -9 -61 -24 37 -42 24 26 -76 -82 -33 6 -18 32 -74 -82 -5 39 -16 -72 -56 -43 -18 71
1969 71 53 -68 3 2 16 63 -20 23 -32 30 -13 -29 -61 15 41 -2 -10 13 58 -71 28 88 18 68 86 19 59 37 118 37
1999 37 -47 30 6 -1 73 -91 -51 5 -20 42 -47 -83 -8 -28 -49 -19 -67 -14 -29 -30 -60 -58 -77 -17 10 -11 -63 19 -7 -28 98
2030 98 83 21 -3 -25 -19 -4 -73 58 78 75 90 18 -105 0 -18 -10 -42 -44 -47 -37 -127 -71 -15 -112 4 71 56 61 28 16 1
2061 1 19 29 -48 -39 76 66 33 59 -48 60 33 -35 -99 2 63 21 -45 -72 -36 36 63 -16 63 -75 -60 3 85 79 58
2090 58 -75 0 -43 -79 -31 -7 -14 42 -68 -65 5 -2 2 12 -47 41 50 54 42 -19 82 3 -7 52 -12 -20 26 26 -48 -52 -47 -96 -71 -63
2124 -63 -50 50 -6 21 -70 -37 52 6 72 96 5 110 -11 -36 36 113 5 -68 29 59 14 -6 6 50 37 -81 -166 -68
2152 -68 62 29 17 12 -79 -24 33 9 -8 -92 -13 -53 69 41 -15 -101 -98 -130 16 13 6 59 22 -88 -61 43 54 -46 -28
2181 -28 88 -11 14 -48 -42 -12 58 -55 47 -13 -68 -3 14 9 -9 -18 -11 4 -53 13 46 22 -81 -68 49 37 24 30 -131 90
2211 90 54 -83 22 -82 -64 -26 99 3 19 -13 -33 6 122 32 -64 -44 65 -66 -68 -70 -90 -99 -125 45 -115 -7 -37
2238 -37 -116 -79 -14 -14 -4 -95 -94 -55 -5 2 26 111 32 -33 -15 -83 -31 86 46 71 17 49 39 -80 34 54 6 -18 -1 -43
2268 -43 50 42 47 -14 19 3 50 175 -35 -71 18 -49 -23 33 -50 8 54 -18 48 -63 6 -60 -35 14 5 22 60 70 -8 -29
2298 -29 -85 71 5 -15 -14 44 35 -29 24 -15 99 116 -4 -68 -42 92 -19 101 -1 12 51 -13 21 -14 77 46 67 61
2326 61 28 -107 58 19 61 100 7 -10 103 51 -12 49 65 61 74 64 -42 61 -56 -28 26 66 46 -31 -42 32 63 -57
2354 -57 50 -91 69 -88 -93 14 -23 -28 49 -73 -40 33 69 -28 -51 50 15 38 -34 -89 27 -126 45 -20 -59 72
2380 72 -50 -27 40 -10 -41 -46 -12 -34 -60 -27 -14 -47 -58 23 -70 -67 -34 69 -60 -50 -21 -11 -16 3 114 -26 -52 -21 -8
2409 -8 42 27 31 -6 -57 5 42 -22 20 -118 -46 45 27 34 30 -25 -2 -24 42 -33 -86 41 -36 45 -6 -107 10 13 -14 25 13
2440 13 -9 30 34 75 25 -29 12 -59 16 129 -15 44 -30 -91 51 -40 -2 94 20 -16 70 22 105 54 50 -7 63 72 22 36
2470 36 9 37 41 -45 39 31 -109 6 2 15 -26 43 15 -66 -47 -14 -11 8 66 -23 -7 16 -43 9 -24 -12 60 0 100 14 -28
2501 -28 -69 45 -92 18 36 28 69 -90 40 22 -20 -4 27 46 -80 -20 53 -61 62 62 -49 -23 -31 12 -37 -63 18
2528 18 -116 46 143 39 -4 71 -2 -10 -25 38 -42 0 -2 -4 -35 -20 -36 46 -40 -49 -28 54 56 36 -101 -19 -54 19 -23 -55 22
2559 22 3 22 -84 -84 6 -9 14 -26 13 -75 8 9 -18 -80 54 -44 -13 -25 -47 -34 16 51 112 11 18 -17 -10 -16 -79 -3 -82
2590 -82 79 30 41 76 44 52 21 -4 -57 -7 -65 -6 81 -97 30 -112 82 57 -63 15 -8 -58 -50 -80 3 58 -3 40
2618 40 20 19 12 53 35 12 57 -43 11 10 -15 -32 13 -65 -11 -78 38 72 -33 -8 23 5 -112 -55 -28 -4 45 -38 44 -16
2648 -16 50 8 61 2 1 46 -84 81 -26 -31 38 39 127 36 93 7 -1 -24 -97 -100 -5 -27 34 18 70 86 37 -29 -21 46 -32 92
2680 92 -78 -31 -19 8 -23 85 -20 20 36 4 61 -16 -23 -38 51 11 -27 52 58 25 -100 -49 57 -37 57 -18 -35 -18 54
2709 54 -25 -71 28 13 17 -20 -90 -49 27 9 75 9 18 6 36 22 6 30 -2 -7 -30 57 21 31 -81 38 -13 6 4 38 -45
2740 -45 105 -8 40 -36 52 -105 16 62 -50 88 43 -47 -42 14 10 -38 -45 30 12 -127 95 40 137 12 104 -109 -25
2767 -25 43 0 -26 -12 -47 -7 41 50 46 -9 0 39 99 -14 -38 47 51 7 -69 19 -1 -21 85 -41 43 -61 -96 28 25 -125
2797 -125 80 -44 9 87 24 58 -58 41 -39 -36 53 -33 16 4 85 27 -1 -23 71 -30 -72 34 -12 1 -13 -38 25 -39
2825 -39 12 -18 22 -9 31 11 25 132 -42 3 -10 75 25 -63 -23 -46 -8 -78 76 -82 -64 -35 46 -62 66 61 13 -87
2853 -87 -53 -53 -64 0 13 92 -79 14 -76 -3 -60 -5 79 -3 14 8 38 -20 25 70 -1 -8 -52 -33 -25 61 -21 -11 56 42 19 28
2885 28 -46 -38 48 -25 -30 36 -44 88 -52 -49 18 32 -9 10 -81 -29 -11 20 8 -88 -92 51 20 -80 113 -8 33 22 22 21
2915 21 -74 -1 54 -25 85 3 -71 -75 20 32 44 31 -135 14 16 46 11 10 -20 5 -87 64 -15 82 -74 26 -7 70 59
2944 59 -65 7 -68 29 23 -6 -30 46 -18 36 38 25 35 -55 48 34 -63 8 17 -73 -13 -8 -15 53 -22 -49 8 42 -33 101 -6
2975 -6 -32 75 -31 -65 105 30 8 0 -9 -55 123 -82 6 70 -40 16 -3 36 15 34 -1 42 -50 -86 -57 9 -24 61 -7
3004 -7 -74 -18 -85 35 -44 -74 -37 -34 -13 -12 -44 33 -18 -7 -8 41 -30 -11 65 -10 30 22 35 -92 36 -5 58 -29 -29 -48 8 74
3036 74 -1 -120 -29 13 -37 -28 -100 -1 -70 5 -16 136 35 54 61 104 71 -30 2 -36 11 -6 106 -21 4 28 26 -39 6
3065 6 -81 61 -75 -103 12 14 42 18 -73 40 17 -6 -49 23 85 -35 -2 100 -73 18 8 -9 93 -64 -8 92
3091 92 -40 -19 -36 -36 -14 -38 -13 13 47 -90 -26 -12 -5 -33 -3 33 -17 55 -14 -65 30 39 -20 -21 40 -49 76 47 2 -40 43
3122 43 -32 51 -68 -69 75 -33 6 44 -11 81 26 -36 44 9 21 -20 42 104 -31 8 80 31 -36 -62 53 40 11 33
3150 33 90 -28 42 -73 -1 -7 -41 6 -22 -68 4 44 -72 -13 8 81 -29 -49 -71 -20 -66 75 113 71 -133 15 13 -58
3178 -58 -48 9 -22 38 -36 7 11 -80 3 53 1 29 -9 -54 -3 13 54 31 -34 -7 20 28 89 49 -40 -50 -29 -22 13 -19 21 -40
3210 -40 -22 62 -8 -7 42 -78 -30 12 13 -40 -23 51 -72 0 -39 -25 -71 -68 -35 -53 2 24 -2 -122 -79 39 91 -53 -88
3239 -88 45 -63 71 22 -54 58 9 36 8 27 -53 87 -2 -43 9 35 -94 0 -64 4 -61 -3 -21 34 129 -12 -38
3266 -38 15 35 26 -10 61 8 39 51 3 -69 -17 -21 -25 23 47 -17 42 97 89 31 -40 -36 23 28 26 5 35 86 -45 -37 74 -25 58
3299 58 -49 14 23 23 19 -99 -2 27 -48 2 -81 -32 92 41 8 -12 75 -40 36 -50 -34 -35 -89 24 -36 -23 32 58 -75
3328 -75 24 33 -50 -32 3 -1 71 28 34 17 2 7 -51 -3 -62 -34 -17 -43 -25 41 81 42 63 4 -79 -91 -181 -27 25 -110 40
3359 40 -39 31 93 -41 -54 -4 -34 -64 59 7 86 -13 -18 86 -82 33 -85 57 2 22 -6 -5 133 31 -58 -35 -18
3386 -18 -27 -95 16 -3 50 17 6 -38 -53 14 -39 8 -21 -25 -14 -47 27 -17 66 43 30 57 14 12 92 -5 -51 -81 84 24 2
3417 2 55 -30 38 81 43 60 98 -35 9 -74 -42 -2 -36 -10 -32 19 -20 49 -39 -64 -4 35 -1 -60 10 96 -27 46 55 -34
3447 -34 -24 -62 -35 -126 -5 -70 -41 -9 63 -81 11 61 5 36 13 -20 -9 -20 -56 -53 6 1 -63 -34 16 -78 -51 8 36 21
3477 21 -12 -19 3 94 -24 25 10 -9 -34 46 -26 13 48 -21 -42 -54 45 8 27 69 -99 -40 -61 -53 30 19 53 32 10 -36
3507 -36 32 23 2 -9 -41 10 20 -3 69 72 61 90 -1 32 46 -54 -44 0 72 -27 57 -34 76 29 -53 83 44 -37 17 -10
3537 -10 -33 -7 62 -83 -53 -41 62 23 -2 -96 -1 -59 -121 24 -57 110 51 94 97 26 59 -75 -6 -12 30 -77 8 -27
3565 -27 53 123 86 16 72 -31 41 -35 67 -78 -18 -50 -38 111 10 -46 72 -10 -52 -14 -95 -16 -112 -29 30 70 45
3592 45 -11 -23 -12 46 -13 -31 67 12 -72 101 9 9 -9 -96 69 -15 -2 -19 -28 -7 58 106 -78 -7 24 0 -18 -105 -40 -14
3622 -14 -89 -94 -62 -60 -50 4 55 11 -62 47 -7 -48 40 -89 -51 4 -94 -7 -62 63 -54 -25 117 -28 42 -2 55 -5
3650 -5 -136 -5 -32 -40 46 -20 -44 55 59 29 21 77 -119 38 -15 -21 26 10 -11 49 35 -99 60 0 -19 -75 50 29 75
3679 75 -51 -42 49 45 -65 42 24 100 -17 -45 136 -109 93 79 -55 -39 34 7 -35 -41 -4 4 -13 -71 36 25 13 79
3707 79 87 -28 6 31 -13 -40 -2 39 11 50 -78 8 -10 101 62 11 -11 17 54 -55 -12 22 -9 -67 -13 89 20 101
3735 101 -32 50 65 113 -30 65 -56 -16 24 20 -18 -53 -16 -111 -75 111 59 -52 -114 0 -20 0 19 -46 29 -51 -111
3762 -111 2 -133 27 -11 -50 -102 3 -26 -15 -46 -6 25 -14 5 -69 30 48 28 -56 47 -60 56 -46 0 -50 25
3788 25 18 -74 -88 7 -51 13 76 0 -59 44 -4 10 63 -51 80 -13 -53 62 -51 38 1 -38 64 11 -50 -32 35 40
3816 40 -16 0 -79 -125 -18 -55 -54 -4 0 57 28 18 -88 -17 -74 -42 1 -87 -10 35 66 -37 -46 11 -13 -112 -43 -27 91 25
3846 25 -22 -81 -35 -16 -11 -105 7 60 53 -69 -59 21 65 -33 40 -7 -40 23 -67 -3 -66 36 -23 -17 18 31 11 -19 -39 -42 3
3877 3 -61 -24 15 -17 -10 61 -20 1 29 -29 71 -31 -5 74 4 34 40 -28 4 -65 -44 -8 39 48 -27 -17 -4 -29 88 -51
3907 -51 43 78 27 -16 -31 -49 -37 -10 -31 11 -42 -26 -35 -98 -11 0 70 -33 -28 -8 -47 -47 6 60 -7 -7 53 25 -60 30 -75
3938 -75 -14 32 -78 1 -28 69 7 21 59 -20 104 -18 -19 1 51 -2 -15 -40 -19 -3 27 71 7 -139 -99 -26 29 -9 -27
3967 -27 -43 -24 -22 -47 19 -2 -20 -53 21 -34 -1 20 27 56 22 60 -7 -66 1 -39 -74 -54 27 -46 -97 -31 -31 56 48 93 -57 27
3999 27 51 -37 -68 18 -5 -82 68 132 23 27 5 6 40 -38 21 35 -22 16 130 67 48 33 78 -14 -110 6 38 27 55
4028 55 52 -60 17 -43 121 -28 17 24 -2 42 20 97 -107 -76 -31 30 28 26 -59 -15 -49 36 13 2 37 43 -41 13 -43 4 -76
4059 -76 -34 31 -70 -2 27 -54 -29 -20 -29 35 -24 -82 -42 -22 43 -22 43 -30 21 2 45 -4 -77 18 -30 12 -1 -5 -120 -52 20
4090 20 -5 -26 -23 -57 10 -8 47 -98 70 81 -66 50 56 -102 -5 -82 -24 -20 3 26 35 87 -8 0 -18 1 45 116 -76 -16
4120 -16 -30 -50 31 108 20 10 28 -13 -44 39 -4 -97 -102 -21 36 -42 -34 -10 1 51 110 -12 -2 19 -103 -67 -8 6 16 90
4150 90 42 70 30 64 -32 39 -6 -42 62 119 1 -60 -14 -28 2 -24 56 61 -10 17 27 12 25 -95 53 48 2 0 141
4179 141 60 -17 35 -17 90 -7 122 -50 54 1 -69 36 48 -19 0 23 -24 -76 0 -88 92 -63 -24 82 -119
4204 -119 19 84 128 -14 -90 41 99 -116 59 20 -40 -7 -115 -79 -78 107 47 33 -3 3 57 -94 -2 36 66 -46
4230 -46 49 -37 -11 9 53 58 -11 45 17 108 -35 -5 70 37 -42 55 45 63 50 -29 43 196 62 -33 27 -25 -17 94 3
4259 3 -8 6 98 59 22 54 8 107 -70 47 87 -81 -67 -1 -137 -64 -70 -30 15 83 -42 -54 51 -33 57 0 -39 94
4287 94 -6 -41 19 -7 112 -33 32 -22 44 50 -125 -11 -16 20 115 -92 23 -47 140 0 35 -73 29 -38 -35 -162
4313 -162 23 46 -91 -35 -54 -20 -142 11 7 28 4 6 -12 8 148 16 -109 45 -38 37 29 65 64 46 40 -63 49
4340 49 29 -27 -53 -2 -88 9 -48 113 31 -37 34 -110 52 -4 -98 40 17 -25 55 41 -5 75 45 95 144 59 -55 -23
4368 -23 9 -21 -49 22 5 19 50 -38 21 -4 -87 -12 17 -88 -88 -66 9 12 5 -25 -123 28 -31 -47 137 97 -39 -35 9 -86
4398 -86 63 75 24 1 87 15 -114 -44 42 38 37 27 104 56 -55 27 -117 57 -32 24 -26 53 11 24 -71 -112 -67 -48 -25
4427 -25 16 -39 -67 -14 -39 -10 -84 -62 -3 -11 -34 104 -7 -41 28 -55 -95 50 -26 33 -57 -66 -45 -61 -91 32 9 -3 58
4456 58 81 71 -48 -57 112 52 36 -1 8 -41 11 12 50 -10 -45 27 32 -47 62 19 -82 -20 -25 105 -47 -55 7 -57 97 17
4486 17 5 45 78 -11 -44 45 -38 6 51 -90 -88 -28 -7 18 -35 18 46 88 -121 -19 -4 -3 -35 36 89 -43 -63 59 -84
4515 -84 -9 47 -11 -31 -28 30 23 37 -21 14 6 42 10 -58 7 -42 -33 -5 -52 -13 5 59 35 -34 -88 9 8 13 -63 -64 45 30 -2
4548 -2 27 6 8 20 57 37 -31 30 17 -37 -9 23 81 -17 21 12 21 33 -60 52 -63 80 79 69 -11 -68 5 10 19 -30 38 26
4580 26 77 -17 11 -45 42 -16 4 -63 29 -55 -58 25 90 -69 35 9 35 30 73 53 -88 67 34 46 80 -3 11 -23 57
4609 57 18 6 22 -3 49 -81 24 -70 -35 -17 -11 29 26 -27 -41 12 72 19 -26 -27 -115 15 59 -17 -11 57 19 62 -28 -60 44
4640 44 102 17 -42 103 52 -20 20 28 77 -100 -6 31 111 44 69 62 21 23 9 -51 36 -83 -11 4 -64 22 -38 -24 111 20
4670 20 -77 0 34 -32 16 18 79 29 86 32 49 -73 97 33 -78 33 68 -75 25 48 38 111 61 29 -14 75 90 -10
4698 -10 49 15 -80 53 -62 -45 47 79 5 63 28 -2 -112 19 -68 -9 -32 -13 -64 3 44 7 -25 10 -78 -16 -21 22 -30
4727 -30 40 20 16 89 91 -7 -13 114 -102 75 -64 -37 44 -39 -25 0 -58 55 43 18 -36 22 -32 -29 -3 -90 79 -28 -11
4756 -11 6 57 10 62 -22 -22 -32 -27 -23 36 3 -45 8 -6 154 2 -13 -7 55 24 27 29 -2 -24 74 -15 -13 125 -48 9 -52 0
4788 0 -54 38 7 3 -24 -10 -34 -23 17 -19 0 -44 64 -21 68 94 18 30 82 16 3 59 -15 70 -15 21 -10 65 -30 -5 -27
4819 -27 -25 11 -95 -87 72 -54 5 47 -11 29 -5 12 46 22 43 3 -95 17 -23 2 22 13 -49 9 0 10 -45 -68 -31 16
4849 16 -94 19 80 26 51 -100 63 17 56 -37 86 -74 105 11 31 24 50 -27 -28 -70 -13 -56 -15 17 19 -1 -28 -40
4877 -40 5 36 -7 18 -4 27 97 -37 -89 45 16 57 -19 -44 -31 -50 26 -30 -23 9 1 -26 7 -19 -45 15 6 -195 20 -43
4907 -43 25 -57 -78 38 -87 35 21 -10 -23 14 -51 -30 77 -57 38 -17 100 38 55 60 -7 -72 53 57 57 -59 -99 61
4935 61 -55 -14 -30 -17 61 44 7 -50 -36 30 -90 -104 -40 106 34 -43 31 -48 36 52 -11 61 -23 -80 39 41 14 -48 -79
4964 -79 63 -6 -55 74 93 -16 -120 1 16 -42 64 66 4 -8 4 -41 55 36 95 -74 53 10 0 -5 -24 5 14 16
4992 16 -55 48 54 -80 -113 -40 1 18 -32 49 65 0 75 -2 0 49 23 -14 71 -34 -46 39 -7 -31 3 32 22 23 -38 11
5022 11 38 -10 47 -6 -36 15 114 101 -45 -29 -16 36 65 79 2 76 -5 7 123 110 -23 -29 44 52 49 13 -14 33 17 -48
5052 -48 -33 81 -3 95 -71 32 54 115 -33 82 35 18 5 -19 21 -46 12 35 22 -87 73 27 53 26 4 19 -12
5079 -12 99 50 -26 28 -25 -47 30 60 61 14 58 -13 -90 48 27 3 -72 -31 -1 -5 84 -12 -28 -15 35 -34 59 -9 63 1
5109 1 53 -30 -13 -33 -83 -87 7 17 8 37 -22 -17 69 -27 63 -113 -49 39 -5 -88 -94 31 -23 106 58 -13 -2 -78 30 -7 6
5140 6 -33 -7 89 0 -36 5 45 86 -70 78 -27 43 27 51 -55 42 18 -91 38 15 59 12 -81 106 46 31 17
5167 17 18 -42 -11 5 -53 41 21 -64 7 3 58 -14 -8 -7 -1 -61 -6 35 60 -43 -153 -56 22 36 4 -36 37 -12 18 72 -44
5198 -44 -21 72 -7 4 -32 -28 30 -7 3 28 110 42 -93 -19 11 -34 -102 43 -16 39 7 12 -68 -28 59 80 3 -7 0 8 16 17
5230 17 -16 -3 8 -71 -53 5 25 -28 75 -15 11 114 81 30 20 -94 -50 -75 27 -14 39 20 55 -76 -23 -25 47 -30
5258 -30 81 43 8 134 27 -60 -79 43 -14 -11 -4 45 61 -61 0 -19 -16 -1 33 143 -47 4 -37 57 88 -68 16 33
5286 33 91 74 -1 29 -28 -19 83 -89 30 20 -59 -40 -19 60 -15 40 -6 151 -11 -141 -10 -1 -109 -7 -16 -61 51
5313 51 -53 -2 -16 -65 14 -17 -8 8 58 -47 -20 13 -42 4 -60 -11 49 72 13 -12 42 -12 84 -51 1 -57 -19 101 62
5342 62 -90 -5 -6 13 32 -19 -57 -1 -16 8 26 -55 11 21 110 -79 48 -42 52 15 -20 -18 -16 102 -7 -20 1 74 -79
5371 -79 -12 -53 -26 5 23 119 -27 -60 -34 -10 -11 -106 -55 6 -14 49 -22 22 89 -72 -20 21 -69 -14 -62 23 83 -16 -20 45
5401 45 -134 -12 -4 15 90 48 -42 -1 9 -4 7 2 -16 -19 101 43 -37 -48 70 -6 -2 58 14 -23 -7 -51 -83 10 -39 -75
5431 -75 -6 25 -101 -32 78 -32 55 59 -31 -6 7 -60 -39 1 -2 -21 -39 -44 2 -9 31 -22 25 -22 5 79 -45 53 38 -9
5461 -9 -8 -37 -12 -37 8 22 -42 -18 48 -21 36 -28 -44 -20 100 -38 43 -92 -28 48 1 74 5 28 -61 5 58 -103 -12
5490 -12 15 32 6 -16 8 -4 29 -57 -3 10 -60 47 17 104 36 7 63 6 15 -64 7 -59 -29 4 -60 -10 -15 -10 -30 17 -69
5521 -69 -13 35 -5 10 52 61 57 14 31 14 -58 0 79 -48 49 71 18 58 -85 -49 -6 15 -78 27 48 -13 -65 8 -93
5550 -93 -32 16 -13 -114 -4 -4 29 -71 -43 -88 10 2 42 17 -19 44 32 -142 27 -12 -11 4 35 12 -113 81 58 72
5578 72 -73 -35 -44 84 83 -17 -56 43 25 24 52 62 60 0 -44 15 -6 -86 -36 29 0 -39 -61 27 21 -2 -3 29 -6 -4 96 -42
5610 -42 -51 -67 15 -32 11 15 23 -42 82 -29 26 -59 -7 20 -27 34 -19 2 23 -24 -50 62 16 28 99 6 67 -55 -18 -2
5640 -2 -17 -31 24 9 36 34 97 40 101 -42 49 94 10 -75 -39 -74 18 24 -7 -9 122 73 59 -54 -12 27 16 0 -31 65 -3
5671 -3 14 -4 -59 -82 60 9 -29 -39 55 104 -57 -7 67 28 56 -11 1 -42 -57 56 68 18 -73 118 -5 -3 18 35 13
5700 13 -44 -70 43 -15 -44 -81 53 -25 81 51 28 55 -31 24 25 73 -43 -62 6 -68 -55 5 88 -45 14 -75 15 82
5728 82 -24 82 43 -44 -20 -17 107 -49 40 -1 25 18 45 32 -34 -87 8 -46 -46 7 -50 15 -37 6 -83 -31 -7 49 -63
5757 -63 -20 4 -1 -29 -22 16 -27 39 4 -44 -35 -23 -51 11 -18 62 72 24 -12 38 59 -102 43 -11 -5 32 42 3 36 -7 47
5788 47 77 76 -23 -123 76 -25 14 33 -28 29 1 78 12 -127 77 36 -35 -70 15 -4 -32 109 45 36 5 -90 -5 -75
5816 -75 -27 73 3 -73 35 -43 -58 -30 29 -6 -27 50 8 -66 -124 -46 -13 -16 -11 -36 12 32 75 87 -26 -47 18 -62 -18 -32
5846 -32 9 -14 20 -35 41 -5 31 1 12 -49 33 -87 -43 31 -52 81 -66 -7 0 -46 11 -76 -61 -11 -24 6 34 14 79
5875 79 -24 -42 53 50 69 -43 -79 -56 -45 -34 47 36 16 74 105 -7 -12 52 49 132 -139 -56 -32 45 -24 20 136 -36 -59
5904 -59 35 -56 66 16 56 9 -109 61 -110 42 -40 7 -48 68 -4 -47 21 5 44 74 79 -13 -30 -9 -38 96 76
5931 76 -21 -12 -23 34 56 53 47 -71 48 -52 -42 -54 -44 32 5 20 31 -62 76 19 -45 41 12 -61 18 3 -21 -10 -12 -14 52
5962 52 11 -82 12 -3 -27 -116 -73 16 60 8 -97 40 -5 -41 -51 51 -44 -35 -19 119 58 -84 -43 -17 -15 37 -36 15 61
5991 61 82 -8 -26 114 62 56 33 -122 -5 23 27 35 15 124 -75 0 41 41 30 -62 -58 -63 43 -5 -47 19 -12 -32 -44 -12
6021 -12 -23 154 -48 8 78 -22 22 -52 90 42 6 14 -41 -44 -15 -10 -7 -81 -39 -81 5 -9 -26 62 17 18 -24 50 5 -100
6051 -100 93 -40 8 6 13 -53 -1 -35 -75 -42 19 -18 -26 -65 3 -43 -83 30 35 -33 29 12 -11 46 113 17 -59 -93 39 17
6081 17 31 -12 -63 -37 14 -12 29 -62 -17 39 -67 10 1 -102 -51 -19 5 39 94 -2 7 68 -10 88 -58 68 -50 -30 28
6110 28 6 38 -86 -55 -38 -21 -16 107 48 27 -37 88 67 38 50 58 -39 64 19 -60 45 -55 62 -9 -73 36 87
6137 87 -26 -50 -27 -8 39 -62 14 20 -3 -21 -12 165 24 24 -73 -12 -25 20 -12 -11 47 77 -12 -55 64 -47 -27 -7 31
6166 31 13 68 -5 -9 -58 24 20 -23 48 10 -38 13 27 -25 -39 57 -89 -8 37 29 73 -15 -12 94 11 -11 47 -27 -105 108 5
6197 5 0 12 -6 -34 -52 50 115 -10 4 -117 19 42 40 -12 82 39 -104 70 -48 32 6 57 17 18 -52 72 -98 25
6225 25 9 -27 59 19 102 7 -2 13 34 15 -45 20 4 -83 -3 78 -6 -61 106 16 102 84 119 -54 -13 -15 -10 12 7 -63 44
6256 44 41 55 -43 15 67 10 32 -23 -23 11 47 -47 -6 -11 76 -56 -51 -10 -22 32 13 59 7 77 43 63 106 85 -26 -72 -44
6287 -44 -25 59 -14 -39 -15 23 -13 29 73 58 -12 -69 54 -38 -56 -46 -13 57 41 -80 -4 -36 26 6 -63 53 37 85 41
6316 41 39 69 -68 44 47 12 45 64 41 30 4 17 -14 27 -41 -70 64 17 -66 -57 27 50 44 65 13 -48 -2 -50 58 -12
6346 -12 53 69 -22 -71 -9 6 47 24 97 52 -16 0 -62 29 -22 56 -28 35 80 -62 40 41 -17 27 46 72 -47 36 73
6375 73 64 39 -71 88 -5 77 -30 -3 -6 -46 14 -45 9 55 29 -9 40 -17 -11 27 -27 -42 107 83 -76 93 -21 72
6403 72 -35 -28 46 -38 0 -69 -81 71 37 113 112 -43 47 -50 71 -7 -13 3 -61 3 -18 -27 -106 26 66 -58 -56 -1 64 47
6433 47 98 -75 68 -69 74 41 -43 3 -55 15 68 -51 17 14 -58 -23 -39 -95 60 -25 97 13 2 54 74 34 -10
6460 -10 -42 39 -85 14 18 -17 71 -31 -3 72 114 22 44 11 39 -43 47 1 -20 -52 21 41 -4 -62 124 -25 30 -16 -27
6489 -27 8 59 40 12 114 -49 -53 3 -33 -45 -54 -7 112 -6 -18 79 67 73 26 17 -22 -34 50 38 -59 -34 -132 -26 -71 12
6519 12 36 -68 37 -41 -39 46 58 34 9 -33 -83 -34 69 30 -42 -4 13 3 51 58 50 26 -82 -9 -84 153 23 13 50
6548 50 48 25 -27 55 63 30 -35 -83 -19 7 88 66 -62 -90 41 -71 52 6 -28 -45 -3 50 -23 -102 78 6 63 55 -35
6577 -35 -46 43 -31 -9 53 30 42 -17 -18 -18 -80 -32 61 12 39 85 128 6 -73 -86 82 34 3 32 -3 31 -39 -37 -27 -64 57
6608 57 -38 54 -56 -39 75 -52 13 -1 -3 110 42 -43 9 -20 -8 11 1 -75 53 64 49 -12 -60 51 64 25 -16 20
6636 20 -43 75 -15 -49 -6 42 -20 115 6 5 30 137 -63 -70 -49 71 6 -2 25 -25 33 -29 -27 12 3 50 -43 -36 -29 -14 -27
6667 -27 -16 3 19 -32 9 11 52 -13 77 -23 55 22 10 34 -5 16 -26 -10 -29 130 -38 -70 -125 0 -47 53 -11 22
6695 22 62 -19 -62 -17 -28 -65 -1 -4 0 42 13 -46 26 -76 59 -46 -56 19 18 36 7 -6 62 -32 13 11 -15 -24 0 -19 -17 -15
6727 -15 -53 96 69 -36 -6 -70 61 10 -52 65 68 81 -74 -49 -3 61 -79 37 -54 -7 -28 37 -76 -32 118 -44
6753 -44 56 -2 0 10 -4 56 18 -38 33 45 0 7 92 -43 -21 -107 18 27 -14 33 47 110 -41 -84 -61 7 7 -72 -12 -65
6783 -65 -33 -68 -3 57 -40 -24 54 0 3 -22 37 -22 -70 -29 46 54 71 -66 -41 26 -15 11 20 -42 6 -30 -68 77 16 -9 -8
6814 -8 15 142 68 -90 105 70 13 -74 50 -32 80 59 100 153 20 43 29 -2 46 109 1 65 113 -69 59 39
6840 39 -39 23 99 95 77 10 -33 -1 27 48 67 -43 -16 -10 71 -27 62 -112 -21 -36 -91 -38 -14 -21 53 -58 7 6 5 -108 3
6871 3 -56 2 -25 3 -40 -34 17 46 -41 -56 -15 -33 -34 -22 34 91 81 65 63 81 31 -45 28 -30 102 59 -46 67 -29 -1 -11
6902 -11 -88 -27 4 39 -39 -8 -31 -86 5 36 54 51 -98 5 -6 -24 -49 84 -3 -73 109 19 97 10 -33 -25 86 97 -65
6931 -65 33 36 -13 -20 -82 -45 -56 52 27 85 -67 -13 -35 64 1 55 -53 -20 113 -27 19 -20 42 53 -63 -12 31 53
6959 53 77 24 89 -19 9 -4 34 9 -32 89 -43 -20 6 -56 -28 -47 -5 -79 78 5 -3 -57 -25 58 -5 -21 -47 -27 86
6988 86 57 -6 -57 29 -13 -24 39 58 15 -88 109 -31 -52 36 17 20 95 117 -38 26 -14 30 -22 4 -31 5 21 -68 19
7017 19 -56 -28 56 83 75 -48 -1 -28 35 14 24 -59 7 0 41 75 -135 14 -84 -50 115 124 -20 75 -27 82 15 7 56
7046 56 -40 5 13 -10 51 -5 38 -65 -50 -28 3 -21 12 91 -2 -31 32 -108 -22 16 -71 -14 -17 50 -42 64 39 35 4 62
7076 62 -148 51 -22 -20 -2 18 13 7 -1 -64 46 16 22 34 -35 -9 -18 52 6 104 -103 16 -48 -70 24 78 -50 -61 0 -28
7106 -28 35 -19 32 -127 -9 54 46 129 -5 -75 73 8 7 11 53 26 22 -4 -20 -30 45 -45 -56 56 -70 -63 25 16 30 -21
7136 -21 40 -29 46 22 -14 -1 46 -11 103 70 33 23 9 -28 5 -78 -32 -16 43 -11 1 64 -35 -46 3 47 -31 -45 -5 71
7166 71 -62 4 -22 -21 65 50 -105 -15 52 -39 -1 13 19 -13 -69 -3 -38 30 -9 48 11 63 9 22 -90 6 64 63 81 -47
7196 -47 -31 46 120 -51 65 24 114 44 55 63 48 47 65 -15 13 30 -55 97 -23 -79 52 42 33 -7 58 -41 1 -18 100
7225 100 -40 62 135 -21 3 -5 34 -32 -20 44 22 -41 117 17 1 11 64 -12 103 -3 60 58 10 -81 -42 -27 -29 -1
7253 -1 60 76 -60 -57 50 -38 -57 -18 39 -39 1 2 -2 66 0 21 -29 13 46 79 2 -3 -140 52 106 49 38 6 93 38 45
7284 45 -94 6 -16 -10 112 0 -48 -8 19 -10 79 15 37 1 93 -65 -12 -10 5 49 -7 36 28 -51 -46 48 98 60 22 6
7314 6 39 41 57 54 24 -77 -18 -18 -86 -43 21 11 14 32 -96 81 46 32 -41 -45 -47 -12 18 -120 -20 -2 4 104 -116 -2
7344 -2 -8 -69 16 56 -106 112 44 -1 15 -3 -9 -50 49 25 -19 51 -19 -29 62 -42 -30 11 -41 -37 129 -17 6 24 -69 -8
7374 -8 7 -49 17 -77 96 -43 -30 -58 75 21 13 129 -71 58 -11 -6 80 -19 65 82 -57 26 -8 70 79 -29 64 -78
7402 -78 43 -26 -78 90 156 96 30 -64 133 -34 1 -42 -56 32 -58 9 -34 -40 10 -51 -26 -12 -7 47 10 58 -1 -34 -23
7431 -23 41 54 -3 21 -5 15 11 -64 -52 42 -68 97 -18 137 10 55 -11 17 -95 105 78 32 74 -69 -30 -8 29
7458 29 -39 -45 -79 -113 10 -57 9 -43 -97 47 35 132 20 19 -78 54 44 8 2 116 67 111 -9 40 5 -20 114 -11
7486 -11 36 6 -36 27 -21 16 -47 27 -38 -53 -59 84 -52 12 -27 -16 -3 126 5 27 9 -7 -97 48 -32 2 64 -52
7514 -52 -80 32 22 -30 39 64 5 -8 8 36 23 -12 -116 20 -36 0 9 -18 -49 47 -46 -53 41 61 -3 -67 39 -49 40
7543 40 -15 -4 43 0 -23 -32 13 69 -51 3 -25 -18 105 -13 -28 70 2 50 16 0 -18 42 123 -83 -64 3 -46 12 15 -54
7573 -54 -35 1 69 -4 -11 7 -34 1 44 -1 77 -13 -10 57 -57 61 17 -5 64 65 21 24 64 35 -11 -10 43 -30 91 -11 -24
7604 -24 5 53 -28 49 -26 21 14 37 -1 18 1 -2 57 -3 -17 -46 12 52 -30 85 32 64 21 -10 -52 -94 -41 -36 46 -10 3
7635 3 42 23 107 41 -39 5 14 -92 -27 0 -57 104 -9 -29 -42 23 57 -12 -11 8 56 -3 -36 -34 37 -32 11 -1 -121 -35
7665 -35 81 10 -38 -17 22 -15 70 -8 84 41 -18 -60 29 87 2 30 98 -24 127 -30 -93 -83 28 21 137 -37 -32 -29
7693 -29 -49 -13 -106 18 -25 5 12 33 6 37 17 -6 -8 -7 48 14 -6 94 52 37 -66 -30 61 15 -39 38 -53 -37 -44 131
7723 131 86 28 114 14 -49 -4 23 -55 -81 -55 90 12 -45 -17 4 -61 34 48 10 9 61 -18 43 -82 -42 34 45 -7 68
7752 68 -10 4 80 -50 -77 2 -70 -56 -22 37 28 8 30 21 14 115 63 15 -53 108 99 -10 -12 -40 15 10 -35 -45 12 25 -56
7783 -56 -63 -24 -7 32 8 -8 61 106 -30 8 83 -35 -15 31 -35 -109 22 13 -31 62 105 -17 -26 34 -10 1 39 153 -52
7812 -52 -4 -61 -24 -108 54 17 10 -59 -49 -29 22 -12 27 -13 28 76 12 56 -10 -8 88 -68 55 23 48 33 100 28 -3 7
7842 7 -43 -43 -21 1 -104 -28 9 -77 125 -19 18 39 -13 -25 -50 -46 35 -7 -17 35 22 4 50 45 -46 73 96 28 -58 67
7872 67 -40 3 14 -52 79 29 11 21 -2 149 -22 57 -14 -73 27 4 -77 43 87 -27 26 28 -8 -13 48 -2 -48 53
7900 53 0 56 34 -71 -124 48 114 1 -90 -111 -7 17 9 13 -46 -48 103 44 -13 -49 5 8 44 152 3 83 9 88 -26
7929 -26 63 10 38 -14 13 -58 -38 -46 29 11 96 -61 -2 -139 42 36 -16 35 6 84 -15 -54 43 -46 -34 -3 -16 -26 46 -31
7959 -31 -103 22 -47 23 -76 -72 -78 34 -31 -31 -40 2 83 60 10 50 5 21 113 -94 92 57 -56 8 47 23 -18 93 -31
7988 -31 -98 -18 -32 -53 -20 42 23 -70 -14 17 21 -112 -31 5 94 19 -110 62 93 11 65 26 18 12 32 51 -26 -64 2 -79
8018 -79 36 -32 10 34 -23 -15 -115 -26 -83 5 -4 88 22 11 -11 21 72 -20 -32 -59 -24 31 -66 -42 118 38 -14 94 -43
8047 -43 17 76 -138 10 -74 -54 38 -45 -15 9 13 -39 28 -67 69 36 14 16 -86 25 49 -44 -2 20 1 49 40 20 -29
8076 -29 -30 -3 109 -23 -56 8 34 65 4 -41 -27 1 85 -31 -26 -72 -112 33 -118 121 -61 -64 -36 -4 41 49 -85 64
8104 64 -76 -117 17 29 88 16 131 -2 48 52 -7 108 87 57 11 2 -111 -82 -29 -49 -36 47 61 33 51 31 -86 69
8132 69 51 40 -127 -20 27 9 -13 -70 -91 66 -18 -9 44 -11 -2 13 85 -32 -22 43 -48 34 -24 -112 45 67 -24 -69 17
8161 17 -1 74 13 0 16 -55 -3 -26 48 -34 93 -1 35 103 169 -75 -14 13 30 -5 -22 33 36 1 9 -13 21 -57 48 -6
8191f
##END NTUPLES=NMR FID
##END=
