##TITLE=1H_Pr Bzt-Am-T
 CDCl3,8 sc, 
 12.03.2021
##JCAMPDX= 6.0         $$ Bruker NMR JCAMP-DX V2.0
##DATA TYPE= NMR FID
##DATA CLASS= NTUPLES
##ORIGIN= UXNMR, Bruker Analytische Messtechnik GmbH
##OWNER= root
$$ XWIN-NMR		Version 3.5
$$ Fri Mar 12 11:25:23 2021 Russian Standard Time (UT+4h)  she@DPX200
##.OBSERVE FREQUENCY= 200.131506
##.OBSERVE NUCLEUS= ^1H
##.DELAY= (6, 6)
##.ACQUISITION MODE= SIMULTANEOUS
##.ACQUISITION SCHEME= undefined
##.AVERAGES= 8
##.DIGITISER RES= 18
##SPECTROMETER/DATA SYSTEM= spect
##.PULSE SEQUENCE= zg30
##.SOLVENT NAME= CDCl3
##.SHIFT REFERENCE= (INTERNAL, CDCl3, 0, 15.7039)
##AUDIT TRAIL= $$ (NUMBER, WHEN, WHO, WHERE, WHAT)
$$ ##TITLE= Audit trail, XWIN-NMR		Version 3.5
$$ ##JCAMPDX= 5.01
$$ ##ORIGIN= Bruker BioSpin GmbH
$$ ##OWNER= she
$$ F:/spectra/data/she/nmr/H-F/1/audita.txt
$$ ##AUDIT TRAIL=  $$ (NUMBER, WHEN, WHO, WHERE, WHAT)
(   1,<2021-03-12 11:24:04.85 +0400>,<she>,<DPX200>,
      <created by zg, POWCHK disabled, PULCHK disabled
       configuration hash MD5:
       00 E9 B6 7A A2 85 ED C7 34 08 36 98 17 FE 4E 26
       data hash MD5: 16K
       5E F5 24 3C BC 05 F0 8C 12 F9 4B 06 E6 57 89 66>)
$$ ##END=
$$ 
$$ hash MD5
$$ F3 9A C1 50 DF 2D 96 2B 57 E6 0C 08 4D 48 C0 93
##$RELAX= 
##$RELAX= 
##$RELAX= 
##$RELAX= 
##$RELAX= 
##$RELAX= 
$$ Bruker specific parameters
$$ --------------------------
##$DU= <F:/spectra>
##$EXPNO= 1
##$NAME= <H-F>
##$PROCNO= 1
##$TYPE= <nmr>
##$USER= <she>
##$AMP= (0..31)
100 100 100 100 100 100 100 100 100 100 100 100 100 100 100 100 100 100 
100 100 100 100 100 100 100 100 100 100 100 100 100 100 
##$AQSEQ= 0
##$AQ_mod= 1
##$AUNM= <au_zg>
##$AUTOPOS= <>
##$BF1= 200.13
##$BF2= 200.13
##$BF3= 200.13
##$BF4= 200.13
##$BF5= 200.13
##$BF6= 200.13
##$BF7= 200.13
##$BF8= 200.13
##$BYTORDA= 1
##$CFDGTYP= 0
##$CFRGTYP= 5
##$CHEMSTR= <none>
##$CNST= (0..31)
1 1 145 1 1 1 1 1 1 1 1 1 1 1 1 1 1 1 1 1 1 1 1 1 1 1 1 1 1 1 1 1 
##$CPDPRG= <>
##$CPDPRG1= <>
##$CPDPRG2= <>
##$CPDPRG3= <>
##$CPDPRG4= <mlev>
##$CPDPRG5= <mlev>
##$CPDPRG6= <mlev>
##$CPDPRG7= <mlev>
##$CPDPRG8= <mlev>
##$CPDPRGB= <>
##$CPDPRGT= <>
##$D= (0..31)
0 1.2 0 0 0 0 0 0 0 0.06 0 0.03 0 0 0 0 0.0002 0 0 0 0 0 0 0 0 0 0 0 0 
0 0 0 
##$DATE= 1615533844
##$DBL= (0..7)
120 120 120 120 120 120 120 120 
##$DBP= (0..7)
150 150 150 150 150 150 150 150 
##$DBP07= 0
##$DBPNAM0= <>
##$DBPNAM1= <>
##$DBPNAM2= <>
##$DBPNAM3= <>
##$DBPNAM4= <>
##$DBPNAM5= <>
##$DBPNAM6= <>
##$DBPNAM7= <>
##$DBPOAL= (0..7)
0.5 0.5 0.5 0.5 0.5 0.5 0.5 0.5 
##$DBPOFFS= (0..7)
0 0 0 0 0 0 0 0 
##$DE= 6
##$DECBNUC= <off>
##$DECIM= 32
##$DECNUC= <off>
##$DECSTAT= 4
##$DIGMOD= 1
##$DIGTYP= 9
##$DL= (0..7)
0 120 120 120 120 120 120 120 
##$DP= (0..7)
150 150 150 150 150 150 150 150 
##$DP07= 0
##$DPNAME0= <>
##$DPNAME1= <>
##$DPNAME2= <>
##$DPNAME3= <>
##$DPNAME4= <>
##$DPNAME5= <>
##$DPNAME6= <>
##$DPNAME7= <>
##$DPOAL= (0..7)
0.5 0.5 0.5 0.5 0.5 0.5 0.5 0.5 
##$DPOFFS= (0..7)
0 0 0 0 0 0 0 0 
##$DQDMODE= 0
##$DR= 18
##$DS= 0
##$DSLIST= <SSSSSSSSSSSSSSS>
$$ [...]
##$SUBNAM2= <"">
##$SUBNAM3= <"">
##$SUBNAM4= <"">
##$SUBNAM5= <"">
##$SUBNAM6= <"">
##$SUBNAM7= <"">
##$SUBNAM8= <"">
##$SUBNAM9= <"">
##$SW= 16.9725357007746
##$SWIBOX= (0..15)
0 0 2 0 0 0 0 0 0 0 0 0 0 0 0 0 
##$SW_h= 3396.73913043478
##$TD= 16384
##$TD0= 1
##$TE= 0
##$TE2= 300
##$TE3= 300
##$TEG= 300
##$TL= (0..7)
0 120 120 120 120 120 120 120 
##$TP= (0..7)
150 150 150 150 150 150 150 150 
##$TP07= 0
##$TPNAME0= <>
##$TPNAME1= <>
##$TPNAME2= <>
##$TPNAME3= <>
##$TPNAME4= <>
##$TPNAME5= <>
##$TPNAME6= <>
##$TPNAME7= <>
##$TPOAL= (0..7)
0.5 0.5 0.5 0.5 0.5 0.5 0.5 0.5 
##$TPOFFS= (0..7)
0 0 0 0 0 0 0 0 
##$TUNHIN= 0
##$TUNHOUT= 0
##$TUNXOUT= 0
##$USERA1= <user>
##$USERA2= <user>
##$USERA3= <user>
##$USERA4= <user>
##$USERA5= <user>
##$V9= 5
##$VALIST= <valist>
##$VCLIST= <CCCCCCCCCCCCCCC>
##$VD= 0
##$VDLIST= <DDDDDDDDDDDDDDD>
##$VPLIST= <PPPPPPPPPPPPPPP>
##$VTLIST= <TTTTTTTTTTTTTTT>
##$WBST= 1024
##$WBSW= 4
##$XGAIN= (0..3)
0 0 0 0 
##$XL= 0
##$YL= 0
##$YMAX_a= 207969
##$YMIN_a= -165840
##$ZGOPTNS= <>
##$ZL1= 120
##$ZL2= 120
##$ZL3= 120
##$ZL4= 120
##$ABSF1= 10
##$ABSF2= 0
##$ABSG= 5
##$ABSL= 3
##$ALPHA= 0
##$AQORDER= 0
##$ASSFAC= 0
##$ASSFACI= 0
##$ASSFACX= 0
##$ASSWID= 0
##$AUNMP= <proc_1d>
##$AZFE= 0.1
##$AZFW= 0.1
##$BCFW= 1
##$BC_mod= 2
##$BYTORDP= 1
##$COROFFS= 0
##$CY= 11.3945322036743
##$DATMOD= 1
##$DC= 2
##$DFILT= <>
##$DTYPP= 0
##$F1P= 15.9154993809931
##$F2P= -4.1035820241983
##$FCOR= 0.5
##$FTSIZE= 0
##$FT_mod= 4
##$GAMMA= 1
##$GB= 0.15
##$INTBC= 1
##$INTSCL= 1
##$ISEN= 128
##$LB= 0.24
##$LEV0= 0
##$LPBIN= 0
##$MAXI= 10000
##$MC2= 0
##$MEAN= 0
##$ME_mod= 0
##$MI= 1.114404
##$NCOEF= 0
##$NC_proc= 0
##$NLEV= 6
##$NOISF1= 3.799351
##$NOISF2= 2.8
##$NSP= 1
##$NTH_PI= 0
##$NZP= 0
##$OFFSET= 15.70392
##$PC= 1
##$PHC0= -11118.23
##$PHC1= 11.40094
##$PH_mod= 1
##$PKNL= yes
##$PPARMOD= 0
##$PSCAL= 0
##$PSIGN= 0
##$REVERSE= no
##$SF= 200.130013532006
##$SI= 16384
##$SIGF1= 3
##$SIGF2= 2
##$SINO= 400
##$SIOLD= 16384
##$SREGLST= <1H.CDCl3>
##$SSB= 0
##$STSI= 0
##$STSR= 0
##$SW_p= 3612.71676300578
##$SYMM= 0
##$S_DEV= 0
##$TDeff= 0
##$TDoff= 0
##$TI= <>
##$TILT= no
##$TM1= 0
##$TM2= 0
##$TOPLEV= 0
##$USERP1= <user>
##$USERP2= <user>
##$USERP3= <user>
##$USERP4= <user>
##$USERP5= <user>
##$WDW= 1
##$XDIM= 8192
##$YMAX_p= 0
##$YMIN_p= 0
$$ End of Bruker specific parameters
$$ ---------------------------------
##NTUPLES= NMR FID
##VAR_NAME=  TIME,          FID/REAL,        FID/IMAG
##SYMBOL=    X,             R,               I
##VAR_TYPE=  INDEPENDENT,   DEPENDENT,       DEPENDENT
##VAR_FORM=  AFFN,          ASDF,            ASDF
##VAR_DIM=   8192,          8192,            8192
##UNITS=     SECONDS,       ARBITRARY UNITS, ARBITRARY UNITS
##FACTOR=    0.0002944,     1,               1
##FIRST=     0,             0,               0
##LAST=      2.4114304,     0,               0
##MIN=       0,             -165840,         0
##MAX=       2.4114304,     207969,          0
$$ Real data points
##PAGE= N=1
##DATA TABLE= (X++(R..R)), XYDATA
0@%%%%%%%%%%%Qj6J6j6J6k4L2m0M8n6O4p2Q8j04J20j41J65j90K18k48K82l20L62
34A92m09M61n18N78o44P20q02Q89r86J090j204J332j469J617j782J963k160K382
52A250k627K898l203L547l939M389m914N532o275P191q345R851j1904J4872j9547
67a1224K7971m7549J66969P1802l73809K25850P0088j62435m600Q7144K1110j28481
79e7164L9393J68599j34216n1185N1617l72J08q0245Q6465K8810j52145J65968
91F5633J7205j69032J15150k0152p5562R6924k5027k5876J592M5883M1030j14388
103d6620M5269N4164j15814N4335N9870l8453l8158J0717J22358r3989j00166
114h6487J78053q2026j00488J68113l5084q0379M4576L3742M114p3744K3538L8064
$$ plain form
0 0 0 0 0 0 0 0 0 0 0 0 0 8 -8 8 -8 8 -16 16 -24 24 -32 32 -40 48 -56 64 -77 88 -102 116 -132 150 -170 192
34 192 -217 244 -274 304 -340 380 -422 467 -519 571 -633 699 -770 847 -935 1028 -1132 1250
52 1250 -1377 1521 -1682 1865 -2074 2315 -2599 2933 -3342 3849 -4496 5355 -6549 8323 -11224
67 -11224 16747 -30802 136167 207969 -165840 60010 130098 -32337 -36937 50207 71317 -57164
79 -57164 -17771 150828 16612 -34573 17044 16672 16780 -63465 23000 51810 -100335 65633
91 65633 82838 -86194 28956 8804 -66758 30166 5139 -20737 -19145 26738 67768 -46620
103 -46620 -1351 52813 -63001 -8666 51204 12751 -25407 -14690 107668 13679 -86487
114 -86487 91566 9540 -90948 77165 42081 -38298 6278 40020 44134 -29610 -6072 31992
126C1992p1608M2208L2160l6691m447j0794O7919m3321p8457J18209n5720o3035
138g1585J41793n4114p5508Q1454Q560l7605j7294L6662k905n6254P8206J3872
150D5282p6164L6107J2599N4j2398l1397N6211l1996k7064R1656n1471m6557O5241
163C0103j7513j5345K707j649M804j8901L9821q43n0351L2917J133j6073J4156
176D966j8587J1228o399o5M5373n3105j3523N5676l9977k346L0056k7667m615
189a8985K0859J5697k1087k0013L0112j3088r997K9507k4687n038J8765R11J0352
202A3308k8005o06K8380k8030Q811K3815l4506K779L0442l941k1615k724K0658
215H766j5354k771K7180k3728q806K3735j510l507j1922j862J4673j1014P198
$$ plain form
126 31992 -39616 2592 34752 -1939 -6386 -17180 50739 7418 -71039 47170 -8550 -71585
138 -71585 70208 16094 -59414 22040 30600 -7005 -24299 12363 9458 -46796 31410 45282
150 45282 -30882 5225 17824 17878 5480 -25917 30294 -1702 -28766 62890 11419 -35138 30103
163 30103 12590 -2755 -48 -1697 3107 -15794 24027 23184 -27167 5750 6883 -9190 4966
176 4966 -13621 -2393 -8792 -8857 36516 -16589 -30112 25564 -14413 -16759 13297 -14370 -18985
189 -18985 1874 17571 -3516 -23529 6583 -6505 -16502 13005 -11682 -16720 2045 2956 13308
202 13308 -14697 -15303 13077 -14953 -6142 17673 -16833 -14054 16388 12447 -9168 -11892 8766
215 8766 -6588 -9359 17821 -5907 -14713 9022 7512 4005 -7917 -9779 4894 -6120 1078
228A078P755k3968J1797J5342j2530l472J77k757L02J3204J863k3601R804J9428
242A4422j8035J181P949j4500K421J2252N694j2918j1437K0871L670j8751O750
255d31N304j5205N871J9846j0295k1056J4893J2413j7966K868P185j4757L105
268h225J6150l522j3704R76J0656j460p056O380l701r167J4878J0016j7635n850
282a1264J6889l054r273J2002k338j5527J2864J5735j4951r127J0967K117p030
295a990M813M453j2742q90J7305K81j8206L132J1436q927j036J1349r868j1029
309a1919J7645O803j6783q46Q873m381k061R639m480j2016Q597J2206q843r342
323f908Q281L47n881P727M726j5311j440J9247m673j4112P405L428r075O055Q223
$$ plain form
228 1078 8833 -15135 -3338 12004 -526 -3998 -3821 -6578 -6276 6928 8791 -14810 -5006 14422
242 14422 -3613 -2432 5517 -8983 -6562 5690 11384 -1534 -12971 7900 11570 -7181 -431
255 -431 4873 -10332 -4461 15385 5090 -15966 -1073 11340 -6626 -3758 3427 -11330 -8225
268 -8225 7925 4403 -9301 -8325 2331 871 -6185 195 -3506 -12673 2205 12221 -5414 -11264
282 -11264 5625 2571 -6702 5300 2962 -12565 299 16034 1083 -8044 2923 5040 -1990
295 -1990 2823 7276 -5466 -6356 10949 11230 -6976 -3844 7592 -1335 -2371 8978 -890 -11919
309 -11919 5726 12529 -4254 -5100 3773 -608 -2669 6970 2490 -9526 -929 11277 2434 -6908
323 -6908 1373 1720 -4161 3566 8292 -7019 -8459 10788 6115 -7997 -592 2836 -6239 -184 8039
338H039j1818p148J2948N985j3361p86P171o538K90J0231m613j1539O199J1404
352F464q058o164Q731m947m749J4427j861j2849L050J0792k605q515P285L21j0468
367i146J0634R278j5074m440J1762L358r535k73R523j1323r87J8221r432j2576
381a0010R547N879m310m600M995p59r006J3407L906j7338M609P320k492k371L97
396h26K981q978L588J5667j6390o977J6166n007l855L847j97l712m715J5707j925
411E374j8237J2690L637q104O328k207k024q68K130J0426j3332k541J2925r256
425c059M242L851r106K242J581O621l739j2306J4995k376j1544J6935n964j1472
439i099P475O420J162j6355O842J4216k0839P612J4078j8932J429R365K376m051
$$ plain form
338 8039 -3779 -10927 2021 8006 -5355 -6141 1030 -5508 -5218 5013 400 -11139 -4940 6464
352 6464 -1594 -7758 973 -3974 -8723 5704 3843 -9006 -5956 4836 2231 -6284 1001 1322 -9146
367 -9146 1488 10766 -4308 -8748 3014 6372 -3163 -3436 6087 -5236 -6223 11998 2566 -10010
381 -10010 -463 5416 1106 -3494 1501 742 -8264 5143 9049 -8289 -3680 3640 1148 -1223 -826
396 -826 2155 -6823 -3235 12432 -3958 -10935 5231 224 -3631 216 19 -3693 -8408 7299 5374
411 5374 -12863 -173 3464 -4640 1688 -519 -2543 -3411 -1281 9145 -4187 -6728 6197 -3059
425 -3059 1183 5034 -4072 -1830 -249 6372 2633 -9673 5322 2946 -8598 8337 2373 -9099
439 -9099 -1624 4796 5958 -10397 -3555 10661 -10178 -2566 11512 -7420 -5991 3374 5750 1699
453A699j1555J5488K00j2546J5021m778o571O665n68P607j0476m881J7327j1682
467I50P66R791j5289O034M395l642J842q694P398j244o843J5267j4221o904J9473
482I079j0748j774M188o073O703o198N670M677j7355J2197M525q587P503q448
496d641M770O252j1410J3183n711r469J6528o803o30K425p354R432n006J215M932
511G713j6284J2827M607j6382J3282m912o931R665l968L504p804l093J6317j2374
525c833p74R021j1299Q116o95k561Q633j5337P523J1536j4236N216k35o53N455
540E877q585R843l583j1516J7560n481o100P378r956Q646J067r602R159p384K87
555b390O188o528N512p341j400J3737j3468J959O233j1014J0097j065n338O326
$$ plain form
453 1699 -9856 5632 5832 -6714 8307 3529 -3042 3623 3055 10662 186 -4695 12632 950
467 950 1716 11507 -3782 2252 6647 3005 4847 -3847 3551 2307 -4536 10731 -3490 -10394 9079
482 9079 -1669 -3443 745 -5328 1375 -4823 847 5524 -11831 366 4891 -3696 3807 -4641
496 -4641 129 6381 -5029 8154 2443 -7026 9502 2699 2069 4494 -2860 6572 1566 2781 7713
511 7713 -8571 4256 8863 -7519 5763 851 -6080 3585 -383 3121 -4683 -7776 8541 -3833
525 -3833 -4607 4414 -6885 1231 536 -2025 6608 -8729 -1206 10330 -3906 1310 1075 422 5877
540 5877 -2708 7135 3552 -7964 9596 4115 -1985 5393 -4563 4083 5150 -4452 4707 -2677 -2390
555 -2390 3798 -2730 2782 -4559 -5959 7778 -5690 -3731 2502 -8512 1585 520 -4818 1508
569A508q296P002K797q322P234o319K155Q336j1154N616m8o248J1625o705j419
584b238M661q103Q564k01o599N858o042M615L188r059P547m232k523J0989r358
599b933M86L508m756P013m067o88K784o984R895n14j0215R383l133j991O044n306
615a474K155k950L28Q795r598p57O701n037K658r09m41J162o501Q945J485j2055
631g493P770J199m056M174k983J186j937q3P570p342j754O160m211K500J054l807
647b053J856k304N035j39p490O505j013l779O293l139l000K015J312K760n836
662b977M84M953n752L251L027n516L10K170K691j925m680O055j160l785O869k965
678A050m254L943J689l07l485J151K634l607K934K150n926J262L322q50j191j707
$$ plain form
569 1508 -6788 214 3011 -5311 1923 -4396 -2241 6095 -5059 557 509 -5739 5886 -819 -2238
584 -2238 2423 -5680 2884 2683 -3916 1942 -4100 515 3703 -5356 2191 -2041 -4564 6425 -2933
599 -2933 -2447 1061 -3695 3318 -749 -1437 1347 -5637 4258 3744 -6471 2912 -221 -2212 3832 -1474
615 -1474 681 -2269 -1941 6854 -2744 -3501 3200 -1837 821 -88 -529 633 -5868 3077 4562 -7493
631 -7493 277 1476 -2580 1594 -1389 -203 -2140 -2223 5347 -1995 -3749 2411 -1800 700 1754 -2053
647 -2053 -197 -2501 2534 2395 -5095 1410 397 -3382 2911 -228 -3228 -1213 99 2859 -2977
662 -2977 -2493 2460 -3292 -41 2986 -2530 -2220 -50 2641 716 -3964 2091 931 -2854 4015 1050
678 1050 -3204 739 2428 2121 -1364 -213 2421 -1186 1748 3898 -2028 -766 2556 1706 515 -1192
694a192K893j863r01N198m569l025N128J17k501j69J063n08j103L396l1n636L104
711e99L027k937m77Q91K91j899J816K809m567j814N389p51k680J582J22j682R50
728e29K665j784l581L234J742k643N77P40j597K02K563j34l817Q76L313j723j084
745i80J853j664j043K849J055l385m18L015n61j539K017m91k432K028K086k317
761G3k058K302J351j895N31J038k352J30L255r11l103J260J709j264k19J572j782
778c63j761L655M58k924o13K214o17n05J581j113k528K217K286k330j424J778
794A1j2j149J793M8k894N22L272j039k111J188M67j117J415Q41k215j243L064
811H41M85k544O44Q27p73J32K043j696j918J601K722k548p07J806j041l49J723
$$ plain form
694 -1192 1701 -162 -1063 4135 -434 -3459 1669 1786 -715 -884 179 -329 -1432 1964 1933 -3703 -599
711 -599 2428 -509 -986 -95 196 -1703 113 2922 -1645 -3459 1930 1179 -1501 81 203 -1479 -529
728 -529 2136 352 -3229 5 1747 -896 -319 421 -1176 -974 1589 1455 -2362 -1486 1827 104 -980
745 -980 873 -791 -1834 1015 2070 -1315 -1733 1282 721 -818 1199 708 -1724 304 2390 73
761 73 -1985 317 1668 -227 304 1342 -1010 -880 2375 1464 -1639 -379 1330 66 -153 1419 -363
778 -363 -2124 1531 1989 -935 -1548 666 49 -456 1125 12 -2516 -299 1987 -343 -1767 11
794 11 -1 -1150 643 691 -2203 -1681 1591 552 -1559 -371 96 -1021 394 1235 -980 -2223 841
811 841 1326 -1218 -574 253 -520 -388 1655 -41 -1959 -358 2364 -184 -891 915 -126 -475 1248
828A248K02k338m5K678k80k230J409m18q06J874J5j726n28J081J699k098N9J032
846H28j842J275K081k626p68J395Q45q74o50J695j825m20L272j734j801J288K78
863D17K03o39K93n8j604K210P88l227J024M10J7N7o57M77j046O5K983k682j162
882b131K735j229L01P33o99r1q71K970j46l770K830N95k042K117n66q99j30J032
900G39J928l074k59K607k792J944O15l121J576q9L87N62k491J719m10r30L060
917A971k946m70K106o75Q68j906N63J896l502L137J877n448K456K057j870L55
933D69q66J843j725q44M500m159r82L912k364L1K87j042J209j817K242M19m504
950c391L862K12k643K324j731L86N36p21L025l560n01M447l226L74J926k178P27
$$ plain form
828 1248 1450 -888 -933 1745 1465 -765 644 226 -580 1294 1309 -417 -945 136 1835 -263 -204 828
846 828 -1014 261 2342 -284 -1052 343 1188 314 -336 1359 -466 -886 2386 652 -1149 139 417
863 417 620 -19 274 216 -1388 822 1610 -1617 -593 -183 -166 -109 -766 -289 -1335 -1270 1713 -969 -2131
882 -2131 604 -625 -324 409 -290 -381 -1252 1718 1572 -2198 632 1227 -815 1302 736 -163 -293 739
900 739 2667 -407 -666 1941 -851 1093 1708 -1413 163 74 461 1023 -1468 251 -159 -1089 1971
917 1971 -975 -1445 661 -14 854 -1052 -489 1407 -2095 1042 2919 -2529 -73 1984 114 469
933 469 -397 1446 -279 -1123 3377 -782 -1764 2148 -216 -185 102 -940 269 -1548 694 1113 -3391
950 -3391 471 683 -1960 364 -1367 -981 -445 -1166 1859 -1701 -2202 2245 -981 -607 1319 -859 -132
967a32j99K202q41m375N480p8m260M392j438k488K690m28N18k152M53K966l759
984a449J371J898m363K423P68o29L29k859L648n11l070M790k360k494M012p91
1000G13o50j313J278K405m367K273K671n665K366K693k923L52l94J788j003j906
1016a682M007l029k155N209k264j263R39q13J684k074J313J300m283L135J728
1031A752l623J782q0J18J18j125K877k834j390N704l380j507L084j865R2M71O77
1048H71q0l164L837P07m209K875l34j508J641l26L55j609m66L777k749j067L279
1065A830k851O71J113l46l39j609L020l08l063L091n06k224K810m46r60m42K82
1082b77K247k909M68K173l005R99J829k118J83j83J291l97j733K232r02j586L003
$$ plain form
967 -132 -331 1871 1030 -3345 2135 2057 -2203 2189 751 -1737 953 525 1043 -1109 -656 2310 -1449
984 -1449 -78 1820 -2543 -120 648 19 348 -2511 1137 626 -2444 2346 -14 -2508 1504 713
1000 713 63 -1250 28 2433 -1934 339 3010 -2655 -289 2404 -519 -167 -561 1227 224 -1682
1016 -1682 2325 -704 -2859 2350 86 -1177 -238 -1051 633 -1441 -128 1172 -3111 24 1752
1031 1752 -1871 -89 -169 -51 67 -1058 1819 -1015 -2405 3299 -81 -1588 1496 -369 -277 194 871
1048 871 791 -2373 1464 2171 -2038 837 503 -1005 636 310 665 -944 -1410 2367 -382 -1449 1830
1065 1830 -1021 -350 763 417 78 -1531 1489 1181 -1882 1209 703 -1521 1289 843 -117 -559 -277
1082 -277 1970 -939 -471 1702 -1303 -304 1525 -593 -410 -593 698 301 -1432 800 -102 -1688 1315
1099A315j226j273J147l03J121j419J49J365k421J091K063k656O44M90R4n1l77
1116b47R77r38q28K510j287j411J891p22K82j95j87L35r25J196P08k298J092P96
1134G49p50J97J83j80p10l3J828j318o57J790j505N50M94o08l86j6R57r8j333
1153h46J172J74q36P70j22n91q5N12N33j188J96Q78j102O09P35j246j26Q18m0
1172B15o5q38P78k0o50J181n03j022O47P28k96m36k7L25m46N60M74j306N08N13
1192C20k16j95m7J6j96J58P69o91o22Q52K94o12O0K71j47k79R13l01q54O66K61
1213D20n94N11Pk67lL78R0r68j99J102j51l45K95q8k66J80M13n77k23M43Q1m88
1235b49L51P4n03K52O36p00l59K69N73l43R6j09l48M7M97K34p93J54J93m1j08
$$ plain form
1099 1315 89 -1184 -37 -340 781 -638 -489 876 -1545 -454 1609 -1047 -403 87 181 130 -247
1116 -247 730 -208 -1036 1474 187 -1224 667 -55 227 32 -155 180 -745 451 1159 -1139 -47 749
1134 749 -1 196 379 199 -511 -544 1284 -34 -691 1099 -406 144 638 30 -356 -372 585 487 -846
1153 -846 326 500 -336 434 312 -279 -364 148 681 -507 -311 567 -535 74 809 -437 -563 255 215
1172 215 150 -688 90 70 -580 601 98 -924 -277 451 155 -281 -308 17 -429 131 605 -701 -193 320
1192 320 104 -91 -138 -122 -318 -160 609 -82 -704 148 442 -170 -110 161 14 -265 648 347 -507 159 420
1213 420 -174 337 344 77 74 452 542 -426 -625 477 326 -19 276 188 -78 102 515 -62 -285 158 239 -249
1235 -249 102 176 -327 -75 561 -139 -498 -229 344 1 97 -12 -360 -313 184 418 -375 -221 -28 -69 -177
1256a77M66k88o61O21L65o98L4K27J27k12M58j19p55L84N69k87l71J8J03K64R4
1277A62J62o01p1O81k0l77k6J78j10O4M04m50k48N71K79p17k2R1j41K19J55P5
1299B58n16jQ75m23l36K79n85K96M32j30l13o9L69J16q48M65N5l30O46j53k7k45
1321a85j08O74n08j93N66n82K22N50m31k54R4L32J0l68N45m66l38Q02l03m90J9
1342d12M89j09k35O6K65l76K11O68p59j1J10K35m4k81K24o9k48R03k36n71M35
1363B55j33L05k06l8J24o40R20J81j083J92N25p09O93n86L27n03j66J109n72m82
1383d87Q09n14N3K27o4M8m99N95K25q15L28M32p22P08l08o4J61l92Q42o05n09
1404e51Q72k15m39N20l43J39j88J45L01j063J048o1n58M10M4n99N92j15Q1j81
$$ plain form
1256 -177 289 1 -660 -39 326 -372 -338 -111 16 -196 262 143 -612 -228 341 54 -317 -299 -196 68 162
1277 162 324 -277 -348 333 313 -64 -90 88 -22 42 446 -4 -252 319 598 -119 -141 -50 -191 28 183 258
1299 258 -258 -259 616 193 -143 136 -449 -153 279 149 -164 -233 136 252 -596 -131 -76 -406 240 87 60 -185
1321 -185 -293 381 -127 -320 246 -336 -114 436 5 -249 -155 177 187 -181 364 -102 -440 362 59 -431 -412
1342 -412 77 -32 -267 -201 64 -312 -101 567 -192 -203 -93 142 98 -183 41 -28 -276 627 391 -180 255
1363 255 122 427 221 183 307 -333 587 768 -315 -123 402 -307 386 -200 127 -376 -542 567 -5 -487
1383 -487 322 -192 -139 88 24 72 -427 168 393 -422 -94 338 -384 324 16 -48 113 -279 563 -42 -551
1404 -551 321 106 -333 187 -156 -17 -205 -60 241 -822 226 165 -393 17 61 -538 54 -61 20 -161
1424a61k16P77p93K35P19r92L86L01k91L63l49K06K98j163J304l4r52O49l13K84
1444B58j20o19R71o64J38P77j137L14K32l18K60m54K11M42r03R31k06n70P83m34
1464a08J47J82l73L06l74l73J083p53O7O19o14L12k33j32O45q88Q14m8j125J366
1484E20l63l32M00n58K29J12n97R85n87J15M49q71M21R6m19O79l81J97j45m68
1504e18Q00l05j33K31j58O4L60n18L56n47L70N17p60M03J70n93M81k29L06j29
1524A68l43O32o69q9P56p93L59K77l73L96m54N7N66p82J14M61m40M99l70O9N0
1545I1m23O19j72k23K45k65o7Q39o40p2J22K2M18p22K46J72m99J49M05k44J87
1566A88l44J74J36n25N99m24K6K56j48m9J19j08K24j91j72M66k51K14k38J24L69
$$ plain form
1424 -161 -377 400 -393 -158 561 -431 -45 256 -35 328 -21 185 483 -680 624 590 -362 287 -26 258
1444 258 138 -481 490 -174 -36 741 -396 -82 150 -168 92 -362 -151 291 -612 319 113 -457 326 -108
1464 -108 39 221 -152 154 -220 -593 490 -263 -196 423 -191 121 -112 -244 401 -487 327 279 -846 520
1484 520 157 -175 225 -333 -104 8 -589 396 -191 -76 373 -498 -77 19 -400 279 -102 95 -50 -518
1504 -518 282 -23 -156 75 -83 -19 341 -177 179 -368 2 519 -241 162 332 -261 220 -9 297 168
1524 168 -175 457 -212 -301 455 -338 21 298 -75 321 -133 -76 490 -292 -178 283 -157 342 -28 41 91
1545 91 -332 287 115 -108 137 -128 -195 644 4 -68 54 76 494 -228 18 190 -309 -160 245 1 188
1566 188 -156 18 154 -371 228 -196 -170 86 -62 -111 8 -100 124 -67 -239 227 -24 190 -48 76 445
1587D45n41o7L30l74L89j96M9k5j15K13r0m9K62k06l63M08j31J71K29m04K62r0
1609A07L3K79n05K5q1rL15j36N8Rr5P2j03Q0Kk56L01n4j67n3k8J52j7l47K87K46
1635A15j50K06j82j70J60j70J59o0k06K55J56j61J73l44j12M15o2l7k88R1M08
1656A96j41K16m23m3J19R8j30K04l46L80l50J37L25l48J20J27M4j81L4r5K3J08
1678G4j10L12m08QK22k32K13k50J77P1J07j34J18j97m7K54k28k33K60n5K10l21
1700a89J50l02K62J85j24o7R3M8J5O3k14L6m0Q7K70j09j14m9m7J34o5J5j23K23
1724A38j28oJ70l85L44n0l8J19j28N9j88N4O0K20k84J35J5j32j18K63q4Q3q0K08
1748B47m2j82K15k8L6l37J68k63K53k04L59k46K09K61l67k0j00J99k48P7N6j76
$$ plain form
1587 445 -96 -163 167 -207 182 -14 35 10 -105 108 18 -31 231 25 -338 70 -61 110 339 -65 197 107
1609 107 140 419 -86 -61 -142 -151 164 28 86 95 0 72 -31 49 51 -205 96 42 -125 -178 -206 -54 -71 -418 -131 115
1635 115 -35 171 -11 -181 -21 -191 -32 -92 -298 -43 113 -48 125 -219 -331 84 22 -15 -303 -212 196
1656 196 55 271 -152 -195 -76 22 -108 96 -250 130 -220 -83 242 -106 14 141 185 4 38 -57 -34 74
1678 74 -36 276 -132 -124 98 -134 79 -171 6 77 184 50 168 -29 -76 178 -50 -283 -23 -78 132 -189
1700 -189 -39 -341 -79 106 -18 -85 8 56 71 134 -80 -44 -84 3 273 164 50 1 -46 88 23 38 -85 138
1724 138 10 4 174 -211 133 83 45 164 36 95 -93 -39 21 241 -43 92 107 -25 -143 120 36 119 39 247
1748 247 205 23 238 210 246 -91 77 -186 67 -137 222 -24 185 446 79 59 -41 158 -90 -13 43 -133
1770a33J68q6P3P4p4o2J1j97K19j72j6MJ23L12k74J58N2j85Q8J83j16j91Q6J54
1794A99k11pj81M8J87k1k14J76J13j35j10k1J72j42k2K39o6m0j55M12l35J57L7
1817H0Q2j00j53K29j46p5N1K26j49k1J46k15j4R0J32j75J76J75m08K95n05K72
1839gK3m4m2k5j10M62j91j67L54l05q6K44k63J06J34j71P8j50J18K18M2j78P1
1862A11k92K67k6n4J08k42L3K82j17l6j84K30o5K9jJ3p5J6L1M7j17Lp5J51K20
1887B57l97Q3J17J34j99J91j01j63J99k33L89kl53J97j86K95k16k86K05m6K51
1908A36J6M7k19N6j21M03k51p1k31K20L7R4j99K70m89M18J3l00K60l29L9K20k91
1931b72K08J62J05j89j38R8R5r0K0j19K71l63p2L30J50l40R9j27L7J64j98K54
$$ plain form
1770 -133 35 -51 22 96 22 -40 -29 -226 -7 -179 -195 -191 -68 244 -30 128 180 -5 83 266 150 -41 45 199
1794 199 -12 -19 -200 -152 35 14 -200 -24 89 -46 -156 -177 -5 -147 -169 70 4 -36 -191 221 -114 43 80
1817 80 162 62 -91 138 -8 -83 -32 194 45 24 170 -45 -59 31 163 -12 164 339 -69 226 -279 -7
1839 -7 16 -28 -70 -95 -205 257 66 -101 253 -52 -138 106 -157 -51 83 -88 -10 -160 -42 176 218 40 111
1862 111 -181 86 60 6 114 -128 -95 187 70 34 -150 80 15 44 43 56 -19 -3 28 75 -42 -39 -114 37 257
1887 257 -140 -57 60 194 -5 186 85 -78 121 -112 277 275 -78 119 -67 228 12 -274 -69 -115 136
1908 136 152 199 -20 36 -85 318 67 -4 -235 -15 22 116 -83 187 -302 116 129 -171 89 -240 -201 19 -272
1931 -272 -64 98 203 14 -124 -26 69 -21 -1 -120 151 -212 -284 46 196 -144 -45 -172 -135 29 -169 85
1953H5o3k02Q5J24M3l5n3R2j89M12k03O2k87M72o49J40J65m5L70m38k13L27K82
1976B82j96j72m5J71j32J67j9m26M13j71L10k19J22q3P2M7N4q2l33P2M9K08n9
1999C0j25J15j20J8J91l9o2n1PK84l10J11j26mK23m5l46M25L6o9l3j98Q0k13N4
2024a67L13j31J26Jm7J2j33OK14k75k2p3N2M21l73R8p3o0J53O5j28rq3o2K10J05
2050A40k47%j35J88j9K78r1j04q3k3L3K00m43M13k77K3J07J51l6k02M61l97J7
2073d6O6j9K5R5M4l22j1J42jj14J28J0q8k20L85r0l84K24J73j9K17k57N3J38k49
2098a20L13m08J42Q5m9j2J31j11K4j34J08m8J53j80J26J36k99J17J76j95R5k77
2120b27K14l3q3L7M7J66ML0j50m4K26k12J58k96R5L09j99l5o1N9O7j11J12m05
$$ plain form
1953 85 22 -180 -95 29 72 37 -16 76 -113 299 96 158 -129 343 -306 -166 -1 -46 324 -114 -327 0 282
1976 282 86 -86 -131 40 -92 75 56 -370 43 -128 182 -37 85 2 74 121 175 93 -240 -168 -119 89 30
1999 30 -95 20 -100 -82 109 70 8 -43 -36 248 -62 49 -77 -81 142 97 -249 176 212 143 110 -88 -8 -221 -167
2024 -167 146 15 141 142 95 107 -26 -20 194 -81 -103 -176 -124 297 -76 22 -51 -111 42 107 -21 -30 -113 -175 35 140
2050 140 -107 -107 -242 -54 -73 205 114 10 -73 -96 -63 137 -306 107 -170 -147 -40 111 75 -127 334 -63 -46
2073 -46 20 1 26 121 165 -157 -168 -26 -27 -141 -13 -3 -91 -311 74 -16 -400 -176 -3 -22 195 -62 -9 129 -120
2098 -120 193 -215 -73 12 -37 -49 82 -29 -5 -139 -31 -79 74 -106 20 156 -143 -26 150 -45 50 -227
2120 -227 -13 -46 -129 -92 -45 121 125 155 5 -39 187 -25 133 -163 -68 241 42 7 -54 5 72 -39 73 -332
2144c32M98k3q4o7p8O6R6j93K32p9j92J51J20k43O7J46j48Q2k80K89lm6J08j88
2168a01R6l4l1QK51K8pj80k34J35R9j31K2m6k8P2R8j4o4m3r0K24M8p0L9R0j45
2195hP5j54o7L89k49j2M1M6qr3lK43n01O46k40p1l9nm4J06p0l9k2q6K31k75J76
2222c3J6P6q6J5m0M0r3K72j56j02n5Q7K77j27R3k84L55j34j77N2j4J03L5n2k4
2247D4J50k98P6k2J64j76j29J59n5j00L54r0J5m8J45j40J94L1l94P7J44j94L74
2270B81l89N1Q5N1m8k26M47k36L7R3m3j01Jj06J97r5p1L2J73j00K53l77J36q8
2294d3K27j51k5M4q8p4q2K88l1k1k38J51M0J27l69J75J52j28R3L2l8q8M6k4L3
2319Hj19Q4k9p3jK36j98K20k62R9J6j19R2kJ16j21j48K68n2K2J67k58J29P0k65
$$ plain form
2144 -332 166 143 59 -8 -86 -20 76 -117 115 36 -156 -5 115 -128 -61 85 -63 19 -261 28 25 -21 87 -101
2168 -101 -5 -39 -70 -62 189 217 210 30 -204 -69 30 -101 -79 -125 -153 -81 17 3 -61 -104 -194 30 78 8 47 137 -8
2195 -8 67 -87 -154 235 -14 -26 15 61 53 -40 -43 200 -301 345 105 34 -5 -10 -54 52 -18 -57 -79 -165 66 -209 -33
2222 -33 -17 59 -27 -12 -52 -12 -105 167 11 -91 -146 -59 218 91 184 -100 255 121 -56 -4 -18 85 120 68 44
2247 44 194 -104 -28 -50 114 -62 -191 -32 -87 -187 167 77 92 44 189 49 243 274 -120 -43 101 -93 281
2270 281 -108 -57 28 79 31 -195 252 16 53 146 103 2 3 -103 94 -1 -72 -40 133 33 286 -91 45 -43
2294 -43 184 33 8 52 -36 -110 -192 96 65 44 -194 -43 -3 124 -245 -70 82 -46 47 79 41 -47 -1 -25 8
2319 8 -111 -27 -56 -129 -130 106 -92 128 -134 -35 -19 -138 -46 -48 68 -53 -201 67 15 37 204 -54 75 145 -120
2344a20J72j21j58J61j3OJ93j72L2j90K30l9M6r7j14K58j51k50L00l42L12N5r1
2367i3J78L6O7k02O9K4m0J10k51J08J50m18p3L50J50j11l06Q2K30j55J4O2l1L2
2391a8j82K41m9O3l3j83R1J59lj00K6K8J11j70j89K40l67J01K35j06M20l96L3
2414d8j18K03j54O8lK12k1r9n8K25l11K72j45j11K95k18J1J2J80k14J10l4k83
2437b29L17n0k9J43l17J83P2l01Q1J81M4q4O3p1L4L1k7j77j9P9L5J82j65L0K4
2462C0j72K2J00K05M2k05j76J76J0o9N8j55J21j32k4j3R1Q3j89K44j08j59K85
2485F5J13k81K12J7j82j51K80k1K52k12r5l4Q5o6J68j3j1n4J72l64J22J23j93
2508f8K36l09J22J31m1o1L7j49J10k29L53j20k87Q4L52k26N6O4j72K88P5j46J11
$$ plain form
2344 -120 52 -69 -227 -66 -79 -73 120 -52 -20 -210 20 -19 27 -70 -184 74 -77 -327 -27 -369 -57 -2 -93
2367 -93 85 121 188 -14 55 79 39 149 -102 6 156 -262 -335 15 165 54 -252 -170 60 -95 -81 -19 -50 -18
2391 -18 -200 41 -8 55 22 -161 -70 89 86 -14 12 40 151 -19 -208 32 -335 -234 1 -105 315 -81 -48
2414 -48 -166 37 -117 -49 -52 160 139 40 -18 207 -104 168 23 -88 207 -11 0 12 192 -22 88 54 -229
2437 -229 88 38 9 152 -165 18 90 -211 -130 51 95 11 74 3 37 68 41 -136 -155 -76 -41 141 -24 6 30
2462 30 -142 -120 -20 185 227 22 -154 22 32 -37 21 -134 -13 -145 -169 -182 -91 -8 -197 47 -61 -220 65
2485 65 178 -103 109 126 -56 -207 73 52 304 92 -3 -37 48 -18 150 137 126 72 244 -120 2 125 -68
2508 -68 168 -141 -19 112 71 10 47 -102 8 -221 132 12 -275 -191 161 -65 -9 55 -117 171 246 100 211
2531B11m35PL3L83l5j50r0j55K09n2L5J90L9j38p0J2J78j2J08j31j16j77J25L6
2555EQ8j74M1j60J25J32j15o2M02k95J29j08R4J90k18j30NJ26nj00M36n25J14
2578eL6j20J03M7P1k75K32m6q4K72k98n3R6J6M6n5q5J62J08k50J61Jm5k17J11
2603g1Q0j1K1L52k48r8k4o2J51j44J08n5J46k38J84n9J13j05o4P9m0R9j95J91
2627A10J4j14l9LJ67o4l9k71J46J64j45P0j10J06J52k05N5j15k8K19l65J85R0
2650a4J19k09lJ14k20L89j08mK9J0%j02J57l39K53r6KK55j31k87J53J01RJ8J28
2675B24k45q7L8R4n7q8O3J50K13k82J05J4k49J73L1k55J68K17k23j54K47j13J78
2698A62k48Pn1J67p8J40k54J32L15k36j90J7P0J38l35N26l19K10j90o7J62n9l09
$$ plain form
2531 211 -224 -217 -184 199 164 14 -76 -231 -22 -74 -39 151 190 52 -18 -6 172 160 268 137 21 -156 -31 5
2555 5 93 -81 -40 -200 -75 57 -58 -120 282 -13 116 8 102 292 74 -56 -51 75 70 -30 406 -119 -5
2578 -5 31 -89 14 61 132 -143 89 43 -41 231 -67 -120 -24 -8 38 -17 -102 60 168 -82 79 80 35 -182 -71
2603 -71 9 -2 19 371 123 25 1 -61 90 -54 54 -1 145 -93 91 32 145 40 -24 55 15 114 -81 110
2627 110 124 10 -29 -26 141 77 38 -233 -87 77 -68 2 -108 -2 150 -55 0 -115 -143 76 -289 -104 -14
2650 -14 105 -104 -107 7 -213 176 68 64 93 103 103 1 158 -181 72 -24 -22 233 102 -185 -32 69 78 96 224
2675 224 -21 -108 -70 24 -33 -121 -58 92 305 23 128 142 -107 66 97 -158 10 227 4 -150 97 -16 162
2698 162 -86 -79 -130 37 -41 99 -155 -23 292 56 -134 -117 -47 91 -244 282 -37 173 -17 -84 78 19 -290
2721b90L58j18K57k31k4k30L17j68j07J84J38k30L85k30K49k98J76k9k05K52j86
2742c0Q9k2j17L7k70O7J94P2l36M18J0n0k65J00K67l68M32l52mJ64k24K23l15
2765b80L88n0Q1K1J1l11J24J30l5j73J67P8k78J39R6J8j51J46k66%J63j86P1P6
2789b1J61j63L3r6j87J99l67L76J40J32k82N5N8j50K17l05K11J30l46L71j37k83
2811b54M31j52k8j06LO9K9l8j51K59j70K15l33M06k08o8R6k4L5J29m94M43K0k95
2835a86M11j09j19M2j12N6j22J41k8O0p8j2J01J74l07k5K66j78M5m9L9o6L4q2
2859a04k0J71m8o6p2J25j1N3J5Qj7j29K19l00N0j5m8K10J42k26j43K39k53Q9K36
2884A05j45o1j6Q6J06K0M0l7j47k9O1l2L0j04J08K44q1p8l6j9o3j55N1L21j76
$$ plain form
2721 -290 68 -50 207 -24 -48 -278 39 -129 -236 -52 86 -144 241 11 260 -38 138 109 -96 156 -30
2742 -30 59 37 -80 -43 -313 -246 -52 20 -316 102 112 62 -203 -103 164 -204 228 -124 -128 36 -188 35 -280
2765 -280 108 58 139 160 171 -140 -16 114 79 -94 73 151 -127 12 108 126 -25 121 -145 -145 18 -168 -97 -21
2789 -21 140 -23 10 -86 -273 -74 -441 -65 75 207 -75 -20 38 -112 105 -200 11 141 -205 166 29 -254
2811 -254 177 25 -3 -109 -106 -37 -8 -46 -197 62 -108 107 -226 180 -28 -96 0 -24 11 140 -354 89 109 -186
2835 -186 225 116 -3 39 -73 -17 -139 2 -26 34 -44 -56 45 219 -88 -113 153 -25 20 -29 10 -56 -22 -104
2859 -104 -124 47 -1 -67 -139 -14 -25 28 43 51 34 -95 124 -176 -126 -141 -189 21 163 -63 -206 33 -220 -131 105
2884 105 -40 -101 -117 -31 75 95 135 98 -49 -78 -17 -49 -19 -123 -15 229 148 70 34 15 -48 -203 -152 169 -7
2909gj02R0j27K20j36J90q8o2R6J12j6j58qj20K22j64N7L5p7K10m08L81k58K46
2933A28l77K28K6j56K35j72J53m9K2q1j19L3k2k2J21J95o5jL4k1o0j48J2LL07
2958B04l20K91J3k13K04j8j88j2J05r7m6R7O7j4j51K1J05o5J29j87J01K65l03
2981a2J47rj34J44j98l2L7J40l46J81N6j00P8M48j26k6l76J94j8J68j00k17J12
3004A1p4K21j02k69P9K18Q6k64P6k47N11k97Rn0K92j67j30m9K22L7J5j88K4j96
3028b32L20r7K75k20K21k22k85L74k90J79M7Kj20O6N6j92L63k32k17K05j42J03
3050c8j0R5K4l80M07o2Q3J45l61K5l3J17J20j69K5QQ5k56J86K8J5j44m0K33N0
3075A53m45L28J15k47J9K49ml46K32J93l91P8J86k88K26J4l19J70J13p7l7P2j39
$$ plain form
2909 -7 -109 -19 -146 74 -62 128 40 -22 74 186 170 12 4 -116 106 -58 -1 34 -43 167 -241 140 -118 128
2933 128 -249 -21 5 -151 84 -88 65 16 38 -43 -162 -129 -151 -173 -52 143 78 77 111 90 30 -118 -106 -103 204
2958 204 -116 175 188 -25 179 161 -27 -39 66 -31 -77 20 87 73 -78 -57 48 -17 112 -75 26 291 -12
2981 -12 135 126 -8 136 -62 -94 -57 83 -263 -82 -26 -126 -48 400 274 248 -128 66 48 216 116 -101 11
3004 11 -63 158 56 -213 -134 84 170 -94 -18 -265 246 -51 -42 -92 200 33 -97 -146 76 113 128 -60 -36 -232
3028 -232 88 -9 266 46 267 45 -240 134 -156 23 70 72 -48 18 74 -118 245 13 -204 1 -141 -38
3050 -38 -48 47 71 -309 98 36 119 264 -97 -72 -105 12 132 -37 -12 -4 81 -175 11 39 54 -90 -130 103 153
3075 153 -292 36 151 -96 -77 172 168 -178 54 247 -144 -66 120 -168 58 72 -247 -77 36 -41 -78 -6 -145
3098a45J43K81l58Q6k60J69K10l56K16LL5n8K76l33K70j69P5k88R6L76k90qK98
3121B69l60j2J74k16j40K71K00j94k75J93J86j46o4K57j84j00N3K66k95J73m9
3142Gk13K93mj09j00J87k38N0J39k11P9J19k51P8O4K1l9K75j67R3j96J14j32L49
3166B08k65O7pj09j03K43k8j38K12J21j72l04L66j24J25l60K32J68j31j5j82L81
3188A85r8m5j00J83j66o0K43j42k0o5J69j59Q1KQ9j42P3j19P1J00j53J43r6j8
3212d4j02K48j76p5L28k33j96J61J16M6j97J15J49j43K07k96n8J84j21L5J68j49
3234c3J0l6K02P1k03o1K08Q9m4j69r9M3J34L6k38J77p1O9m0J4J4O0m0l5l06L31
3260H3r0j11J53l31L58r4R2m4K06j57j51rK37j98M0J12o1j54J92O6k34J03r2K21
$$ plain form
3098 -145 -2 279 -79 7 -253 -84 126 -230 -14 -11 24 -34 242 -91 179 10 85 -203 -107 269 -21 -29 269
3121 269 -91 -103 71 -145 -285 -14 186 -8 -283 -90 96 -50 -114 143 -41 -141 -88 178 -117 56 7
3142 7 -206 87 83 -26 -126 61 -177 -127 12 -199 -120 -1 -252 -174 -110 -89 -128 147 -20 73 -123 -9 -141 208
3166 208 -57 10 3 -106 -209 34 6 -132 80 201 29 -275 91 -33 92 -268 -36 132 1 -14 -196 185
3188 185 87 42 -58 125 -41 -101 142 0 -20 -85 84 -75 6 8 97 -45 28 -91 -20 80 -73 70 -26 -44
3212 -44 -146 102 -74 -149 179 -54 -250 -89 27 73 -124 -9 140 -3 204 -92 -150 34 -87 -52 116 -33
3234 -33 -23 -59 143 214 11 -50 158 247 203 34 -65 -22 112 148 -90 87 16 85 45 59 73 133 93 58 -248 83
3260 83 -7 -118 35 -296 62 -32 60 16 222 65 -86 -95 142 -56 -16 96 35 -119 73 139 -95 8 -84 137
3284A37r3k17J66q3o4J62J07k46L09l5k96K11k67L43J41o2r7j31K26m34K4M73
3306B74l45M3qR4J9j35J71l8J51k40L63m10o6p0K09j52M58m73K07k39L13r8MJ25
3330A57K4k46P9r8j40L83j72K16l24J14j10L01k69Q1n9K10j6m0j10J8j00K03l54
3353b52L06o4m7J26o4p7J78O4k7j97j49K16j97K46k46K48J12l9j61JK20k93J9
3376g7P8qo7J20n5N0k42K73J05k01N8j73K19k03K8j45K87J7K01m09K02rJj10K05
3401A45P3l81q7J55M7K6M8J18j10J3j08J08j75J95k5k42qK70q6J8j20J67j28l1
3425a18o3L92k07k8J37M3k95kL58O0k84%k91K73J06j9j24l5o5L05j97O5r3M3R3
3450E4j17k8L0J17K6r8N1J05l41M3K08k9j04P3j23K30O1j06j51P0J2j13K62l12
$$ plain form
3284 137 44 -173 -7 -90 -154 8 115 -131 178 143 -153 58 -209 134 275 213 116 -15 211 -223 -199 274
3306 274 -71 -28 -36 58 77 -58 113 75 226 -14 349 -61 -127 -197 12 -140 318 -155 52 -187 126 28 32 157
3330 157 181 -65 14 -84 -224 159 -13 203 -121 -7 -117 184 -85 -4 -63 147 131 91 -19 -1 -101 102 -252
3353 -252 54 -10 -57 69 5 -72 106 170 143 -54 -203 13 -184 62 -184 64 176 137 -24 -23 197 -96 -77
3376 -77 1 -7 -74 46 -9 41 -201 72 177 -24 34 -139 80 -123 -95 -240 47 64 265 -144 58 49 50 -60 145
3401 145 218 -163 -250 -95 -48 -22 26 144 34 47 -61 47 -128 67 42 -200 -208 62 -24 -6 -126 41 -87 -118
3425 -118 -181 211 4 -24 113 156 -139 -141 217 277 -7 -7 -298 -25 81 62 -62 -97 -162 143 -54 11 -82 -39 54
3450 54 -63 -91 -61 56 82 -16 35 140 -201 -158 50 21 -83 -10 -133 97 158 52 -99 -29 -17 -130 132 -180
3474a80P9L2J13N1j16rJ00j19M2L4L8j40J51k8o1k7k9J05j5O6j49n5J68r7p6k4
3500a46K08Qr4R1k9j89n4L50r0l7O9k5k2J07k16P3P5j77L6J79k91J98Q4j94J87
3525A01j59J8N7O8j67j50K53O7j28J5L9p9l5J5K29M9l81J66J45q6j56j20M13j14
3549F0j26j48R4J71j4l0j05J71k67L42j41o3L7N4J34j58R1p9K5pp9l4K7J2J87
3574A54j2l3j31J82J58m56J24O8j62K01j08l61K22Q2j27K97K1j81l1j0K93k3j01
3597F6o3J43j92l3L4P9j99M6R0J11k78J86L73m22K5L1RQO5m7K9j20J05k34P2N7
3623e9O2J4o9J68q6Q7k50J64m9Q5k06R1Q9j22Q4M7Jm2j10Q1J93k02ml0j11L01
3649A27l1q1R1k15J25j18L1K76m40J82m8J74l5k00K43k35L51p0pk4O6k37J9N9
$$ plain form
3474 -180 -101 -69 44 95 -21 -30 70 -49 -7 27 65 -75 76 48 -13 -40 -69 36 21 87 -62 -117 51 -46 -122 -146
3500 -146 62 70 -24 67 38 -151 -205 145 55 18 87 62 40 147 -69 4 79 -98 -62 117 -174 24 108 -86 101
3525 101 -58 -40 17 85 -82 -232 21 88 -40 -25 14 -65 -100 -85 144 193 -188 -22 123 37 -119 -239 174 60
3549 60 -66 -214 -120 51 37 7 -98 73 -194 148 7 -56 -19 35 169 11 102 23 48 41 -38 -72 -45 -33 154
3574 154 142 109 -22 160 318 -138 -14 54 -108 93 -15 -376 -154 -72 -199 98 119 -62 -93 -103 190 167 66
3597 66 3 146 -46 -79 -45 34 -165 -119 -29 82 -196 -10 363 -59 -34 -3 6 14 79 32 61 -59 46 -188 -116 -59
3623 -59 3 17 -52 116 30 117 -133 31 -18 67 -139 -48 41 -81 3 50 51 9 -101 -20 173 -29 -33 -63 -174 127
3649 127 96 15 106 -109 16 -102 -71 205 -235 -53 -101 73 38 -162 81 -154 197 127 120 96 162 -75 -56 3
3673CJ88j34o2KQ6k36M03l65K41k04J75o3M7j19J97n3n3N5j65P4k12J15J59j13
3697c4r5P7j57N2M1K61m00L22j67o1K71o1q4J76K4K1p2j3K7k84K94qn4j99K43
3722A20j60J27j0Q5m6l5J9q3J04j89J08m9R3r3K7R1k20Ok9J56L1m7r6P1m8NJ4
3749d8R8%m5N9M1j78K10k57J15lq9J29j60K73l75J13J45k16K60j53K08k70J28
3772a5k4q0NK10j54K2J01k88K34q0O1r2L13m12J05j58L41j22L2r2J9m0J61j07
3796f0J09l07L53Qm9L6Rq9Oj14Q8l09M42p1j58Q9R1j39k36N97l06O8j35q9K71
3821A05J03l4k81r9L26l52Q6J47L25l64j04OL83j17J33j77k7J89l12K3J09m0k5
3844CJ15l1J42k52L2o0J89j55O5J4J08k06J63k1k73J72j19p5J29o3Q5J67k53p6
$$ plain form
3673 3 191 57 -5 -3 83 -153 250 -115 126 -78 97 34 81 -38 159 106 53 108 -57 17 -195 -80 79 -34
3697 -34 -129 -52 -209 -157 -116 145 -255 67 -100 -161 110 49 -35 141 165 186 114 101 128 -156 138 130 76 -123 120
3722 120 -40 87 77 162 116 81 100 17 121 -68 40 -9 84 -9 18 109 -111 -105 -134 22 53 6 -90 -19 -67 -62 -48
3749 -48 50 50 5 64 105 -73 137 -120 -5 -8 -97 32 -128 145 -230 -117 28 -188 72 -81 127 -143 -15
3772 -15 -39 -119 -114 96 -58 -36 65 -223 11 -69 -8 -100 213 -199 -94 -252 89 -33 -1 -93 -74 -114 47 -60
3796 -60 49 -258 95 103 54 90 99 10 16 -98 -10 -319 123 52 -106 -17 74 -65 -301 296 -10 58 -77 -166 105
3821 105 208 174 -107 -206 120 -232 -146 1 326 -38 -142 -136 247 130 263 86 59 248 -64 -41 68 28 3
3844 3 118 87 229 -23 9 -51 138 -17 48 62 170 -36 127 106 -167 5 -114 -189 -60 -123 -38 129 -124 -200
3868b00N10k41l47L06j60Q9R9j28J66m1%J8j12K3N8J25j68L0O2n8Pr4R2k40L64
3893A60k53J66o6J31n4j06J52m89j38L86O6p5K96j71l3J81k73M2J80j05M7k75
3915b31K71n0k7R8K39k18nq2l0O7j96K16Nl9J01j14K18m04K08M3j13K58M2j8k65
3940b6N6k0K26l21P7J24j62q0J61q7P8o0K54k33j17O2J5J39j51J2L14k22k68L50
3964A21j99R3j37J81m2J79mr7M7k20K02j08r9j3J16k8k5mJ45q4p1O5O8%n3J4k65
3991b18L41jj84j8j57N68k44j10q3K18j40K67k02j8l5Q5n9J13j45l6K69j77j75
4014a41L4j7j1K8Q4Q7P9j69J41o1J8k36K47n1o8K15j84K03j78J75k58l2j65J99
4038f1l5j9J14j81J40j41J59n9J43j37N6J0o3m9M26m41K24j27n5M32k94J21j76
$$ plain form
3868 -200 310 69 -278 28 -132 -43 56 -72 94 53 53 71 -41 -18 40 165 -3 27 89 31 38 -56 36 -204 160
3893 160 -93 73 7 138 84 -22 130 -359 -497 -111 -45 -120 176 5 -28 153 -120 -78 102 -3 44 -231
3915 -231 40 -10 -37 61 300 82 77 -5 -35 32 -164 52 57 18 119 5 223 -181 27 70 -43 215 257 239 -26
3940 -26 30 10 236 -85 -8 116 -46 -126 35 -52 26 -34 220 -13 -130 -68 -53 86 -65 -53 261 39 -229 121
3964 121 -78 15 -122 59 17 196 192 95 142 -78 124 16 -83 -96 20 -8 -33 -37 108 24 -47 18 86 86 33 47 -218
3991 -218 123 122 -62 -80 -237 331 87 -23 -106 112 -28 239 37 19 -16 69 10 123 -22 -58 211 34 -141
4014 -141 -107 -124 -135 -107 -23 64 143 -26 115 54 72 -164 83 32 -36 179 -5 198 20 195 -63 -95 -260 -61
4038 -61 -96 -115 -1 -182 -42 -183 -24 -83 60 -77 -21 -11 -74 -123 303 -138 86 -41 -96 336 42 163 -13
4061a3K83j70l03J10K15k29L96k20k9n7M3r0NJ62q6J50pj63j00J20P3j79J79k
4085H8K06m15J57j53N2P6j50J38j51L46j83R0l3l23J78N9j24K33K12l62P5k12
4107a96rJ8n7K61Q8l00K40k8m6J1J2j38K35J76l52K77k40J18J6j78QK6K82m06
4131a82J81J79n2j47J36j91j2J3k01L29l2J42k41J61m9m2j52L9J04J11Nj29nK07
4155A72k2J69k51r7n9J43j5K7n2L25m43j56K55r4J62k83L9J20K77m78J94k2rQ
4179i0j40K78K7L5j43j3p3K1m3O3J20m4k9k01L91o2l9p4J22j74n0J08k1J1k1J38
4205I7q7j47N6N0p4o9M53l39J49j04r5J3J04j27L1J21k19K32J37k13J83j62j98
4228b08J46K13j98j49N3j8r7K62P9J3j65P2R2j63K74l37K45j74O8J51l23K13K44
$$ plain form
4061 -13 270 100 -203 -93 122 -107 289 69 40 -17 26 -64 -59 103 17 167 160 -3 -103 17 90 -89 90 88
4085 88 294 -121 36 -117 -65 11 -139 -1 -152 194 11 101 68 -255 -77 -18 -142 91 303 -59 16 -196
4107 -196 -205 -187 -244 17 105 -195 45 17 -29 -18 -6 -144 91 267 -85 192 -48 70 86 -92 -84 -58 224 -182
4131 -182 -1 178 126 -21 115 -76 -88 -75 -276 53 21 163 -78 83 34 -8 -160 -121 -17 94 99 -30 -35 172
4155 172 150 319 68 -29 -88 55 40 67 15 340 -103 -259 -4 -98 64 -219 -180 -60 217 -261 -67 -89 -98 -90
4179 -90 -230 48 75 110 -33 -46 -119 -98 -141 -78 42 -2 -31 -232 159 97 58 -16 106 -68 -118 -10 -31 -20 -41 97
4205 97 10 -137 -81 -31 -105 -174 279 -60 89 -15 -110 -97 7 -120 -89 32 -187 45 182 -31 152 -10 -208
4228 -208 -62 151 -47 -196 -143 -161 -258 4 83 96 -69 3 95 -68 206 -131 114 -60 8 159 -164 49 293
4251B93k13l19L88k17l7N5K80l08p2J13j01K00j18R0q9k6J69j76J24o2m8K09l63
4274b28K4J52o1J51J80q2j32%%j23K11k07J41j41J90k00L81r3j91J01L9j39O4
4297C7o4J57j08n9J04P6j59J31j62r7J26j26m6K86k0m05N24k45p6K92r8k42J80
4320FK8Qq4p2Q3Qr1O6j69L07ql43J22J3J36k4k84J22J06j08L99n8m49J84k5M3
4346h4J24J39k75PJ05Q4K02j54j34p3J72Nj83L12l30J91j78J24o4J30j02j80J07
4369e5n6J66nl10J73L9j9j98N55k61j83k3K22n0j2p1jk1J86j81J10R1n6n8J14
4394I6K0k21J50j17PK29k53J24j69P7J19l2l5J63n6j84J1J14k8j43K19l0j90L20
4418A91j1k70J24q0J48n7J40j07k22M1J09n9K11jk48m4K46qL2N8j09l67K59J88
$$ plain form
4251 293 80 -239 149 -68 -105 -50 230 -78 -150 -37 -138 62 -56 34 -55 -81 88 -88 36 -26 -74 135 -228
4274 -228 -204 -52 -113 38 218 136 4 4 4 -119 92 -115 26 -115 75 -125 256 163 -28 73 112 -27 37
4297 37 -27 130 22 -37 67 143 -16 115 -47 -144 -18 -144 -190 96 76 -329 195 -50 -126 166 68 -174 6
4320 6 34 42 -42 -114 -31 -23 -114 -48 -217 90 82 -261 -139 -126 10 -14 -298 -176 -70 -178 221 163 -286 -102 -127 -84
4346 -84 40 179 -96 -89 16 100 302 148 14 -59 113 118 -65 247 -83 108 -70 54 -10 120 18 -162 -55
4369 -55 -111 55 50 -260 -87 -48 -67 -265 290 29 -154 -177 45 -5 -17 -88 -89 -110 76 -105 5 96 40 -18 96
4394 96 116 -105 45 -72 -65 164 -89 35 -134 -57 62 30 -5 158 102 -82 -71 43 15 -128 91 61 -129 191
4418 191 180 -90 34 -46 102 45 185 78 -144 -103 6 -53 158 157 -91 -135 111 103 135 193 84 -283 -24 164
4442A64j64J38k49q3K69M5J12l22M4J18jl29p4L72j51J72j17K16K22l42q4J1k4
4465e7Q8K4j98J86l00J56O4K56k92R8M0n4K58j97M5k20LK11p3l96L57K31k34J4
4489A0J49Km3j59J68k50O3K4K14l6q0j03l6kK40j42j33J37k62J38K47N3k05j31
4513a37P8q4N0K79q9o2J25j36l25L75R6j69M1j01L5J28j41j97K44K14j64J07r7
4536G0R8l4k84j1J38M7r6rpK21j02r1omL0O4K19l21R1j49K68l09L21J22Rk80O4
4563E9N8o8j79l0P6j25K3L18k06o3N2j37J56K43k65M7M2j0J56j89P1j28P1K6L9
4588C7q2l9P5J15K5j01L2l5kM7n6K3K14k62K39k08j71K39j3k43J54M3j11r1J88
4613A7j77K64q5k25N0K89k19J19O6j4j23K57k82J7j5n1M7r8Q9J52k25K14j48Q
$$ plain form
4442 164 0 138 -111 -194 75 120 232 -90 -46 72 71 -258 -332 40 -111 61 -56 160 382 40 -44 -33 -57
4465 -57 31 55 -143 43 -257 -101 -37 219 -73 25 65 11 269 72 117 -103 -100 111 38 -358 -1 230 -4 10
4489 10 159 161 118 -41 127 -123 -60 -36 178 142 62 -41 -77 -79 161 19 -114 23 -239 -101 146 199 -6 -137
4513 -137 -59 -143 -93 186 97 35 160 24 -301 74 170 1 42 -59 -24 104 -37 -234 10 224 60 167 70
4536 70 168 134 -150 -161 -23 24 -72 -81 -88 133 31 -60 -66 -70 -40 24 243 -78 13 -136 132 -177 144 266 275 -5 59
4563 59 117 49 -130 -160 -84 -209 -186 132 -74 -137 -85 -222 -66 177 -88 -41 1 -9 147 -42 29 -99 -28 -2 37
4588 37 -45 -84 -9 106 131 30 62 27 25 72 16 39 253 -9 230 22 -149 90 77 -166 -12 31 -80 -171 17
4613 17 -160 104 19 -206 -156 133 -86 33 99 85 -38 219 -63 -46 -61 -112 -65 -163 -74 78 -147 67 -81 -73
4637g3K24j35J65N9j24l60M90j74j10J22j19J60q1j4n4j65l3J40J5r4J94l9P9
4660G3q0j99K95k25P8J5N8k3Jj43K36K6pk22L7P3k09k9J60l4J07J03j32J4j4J61
4686A20rj40NJ16j73M9p4M3MK14j09r0J68k48J23J03r2r6l5L13k13r3K56k35J6
4711g7n1N6K04mj57J02p9L00l63j06J09J58O7r7L3k45J55k15J06K7M1M7P2k82
4735a99Q5L23l5k20n5J23j05l1J13J74k64j67L82j57o4M2l9J6M2J53j42o7J42
4758E0k19M8K11j1j98K86j7l44J59J82j34OJ09o6k01j07J93l6L1r4L9J00q3J12
4782A6n3K34k21q6L21l15K20qj38Q3l05L96k22J65j84K9J25n6k56O4J67J1M3n2
4806b2ok53K33j3J72q8j51K79j73R1J37m59K17J18j51J10j13J57q9K4J06j89j5
$$ plain form
4637 -73 151 16 181 240 116 -244 246 72 -38 84 -35 125 44 30 -24 -189 -222 -82 -67 -161 33 -6 73
4660 73 -7 -206 89 -136 -58 -43 15 -8 -7 -150 86 112 105 -117 -80 -7 -216 -245 -85 -119 -12 91 -41 -27 -41 120
4686 120 111 -29 -24 92 -81 -32 -106 -63 -59 155 46 -44 124 -124 -1 102 10 -86 -121 192 -21 -114 142 -93 -77
4711 -77 -128 -72 132 128 -29 73 -6 294 -69 -175 -66 92 159 62 95 -150 5 -210 -104 -77 -36 11 83 -199
4735 -199 -114 209 174 -46 -101 22 -83 -114 -1 173 -91 -258 124 -33 -97 -55 -94 -78 -36 117 -25 -92 50
4758 50 -169 -121 90 79 -119 167 150 -194 -35 147 13 19 128 62 -139 -246 -53 -89 -58 -152 -113 -13 -96 16
4782 16 -37 197 -24 -110 211 -104 116 108 -30 53 -252 144 -78 87 -97 -68 57 1 -255 -191 -24 -13 30 -22
4806 -22 -28 -281 -48 -61 111 23 -128 151 -22 69 206 -253 -36 82 -69 41 -72 85 -4 20 126 -63 -78
4829g8l3J3r9K92j36j63K28O1l1j57k7R1j97J24K75k31oo9N4R5j43J20J69p9n8
4854A5J07j63j4K2j31J69pK54l04J19o6K1j39J93j56P6j27L44k49j37K97k4M6
4877A46j75P7K9P4j64j3Q7J35j40j05J72j04J65l43N3r4J86K36m11L67l85K69
4899F2j65o4K45o9N4j59L1jQ6L2n9n8Q6J58j30n5j06K52n6q9l9J79j37j98k1O1
4925a60Q0J81O2o7k2j02K12kj91oN7M7j37Q2j04J75j63K15j06j49J1J52qm4N3
4950F6p4m2l79M63o0K27l30K93k75Q0p0kJ38n1K6R0J20k82J76l23L6J25J01k03
4974a50J11R1j05J3L7J01k48J06PK77j44j31J18p5j30o3P5P1J16NN7m55J55K95
4998A34J12k66J00L7k98J48K54j38o6k9M2KP7k01J26K49j26pj72m3J03j72k5K09
$$ plain form
4829 -78 -111 -98 -197 95 -41 -204 24 85 54 -103 -130 -39 -236 -112 163 -68 -74 -143 -89 6 -137 -17 152 73 15
4854 15 122 -41 -55 -33 -164 5 -2 252 -52 67 1 22 -117 76 -80 -4 -131 213 -36 -173 124 100 146
4877 146 -29 48 77 151 -13 -26 61 196 56 -49 123 19 184 -159 -106 -200 -14 222 -189 178 -207 62
4899 62 -103 -167 78 9 63 -96 -65 -66 20 52 -7 -65 21 179 49 -6 -112 140 84 -5 -44 135 -2 -200 -221 -160
4925 -160 -80 101 163 96 74 -28 184 182 -9 -15 42 89 -48 34 -70 105 -58 157 51 -98 -87 65 57 13 66
4950 66 -8 -50 -429 34 -26 201 -129 164 -111 -31 -101 -103 35 -16 10 100 220 -62 114 -209 -173 -48 53 -150
4974 -150 -39 52 -53 -40 -3 98 -150 -44 -37 240 96 -35 83 8 -122 -185 -110 -39 77 82 139 -316 -161 134
4998 134 246 -20 80 117 -181 -33 221 83 17 -12 30 32 109 -92 34 283 157 150 -22 -65 38 -134 -159 50
5022E0m2O6j43M4J30j22j00J59Rk49N5K66o2j90J54j71o3K49J50j85J31j84p1
5045a19k2m2K64j94L34p2p7J47k33oR0J23l04R0P1P8J9k19M9L0o7j84L77p9j50
5070i6L50m84P1L11j59P7p2j86K77k18nN1J86p0k9N0q3n7j42N45k21j6P1k02R3
5095D2j13J37j10J71l9k74M5lP3j73J97L11l35J10r0J40O6j24kq4J3l8Pk4J22
5120B5l2J3k8J13kk71M9P9oR4J34k40J70N6k47N8Q0M4k74J0L20k09J38r4K50l90
5146a60j01N9K64m6J26j46k24J94J40j51NN5j09O7N4J27M8l17N2P4N3k02r0R4
5170a34j40K54Q4j59M5K1j28N3K64l20%J82P1j29p1J8L8Q4l41J50J12n3J21l3
5194a1l2l1Q6R8j05j4p4K6R9q9J98m04K96j98m0P6Q8L3j09J96J42k35pk61K15
$$ plain form
5022 50 8 74 -69 -25 105 -17 -117 42 51 -198 -143 123 61 -129 25 -146 -209 40 190 5 136 -48 -119
5045 -119 -141 -183 81 -113 221 149 72 219 -14 -20 70 193 -111 -21 50 128 147 -72 -23 7 -60 -244 133 54 -96
5070 -96 254 -230 -159 152 -7 70 -2 -188 89 -129 -134 -83 103 33 4 54 -29 -86 -228 317 96 80 151 -51 42
5095 42 -71 66 -44 127 88 -186 -141 -144 -71 -244 -47 264 -71 39 -51 89 155 31 29 -55 -42 -80 -73 -97 25
5120 25 -7 6 -22 91 89 -182 -133 -54 -60 34 168 -72 98 154 -93 -35 45 89 -185 -175 145 -64 74 -20 230 -160
5146 -160 -261 -202 62 16 142 -4 -228 -34 106 -45 -40 15 -94 -27 27 154 202 -115 -63 11 64 -138 -228 -134
5170 -134 -274 -20 64 -95 -50 -29 -157 -104 160 -160 -160 22 93 -36 -107 -89 -51 33 -308 -158 -46 -99 22 -11
5194 -11 -43 -74 12 110 5 -9 -83 -57 42 -47 151 -253 43 -155 -195 -119 -31 2 -107 89 231 -4 -11 -272 -57
5219e7J14Q6k77l2R5Q4m6L6o1k7K7Q2j60J49J70k91K34j01k09K18p0K1O6lj14
5244f6n1J44K45j37k64L04k92L05r1k27P8j08J30K46m16rJ55J05rj03J91j53k7
5267e0K19k98K48M9j15l03L34k16K47j21P4J5j02R4J8j90r6L46k70J35k54K24
5289a2l8L7J46l55J49N0J50q9k7k36K96l75K02N3P1o0j17J56Mo0o7k3LL35k11
5314a8Q5k75J00K48k8j75o6O9j73J95j96P3k7J0K20L1pP5k25J98l58K80N8k13
5338a19K03Qo8p0k6j14K38k26L87p2l11k7J24J79r5o0o3J71p2k82M37l77K50r5
5362h0J87m05M72j54K1p7lQrJ23j18j45J1J45L5q9p1J4J88Q5k40N9j42K99j13
5387AQ9J92k41k21J04K09l76K69RJ5O5k22p3R8K6L5K4N9q1j4J68j49j81k2L64
$$ plain form
5219 -57 57 143 -134 -166 -71 13 -33 3 -58 -85 -58 24 -136 13 183 -108 126 25 -184 34 -36 -15 51 48 -66
5244 -66 -117 27 272 135 -129 175 -117 188 97 -130 -52 -160 -30 216 -200 -209 -54 51 42 -61 130 -23 -50
5267 -50 169 -129 119 168 53 -250 84 -132 115 -6 68 83 -19 75 93 -97 -193 153 -117 18 -236 -12
5289 -12 -50 -13 133 -222 -73 -23 127 38 11 -225 71 -304 -102 -49 22 -38 -155 1 5 -55 -122 -145 -142 193 -18
5314 -18 67 -208 -108 140 112 -63 -129 -60 -233 -38 -234 -161 -188 -178 42 73 66 141 -84 114 -244 36 94 -119
5338 -119 84 92 24 -46 -72 -186 52 -174 213 141 -170 -197 -73 106 11 -49 -112 59 -13 -295 142 -235 15 -80
5362 -80 107 -298 174 20 41 -36 -39 -31 -40 83 -35 -180 -169 -24 11 -78 -149 -135 53 138 -102 -43 -185 114 1
5387 1 90 282 41 -180 -76 133 -243 26 35 50 115 -107 -180 -82 -56 -21 3 62 -19 -33 135 -14 -195 -217 147
5412A47j58j83K39K25l33J63q7R3k28K37k30J83jk49L20l96L87j05o1j4J69r1
5434B7p7K35k48p3M84l02k84K92R2j14j59j9J99o7l3k6n9J98K2j41J35J6j82m8
5458a32K19j98L24l10Q3j00m9R9M1q5J65l6K7J08j38j66P8n2P1k6J60J6k0k83
5482b04K52J02m9J28k56O9j20J71l13K55j65L90n54K36J15k1Q4%l96N0L0K4J14
5505e8j01K21m9j03j13J00Q0L2o2j04K71j03j0O7P4j48N0k1Mj9N1J28r4k04J38
5530B7J86j26l7Q4j86J58M9o0r2l34L56JK9o5J4p7n5M46M6k71k96K32M4L0j24
5555b1J04j26j7K94k74J65j7R6l45J09K33j29j52J02Lk94K21K2k9o7%O3O2k5O7
5580D5M0l5k0o2j9k56L43p3M1J62j07J5j50M9J01L9p4M1k4j61L03k93J6J1L7J2
$$ plain form
5412 147 -11 -194 45 270 -63 100 13 106 -122 115 -115 68 67 -182 138 -258 129 24 -37 -51 118 27
5434 27 -50 185 -63 -136 348 46 -238 54 146 32 -127 -146 53 -14 -47 -73 -132 66 88 -53 82 98 -84 -132
5458 -132 87 -111 213 -97 -14 -114 -163 -64 -23 -108 57 21 48 156 18 -148 -70 -122 -51 -77 83 99 79 -204
5482 -204 48 150 101 229 -27 42 -78 93 -220 35 -130 260 -294 -58 57 36 120 120 -276 -226 -196 -172 -58
5505 -58 -159 62 13 -90 -203 -103 -23 9 -53 -157 114 11 1 68 142 -6 44 23 27 8 59 187 93 -111 27
5530 27 213 87 50 134 -52 106 155 95 3 -331 25 26 55 -10 4 -73 -128 318 364 93 -203 29 73 103 -21
5555 -21 83 -43 -60 234 -40 125 108 204 -141 -32 201 72 -80 22 25 -269 -48 -26 -55 -122 -122 -59 3 -22 45
5580 45 85 50 30 -32 -51 -307 36 -37 4 166 59 74 -76 -27 74 113 39 80 56 -105 198 -95 -79 -68 -31 -19
5606a9m1K58J23j53k04O9O7N3k55n0K22j4j03K83k35qj52J54p2R3l40K91L7Pj19
5631a08J24J6j05J30k08K07m13L27j24K56j42j92K49J31L0j39j1j95J18J79j93
5652f3m0M29j75n3j31O5pN1N6k09j23J17M9Qk06M88p7q1j67rk37K30K05j47K77
5677B50k30R4m72J48K21L2m3k43K75N7o1p1k25J18K77j67QK5J17j10k11L35k98
5700a74j3J49j34K85j61L6R5J03k87K98r2o2R1L0q5n8j13J45j72L39KLm50J7K30
5725B2J42j75J49j79j19K99r9j5k3l9n3L28l60O6p5K88k62QJ97q6K37j86k32J46
5749b1P5o2j96K88o8m1p5jJ18R3j04j52J67j99K00p0J10j47QQ9N8l2N9l43J61
5774h5J0L27p6k35M0P3P7j34K6J95k32l3J10J06l38J38J98k52O0K26k80J49j37
$$ plain form
5606 -19 -60 198 321 168 -36 33 100 153 -102 -152 70 56 -47 236 1 -7 -159 -5 -77 16 -324 -33 4 11 -108
5631 -108 16 32 -73 57 -151 56 -357 -30 -154 102 -40 -232 17 148 178 39 28 -167 -49 130 -63
5652 -63 -103 326 151 98 -33 32 25 76 132 -77 -200 -83 -34 -26 -232 256 179 98 -69 -78 -315 -85 120 -27 250
5677 250 20 114 -358 -210 11 43 0 -243 32 89 28 -43 -268 -150 127 -40 -32 -7 110 0 -211 124 -174
5700 -174 -187 -38 -172 113 -48 -12 83 186 -101 197 105 43 134 164 79 21 -92 53 -119 220 222 225 -225 -208 22
5725 22 164 -11 138 -41 -160 139 40 25 2 -37 -90 238 -122 -56 -131 157 -105 -97 100 14 251 65 -167 -21
5749 -21 54 -8 -204 84 16 -25 -100 -101 17 110 6 -146 21 -178 22 -48 62 -85 -77 12 70 38 97 -246 -85
5774 -85 -75 252 176 -59 -19 54 131 -3 23 218 -14 -47 63 169 -169 -31 167 -85 -25 201 -79 70 -67
5797f7P6Po4k4m6O8L04j63j17J56k31K09J78l07Lj91K76m9j42K43j4k8o4j38K00
5822G5ll3M8j65J0j75J12J81J6J59k58N5mj71L26l16J97j47j48J46J51p2K54k96
5846e8J84k90J95j91K81j48J39j36P5j14p6J94K0k96K92j81M6O9J31q9L0J5k25
5869a33K63j06o3j59J16K32o4m3k14K90r9P5j01k09K05K43j87O4j93MK2j34K85
5892I4j58M3Q0K5j78M6N7L8j87K11J55k54j17K03j8L8Mm8J94l66K17M4m3j3NN7
5918A29k16J11o2n9J3O7P6k26N6k1n7J21K5J10K5l08j9K21l6j02K03o6j26N9J90
5943A08k4j12M6j11J13Q1k57R2K33j39R3j19O3p5k97K92J26k83J10M8R2j29kN7
5967FJ00n1k00J89oOK8J38k59K9j01J04J21j52J22j87K08MrK2k16L8J96j69j70
$$ plain form
5797 -67 9 16 -48 -72 -118 -50 254 91 -26 130 -101 108 286 -21 -18 -209 67 18 -124 119 105 77 13 -125 75
5822 75 72 39 87 -78 -68 -243 -131 50 66 225 -33 22 18 -153 173 -143 54 -93 -241 -95 56 -16 238 -58
5846 -58 126 -164 31 -160 121 -27 112 -24 51 -63 -139 55 75 -221 71 -110 -64 5 136 47 77 92 -133
5869 -133 130 24 -39 -198 -82 150 86 43 -171 119 20 95 -6 -215 -10 233 46 110 -83 -79 -57 -191 94
5892 94 -64 -21 59 84 -94 -48 9 47 -140 71 226 -28 -145 58 40 78 82 34 228 -138 79 123 80 67 72 129
5918 129 -87 24 -38 -97 -84 -17 59 -167 -111 -132 -189 -68 -43 67 92 -216 -235 -14 -50 -152 51 -15 -141 -82 108
5943 108 84 -28 18 -93 20 101 -156 -64 169 30 123 4 67 -8 -305 -13 113 -170 -60 -12 80 -49 -51 6
5967 6 106 55 -145 44 38 44 72 210 -49 -20 -121 -17 104 -48 74 -113 95 99 90 112 -104 -66 130 -39 -209
5992b09RJ52J29r5j18K31m2j16P7N2L3j17N4J51l87J32N0J95j57j08J09Ko7K42
6016B02r3o6k21K00rj40K63j05K15j35l7p0M2j59K0J58j92K23j10o3J61r3pK55
6040B39l42J27J18l72K92j53qJ36j08M4L5J06j0p3J9j63K17k54K44k34R8j83L02
6063G7p4j92J22N4K16j6j61j34J76j69L17k15K51k84J03j88K40j14N4k15K28m6
6085C0K50m93K34J00j82J09m4k01J16RJ97j96K92O4k55J25m23L91k48J32Q2Pl0
6108F6J43j68j16J28k98J24M5J35l8O1M1o0k61M81l52p2J99k2R6j50jj10K88k91
6132a32K12J84l59Q0l28M80j37oM5j25p1Q7M7l6n6M0o6K10r5O4j02NK74l29J53
6157C9j0J21P3k02k6j33J12P9o7J8k17L05P4k92j8Q4r5K78k43O3N8J67j59k7o5
$$ plain form
5992 -209 -200 -48 81 -14 -132 99 57 -59 18 70 103 -14 40 191 -196 -64 -14 181 24 -84 25 27 -40 202
6016 202 109 43 -178 22 13 -127 136 31 246 111 74 4 46 -113 -93 65 -127 96 -14 -77 84 -9 -16 239
6040 239 -103 24 142 -230 62 -91 -99 37 -71 -27 8 114 104 31 50 -113 104 -150 94 -140 -42 -225 77
6063 77 3 -189 -67 -13 203 187 26 -108 68 -101 216 1 252 -32 71 -117 123 9 63 -152 76 30
6085 30 280 -213 21 121 -61 48 4 -197 -81 -72 125 -71 221 285 30 155 -268 123 -125 7 89 96 66
6108 66 209 41 -75 53 -245 -121 -76 59 21 82 123 63 -198 283 -69 -141 58 36 132 -18 -19 -129 159 -132
6132 -132 80 264 -95 -15 -343 137 0 -6 39 -86 -157 -70 -23 -59 -115 -75 -141 69 -26 38 -64 -59 215 -114 39
6157 39 29 150 223 21 -5 -138 -26 53 -14 4 -213 92 166 -126 -144 -60 -155 123 -120 -57 1 168 9 -18 -83
6182h3j79P9K34m6P2L1p6j04K10k18Q6k9J96Rj50j92K50R9k92M8J38j51k3K04
6206A13k88K65j08J84r5j03J14k70J69m3j05J86K3J51P6l03kN7J5j41K69l51J14
6229g3m4N8J60rj43N7j35j0PK08q4m6Q0k7J85j15j54J29K3k56K72Q7j12J6l3p4
6255c3J65k61K17k03K63J4k82K13R8p9l7j53L15j55j70M7o9J09k15J70r7K67n8
6278F6J83k37K7Q3o2Q8p3P0j49Q0k33K06j13k6L8P5m1k14Q1J04Q3kj46L26l26
6303a12L11j91p2J27R2l22J24P4K11l79L7J58l1k4p4J82j28k14M29k40Q6lQj98
6327a49MJ53K32j52k14J95k10%R9J55n1k10L52l74K22K6j10J15n0K64k45j13O7
6350FJ97r7q9K7o6J4N3M8j53j17M8J53k6M2J53p3j75Q9k00M14l38M8m5k2p9J65
$$ plain form
6182 -83 -262 -183 51 5 77 108 32 -72 138 -80 6 -23 173 182 32 -160 90 189 -103 -55 83 -68 -91 113
6206 113 -175 90 -18 166 71 -32 82 -188 -19 -62 -167 19 42 193 269 -34 -36 21 36 -105 164 -187 -73
6229 -73 -117 -59 101 92 -51 6 -129 -139 -132 76 -8 -54 26 -1 184 69 -85 44 67 -189 83 170 58 74 41 -33
6255 -33 132 -129 88 -115 148 162 -120 93 191 112 75 -78 237 82 -88 -41 -110 -1 -216 -46 -143 124 66
6278 66 249 12 39 122 60 148 75 145 -4 76 -157 49 -64 -90 -52 23 -18 -232 -151 -47 36 34 -112 214 -112
6303 -112 199 8 -64 63 155 -167 -43 31 242 -137 -100 58 27 3 -71 111 -17 -231 198 -42 44 41 49 -149
6327 -149 -145 8 240 88 -126 69 -141 -141 -42 113 62 -148 204 -170 52 78 -32 83 33 297 52 -61 6
6350 6 203 106 17 44 -22 -8 45 93 -60 -177 -129 24 -2 40 193 120 -55 34 -166 248 -90 -42 -87 -109 -188 -23
6376b3M6o5k2j90J6J00K53k38K59j22J38J1r3r3j9J17M9k29J15p8J10j83J65P5
6400I9q8j26K42n3l9n5j11K43j12J96j40k91M81l56O9L6m7Q6J4j07J33m0r7L9
6424b4j87N6K85p9p4J59k10K68j69O1j28p1K56k74J66n5k10K88O9L3k43m6J07
6447b2n1Q0p3J80n2L2K6k23J38k34K6M17l38J43l25M38j21J94k10J28k4n0J12
6470A91j00J83o20L19k1Q8j34N6J11k46J98O9J76k08Q7k17J68K0k16q0Q8J47J47
6493B06k95k30K32J03j29J05j02J50R7rk06p9K25J3jj98M00l86J44j64L30n47
6515c41L79N2L4J82l49k06K43Ok84J75J00J62k7k46L51m4r8m1J34m23M22j72j53
6538a44O0J54j33R1n2K2m7J20j23R7J9j63K01k98L34l01L10o0k18LMJ32O5m8L3
$$ plain form
6376 -23 23 -42 -64 -254 -238 -138 115 -123 136 14 152 163 70 -23 -42 75 124 -105 10 -68 42 -141 24 99
6400 99 11 -115 127 74 35 -20 -131 112 0 196 56 -235 246 -110 -41 -5 -52 34 48 -59 74 34 -63 -24
6424 -24 -211 -155 130 51 -23 136 -74 194 25 86 -42 -113 143 -131 35 -20 -230 58 127 160 -83 -129 -22
6447 -22 -73 7 -66 114 62 94 120 -103 35 -199 -173 244 -94 49 -276 162 41 235 25 153 129 79 191
6470 191 91 274 -346 -27 -48 40 -94 -38 73 -173 25 94 270 62 149 -68 100 120 -96 -176 -88 59 206
6493 206 -89 -319 -87 16 -113 -8 -110 40 137 128 -78 -157 68 81 80 -118 282 -104 40 -124 206 -341
6515 -341 38 90 124 306 -43 -249 -6 0 -284 -109 -9 153 126 -120 231 187 89 48 182 -241 181 9 -144
6538 -144 -84 70 -63 28 -24 -2 -49 71 -52 45 64 -99 102 -196 138 -163 147 87 -131 -128 -124 8 73 25 58
6563E8K3j96O6K6nJ13l42L27m3k5R3p4M2m6k1J48J2n8k51j10K52J37j47Q8%K8
6589I5J9kk16J87k4j82j46K38J46Rj93j1P7P2j54K09q3p4n2J69j9j73K58l02J42
6614a0q6J44Rj40j12Q8J61j86L24l29l6MmL26j31j24R4K2l6J28k40J16M4l4J40
6639A32l47J4K87k16K33j11K39j68j97J65Q3J58k15o3L9j86M68m47j18J59j04
6660a95K84j71J37J04m2k42J89J7l51J40J79k5J51l6j60K61l63J59j27M4m5J22
6682C0k14J37O6k5M5q4j23N23l90j09K09J28p9m13L25K1k3j48J60j66J50l9m7
6705f6J11j16J4N4J67j98KK42m41J05J42J56k54q8J54K38k30K3l7Q5j90K54j00
6728B7k34K49Q3rj29j76Jr1M64j78J14l7N2l1j69Np9L63l77J7M8j10K90j96K16
$$ plain form
6563 58 81 -115 -49 -23 -28 85 -257 70 27 2 95 21 63 17 -4 144 156 98 -153 -263 -11 126 -21 67 67 95
6589 95 114 112 -104 83 59 -123 -269 -31 115 124 -69 -80 -3 69 -85 124 41 -33 -85 84 65 -108 150 -152 -10
6614 -10 -96 48 57 -83 -195 -107 54 -132 192 -137 -173 -169 -173 153 22 -102 -8 14 -22 106 -134 -18 26 -8 132
6639 132 -215 -201 86 -130 103 -8 231 63 -134 31 114 272 57 -6 33 -153 315 -132 -250 -91 -195
6660 -195 89 -82 55 159 117 -125 64 81 -270 -130 49 24 175 139 -21 240 -123 36 -91 -47 -92 30
6682 30 -184 -47 19 -6 39 -45 -168 355 -35 -144 65 193 114 -299 26 47 24 -124 36 -130 20 -19 -66
6705 -66 45 -71 -57 -3 164 -34 -32 210 -231 -126 16 172 -82 -170 -16 222 -8 15 -22 63 -127 127 27
6728 27 -207 42 125 116 -13 -189 -188 -279 185 7 121 84 136 105 -64 -59 -138 225 -152 -135 -87 -197 93 -103 113
6753A13j73K5r1J64Pj32J39j0J74j14rj09mJ62Q3l82J46J14j57K20l06K40l4q3
6777a7rk46L18k3k26J27M59m66K17k01J05m7Q8m3N5j46n8J34j82J65k46K86M5
6800H9j98r7J84J27n4k3K59l92K55k98K4K27q1mR7jj19p1J82j03M9j02P9k47L15
6825I7q7J83k31K2K20j24K01k63N6k26J30k5O0J49o0K4L9j45K29j97j38O1o6m6
6849a37L32j39L8n9q7l1m6J85n6j36o2RL6q2J50J86j08L2Q5k09J12rj14M0J54
6874H4k61K87J57l83J04K16l82J7L61k98N1K30l92%K2K05N7k51K76j94jJ18r3
6897g0K1J67j60K59q1j51k19J68K00ll0k4j04N2j68K13o6J02l2j3J07j59k4k7
6921d2KJ37j80R3OJ24j10j73J96j6p6M7P8j6r6NL00j13k01J68k17K76j44j21J00
$$ plain form
6753 113 -60 -35 -126 38 45 -87 52 42 216 102 93 -16 -20 142 225 -157 -11 103 -54 166 -140 100 66 -17
6777 -17 -26 -272 46 23 -203 -76 383 -83 134 -67 38 -9 79 36 91 -55 -113 21 -161 4 -242 44 89
6800 89 -109 -206 -22 105 51 28 287 -105 150 -148 -124 103 22 18 115 114 -5 -76 106 3 52 -50 29 -218 97
6825 97 10 193 -38 -16 204 80 281 18 74 -152 -22 -47 13 162 102 126 165 20 249 52 -86 -25 -91 -137
6849 -137 195 56 94 35 -52 -83 -129 56 0 -136 -198 -189 -153 -235 -85 101 -7 25 110 -99 13 4 -110 -70 84
6874 84 -177 110 267 -116 -12 204 -178 -161 200 -98 -47 183 -209 -209 -187 18 75 -176 100 -94 -95 23 -70
6897 -70 -49 118 -42 217 136 -15 -234 -66 134 131 101 77 -27 25 -143 70 4 106 74 61 168 9 -15 -42
6921 -42 -40 97 -83 10 16 140 30 -143 53 37 -39 8 86 70 -26 -21 279 166 -35 133 -84 192 48 -73 27
6946B7J9NM2j58k1J08j09K0j50J15K17q1q9p3L40l09K07n8o7Q6j64J88j29K35
6970B01l88J91Q8l1n5m9K12J4j85J91k71J15L5J52j34n2O2Kj29n7n3J32J09p4
6994B6J81J54l97O3J31j47J8j24K34p6O2k94L55k45J04l7p3n3M0j71J42J63k02
7017a46J74j59O6J70r1p2J95MJ68k33j89O4m5J68p9pk22J28L7j35K80J80q3j39
7041C4L4k13P1J39l2Pl23K78J92l26J66J92j33j26KL50m00K31k91K13n0m4k11
7064b40J78P5j2O5J4J39k73p3O4J20J79k21m4M0qJ58k37L04l33P9N4j14%K21k4
7089A11l9j08J72J3Ml01J62j8m3N7j15K87Q6r2m7l97K81j63L34J7k91J18j7J38
7113A49l4j60K76k81K74l02J43k0M4r1n8K5j83J67J89l14K69O4m11L64J38j26
$$ plain form
6946 27 46 51 93 -65 -86 22 -87 -67 -217 -102 115 34 -55 -128 212 -97 110 52 -15 71 -93 95 -34 201
6970 201 -187 4 92 61 6 -43 169 183 -2 189 -82 33 68 220 86 34 96 98 -31 -88 -141 -9 100 26
6994 26 207 361 -36 27 158 11 29 -95 139 63 125 -169 186 -59 45 8 -65 -118 -78 -249 -107 56 -146
7017 -146 28 -131 -65 105 14 -58 137 141 309 76 -113 -49 -94 74 -5 -12 -234 -106 -69 -204 76 256 173 34
7041 34 68 -145 -74 65 33 40 -283 -5 187 -139 27 219 86 -40 -38 312 -88 143 -148 65 15 -29 -240
7064 -240 -62 13 1 66 80 219 -54 -127 -63 57 236 15 -29 11 3 161 -76 228 -105 -26 28 -86 -86 135 111
7089 111 72 -36 136 149 153 -148 14 -4 -47 10 -105 182 268 176 129 -268 13 -150 184 201 -90 28 11 149
7113 149 115 -45 231 -50 224 -78 65 45 89 -2 -60 -35 -218 -51 138 -176 93 157 -254 110 248 122
7135A22j99J11K88j67l49O2J94J01Rk15Q3r9L04l77K21k50j3L00J8p7J8j16j0
7158d1n7j4J09m7K11j73m7J24M9J8k31J94r3k71L5L94j04P9m10l2L51j31J73J37
7182B23k12p5q2j48R6L53j42j33J78qL1k01J22J83k29O4q5kJ38j22j17K04r6K82
7206B22p7k19k5J69k19J6N6r3K81J1n1j4P2l04K58J0j82k5K31j99J26j71m8J20
7230e5J37j07K94j08l78K11J41l0j80J04p2J20j19JNQ3q5M2k0l6J25q4N2p6J25
7255I0j6p7j15J9j71N26j54M4j70K3N6J2J01q4J72k24N8k3k54L49k53P2K32k54
7279d1J74l9k55L06j07J48k12R6J97j29j55Q9J68k02j17K39j98J94l62K44p8L23
7301B83j71k9j35J24q2r7K73k80%mK00j54J93k62Pj67L86j20j1J09m9k71M59k45
$$ plain form
7135 122 -77 34 322 155 -194 -132 62 163 172 -43 40 -59 245 -132 89 -161 -174 126 144 67 85 -31 -41
7158 -41 -98 -112 -3 -50 161 -12 -59 65 114 132 -99 95 2 -269 -234 160 56 135 -275 -307 44 -87 86 223
7182 223 11 -64 -146 -294 -198 155 13 -120 58 50 81 -120 2 185 -44 20 -65 -67 71 -51 -168 36 -60 222
7206 222 145 -74 -99 70 -149 -133 -77 -170 111 122 71 57 129 -175 83 93 -89 -114 117 -82 44 -127 -175 -55
7230 -55 82 -25 269 161 -217 -6 135 105 -75 29 -43 77 -42 -41 -36 47 -38 4 -16 -52 73 -11 41 -35 90
7255 90 74 -3 -118 -99 -270 256 102 146 -24 -1 55 67 168 84 256 32 90 67 -187 162 -91 -19 213 -41
7279 -41 133 94 -161 145 38 186 -26 70 267 138 -17 72 240 38 -79 160 -38 156 -206 38 -40 283
7301 283 112 83 -52 72 -10 -107 166 -114 -114 -118 82 -72 121 -141 -134 -301 85 -35 -46 63 14 -257 202 -43
7325d3J67k48O6q0J30J03R5k95j41K78N2k19K32J10l47K09j92K50j43J9o3O3J88
7348A91l79L41j77j05K24M1k14K33l48J75k21J13K43m63M08J88j03j76p4J36o1
7369b8R4j82J84o5j39K22n1J72m0j18o5J13M3j4R9j55rr8O5M7j8j31J23J13n8
7394A04j35k9m3R3n7M12k27k20N1k9J86k03P6J77p6k35K88K5j05J29k19n3p8P9
7418h9j04Q4K5K37r5K28l97L82k23J4n5l8R0n7j16J05l1j68K74L91k83k36O3L9
7442D0o7J67j50J3j20O1J66j38K86k45r2J85j21j6P2J14j84J79j47N7J2k0J51
7465B03m26K02n0K63o4l59J39k8J30L3k60L82j94R4r4k33L49j93J22j14R5L4p2
7488d1J67j23j1K58l01p6J09J77k9k35J6J54l1j63K89k3n1j77j57K67k12J11Q0
$$ plain form
7325 -43 124 -124 -58 -138 -8 95 190 -105 -246 32 84 -135 97 207 -140 69 -123 127 -16 3 -60 3 191
7348 191 -188 153 -24 -129 95 136 -78 155 -193 -18 -239 -126 117 -346 62 250 147 -29 -103 33 -28
7369 -28 66 -116 68 3 -136 86 35 207 167 49 -16 97 140 126 225 70 61 -37 28 75 57 -74 49 162 104
7394 104 -31 -60 -103 -10 -67 345 118 -102 -51 -80 106 -97 -21 156 80 -155 133 158 53 182 -37 -90 -168 -89
7418 -89 -193 -109 -84 153 58 286 -111 271 48 62 7 -31 59 2 -114 -9 -40 -208 66 457 174 -62 1 40
7442 40 -27 140 -10 3 -117 -56 110 -28 258 13 -79 106 -15 -31 41 155 -29 150 3 60 72 52 203
7465 203 -223 -21 -71 192 128 -231 -92 -120 10 43 -217 165 -29 65 -29 -262 87 -106 16 -98 -3 31 -41
7488 -41 126 3 -8 250 -51 -127 -18 159 130 -105 -89 65 34 -129 160 137 86 -91 -248 19 -193 -82 -2
7511bK59n10L22j2M3j62j4j45J67K74j71J8k04k6K68p4k60J71J67j14J11o6lj34
7535i7J15n2O0P1M7j77j92N1K9P6J16j31K12k2Jr1P6k5o5Q0O1m21M49j78R2j70
7561h5L7K38l12Q1J19j57J66m8p7j23K26j00pK15k17K03j33p0q6K59o7lJ21k68
7585h8K9K36k78P9m0P5J02O6l05J53j5P8r8J61o5l16K46n8P4k5K2r5p6K44N1k22
7611f5KJ13J37m42L0K82j73M4J7L8n4K18q0r4k0K21j43o9J16K8k75J83r5q0M3
7636a18k0J31j69J29J51j36m2J54k8j13o3k0J60j38J97j95J08N1j38J55l17K42
7658a9k41M95j82lr7J89M3j3l57J23K44K6l01J42p2P9j74K76k29R6r9p8Q3qj64
7683b41K85j81k1J11J69Kj56ON2j0j46J15J32l12K32J4J8l3L1J06j65q3M9Q2J75
$$ plain form
7511 -2 257 -253 69 57 100 -62 -76 -221 -54 220 49 67 -137 -163 105 31 -229 -58 109 -5 106 40 37 -97
7535 -97 18 -34 26 97 144 -33 -225 -174 -145 -69 47 -84 128 106 107 16 92 67 2 82 143 -278 171 -7 85 -85
7561 -85 -48 190 -122 -41 78 -79 87 39 -38 -161 65 -35 -42 173 -44 159 26 -44 -130 129 62 59 180 -88
7585 -88 -59 177 -101 -22 -62 13 115 181 -124 29 14 92 -6 155 90 -226 20 -38 36 11 33 -62 -138 106 157 -65
7611 -65 -63 50 187 -255 -225 57 -116 -72 -55 -17 -71 147 67 -27 -47 174 31 -38 78 106 -169 14 -81 -161 -118
7636 -118 -138 -7 -176 -47 104 -32 -74 80 52 -61 -124 -144 16 -122 75 -120 -12 39 -99 56 -261 -19
7658 -19 -260 235 53 50 -47 142 185 172 -185 -62 182 208 -93 49 -23 56 -118 158 -71 25 -74 -152 -69 -77 -241
7683 -241 44 -137 -158 -47 122 124 -32 -26 26 16 -130 -15 117 -195 37 51 69 36 67 173 8 -75 -26 56 231
7708B31j48k97L42k38J17j1P9P8m1l3r5R9o1j4J22L0j93K53k70P6k92M17k37p8
7732a64L67j98j4j64L16l03r1J52pn2L81j30J45m26j9J25J51k81J87j53J19MJ82
7755A27j63J20k4q2k08K99j13J80j15j36J43O9o3p5K70l14J92k7l12K52Rm6K25
7778B08k82J72J9j61J57j3k23J84k59K98K3r6k92J23J86k04L3K37j3l54L11j75
7800a21J31J9mo4J30p5N4K90k85j77k5Q3J90N5O8k15J5m60M67l6m2m2j77k3K37
7825gm8l02L87j3l6J26o7J38k04o4o8K92j72o9J60j28m8K69k64K50k03j44K55
7848D0O5j77M3J60m53L47J0R9j62l9q8K65l7j87J48M8k32R9J72k31k6P3J91k6
7872A02j81J23J27p3m4k29K66j71K7J46p7K4ml7L3K9Q0k5j27K3j89J84M4n6J63
$$ plain form
7708 231 83 -214 128 -110 7 -4 75 153 112 79 -16 83 22 8 130 160 -33 220 -50 26 -266 151 -86 -164
7732 -164 203 5 -9 -173 143 -160 -251 -99 -106 -158 223 93 238 -188 -207 -82 69 -212 -25 -178 -59 -55 127
7755 127 -36 84 60 -22 -230 69 -44 136 21 -115 28 97 34 -41 229 -85 107 80 -232 20 29 -17 208
7778 208 -74 98 117 -44 113 100 -123 61 -198 100 123 27 -265 -142 44 -160 -127 110 97 -257 54 -121
7800 -121 10 29 25 -39 91 16 70 360 75 -102 -127 -44 146 201 269 54 69 -391 76 40 -2 -44 -221 -244 -7
7825 -7 -55 -357 30 17 -19 107 40 178 -26 -90 -158 134 -38 -107 53 -75 -123 146 -118 132 -71 -215 40
7848 40 105 -72 -29 131 -322 25 35 134 -28 -67 -155 110 73 -114 34 82 -150 -51 121 -110 -136 -63 128 102
7872 102 -79 44 171 98 54 -175 91 -80 -53 93 16 40 36 -1 32 61 141 116 -11 12 -177 7 51 -5 158
7897A58l7N1r0j27mM4J36j23j49K13j69m9K04K35l77l6P6J96k57P4K06l26L55
7920B04j68j26j42K46K1p7k73K38K17n9J9j60J53m9p6KJ40j92R1j5O3N8j30P9
7944F4Jok9j59J01J07n3j71K98k27j12K5K50p3j03O0Q3J09O8k51R1j73M00j49
7968A51j58J80r1N7j60m8L5K69l09N7J11j27r9J64o2m0Q3k39O3M13j18k69L97
7991B60j58k1k55K7L80k76P8R6l59K27M5k01J21j01n7L04k31M60l59R5j98J28
8013EL8n4J0j26J72M7l8J11K1l34L60j49j3j63J16R9l89L21M3k82R1K17q4rJ22
8038A32L7r7k69J35J45k19m0L50j49NM2j03pJ25j40N5K86l09rJ48r7K2J18j93
8062c2K20k89M28m44O7k62K15K20J5N0l45j12M18j09Q7Pk12J41k51K31j22N9J9
$$ plain form
7897 158 121 172 82 -45 -49 -5 131 8 -141 72 -97 -146 58 293 -84 -120 -44 152 -105 -31 175 -151 204
7920 204 36 -90 -232 14 35 -42 -315 -77 140 81 100 -60 93 44 -32 -30 110 -82 9 -6 57 115 -15 64
7944 64 65 59 30 -129 -28 79 26 -145 153 -74 -186 -161 89 16 -87 -27 56 165 233 -18 73 -100 300 151
7968 151 -7 173 82 139 -21 -69 -34 235 -74 -17 94 -33 -132 32 -30 -70 13 -226 -163 250 132 -137 260
7991 260 102 81 -174 -147 233 -43 35 131 -228 -1 44 -157 -36 -137 -194 110 -121 339 -20 75 -123 5
8013 5 43 -11 -1 -127 45 92 54 165 186 -148 212 63 50 -113 3 102 -287 34 77 -205 -114 103 19 10 132
8038 132 169 72 -197 -62 83 -136 -176 174 25 30 72 -31 -38 87 -53 2 288 -21 -30 118 21 43 161 -32
8062 -32 188 -101 327 -117 -50 -312 -97 123 138 188 -157 -269 149 40 127 134 -78 63 -188 43 -79 -20 -1
8085aK08l4j50J6Rn4k73K01q6L20p1J0n77M91N1L0k53J25N9m39M01J09l5k03K61
8110A15j29J86j41k61L94l41K46n1k3O8J35j13o0m4J50k71J19NK13j20Mp2q9J86
8134A06K56m70J20J17j88p8N5p1K03k80J87j4J67Kk07j79J95OJ81l95L01J16k58
8157a28K90j59j30J10J46q1M4r6R5p1j2J5L1O6k13J42q5J3Q6O9rj94M7r3J43N7
8183H3j01j9o3J13Pn2j29K86
$$ plain form
8085 -1 207 173 23 39 48 -6 -279 -78 -164 156 85 95 -482 9 60 90 -163 -38 21 -418 -17 92 57 -146 115
8110 115 -14 172 31 -230 164 -177 69 18 -5 63 198 85 25 -19 131 -140 -21 -16 197 77 81 9 -80 106
8134 106 362 -108 12 129 -59 -137 -82 -153 50 -230 -43 -57 110 112 -95 -274 -79 -73 108 -287 14 130 -128
8157 -128 162 3 -127 -17 129 48 92 -4 91 20 8 23 54 120 -93 49 -36 -23 63 132 123 -71 -24 -117 26 83
8183 83 -18 -37 -100 13 20 -32 -161 125
8191A25
$$ Imaginary data points
##PAGE= N=2
##DATA TABLE= (X++(I..I)), XYDATA
0@%%%%%%%%%%%Qj6J6j6J6k4L2m0M8n6P2q8J04j20J38j62J91k21K54k90L30l78
33b02M29m85N49o18O94p77Q68r68J077j195J327j470J623j794J981k184K407k651
51a389K920l216L545l913M323m785N310n914O618p445Q435r651J1181j3177J5906
66H748j9892K6356l9206J11059k14570O9818K46528k46137Q043R3765K4784j07397
78c8101k048J55280r8949j30168J10941n484n245m2708L2172Q1787j38040O9536
90a1027J07127k05285P0238P9776j12701Q7578K0864o2472L2732J9049L4929q7620
102b6812q869J03691r5861R003R7470o2055l2770J2332P5369m1885j39285J47863
114C8191J4207j62171J50542K3339j35974N6601L9632j6425n4079j270P0509n4860
$$ plain form
0 0 0 0 0 0 0 0 0 0 0 0 0 8 -8 8 -8 8 -16 16 -24 24 -32 40 -48 56 -64 74 -88 103 -118 136 -154 176 -202
33 -202 227 -258 291 -327 367 -410 458 -510 567 -628 699 -771 852 -942 1039 -1145 1262 -1389
51 -1389 1531 -1685 1860 -2053 2270 -2515 2795 -3119 3499 -3946 4489 -5162 6019 -7158 8748
66 8748 -11144 15212 -23994 87065 -127505 -57687 188841 -57296 -49253 44512 69296 -38101
78 -38101 -40149 115131 16182 -113986 -3045 -8529 -13774 -56482 -24310 57477 -80563 -11027
90 -11027 96100 -109185 -38947 40829 -71872 15706 36570 -25902 6830 25879 60808 -26812
102 -26812 -35681 68010 -27851 -18848 78622 16567 -16203 -3871 71498 29613 -109672 38191
114 38191 52398 -109773 40769 64108 -71866 -15265 24367 7942 -46137 -47407 23102 -31758
126c1758P238O1616n2186n599P974L0504r27r1824R1625K2539j07966J19531J190
139E1957j21339Q2974L1615o0806q219K8703J7179n1206M0865M2970r2164J8309
151a9162M2674k7803j353k6185L7052R264n4002P2021j3848q0803P0215P354m1938
164b6514J7574j297Q963r363J5052J5396n5335K0685K7833l1671J4631n560k080
177a1686J4345j4246L1354k7208l8487O4360j8219l0668M2862j8625j3808K6981
189F955O964j8516k1748K7326O599k4478K7801q656j8943K8843k930j994j3679
202f456j1164L4306j5014j1655L1194k5548j0036L5188p686k4720k231K1734m407
215C505j4618K5101j2663j9923K8249L7j4217l818k259J6395l795n676J3119j8166
$$ plain form
126 -31758 -24520 37096 -15090 -20689 -12715 17789 16862 -74962 16663 39202 -68764 50767 51957
139 51957 -69382 13592 45207 -15599 -23818 4885 22064 -29142 11723 54693 -37471 -19162
151 -19162 23512 -4291 -5644 -31829 5223 14487 -39515 32506 18658 -62145 8070 15424 -26514
164 -26514 -8940 -10237 -1274 -10637 4415 19811 -35524 -14839 12994 -18677 -4046 -9606 -11686
177 -11686 2659 -11587 19767 -7441 -45928 18432 213 -30455 12407 -6218 -20026 6955
189 6955 13919 -4597 -26345 981 7580 -16898 10903 2247 -16696 12147 9217 7223 -6456
202 -6456 -17620 16686 1672 -9983 21211 -4337 -14373 20815 13129 -11591 -13822 7912 3505
215 3505 -11113 13988 1325 -18598 9651 9688 -4529 -8347 -10606 5789 1994 -3682 9437 -8729
229h729K243K2098j5525p818N944N28J781P632J757j9061L125K3450j6046r955
243h576J4695j0350p05J4092k18j1252j0708J6702R020k1936J134J2923j1698
256f877J109J8165q630k1085J2429J7840j7763m811J3846r379p37J6194l900j5035
270h634K073J2564o49r414M228K735q029J0285J0144j7305q628J7714K115j3872
284d673Q048L479j4185Q140J6515j5431j3122J3288N252q786J346N629r094k377
298e971J5196J98j8554O08J5965o573o559J0760m562j1605J4317Q949j8393l810
312a0034J3366k119n521P600j353j1086O759J2632q936j2107Q981N162p339M128
326A33M933j1346l671J7964j628j7756O222Q803q305J980Q548r637p465J2283
$$ plain form
229 -8729 -6486 15612 87 -7731 -1787 -1259 522 8154 9911 -9150 -6025 17425 1379 -8576
243 -8576 6119 -4231 -4936 9156 8938 -2314 -13022 3680 12700 -9236 -8102 4821 -6877
256 -6877 -5768 12397 3767 -17318 -4889 12951 -4812 -9623 4223 -5156 -5893 10301 6401 -8634
270 -8634 -6561 6003 5354 -4060 168 2903 -5126 5159 15303 -2002 -10630 7084 9199 -4673
284 -4673 3375 6854 -7331 809 17324 1893 -11229 2059 7311 -1475 -129 5500 -3594 -5971
298 -5971 9225 9423 -9131 -8523 7442 869 -5690 5070 508 -11097 3220 12169 -6224 -10034
312 -10034 3332 1213 -4308 3292 1939 -9147 -2388 10244 1308 -10799 -1818 3344 -3995 133
326 133 5066 -6280 -9951 8013 6385 -11371 -5149 3654 -4651 -2671 5877 -3760 -11225 1058
340A058P388j3678l922J1022l194k518Q706k979j0609N559J1860o964r286Q882
354A325J400p583J0738J670j4653L586J1484k339j0070M097N723r375N240J0661
368A1904j3975o629J3926L045j0041k748R633m922o484J6352n009j6427J0680
381f95Q369o811m696L878K663p660P190P570j7292J161J2602m707l379K50K673
396A116l265j529J4234j0243j3465J8323L23r851N481N3k216k679R271L300j9440
411a0587Q647J1956j2189L580J992m906K723L5O936p786q865J6476m958m931Q661
426F784r291O00N295N81p5j1926R421P353j6319J1941K291j6170R537O935k142
441D815j0862O89J8421j5124l898K0291j6184m927J5761j928l946q984R783Q271
$$ plain form
340 1058 8446 -5232 -9154 1868 -1326 -3844 4862 1883 -8726 -3167 8693 1729 -7557 1325
354 1325 2725 -4858 5880 7550 -7103 -3517 7967 5628 -4442 -345 5378 -3997 1243 11904
368 11904 -2071 -8700 5226 8271 -1770 -4518 5115 193 -6291 10061 5052 -11375 -695
381 -695 7674 863 -3833 45 2708 -4952 2238 9808 -7484 -6323 6279 1572 -1807 -1557 1116
396 1116 -2149 -3678 10556 313 -13152 5171 5494 -4357 1124 1177 -1039 -3718 5553 8853 -10587
411 -10587 -1940 10016 -2173 1407 3399 -1507 1216 1251 8187 401 -8464 8012 3054 -1877 6784
426 6784 -2507 -1907 3388 3969 3894 -8032 1389 8742 -7577 4364 6655 -9515 22 6957 4815
441 4815 -6047 -5358 13063 -2061 -5959 14332 -1852 -6779 8982 7054 3108 -5876 3907 12178
455A2178j7266R983L452j3320Q758Q52M96l888r856J6897m224j1101J3883j1340
469d496j565J1582q125J227m089J682O692j0659J0167l158j4038K0872l418j1905
483i231J1105n599L961Q32l201R558j4169M552J3399j3641M390p32l181J1258
497I301j1311M078M390j5130J4274N18j0952P914p236M794K316p531P899j1287
511g963L446J3428j8351O428O419j3401J1090l69l238N55o714J5246m850j0488
525h762J4244p617LP925q610P454p033k112J6848j4106k308Q320n894O138o140
540a650J226M931j4292J2459L322j4953R731m318JQ050j2759O319R79o420R939
555B565o323M19J445o212J3648o987p646J3471r050L077O564j0631O640k451k94
$$ plain form
455 12178 -5088 4895 8347 -4973 3785 4637 5133 1245 -8611 8286 4062 -7039 6844 -4496
469 -4496 -6061 5521 -2604 -1377 -5466 -3784 2908 -7751 2416 -742 -14780 6092 2674 -9231
483 -9231 1874 -3725 236 1068 -2133 7425 -6744 -2192 11207 -2434 1956 1224 -1957 9301
497 9301 -2010 2068 6458 -8672 5602 6120 -4832 3082 -4154 640 2956 -4575 3324 -7963
511 -7963 -4517 8911 -9440 -3012 3407 -9994 1096 727 -2511 -1956 -8670 6576 1726 -8762
525 -8762 5482 -2135 -2132 5793 -2817 4637 -2396 -4508 12340 -1766 -4074 4246 -1648 4490 -1650
540 -1650 -424 4507 -9785 2674 5996 -8957 774 -3544 -3543 4507 -8252 -1933 -954 -7374 2565
555 2565 -3758 -3339 -1894 -8106 5542 -1445 -9091 4380 -4670 -1593 4971 -5660 980 -1471 -1765
570a765Q101j0316L746J382m278R824q091j760P432q676P854l21q743Q891n714
585b434K360N370j0333N215l52j706O971r015K853L865p421R808m454o166Q896
600C457n059L232Q37n649N655m532L550M701j2413O343L895p612O909l258j968
615a912K233k957Q129n675o333J0136l712j406K984l609K713l565L232O275j2795
630f262M061P473p691L502o12j607J371j710N655l670n707Q404k350k055L899
645B701m762J890M1J028K333p711L978M264o642M781k03n410M117J185Q77l455
661i88k083O981l960j006N394n392m55L519R08j128m725M466K364n929M517K34
677B717o043M482J880j739k196p2L707k927j86L368n082k31M831j456k158q49
$$ plain form
570 -1765 6336 -3980 -234 1148 -3130 6694 -1397 -3157 4275 -4401 3453 3132 -5611 3280 -2434
585 -2434 -74 5296 -5037 178 -174 -1880 5091 -3924 -1071 2794 -4627 5181 727 -5439 3457
600 3457 -1602 1630 2467 -3182 2473 -2059 1491 6192 -6221 122 4017 -3595 3314 56 -1912
615 -1912 321 -2636 5493 -182 -6515 3621 -91 -1497 1487 -2122 591 -2974 258 6533 -6262
630 -6262 -2201 5272 -2419 1083 471 -1136 235 -1475 4180 510 -5197 3207 857 -1198 2701
645 2701 -2061 -171 -130 898 3231 -4480 -502 3762 -2880 1901 1698 -3712 405 1590 2467 -988
661 -988 -3071 3910 -50 -1056 4338 -1054 -1509 2010 2918 1790 -2935 1531 3895 -2034 2483 2717
677 2717 -3326 1156 3036 1297 -899 -971 2736 -191 -377 2991 -2091 -2322 2509 1053 -1105 -1954
693a954K088K30k499L829j626m731N360J744m225J71J542j69q95J792J490n383
709c236J780M554l183j622J783M78j123L62K621l105k509N117N70m308J421J464
725A064j841N78K081j470l404L114K805l230q88J627q19k14K009N1l096J53L989
742B509j390k344K225q72j258K319R53l152o33L175M1k239J139L05k139J564K017
759B220k098k331K294J780k091j53J161j784l22L510q97l565J286K256j052j212
775i98J416j294j100L034N90l092p68K896j53j352J137j60j814J203K656k255
791e4j845K133N97j269M09R08k420N77K653k65l275J772R39j058M18J060j673
808c93j073K943P05l038J43J833q49l11J509o73k351J824K352k257j773K242j45
$$ plain form
693 -1954 134 364 -2135 1694 68 -4663 697 2441 -1784 -1613 -71 -240 -1135 657 2147 -3236
709 -3236 -1456 3098 -85 -1707 76 554 -569 -207 2414 -691 -3200 1917 2487 -1821 -400 1064
725 1064 -777 -199 1882 412 -2992 122 2927 -303 -1191 436 -383 -597 1412 1463 -1633 -1480 2509
742 2509 1119 -1225 1000 128 -1130 1189 2142 -1010 -1643 1532 1573 -666 473 778 -1361 203 2220
759 2220 122 -2209 85 1865 -226 -379 782 -1002 -1324 2186 1289 -2276 -990 1266 214 -998
775 -998 418 -876 -1976 1058 1648 -1444 -2212 684 531 -821 316 156 -1658 -455 2201 -54
791 -54 -1899 234 831 -438 -29 879 -1541 -964 1689 1424 -1851 -79 860 -198 220 1280 -393
808 -393 -1466 1477 2182 -856 -713 1120 271 -40 1469 796 -1555 269 2621 364 -1409 833 688
825F88j083J814n30k089J87K736k20k633P33J226j646J554K90k196L02J197R03
842A233j334q86J653j178M00K033k414j272K005Q12j143r13J173N9j648K838o07
859H11l364K055J153o21m43m12N92j059J369J586l647K54K386j040N74o60m8K06
877c08l54K626j776k002K940k53j204J743j515J00l52J695Q61m124J714K493k882
894e98J231L41j834M75O57J316k181j446L550k001j79J985l296R43J629j099P80
911B73j561P24R97j671K308r62j879K880n82L1m71j118K789k674M18L334m641
928a805N27L833k781k00j69P15nj831L471j831l737N228j286k070J889j426J204
945b74k22j30J853m109J895L048l820J675J66r78K005j381J401q47k567N076j700
$$ plain form
825 688 -395 1419 889 -1200 -1013 1723 1503 -1130 -397 829 -817 737 1027 -1169 -867 330 1233
842 1233 -101 -987 666 -512 -112 1921 -493 -1765 240 1052 -91 -1004 169 228 -1420 1418 811
859 811 -2553 -498 655 34 -409 -821 -229 -1288 81 1667 -1980 -1726 660 -380 194 -466 -514 -308
877 -308 -662 1964 188 -1814 1126 873 -331 1412 -103 -3 -355 1340 2201 -1923 -209 2284 -598
894 -598 633 974 -860 -385 272 1588 -593 -2039 1511 -490 -669 1316 -1980 -1037 592 -507 273
911 273 -1288 -564 433 -1238 1070 108 -1771 1109 527 558 87 -1031 1758 -916 -498 2836 -1805
928 -1805 -1278 2555 -226 -426 -595 120 115 -1716 1755 -76 -3813 1415 129 -1941 -52 -1478 -274
945 -274 -496 -626 1227 -2882 -987 2061 -1759 -84 82 -896 1109 -272 1129 282 -2285 2791 1091
962A091k505L416j819m52R68K63Q70m248L035K558n589K918J413m481K924N51
978I13r75q44o09L280k457q88L679l888P75K905k612R10j400J395J939m357L291
995A057M94m548M279N92k523K52j7K369k691m24M007m792L31M764l676p29J020
1012b35L84O28k957L233m44m012N203q12l531K569j03K71j61m82J960l291J267
1029e13L584m382P66J613j173R87j150J272m74k877N077j198l950L821o02j556
1045g55J504n39K94k099J842K459m679J400K063l045J943o2m69j22j005L285j732
1062B83k471L996j675j260K611j166o40k66J262J136l649J799J518l151K093P55
1078A175k277Q20k48J861j431j624L149k043o10K883j904j142J160M78K54k012
$$ plain form
962 1091 -1414 2002 183 -269 699 962 1832 -2416 619 3177 -2412 506 1919 -2562 362 913
978 913 -62 -906 -1515 1765 -692 -1580 2099 -1789 -1014 1891 -721 189 -1211 184 2123 -2234 1057
995 1057 1551 -2997 1282 1874 -649 -397 -414 1955 -736 -1160 2847 -1945 -1614 3150 -526 -1255 -235
1012 -235 149 777 -2180 1053 609 -3403 1800 988 -2543 26 -77 194 33 -449 1511 -1780 -513
1029 -513 3071 -1311 -545 1068 -105 882 -268 1004 530 -2347 2730 1532 -2418 1403 801 -755
1045 -755 749 210 504 -1595 247 2706 -1973 -573 1490 -1555 388 326 -143 -265 -1270 2015 283
1062 283 -2188 1808 133 -1127 1484 318 -322 -588 674 1810 -1839 -40 1478 -1673 420 1175
1078 1175 -1102 -282 -530 1331 -100 -1724 1425 -618 -1228 1655 -249 -1391 -231 247 501 -1511
1094a511J466O52k445K722K45k505J637N4K41n34q02J734j196l58K457k230o05
1111i78K133q61j81j91K48R7j124K135n39k284K094j0p47O45p74M57o20M05J326
1130A231k026Q6J553p87j68L09k54l21K13J274q22j688K215l75j086J219m05o03
1148d35N53J77L25j548N77P20o84N37K73j023J0P64J37m53q81J386n34k95Q79
1167D85r25k78J117J81n41o35M99N12j124R59J2j273R08O52m13k90PL92l75L73
1187B43N16j158o3J085l06n26N7L64j11Q8J89l61l04M14L98n46J1L77n80K21L32
1208C40L0j052N13Q35n71k78K57j48k18M54J75o13j3M55K17o84K50J60m26M65
1228A48J07n14m82O72L50o17O9L64p11M24N39k66m37J63N57k61k76J67j58j63
$$ plain form
1094 -1511 -45 607 -1838 884 1129 -1376 261 315 556 22 -780 954 -242 -600 1857 -373 -978
1111 -978 1155 294 113 -78 170 267 -857 1278 739 -1545 549 539 -208 437 -337 120 -500 -95 1231
1130 1231 -795 -709 844 57 -111 198 -56 -377 -164 1110 288 -1400 815 440 -646 573 168 -435
1148 -435 118 295 620 -928 -351 369 -315 222 495 -528 -518 246 383 -70 -951 435 -99 -394 485
1167 485 -440 -718 399 580 39 -596 -97 415 -709 250 262 -1011 -103 549 136 -154 -147 245 -130 243
1187 243 759 -399 -462 623 317 -209 -152 212 101 189 378 17 -287 127 525 -21 -10 367 -213 8 340
1208 340 370 -682 -169 666 95 -183 74 -74 -292 162 337 -276 -289 166 383 -301 -51 109 -317 148
1228 148 255 -259 -741 -69 281 -336 -267 97 -614 -190 349 83 -354 -191 366 105 -171 -4 -162 -325
1248c25N45J64p62J2O48l4m26K79k39k24M94M18p30k60N47Kk69N11k30l11P8O55
1270E43k10n71M04J82j71j3J48l95j39N45K41q02J63L50m32K02L36j66o50M57
1290B2L76o89P1Q4J64M8J29l07l59J70N52k96l70M83j46k23K89J01l25k26N61
1311A09J03l40J0L48k92K79P8m37j60M87K15l35k93N23n61k40P28j02m10mO95
1332D01j23m48q1K61l66N86R3r35N08L01J85n52j14O08m16j14P87n38l81P28q8
1353C02J21k68J67j03l81M05K50j231R49k2j16Mk18K94m38K80O81j247r4Q26m68
1374c07L77n1p8N2j51L86j22r27J132k6m37N17j49k76k16L85M83q49R5N30m91
1395a23J36L13o16L69k10O9K29r13J018J5o06N08m80j5J35N3N17r39K49Q94j168
$$ plain form
1248 -325 220 384 -378 -366 282 248 -178 101 -138 -362 132 550 -180 -440 107 109 -160 351 121 -190 -112 543
1270 543 333 -238 166 348 177 164 312 -83 -222 323 564 -238 -75 275 -157 45 381 215 -435 22
1290 22 398 -291 -220 -136 28 76 205 -102 -461 -291 261 -35 -405 78 -68 -291 -2 99 -226 -452 109
1311 109 212 -128 -118 230 -62 217 295 -142 -302 185 400 65 -228 295 -266 -506 222 120 -290 -294 401
1332 401 278 -170 -251 10 -356 230 323 -612 -104 197 382 -170 -284 324 -92 -206 581 43 -338 390 302
1353 302 423 155 322 219 -162 243 493 -738 211 189 73 77 -141 153 -285 -5 676 -571 -665 161 -307
1374 -307 70 19 -59 -7 -158 228 106 -821 311 285 -152 365 216 -60 -276 109 592 -257 -162 368 -123
1395 -123 13 326 -290 79 -131 -62 167 -746 272 287 -319 189 -291 -306 -171 -118 399 -540 -291 603 -565
1416e65N97L81q06N17K9j39M39o51O49k43m96Q08o29k87Q86m94L28l99k97J168
1436G96q94K40L65j021N55J84k98%m12O83k25k38N23p46K0J006p08j62K40j5K82
1457A75m11L82K07r96R24q6l45K34o03M23K79m05P31n82k14Q55n19j64K55k02
1477f2K33k36J32J59q87P76K41p55M42J1k69L53q5J2q6n58J269p85n5M56m78N84
1499D12m20r8K25l13N10l0k49K24j03k54O27o88M68J7m44N72p85p8O79p43P52
1520B81j59l77K63n30N08N9m81N37l8l81P54n30K1J66m61O15j13l84M99m90K75
1541C4J67l51L08j21k5L33p53N25j76j27O91m23o4J22m35N89k04k41L37m86L81
1562H1R5l78J84o9O2P7k41K06K35n04N82m05M2L48k68N8L2j94pp9oM82l21Q8o2
$$ plain form
1416 -565 32 413 -393 124 153 14 453 -198 451 208 -288 520 -109 -396 490 -4 324 -75 -372 796
1436 796 -98 142 507 -514 41 225 -73 -73 -485 198 -27 -265 258 -488 -468 538 -170 -332 -92 -107 175
1457 175 -236 146 353 -643 281 195 -150 84 -519 -96 183 -222 509 -73 -287 568 49 -115 140 -62
1477 -62 171 -65 67 226 -661 115 356 -399 43 54 -215 138 53 65 -21 -579 690 -95 -150 306 -172 412
1499 412 -8 -106 119 -194 316 286 37 261 158 -96 531 -157 311 328 -116 456 -329 -407 272 -471 281
1520 281 122 -255 8 -522 -14 45 -436 101 63 -318 436 -94 -73 93 -368 247 134 -250 249 -241 34
1541 34 201 -150 158 37 12 345 -408 117 -59 -186 505 82 18 140 -295 294 90 -151 186 -300 81
1562 81 176 -202 -18 -87 -25 52 -189 17 252 -252 330 -75 -33 315 47 105 137 -57 -64 -143 -149 333 12 100 38
1587C8p0L13m30J03L25l84N20k22m13N97o08K62K42m41K7J65l60N10l44O7Q2K53
1609B32k68j44j2L92m04J25J00k92K32j37Q2K59k56J47j92J41J1j79J01J32K12
1630B82j62lk84L13j12L6n8k69M91l26K97k35j68L10j14k8K46k97k2J59O4l1J44
1653B33l83J96J27O1j60j63J7L24k44J23k19K6j0R4O9p8J63M0p0k01j50R8K16
1676A09MJ73k48k21O0J42N8Ml09J54R3k1p7KJ14K9k47J27p2J58j0n8K80k86mj6
1702f2L6J00q6J16j30K58k8p9j00N5p1r6L2o2L25k28k2j37L6K12O7l9q6j65J22
1727c2M1J60J26m60M06j56j27K0K04p6J3k06L38k38j03J76j97J57rP5o6j06J39
1750G9J69l36J59J03j62m9l1j01M3J46Q7j73K15j32j29J23K24j46k72M0M10j74
$$ plain form
1587 38 -32 281 -149 -46 279 -105 415 193 -220 377 -231 31 273 -168 -141 24 -336 174 -170 -103 -21 232
1609 232 -36 -180 -192 200 -204 -79 21 -271 -39 -176 -94 165 -91 56 -136 5 16 -163 -62 70 282
1630 282 120 117 -167 146 34 70 12 -257 234 -92 205 -30 -198 112 -2 -30 216 -81 -103 56 120 89 233
1653 233 -150 46 173 234 74 -89 -72 252 8 131 -88 -62 -72 22 91 13 176 216 146 -55 -205 -107 109
1676 109 113 286 38 -183 -123 19 77 81 -228 -74 19 -2 -79 -77 37 66 -181 -54 -126 32 22 -36 244 -42 -46 -62
1702 -62 -26 74 -12 104 -26 232 204 125 25 80 9 -87 -55 -117 208 -20 -42 -179 -143 69 136 97 11 -154 -32
1727 -32 9 169 295 -165 241 85 -42 -22 182 106 119 -87 251 13 -90 86 -111 46 37 112 46 -60 79
1750 79 248 -88 71 174 12 -37 -68 -169 -126 20 107 -66 149 17 -112 11 235 89 -183 -143 267 93
1772I3l17M4n3l5N3j23K66K9j07J78Nl07K88M9R7r3O6Rj38J51j31j23J89k22N3
1797g9n5J55j04M6K76l55nK87k72J6R1J43j48L3J73k26Q8N2k24n1K96N5r4j39
1821d1J45j57K38n03K71j35m1M82k93j8QL39l10M6k93L48k13J07J38k73K28L5
1843A08k31K88k70O5j74K27J58o58M61Q1q9K86j83j92L12j05n8l1m5J38k04j3
1865a29K38k81K79J5N2r0N9Q4Q5k07P5J14l97L45l10J14K03k54k22L20k16K99
1887A76k73j32R1L04j89k4J81n0j43K42j91l41M89K0j52L6n2j72K69j66mj5o4
1910a60K36j35J89j53j13K85k11L31k70p7K02l04L67j15m77J96K74J61p3k4l11
1931a82K48l47N6K58l47J91K86j59q2J85J53j93k90k1K99j85K40k70K98k62K9
$$ plain form
1772 93 -224 -180 -233 -268 -215 -338 -72 -43 -150 28 33 -274 14 63 160 67 133 142 4 155 24 -99 90 -132 -79
1797 -79 -134 21 -83 -37 239 -116 -121 166 -106 -90 1 144 -4 29 202 -24 64 116 -108 -159 137 192 98 -41
1821 -41 104 -53 185 -318 -47 -182 -223 259 -34 -52 -44 295 -15 31 -262 86 -127 -20 118 -155 73 108
1843 108 -123 165 -105 -40 -214 13 171 -487 -26 55 -34 252 69 -123 189 84 26 -5 -50 88 -116 -129
1865 -129 109 -172 107 122 174 84 143 227 312 105 180 294 -103 242 -68 46 249 -5 -227 93 -123 176
1887 176 -97 -229 -138 166 -23 -47 134 84 -59 183 -8 -349 140 160 8 44 -8 -180 89 -77 -81 -96 -160
1910 -160 76 -59 130 -23 -136 149 -62 269 -1 -78 124 -180 187 72 -405 -209 65 226 153 129 -182
1931 -182 66 -281 -225 33 -314 -123 163 4 -78 107 260 67 -223 -244 55 -130 110 -160 138 -124 -95
1952i5J57j53J33p0k18K51j42p1J23P8M5J53k56K67k13N4K0Mn7j63K47j27jK6
1976hN9k5O2k7k90L46n4o1o6k7J15m80N63r2k3n2R8k6N0Q7k05pl9K11j67K7j86
2003b17R9m6K20J10m2j57j26K96k34J56J61k61r6J84j67K44j14j1%j40N58m75
2025e8k41K38p9j4K25j96K4J54k51K69K01j75j6r0L2p7J73O7m36L50j28k05L15
2048H2j3r8Q9l05M98l53J73N7m05J33Q1p4K01M0k19L47n42J74j79J76J86k52K91
2071H8k41K81p6j56N3j5J20k78K12o3K0L1n2L02n1k53K71j81r0K2J03k64K33m6
2095c0m8K19l67K41l0j34n3K14J86k1j50j09j65K44J03n1J20k09K65p5l08L40
2117A82j7k12LM1L3L3m23L68q7J89j90P9O2j81J92N5J04l61K42l38J95J80j88
$$ plain form
1952 -95 62 -91 42 -28 -246 5 -137 -208 -85 -7 38 191 -65 202 -11 43 63 67 10 -153 94 -33 -34 -8
1976 -8 51 26 88 61 -229 117 63 2 -64 -91 24 -456 107 15 -8 -60 38 12 62 149 -56 -63 -102 109 -58 -31 -217
2003 -217 -118 -164 56 166 124 -33 -159 137 -97 59 220 -41 -137 47 -120 124 10 -1 -1 -141 417 -58
2025 -58 -299 -61 -140 -154 71 -125 -101 53 -198 71 272 97 81 -9 23 -54 119 186 -250 100 -28 -233 82
2048 82 69 -29 60 -245 253 -100 73 130 -275 -142 -61 -135 66 106 -113 234 -308 -134 -313 -137 49 -203 88
2071 88 -153 128 52 -104 -51 -66 54 -224 -12 -75 -55 -24 -76 226 175 -78 193 12 -78 -56 47 -217 16 -30
2095 -30 -78 141 -226 15 -15 -149 -202 12 198 177 27 -82 -247 -3 100 49 169 -40 225 150 -158 182
2117 182 165 -47 -44 -3 30 63 -360 8 -79 110 -80 -1 61 -120 72 127 231 -130 112 -226 -31 149 -39
2140c9K18l42J86O4Lj38J21j44k4L8J43j40O9o9J5OK2k14j6K34K3qj12J32llk73
2167b51L26m3ol8j29K13q4k30J95j40J51J24r7J07j39n1L01j61k2M0j78j26O1
2190a77p1K85J32q2j70Q3L1k73J89j16L50j51N8j64k8J32J60k57J58o8PK1m6l5
2214c2L9j14j44J49R3l50K88K20k96j16L29L91n16PQ6m9j75J62k38LL26J03J5
2237A81n7j98LJ14Qj10K22m00L57l27J05J73j87J67j01J54j98M7k58L62O3j75
2259e5K8K93m21K89k09O8l3J03j78J60j66K60j97M3j79m1M14j73J7m9k07L10o4
2282A3n5J28j38J30l7J33J19k21k1l7j30O1L0o6J33n5J1r5J86k35%L26l18K8J83
2307G3r7P4m3J06k45K27K4j86J68p4M0j90P7q1J65k10K48q9J7K14j30m5Mm5m8
$$ plain form
2140 -39 179 -163 23 87 90 -48 73 -71 -95 -57 86 -54 15 -54 -39 -33 -11 -225 -241 -7 16 8 -104 28 25 22 -251
2167 -251 75 32 26 -12 -141 72 -12 -242 -47 -187 -36 88 -9 98 -41 -92 209 48 26 66 -112 -238 -177
2190 -177 -248 37 169 87 -83 0 31 -242 -53 -169 181 30 88 -76 -104 28 188 -69 89 21 28 49 3 -32
2214 -32 7 -107 -251 -102 -9 -359 -71 149 -147 -263 66 457 -59 -52 34 -15 -190 -28 -266 -263 63 166 181
2237 181 124 -74 -71 43 51 -59 163 -237 120 -207 -102 71 -116 51 -50 104 -94 -47 -305 57 120 -55
2259 -55 -27 266 -155 134 -75 -7 -40 63 -115 45 -121 139 -58 -15 -194 -235 179 6 23 -26 -233 77 13
2282 13 -42 86 -52 78 41 174 293 72 51 14 -116 -55 -25 -91 42 -13 -2 -97 89 -146 -146 180 -138 -110 73
2307 73 -24 50 7 113 -132 95 119 -67 101 27 67 -123 -46 -127 38 -172 76 -13 4 218 88 43 47 2 -46
2332d6J60k8O0k76J81j47L0j20m5K73k46J65K85k67k6J7j4J38m2l8p0J99j84k70
2356c11L23j35L11j80O5k10N0J54J14l07K15j04L7J64j04k44K97o6j42q8P4J53
2378F6n3j23j62K75k02L68k66K08l31K63j61j04j08K62n7K50r2kJ39p0J20m41
2400b21L82j89J4j96K49k0k11J13O1n3L4P6Ll7J2J4l23L84j72M0j60K28l6M6J14
2425A52m09K73j46J52J07j64N8l51L49K6j29J06N7J23j33L5j47O5L1K00j57l11
2447b13J44j00J73q7K19j51p8K95k49K25l20J59N1k93J02K21j77J7n5L2j86j49
2469d20N32l05K86j16p6K64k35R5j07k0J73J09k05P3Q8r2Q4k29K67j60j92K13
2491B7j93N6K05l17J51kK23k81Q0Q1j05o8J81n1L61n50J51J90m90L17l0J98q5
$$ plain form
2332 -46 114 86 146 -130 51 -96 -66 -186 -231 42 -204 -39 246 -21 -47 -30 -44 94 52 14 -56 143 -41 -311
2356 -311 12 -123 188 8 73 -137 -87 67 181 -126 89 -15 22 186 82 -162 135 69 -73 -161 -87 66
2378 66 13 -110 -272 3 -199 169 -97 111 -220 43 -118 -222 -330 -68 -125 125 33 31 170 100 220 -221
2400 -221 161 -28 -14 -210 39 19 -192 -79 -18 -71 -37 39 42 5 17 31 -292 92 -80 -40 -200 28 -8 38 152
2425 152 -257 16 -130 22 129 -35 23 -328 21 47 -82 24 81 204 71 106 -41 24 55 255 98 -213
2447 -213 -69 -169 4 -83 136 -15 -93 202 -47 178 -142 17 68 -225 -123 98 -79 -62 -117 -85 -271 -420
2469 -420 112 -193 93 -23 -99 165 -70 25 -82 -102 71 180 -25 48 136 44 128 -101 166 6 -186 27
2491 27 -166 -110 95 -222 -71 -73 150 -131 -51 30 -75 -143 38 -13 348 -202 -51 139 -351 -34 -64 134 49
2514D9j57J38Nj4Mj73J44J15j43J5K98k35j80k3o9J72M7J61k35P1K8k5Q4L2l14
2539b05N32l60Rj61L50j19Jn1M7q4L0m4J23O1k43J49N3j47Rk14j5K76J76j60n4
2564d1K00j12m2r3M3k30L83o3n9o1N2P1q7J83J5j15k16J67k4LQ0l2q0K86j32j27
2590c1p6K77k24j22K18j61q1K94k43J82ko6J21k30P4K2K15k54J43J17k08J42n4
2613E3p7J86j82QK5J55l01J2Q4J91j52n4K42j77J20r4n1qj1Q9j28j3LJ73j76o0
2639a43J86J20r1J04k50J30q8J28J4l8J6j55J8P1m2O2K9J35l00K87j32j61K32
2662A32j92J6j0J64M7l37J28Q9Q6R2j61R2j28J84m04K57J30m0k24J39J72j01k77
2685a46K0K52n0n3j21R0o5j57K91k1j10P6J49q7Oj12Q1J12k93K51k09j8K06j79
$$ plain form
2514 49 -108 30 35 21 25 -148 -4 111 -32 -17 281 46 -134 -157 -226 -54 -7 154 -81 -10 18 -7 77 109 -205
2539 -205 327 -33 -24 -185 165 46 47 -4 43 -41 -11 -55 68 129 -114 35 88 -59 -50 -264 -279 -3 173 13 -41
2564 -41 159 47 5 -88 -45 -275 108 45 -14 -75 -23 48 -39 144 159 44 -172 -5 -29 -26 54 22 -58 228 96 -31
2590 -31 -107 170 -54 -176 42 -119 -200 94 -149 33 31 -35 86 -144 -70 -48 167 -87 56 173 -35 107 53
2613 53 -24 162 -20 -12 13 168 -133 -121 -37 154 2 -52 190 13 133 39 -12 -20 -31 58 -70 -83 -80 93 -83 -143
2639 -143 43 163 72 176 -74 56 -32 96 110 72 88 -67 -49 22 -20 42 71 206 -94 193 61 -100 132
2662 132 -60 -44 -54 110 157 -180 -52 37 123 215 54 146 18 202 -202 55 185 145 -79 60 232 131 -146
2685 -146 -126 126 76 23 -98 -8 -73 -230 61 40 -70 6 155 68 74 -38 43 155 -138 113 -96 -114 92 -87
2709h7J86J8j66K06j53J2J22k33Q1kJ13q3j05j07J24NJ24mq7j54K27J24j95J25
2733I1j70K24j31r6J65j61L11l59L7K02l68J80J39l9M1k19M02k65q3J34l8O4o4
2756cj53q5J94J02o1J01N7j59j7P9J19o6nj04q4J35j81M14o6k85O7l97N98k35
2780c5p0K78k33M0J27j50O9R6r9j27J16Pk98K24N1J01k7j48J02q9j35N0K41O5
2804A56l28j0M5L43k08j3q2N4J42l2l2j98K51m9j07l5L9o3J46k12K35j90L2N3
2828f3Q2Q1r5Rk0J90l99M62j35R5j05l19K84n9PJ06j53N4J93j23o6l4j54J68L5
2853D1l4j32K93l44Q4j85J38N7J88j57JK38m14%J9J69K90n60K25J25j90N3J65
2876G0q1jN2k11K84qj02m8J13j15J27j50J32l6M3r9P6J08j84j43J44m1J75L76
$$ plain form
2709 -87 99 117 -49 157 4 16 138 -95 -14 -16 97 14 -91 -198 -74 -69 55 51 -36 -190 37 161 -34 91
2733 91 -79 145 14 -82 83 -78 233 -126 -89 113 -255 -75 64 25 66 -153 249 -16 -99 35 -3 61 -3
2756 -3 -156 -241 -47 55 -6 95 152 -7 -24 55 174 108 103 -1 -85 50 -131 283 217 -68 -1 -398 200 -35
2780 -35 -105 173 -60 -20 107 -43 26 122 23 -104 12 19 -279 -55 -4 97 70 -78 24 -65 -200 -150 91 156
2804 156 -172 -182 -137 206 -2 -15 -97 -43 99 67 35 -163 88 39 -68 -103 -64 -127 19 -193 42 -148 -116 -63
2828 -63 19 100 5 14 -6 184 -215 247 112 207 102 -217 67 8 15 121 -32 22 215 92 26 -8 -162 6 41
2853 41 7 -125 168 -176 -92 -277 -139 -82 106 -51 -50 188 -226 -226 -207 -38 252 -308 -83 42 -148 -95 70
2876 70 -11 -12 40 -171 113 105 3 -45 68 -47 80 -70 62 26 69 -30 46 154 -30 -173 -29 -70 105 481
2900D81l62l5n6j55OL81k60L01n56J67j46J55J20m9P0l84M53j94J94r0j23R7J14
2923A29o0k75J83K81l75L16m56L75n6j08O6k32K24j18K46r4l07N41k00R7o8k91
2945a82M92m40J46J9j83K35q0K8p7K01j08j11k6K4r2J57J15k57K27k0j7j3P5K8
2969A41l34j5j11K55J09n4j64K92j89N5Rk25K99L3j58k47M39j85J37k1J1J07k67
2992h3qj28L99j35o7K1M7KR0k45J17M2K09l02K4J23l1j7l33K54o2J0J06j12J33
3017E4L8L8l24LM3K88j66j73K47O3k08K4m3o3K52l6J52q7k1k52KL8J59q2O4o4
3043e4k20K27p8J32M0M7m76M83j35p2O5j45Q4K60J6l82J31N0J16J01j75j12J34
3066C7K00l06J02n4j25pK20q5J28k08L3J01m5M05k55j44j7L4m2j24K56j08J65
$$ plain form
2900 481 119 84 28 -127 -121 260 0 301 -255 -88 -234 -79 41 -8 62 -322 131 -63 131 41 -82 15 129
2923 129 69 -206 -23 258 -117 199 -257 118 62 -46 20 -212 12 -106 140 46 -261 280 80 177 109 -182
2945 -182 310 -130 16 35 -148 87 7 35 -42 159 51 -60 -86 -62 -154 3 118 -139 88 68 51 38 113 141
2969 141 -193 -208 -319 -64 45 -9 -173 119 -70 -15 -6 -231 68 101 -57 -304 135 -50 87 66 77 184 -83
2992 -83 -91 -219 180 45 -22 -1 46 48 138 -107 10 52 261 -41 -17 106 75 58 -275 -21 -83 -73 33 -79 54
3017 54 92 130 -194 -191 -148 140 -26 -199 48 111 -97 -73 -116 -179 73 37 189 102 81 -171 -169 -131 28 -54 10 -54
3043 -54 -274 -47 -125 7 47 94 -382 101 -34 -106 -41 -186 -102 158 174 -208 -77 -27 89 190 15 -97 37
3066 37 237 -69 33 -21 -146 -153 67 -18 110 -98 -65 36 -9 396 141 -3 -20 14 -28 -152 104 -4 161
3089A61j40j13l2J66k13n7J99j81K52l7l2j65J53mJ4J9q2Q6J47k43J08J40r4K2
3113G4j60J51N5J9l81L41k88N03j60j67k42K84J08r1j82K62J69l61N3J25k33J6
3135a05K7l3J88l6j44q9J35n7J05j29M26q7mm26L41k67J10K61m12L39j58R2o7
3158A0M7k38K00J37o1J41j50l8j58J58k18K04l9O0o6q8J51j0r2j22K28j82J12
3181a4J58n0k16R6J22K1Nj88J71j7j27N3NQ1J88k88O4O4o4Mm6l5R3K8q6k13M98
3208C07k21K7JO4Q0k00j34L05j07r6J16k13P5L32m02k1N8P6k40J06J39j03J18
3231F7m7L3P8j43K37p9k21J76k19J87m0n0J93l90K28k7J55j49k9J98k2k71L09
3254A74j46P9K3l76K30J72j20N5k25J28O5l05J27M4o8l4J79j61Q1M01l53J3J04
$$ plain form
3089 161 21 -92 -124 42 -171 -228 -29 -210 42 5 -27 -192 -39 -43 -29 -10 -92 -6 141 -102 6 146 52 74
3113 74 -86 65 120 139 -242 99 -189 314 154 -13 -255 29 137 46 -136 126 295 -66 -13 112 -121 -105
3135 -105 -78 -111 77 41 -103 -192 -57 -114 -9 -138 288 201 197 -229 112 -155 -45 216 -196 143 -15 77 10
3158 10 57 -181 19 156 95 236 86 48 -110 48 -170 34 -5 55 -11 -99 52 42 -50 -172 56 -126 -14
3181 -14 144 94 -122 -26 96 117 122 -66 105 88 -39 14 19 100 288 0 64 128 64 68 22 -13 80 108 22 -191 307
3208 307 86 113 114 178 258 58 -76 229 122 26 142 -71 4 336 -66 -87 -29 47 -193 -87 52 -51 67
3231 67 20 53 131 -12 225 146 -75 101 -118 69 29 -21 172 -218 10 -17 138 -11 -40 158 136 -135 174
3254 174 28 107 130 -246 -16 156 36 91 -134 -6 59 -246 -119 -75 -143 -177 2 -159 -78 323 -30 -17 87
3277H7j86J38k01K08j4j60K57k16P9K7K09m24J14R3p4M1K13l05J80j03j3J15j89
3300a24r5J90J41k20J19l4N3K1k51K91Q4m14J15L80k31j69m7J47o6J73O0Mj46
3323a9k7j58M15l15J84Ok67L35j14j06K21j98J68l30L40k48J96l0n1j7r4O4p1
3346a16L60m15J90j00o4K71j53j14K3J61R8j49ll5L17q2o2k44K12j99J95Q7n3
3369A25j83J13j74L40j13j32K8J48j65q3P9p4l8J0L8K57l79J95q5M5K56l98J96
3392Fr9j41L29m44J32K13K12k7k20J79N8n4m2r5K65j28j45J74j36j12J82l6j04
3415c3K0j1OJ50k66N5j7J40j26J0L47k60l9oJ02j32J01J87l02J92o6K19j51l25
3439b05K88K04m05K05O1j3k12o9L06r0j47K63j11k38K27k2mp9J93l10J56j75J37
$$ plain form
3277 87 -99 39 -162 46 32 -128 129 -87 -8 19 228 -196 -82 11 -63 -22 191 -114 66 -37 -50 65 -124
3300 -124 -219 -29 112 -108 11 -23 30 51 -200 91 175 -239 -124 256 25 -144 -191 -44 -110 63 123 127 -19
3323 -19 -46 -204 211 -104 80 86 -181 154 40 -66 155 -43 125 -205 135 -113 83 53 2 -15 -109 -45 -116
3346 -116 244 -171 19 -81 -145 126 -27 -141 -118 43 141 -8 -11 -46 271 189 127 -117 95 -104 91 178 125
3369 125 -58 55 -119 221 108 -24 4 152 -13 -96 -17 -91 -129 -119 -81 176 -203 -8 -93 -48 208 -190 6
3392 6 -93 -234 95 -349 -217 -4 208 181 -39 140 198 144 102 7 272 144 -1 173 37 -75 107 71 -33
3415 -33 -13 -24 -18 132 -134 -79 -96 44 -82 -72 275 15 -24 -30 72 -60 41 228 -74 118 52 271 120 -205
3439 -205 83 287 -118 87 148 135 -77 -146 160 70 -77 186 75 -163 64 42 38 -41 152 -158 -2 -177 -40
3462d0J27l3j4J62j54j79n3Q5R7N3j66L48k33j7j09J59OJ79j82L7q1pn1QK97l04
3488f5J60j95n3J04Lj03K90j77m7J8R6J21j96l6L16r1j12K0j7qJ17j98o5J62K6
3513G0M0j35K19k16Rr5K3N4j00J22j6pQ7K7k16J79N2r7M8orq2P3p7K37j51nP0
3541I8N6l78L83r6q2Q7o2l4j21L19k97L95j70J77j83m5Q6j93q4J28J55k34J97
3564A02j14p4j28m3K79K3k18J12pp8J80n7k9J14j87L71l12J22q3o3k4K26p2j49
3588a09o2J25k69J38K4L22j24o2j12R9K24j05k14K5j8J73R8n12L35K06O9k57l9
3611d5K8j39J12Q4k5k25K5L08k8n6K2j1j04P7n5J86K12k97j64J87k6j32J84r2
3635B6J28R8m25J30K20M3k24q5p0M4J91J88n57M00Mr0j17K5j5j54K91J7q1q5J66
$$ plain form
3462 -40 87 54 40 202 48 -131 -184 -99 -2 51 -115 233 0 -17 -126 33 39 218 36 73 -8 -15 -66 -58 239 -65
3488 -65 95 -100 -153 -49 -46 -149 141 -36 -83 -65 31 152 -44 -80 236 145 33 53 36 28 145 -53 -118 44 70
3513 70 110 -25 194 -22 -13 -108 -85 -31 -131 -9 -25 -32 55 82 -134 45 97 0 48 42 33 -49 24 -53 184 33 28 98
3541 98 154 -224 159 63 -19 68 6 -28 -149 170 -127 268 98 275 92 47 133 -60 -144 -16 139 -95 102
3564 102 -12 -86 -214 -257 22 45 -173 -61 -68 -146 34 -23 -52 62 -125 246 -66 56 -27 -90 -114 112 40 -109
3588 -109 -171 -46 -315 -177 -153 169 45 -17 -129 -30 194 89 -125 -100 -118 55 153 -359 -24 182 251 -6 -45
3611 -45 -17 -156 -44 40 15 -210 -185 123 95 39 61 50 -54 23 -32 154 366 69 -95 92 66 -66 118 26
3635 26 154 252 -173 -43 177 220 -4 -89 -159 -115 76 264 -293 107 111 21 -96 -71 -86 -240 51 68 -13 -98 68
3660F8L8j83o8J74n7r6M3L8J28k6k17K87j37l0r2J20J45Nk41K90l55J79j16K94
3684A91j78P2j69q4K22j35J56J00k68L3o0J53n9k55K22Q1j22J54j16J94j71J27
3706H8l66J76J8K6K28p1o0L2J2Oq2R8J6j36p9K15j58m7n6j08L10n5j52l3L49N1
3732B22k15j08J15j8L00n45K47m9pP2J20j13Q1k12M2J08J56q0j27l6J63m3kk55
3756a84R5J99k63J95q8J64l9o2r4P1K4j03L7J51j38N6L7J30m9J09k65O8r1O3n1
3781b8j5J02k61J94Op0N5j01K18j1k72K99k04R8Q3j62J59j39R4k6j48J47J39R7
3805B54k35J5p8J80j77P7K2j16O1Lj49J43J79n0k71K7O3J32j28m3J12n8NO6J15
3830A49k88J03n9Q8m0N2J09n2j23J3j89J21K39j79l9K02r1J23j26N4P9k17k23
$$ plain form
3660 68 106 -77 -145 29 -28 -124 -81 -43 85 59 -158 129 -8 -38 -130 -10 135 140 -101 189 -166 13 -103 191
3684 191 13 85 -84 -168 54 -81 75 175 -93 -60 -120 33 -26 -281 -59 22 -100 54 -62 132 -39 88
3706 88 -278 -102 -84 -58 170 99 39 71 83 89 7 105 121 -15 -94 121 -37 -84 -140 -248 62 7 -145 -178 171 222
3732 222 7 -101 14 -4 296 -249 -2 -51 -58 14 134 21 102 -110 -68 40 196 116 -11 -47 116 73 71 -184
3756 -184 -89 110 -153 42 -46 118 79 17 -77 -6 18 -85 -48 103 -35 21 58 188 139 248 -17 51 -40 23 -28
3781 -28 -43 59 -202 -8 -2 -72 -17 -118 100 89 -183 116 -88 10 93 -69 90 -49 45 19 -129 18 157 254
3805 254 19 34 -44 136 -41 36 58 -58 3 6 -143 0 179 129 -142 -115 -52 80 -48 -91 21 -37 -32 34 149
3830 149 -139 -36 -95 -7 -47 5 114 62 -61 -48 -237 -116 123 -56 -95 107 16 139 13 67 146 -71 -294
3853b94K46K97k96P7j66k7N0K79l11L20k08J94j00q6K0N5p6J18j51J08j42%J11
3876A8L3Lm1j5j70J57o7K56j87K3Q1k61K42n1Rj05r5M6R7N6J42k79J55l04L21
$$ plain form
3853 -294 -48 249 -47 30 -136 -163 -113 166 -145 175 -33 161 61 -25 -5 50 -26 92 -59 49 -93 -93 18
3876 18 51 54 13 -2 -172 -15 -82 174 -13 10 91 -170 72 21 30 -75 -170 -124 -27 29 171 -108 47 -257 64
$$ [...]
8191I9
##END NTUPLES=NMR FID
##END=
