##TITLE=1H_Pr Bzt-63
 CDCl3
 8 sc, 
 22.09.2022
##JCAMPDX= 6.0         $$ Bruker NMR JCAMP-DX V2.0
##DATA TYPE= NMR FID
##DATA CLASS= NTUPLES
##ORIGIN= UXNMR, Bruker Analytische Messtechnik GmbH
##OWNER= root
$$ XWIN-NMR		Version 3.5
$$ Thu Sep 22 15:40:18 2022 Russian Standard Time (UT+4h)  she@DPX200
##.OBSERVE FREQUENCY= 200.1313499994
##.OBSERVE NUCLEUS= ^1H
##.DELAY= (6, 6)
##.ACQUISITION MODE= SIMULTANEOUS
##.ACQUISITION SCHEME= undefined
##.AVERAGES= 8
##.DIGITISER RES= 18
##SPECTROMETER/DATA SYSTEM= spect
##.PULSE SEQUENCE= zg30
##.SOLVENT NAME= CDCl3
##.SHIFT REFERENCE= (INTERNAL, CDCl3, 0, 15.7039)
##AUDIT TRAIL= $$ (NUMBER, WHEN, WHO, WHERE, WHAT)
$$ ##TITLE= Audit trail, XWIN-NMR		Version 3.5
$$ ##JCAMPDX= 5.01
$$ ##ORIGIN= Bruker BioSpin GmbH
$$ ##OWNER= she
$$ F:/spectra/data/she/nmr/H-F/1/audita.txt
$$ ##AUDIT TRAIL=  $$ (NUMBER, WHEN, WHO, WHERE, WHAT)
(   1,<2022-09-22 15:39:06.28 +0400>,<she>,<DPX200>,
      <created by zg, POWCHK disabled, PULCHK disabled
       configuration hash MD5:
       00 E9 B6 7A A2 85 ED C7 34 08 36 98 17 FE 4E 26
       data hash MD5: 16K
       41 F9 7A 5C 54 27 5C 76 70 4A F1 C8 84 75 6E A2>)
$$ ##END=
$$ 
$$ hash MD5
$$ 2F D7 41 8C 04 80 17 4F DE A0 D8 6F 09 1C C2 E8
##$RELAX= 
##$RELAX= 
##$RELAX= 
##$RELAX= 
##$RELAX= 
##$RELAX= 
$$ Bruker specific parameters
$$ --------------------------
##$DU= <F:/spectra>
##$EXPNO= 1
##$NAME= <H-F>
##$PROCNO= 1
##$TYPE= <nmr>
##$USER= <she>
##$AMP= (0..31)
100 100 100 100 100 100 100 100 100 100 100 100 100 100 100 100 100 100 
100 100 100 100 100 100 100 100 100 100 100 100 100 100 
##$AQSEQ= 0
##$AQ_mod= 1
##$AUNM= <au_zg>
##$AUTOPOS= <>
##$BF1= 200.13
##$BF2= 200.13
##$BF3= 200.13
##$BF4= 200.13
##$BF5= 200.13
##$BF6= 200.13
##$BF7= 200.13
##$BF8= 200.13
##$BYTORDA= 1
##$CFDGTYP= 0
##$CFRGTYP= 5
##$CHEMSTR= <none>
##$CNST= (0..31)
1 1 145 1 1 1 1 1 1 1 1 1 1 1 1 1 1 1 1 1 1 1 1 1 1 1 1 1 1 1 1 1 
##$CPDPRG= <>
##$CPDPRG1= <>
##$CPDPRG2= <>
##$CPDPRG3= <>
##$CPDPRG4= <mlev>
##$CPDPRG5= <mlev>
##$CPDPRG6= <mlev>
##$CPDPRG7= <mlev>
##$CPDPRG8= <mlev>
##$CPDPRGB= <>
##$CPDPRGT= <>
##$D= (0..31)
0 1.2 0 0 0 0 0 0 0 0.06 0 0.03 0 0 0 0 0.0002 0 0 0 0 0 0 0 0 0 0 0 0 
0 0 0 
##$DATE= 1663846745
##$DBL= (0..7)
120 120 120 120 120 120 120 120 
##$DBP= (0..7)
150 150 150 150 150 150 150 150 
##$DBP07= 0
##$DBPNAM0= <>
##$DBPNAM1= <>
##$DBPNAM2= <>
##$DBPNAM3= <>
##$DBPNAM4= <>
##$DBPNAM5= <>
##$DBPNAM6= <>
##$DBPNAM7= <>
##$DBPOAL= (0..7)
0.5 0.5 0.5 0.5 0.5 0.5 0.5 0.5 
##$DBPOFFS= (0..7)
0 0 0 0 0 0 0 0 
##$DE= 6
##$DECBNUC= <off>
##$DECIM= 32
##$DECNUC= <off>
##$DECSTAT= 4
##$DIGMOD= 1
##$DIGTYP= 9
##$DL= (0..7)
0 120 120 120 120 120 120 120 
##$DP= (0..7)
150 150 150 150 150 150 150 150 
##$DP07= 0
##$DPNAME0= <>
##$DPNAME1= <>
##$DPNAME2= <>
##$DPNAME3= <>
##$DPNAME4= <>
##$DPNAME5= <>
##$DPNAME6= <>
##$DPNAME7= <>
##$DPOAL= (0..7)
0.5 0.5 0.5 0.5 0.5 0.5 0.5 0.5 
##$DPOFFS= (0..7)
0 0 0 0 0 0 0 0 
##$DQDMODE= 0
##$DR= 18
##$DS= 0
##$DSLIST= <SSSSSSSSSSSSSSS>
$$ [...]
##$SUBNAM2= <"">
##$SUBNAM3= <"">
##$SUBNAM4= <"">
##$SUBNAM5= <"">
##$SUBNAM6= <"">
##$SUBNAM7= <"">
##$SUBNAM8= <"">
##$SUBNAM9= <"">
##$SW= 18.0517283424941
##$SWIBOX= (0..15)
0 0 2 0 0 0 0 0 0 0 0 0 0 0 0 0 
##$SW_h= 3612.71676300578
##$TD= 16384
##$TD0= 1
##$TE= 0
##$TE2= 300
##$TE3= 300
##$TEG= 300
##$TL= (0..7)
0 120 120 120 120 120 120 120 
##$TP= (0..7)
150 150 150 150 150 150 150 150 
##$TP07= 0
##$TPNAME0= <>
##$TPNAME1= <>
##$TPNAME2= <>
##$TPNAME3= <>
##$TPNAME4= <>
##$TPNAME5= <>
##$TPNAME6= <>
##$TPNAME7= <>
##$TPOAL= (0..7)
0.5 0.5 0.5 0.5 0.5 0.5 0.5 0.5 
##$TPOFFS= (0..7)
0 0 0 0 0 0 0 0 
##$TUNHIN= 0
##$TUNHOUT= 0
##$TUNXOUT= 0
##$USERA1= <user>
##$USERA2= <user>
##$USERA3= <user>
##$USERA4= <user>
##$USERA5= <user>
##$V9= 5
##$VALIST= <valist>
##$VCLIST= <CCCCCCCCCCCCCCC>
##$VD= 0
##$VDLIST= <DDDDDDDDDDDDDDD>
##$VPLIST= <PPPPPPPPPPPPPPP>
##$VTLIST= <TTTTTTTTTTTTTTT>
##$WBST= 1024
##$WBSW= 4
##$XGAIN= (0..3)
0 0 0 0 
##$XL= 0
##$YL= 0
##$YMAX_a= 138097
##$YMIN_a= -129123
##$ZGOPTNS= <>
##$ZL1= 120
##$ZL2= 120
##$ZL3= 120
##$ZL4= 120
##$ABSF1= 10
##$ABSF2= 0
##$ABSG= 5
##$ABSL= 3
##$ALPHA= 0
##$AQORDER= 0
##$ASSFAC= 0
##$ASSFACI= 0
##$ASSFACX= 0
##$ASSWID= 0
##$AUNMP= <proc_1d>
##$AZFE= 0.1
##$AZFW= 0.1
##$BCFW= 1
##$BC_mod= 2
##$BYTORDP= 1
##$COROFFS= 0
##$CY= 11.3945322036743
##$DATMOD= 1
##$DC= 2
##$DFILT= <>
##$DTYPP= 0
##$F1P= 2.36226072786647
##$F2P= -0.459571619588291
##$FCOR= 0.5
##$FTSIZE= 0
##$FT_mod= 4
##$GAMMA= 1
##$GB= 0.15
##$INTBC= 1
##$INTSCL= 1
##$ISEN= 128
##$LB= 0.24
##$LEV0= 0
##$LPBIN= 0
##$MAXI= 10000
##$MC2= 0
##$MEAN= 0
##$ME_mod= 0
##$MI= 1.114404
##$NCOEF= 0
##$NC_proc= 0
##$NLEV= 6
##$NOISF1= 3.799351
##$NOISF2= 2.8
##$NSP= 1
##$NTH_PI= 0
##$NZP= 0
##$OFFSET= 15.70392
##$PC= 1
##$PHC0= -18034.59
##$PHC1= 9.400692
##$PH_mod= 1
##$PKNL= yes
##$PPARMOD= 0
##$PSCAL= 0
##$PSIGN= 0
##$REVERSE= no
##$SF= 200.130013532006
##$SI= 16384
##$SIGF1= 3
##$SIGF2= 2
##$SINO= 400
##$SIOLD= 16384
##$SREGLST= <1H.CDCl3>
##$SSB= 0
##$STSI= 0
##$STSR= 0
##$SW_p= 3612.71676300578
##$SYMM= 0
##$S_DEV= 0
##$TDeff= 0
##$TDoff= 0
##$TI= <>
##$TILT= no
##$TM1= 0
##$TM2= 0
##$TOPLEV= 0
##$USERP1= <user>
##$USERP2= <user>
##$USERP3= <user>
##$USERP4= <user>
##$USERP5= <user>
##$WDW= 1
##$XDIM= 8192
##$YMAX_p= 0
##$YMIN_p= 0
$$ End of Bruker specific parameters
$$ ---------------------------------
##NTUPLES= NMR FID
##VAR_NAME=  TIME,          FID/REAL,        FID/IMAG
##SYMBOL=    X,             R,               I
##VAR_TYPE=  INDEPENDENT,   DEPENDENT,       DEPENDENT
##VAR_FORM=  AFFN,          ASDF,            ASDF
##VAR_DIM=   8192,          8192,            8192
##UNITS=     SECONDS,       ARBITRARY UNITS, ARBITRARY UNITS
##FACTOR=    0.0002768,     1,               1
##FIRST=     0,             0,               0
##LAST=      2.2672688,     0,               0
##MIN=       0,             -129123,         0
##MAX=       2.2672688,     138097,          0
$$ Real data points
##PAGE= N=1
##DATA TABLE= (X++(R..R)), XYDATA
0 0 0 0 0 0 0 0 0 0 0 0 0 0 -1 8 -8 8 -8 16 -16 16 -24 24 -32 40 -46 50 -58 72 -80 90 -105 120 -137 153 -175
35 -175 195 -219 248 -276 308 -342 380 -422 468 -517 572 -632 696 -766 846 -930 1026 -1130
53 -1130 1246 -1378 1526 -1694 1886 -2109 2373 -2688 3075 -3562 4195 -5060 6310 -8292 11942
68 11942 -20883 94630 54306 -96456 64530 138097 34479 -70310 -25846 2736 -13722
79 -13722 -34679 -35357 -54974 -32157 23797 38092 -31091 -60116 6628 58364 -3194 -61400 -27066
92 -27066 25597 15948 -6300 -3516 14818 43249 65810 35266 -4807 13530 39194 5426 -28439
105 -28439 -27580 -40760 -55533 -23475 -6316 -45403 -45481 28604 54942 953 -17885 33351 59873
118 59873 20181 -13682 -871 6364 -12629 -6303 13635 -11778 -33601 18583 54356 -12835
130 -12835 -58321 12622 54248 -20895 -71944 -22261 14444 -14701 -28336 -3264 10674 17181
142 17181 36015 35784 12971 17105 43693 35682 -11888 -34401 -8644 5003 -25494 -46818 -25248
155 -25248 -1733 -5847 -12472 -7360 -1274 12639 20774 -3072 -21292 5119 22528 -5880 -16530
168 -16530 15014 25236 3942 7572 29192 21159 4606 11772 12337 -11522 -25809 -13237 -10439
181 -10439 -31466 -36109 -10648 -792 -17311 -12185 19775 24578 1994 6055 27872 16257 -7458
194 -7458 1981 14350 -1881 -12271 475 5376 -2178 715 7197 2302 -4 2594 -4456 -13027
208 -13027 -9213 -4761 -10776 -16240 -8462 2625 3063 2289 9350 15371 12252 10534 11862 3311 -7117
223 -7117 1453 6135 -16278 -26419 -1743 9872 -13168 -20202 7935 19066 -1819 -7374 9859
236 9859 12023 -1169 -1805 4810 -810 -6556 3624 10424 -1910 -7852 8599 16647 -2301 -14184
250 -14184 1371 9663 -8883 -20061 -7593 -691 -8072 -10350 -2776 2494 3282 5574 7337 7886
264 7886 8519 7438 6071 5495 1472 -2857 -108 2634 -2717 -7249 -2370 4098 -1275 -8135 -2507 4532
280 4532 -2356 -10412 -4152 4004 -4260 -11391 593 8833 -3040 -7171 8634 13581 -1669 -4904
294 -4904 10753 11322 -4910 -5695 6602 4757 -7399 -5104 5134 1212 -7431 -1205 7323 -379
308 -379 -7931 964 8093 -2090 -10242 225 7139 -2988 -9232 -1067 4617 -1065 -5289 -1172 3506
323 3506 1355 -841 661 3426 2363 453 2135 4128 1036 -1280 2334 4198 -874 -3879 838
338 838 3961 -1294 -5410 -847 3258 -1774 -6646 -2084 2548 -2446 -7156 -1138 3440 -2329 -4572
353 -4572 2497 6070 89 -948 5415 5516 142 404 3823 1875 -2564 -1950 1369 -578 -4470 -2120
369 -2120 2472 1291 -2711 -1163 3523 2684 -1399 -1409 719 -543 -1905 -1977 -1854 -1721 -940 128 402
386 402 469 244 74 1896 2570 -1927 -3766 307 2593 -1497 -3690 589 4210 2725 1392 3239 4456
403 4456 4069 2575 1178 94 -3476 -3926 -861 -2824 -9027 -7666 757 1507 -5514 -5150 3375 4906
419 4906 -140 -2344 698 3488 2577 730 742 1614 1513 3587 5976 3763 -994 1583 7913 2074
435 2074 -8240 -5670 2488 -763 -10235 -10087 -2776 -626 -3581 -3131 981 2648 1862 2779 5576 2407
451 2407 -2188 3257 8127 -1109 -9213 75 9413 1847 -6229 154 6709 2043 -3400 -715 1611
466 1611 -1693 -4577 -1742 -512 -6180 -6272 4332 8162 -3235 -6370 6881 11711 -2100 -6243 3850
481 3850 5166 -4698 -7355 -1809 -454 -3269 -1508 2738 1205 -2983 -90 8586 6720 -4296 -2731
496 -2731 8956 5160 -8336 -5136 7584 4901 -5747 -3329 4644 2207 -3191 -555 3328 -1027
510 -1027 -7510 -6039 1049 -2159 -10081 -3629 6644 595 -8313 2048 13414 5106 -2694 6381
524 6381 10458 8 -5189 2092 6084 -1204 -6827 -1458 3585 -2037 -6833 460 6108 -3022 -8905
539 -8905 64 2289 -7548 -6428 4221 2659 -6684 -3607 6048 6972 769 1054 6402 7132 515 -3522
555 -3522 1922 5111 -1873 -5062 388 -130 -6523 -2639 5668 2470 -5366 -1817 4877 1771 -4292
570 -4292 -3019 2621 3681 -3018 -6753 -329 4338 -136 -1162 3612 1683 -3756 1210 5996 -1593
585 -1593 -6168 1480 4851 -2971 -7263 -1293 6428 5789 -1416 -3231 3273 6295 1279 -2042 700
600 700 393 -1837 -1133 -2516 -6211 -2575 3638 1305 -5313 -4952 997 4247 2045 -2833 -3526 3648
616 3648 5617 -2516 -4704 3182 6919 2101 -596 632 999 1830 3539 1928 -2367 -2838 -649 614
632 614 -1600 -6462 -4116 3409 1752 -6999 -5597 3755 3991 -1851 -1250 1660 178 -132 2242 1447
648 1447 -650 242 2958 3282 -869 -2911 1409 6903 2588 -5498 -3000 4894 2521 -4508 -2830 1562
664 1562 524 -2479 -2263 -1114 -807 -477 429 111 -2404 -3286 957 4699 -832 -5648 1228 6966 -480
681 -480 -5864 1587 6738 1151 -3207 1237 3826 685 -541 2188 2118 -1385 -2505 1240 970 -4527
697 -4527 -4285 1776 1524 -5712 -5088 2818 3060 -3249 -2249 3587 2620 -2183 -769 3133 2028 -1248
713 -1248 -646 2567 1838 -1681 -230 4412 2785 -2926 -1139 4034 1142 -4428 -1848 1920 -817 -4566
729 -4566 -1850 2027 34 -2018 616 3329 772 -2172 798 3404 -1023 -4146 -181 2370 -2206
744 -2206 -4606 338 3913 -221 -2205 2109 4154 999 -505 1853 2798 -344 -1816 793 1067 -1678
760 -1678 -1268 1970 1556 -2023 -1550 2318 1149 -3417 -3397 -253 -630 -4412 -4544 -371 432 -1372 -286
777 -286 2589 3416 2455 2798 4313 3304 1082 1140 1740 49 -1899 -1521 124 -773 -2772 -1455 679
794 679 77 -2015 -2095 -420 -825 -2853 -2887 -1029 -655 -1275 -408 1669 2563 2071 2748 4206 3561 1462 1070
813 1070 1712 187 -2201 -2828 -1242 -1338 -2555 -2039 -416 620 30 -307 1061 1230 81 -667 -176 82
831 82 -1697 -1610 -53 479 -1039 -401 2201 2398 33 -894 1269 1545 -1998 -2839 -675 -227 -2252 -2024
849 -2024 1385 2318 440 1368 4233 3319 327 865 2921 643 -3581 -2790 163 -1684 -4699 -3042
865 -3042 674 -216 -2801 -689 2515 382 -1829 191 2412 -549 -2201 669 3140 928 -839
880 -839 2301 4700 2501 -327 1799 3254 6 -2806 -846 -457 -3367 -4866 -1660 -523 -3272 -3463
896 -3463 836 2879 -469 -1668 1991 4117 -114 -2138 2020 2990 -825 -1693 2119 2693 -1371 -84
912 -84 3755 2052 -2504 -1361 2686 968 -4038 -3224 1718 412 -4228 -2528 2346 1119 -2574 -186
928 -186 3353 -202 -2486 1322 3085 -1759 -3464 760 2422 -923 -3179 929 3779 861 -1450
943 -1450 740 2963 1205 -609 1680 2255 -1520 -1557 1873 818 -2639 -2200 1445 807 -3193 -3353 210
960 210 2123 -879 -3307 -186 2274 -652 -1863 1661 2227 -1158 -658 3077 1054 -2308 925 4446
976 4446 1248 -2386 -925 2708 1906 -2340 -2309 1176 554 -3023 -2219 1169 63 -2062 764 2325
992 2325 -1385 -2067 2694 3247 -1200 -2389 564 751 -1722 -2434 -1050 102 524 -964 -722 1149 1918
1009 1918 1270 2418 1704 -580 101 1595 620 -1348 -615 750 453 -158 -1441 -1031 1903 1373 -2573
1026 -2573 -3249 -363 -1527 -3713 -2303 -545 -2092 -1562 1642 1917 1022 3181 5609 4129 2183 1092
1042 1092 1826 2300 343 -2669 -1806 -473 -2485 -3626 -833 -49 -1582 -545 272 -1843 -2330 -263
1058 -263 -571 -1566 -1061 -859 -748 1488 3408 2264 3146 5739 4041 433 1252 2187 -111 -2933 -2928 -3307
1076 -3307 -4173 -4492 -2866 -155 504 -905 748 3779 1882 -1111 2170 4295 -968 -3890 332 1570
1092 1570 -2298 -1226 2605 2227 -696 189 1692 638 -1382 -2263 -1747 -2136 -5005 -4425 -403 899
1108 899 -852 1124 5375 5081 2174 4105 5909 3263 71 -954 -2043 -3107 -4324 -4481 -2972 -1413
1124 -1413 -2979 -3574 688 2184 -821 -620 2780 596 -3169 -1155 2357 1061 -767 1882 5013
1139 5013 4159 2341 3564 5864 3556 -1206 -2028 -411 -4270 -8781 -5509 -2666 -6149 -6879 -890 1750
1155 1750 -256 1096 5424 5625 2146 1599 2659 2287 129 -378 551 1216 -539 -318 2318 2410 -223
1172 -223 -472 1257 -860 -4257 -4168 -2832 -4172 -4412 -3197 -1593 367 2120 3299 5091 6051 4676
1188 4676 2767 3376 2789 -976 -2785 -1554 -2734 -5408 -4100 -984 -757 -1654 40 2265 1727 -31
1204 -31 80 1228 570 -1658 -1179 864 671 -3 2231 4260 2904 1831 3177 2723 -607 -2219 -2378
1221 -2378 -3905 -5947 -6178 -5385 -4086 -2846 -944 890 2696 4080 4273 4450 4469 3657 2306 1172 -126
1238 -126 -280 -725 -1432 -494 438 -125 -977 203 490 -1808 -2983 -1926 -2638 -5104 -4622 -2084 -1583 -1699
1256 -1699 473 3816 4650 4093 5109 6329 4544 2201 1719 779 -1444 -3995 -3607 -2587 -3307 -3847 -1577
1273 -1577 379 -134 -561 569 1166 184 -871 -642 -309 -601 -1072 -312 1656 2112 1685 2788 4187 2950
1291 2950 474 516 1109 -1857 -4522 -4050 -2588 -3527 -4556 -2053 1281 878 689 3400 5112 2709 1080
1308 1080 2533 2913 -697 -2603 -201 -89 -2700 -2852 440 1059 -1426 -1326 1486 900 -2440 -2509 -206
1325 -206 -689 -3289 -2205 730 961 -67 1970 4777 4047 2464 3077 3952 2215 -1255 -1179 -289 -2585
1342 -2585 -4506 -3595 -1680 -1840 -3069 -1612 1053 454 -805 416 2169 661 -1417 295 1854 356
1358 356 -1005 1374 3294 1800 439 2319 3356 704 -1272 -110 159 -2458 -4226 -2213 -1202
1373 -1202 -2898 -2652 372 1187 -325 331 2519 2816 250 -62 1713 1027 -1552 -1353 416 133 -1148
1390 -1148 -597 1365 1039 -460 -127 1248 360 -1519 -856 197 -672 -1747 -540 780 237 -85 820
1407 820 1972 1384 61 185 879 -125 -1514 -1039 -524 -1338 -1982 -1102 149 -483 -521 767 1387 734
1425 734 476 1166 1317 549 159 202 772 129 -423 213 850 -209 -386 1 23 -821 -993 -634 -830 -1166
1445 -1166 -1522 -923 -389 -165 -173 -109 852 1004 416 1020 1431 715 238 705 837 -77 -290 314 -1 53 -168
1466 -168 -651 -82 -15 -181 -613 -160 195 -983 -740 453 -213 -795 -8 193 -455 -712 3 148 268 -140
1486 -140 -230 243 1175 300 222 1709 1050 -742 -26 1166 220 -829 416 706 -752 -834 -91 452 -525
1505 -525 -1134 -501 34 -795 -1707 -841 675 -368 -1515 450 1216 -41 -6 2209 2163 -6 259 1487
1523 1487 485 -640 -208 56 -205 -1119 -1634 -457 855 -638 -902 871 644 -1346 -702 871 -130
1540 -130 -1494 -432 684 -284 -510 741 1507 1114 248 12 1027 711 -864 -998 706 -329 -2251
1557 -2251 -991 657 -112 -800 1290 1988 223 -153 1292 1538 476 -614 -139 -60 -855 -2007 -641
1574 -641 661 -671 -1619 417 1109 -1120 -1116 1063 481 -1470 -988 452 -17 -536 754 1632 1664 1099
1592 1099 962 1577 2054 358 -291 550 -386 -2797 -2046 -536 -1430 -2232 -912 -263 -740 -629 656 1109
1610 1109 828 283 -176 399 720 -146 -176 1410 1374 -120 793 1694 1011 56 712 627 -1313 -1783 -1090 -1386
1630 -1386 -1396 -1343 -1155 -394 -315 -258 411 1773 1390 255 767 1178 -205 -672 590 293 -860 -311 106
1649 106 -300 212 629 389 123 326 -449 -739 88 -30 -890 -542 308 -179 -183 671 987 878 839 309 96
1670 96 85 -539 -999 -697 -368 -1867 -1814 101 -92 -674 690 1383 709 334 1011 1447 607 359 100 451
1690 451 -8 -377 -164 813 359 -467 -110 699 -400 -1461 -773 -126 -1244 -1766 -812 -399 -774 -500 340
1709 340 1091 639 490 1241 1776 981 -181 459 1227 -429 -1142 263 469 -794 -965 432 377 -551 -713
1728 -713 106 471 -764 -1370 -74 215 -1005 -1319 545 1107 -662 -140 1596 859 -507 -114 1374
1745 1374 659 -981 -349 779 6 -1037 -289 1003 151 -776 202 1347 472 -938 -6 1026 -126
1762 -126 -1150 -270 703 -480 -1184 -240 517 -121 -1049 23 718 -238 -837 176 1045 -145 -988 333
1780 333 1033 -75 -548 718 1350 60 -676 590 947 -399 -943 322 363 -813 -1214 42 94 -1215
1798 -1215 -1138 570 222 -1065 -372 717 655 -617 -189 920 536 -257 195 815 513 -532 203 1066
1816 1066 485 -525 -82 706 118 -586 -178 455 41 -923 -237 185 -327 -830 -200 199 -226 -910 -241
1835 -241 578 82 -512 79 538 115 -55 60 348 191 -262 176 779 488 -180 756 825 96 -216 218
1855 218 -139 -453 -650 -651 -5 -733 -1037 -315 -110 -419 -381 -8 329 -120 -188 389 411 313 -123 175 666 468
1877 468 34 680 696 724 34 134 421 -345 -658 -466 -297 -714 -874 -737 84 -28 -662 -185 513 383 -37
1898 -37 272 682 194 -464 -17 691 -182 -550 184 700 281 -336 195 693 83 -183 173 253 -213 -760 -265
1919 -265 132 -319 -448 526 570 -27 -377 478 799 -527 -671 -94 4 -996 -1160 151 436 -282 -389 353
1939 353 1058 -119 247 1140 1053 -253 -1 874 446 -359 -214 829 211 -167 -333 468 226 -945 -851
1958 -851 101 -151 -1309 -926 164 -451 -1191 -143 943 61 -505 858 1433 441 170 746 942 36
1976 36 -663 -108 485 -87 -982 -82 498 -317 -917 296 406 -901 -983 80 132 -1000 -634 377 181
1995 181 -312 -249 486 1051 375 18 403 712 -490 -551 553 423 -954 -474 647 -80 -589 365 831
2014 831 389 -329 41 196 -102 -108 -186 31 17 -846 -519 556 -53 -544 124 821 83 -758 103 511 -449
2035 -449 -530 -146 24 -106 -1 201 821 614 196 438 975 432 -710 146 441 -331 -832 -156 -10 -572
2055 -572 -352 168 -279 -167 -190 -78 264 127 -320 43 469 -65 -328 588 876 155 279 659 127 101 161
2076 161 290 -64 -130 -292 -769 -444 -210 -584 -270 89 -125 -682 -70 216 -283 -1 124 278 -115 184
2096 184 263 448 523 178 -448 336 462 -206 420 966 135 -588 104 439 -391 -173 453 87 -517 -452 87
2117 87 -16 18 -207 -268 250 -403 -603 33 489 -230 -747 83 415 -421 -226 641 400 201 -180 215 279
2138 279 185 -169 321 478 -26 -727 226 563 -670 -726 145 45 -1012 -508 458 463 -416 148 777 211 -450
2159 -450 -96 312 258 -319 -196 620 119 -390 -84 913 365 -737 476 581 -193 -624 37 545 -357 -704
2179 -704 133 333 174 -255 -115 707 -79 -623 75 383 -479 -969 -81 80 -844 -364 355 533 -69 50
2199 50 961 878 242 38 707 724 -341 -501 189 381 -289 -419 437 377 -658 -579 648 -68 -696 -315 -243
2220 -243 -722 -1151 -508 129 151 -346 572 1377 774 539 748 1147 496 -412 -136 388 -487 -939 -235 -282 -702
2241 -702 -702 -96 562 -290 -317 95 245 -354 -476 -132 66 -155 -153 393 772 829 848 770 658 389 29 -175 -311
2264 -311 -610 -887 -838 -729 -566 -585 130 524 351 662 728 1038 557 413 166 -61 -481 -405 -112 -206 -375 -122
2286 -122 218 344 1 -95 -46 -354 -432 -892 -418 -470 -428 -401 504 647 847 1110 1382 1280 991 730 623 -45
2308 -45 -418 -971 -1019 -642 -1060 -1221 -391 -267 -205 28 444 538 36 -232 131 70 36 -337 421 693 458 583
2330 583 1233 1224 499 505 546 -37 -915 -940 -672 -998 -1749 -993 -746 -203 -496 172 727 957 817 822 915 649 135
2353 135 -31 78 -222 -341 -216 420 343 -148 -149 674 233 -542 -525 -1 -522 -1369 -843 -95 -268 -119 182
2374 182 971 972 478 777 1306 786 53 -76 -216 -915 -1414 -867 -409 -738 -809 101 729 133 -173 759 760 28
2396 28 -320 455 664 -191 -277 613 697 329 319 948 834 -58 -193 -42 -232 -1207 -1512 -916 -1000 -1500 -981 252
2418 252 334 304 691 1394 1165 765 741 1165 475 -309 -290 229 -18 -244 -376 345 60 -482 47 224 -86
2439 -86 -814 -467 -434 -703 -819 -396 72 -21 175 761 1024 951 427 1113 1163 165 -389 -193 -222 -478 -845 -475
2461 -475 -307 -608 -427 227 410 389 48 337 242 -177 -109 -132 248 -296 -189 95 616 -114 68 507 131
2482 131 -186 -87 14 -505 -478 -495 -383 -222 -331 -112 158 736 670 393 678 720 -5 77 -37 -97 -95 -280 -227
2505 -227 -502 -272 -337 -421 -151 62 -157 -142 127 -354 -400 14 101 -297 -91 466 377 430 594 354 567 672
2527 672 218 221 236 -80 -550 -510 -230 -723 -406 182 31 -457 -30 286 122 -59 -19 90 59 -54 -42 -42 345
2550 345 192 -133 632 565 -169 -244 329 95 -428 -34 27 25 -403 -225 234 369 -210 -271 365 215 -80 -33
2572 -33 259 138 -530 -293 295 -226 -352 -55 464 -357 -154 448 434 48 -93 62 146 -66 -126 37 496
2593 496 -136 -552 149 213 -319 -566 248 214 -477 -328 221 -50 -335 -161 -132 168 -159 -45 29 350 50
2614 50 -309 195 197 -385 -126 362 118 -146 54 370 96 -164 -48 82 25 -495 -60 159 118 -250 -34 178
2636 178 363 -418 12 354 -148 -416 -307 196 -655 -448 24 359 26 52 237 461 301 -160 -126 556 -135
2657 -135 -218 115 283 -38 -435 273 145 -50 23 138 68 -481 -209 -441 -332 -440 -475 -94 217 152 -171 170
2679 170 345 148 -116 662 351 -10 -84 -55 -345 -80 33 -154 36 -95 -214 -217 -51 -121 -57 -39 123 -413
2701 -413 -133 -19 -162 -212 149 63 173 49 322 315 80 257 24 25 -80 -198 -420 -132 48 -173 -140 301
2723 301 253 -30 148 174 128 11 -7 -121 -148 -95 6 -81 348 -6 -277 208 171 -83 -158 -69 -4 -212 -265 -130
2747 -130 -85 -35 51 401 343 70 229 473 451 246 110 327 142 -180 -333 -132 -373 -295 -39 -149 -161 -172 -48
2770 -48 94 -70 -247 169 -83 236 -252 258 172 197 228 242 745 329 432 463 241 3 -123 -162 -41 -374
2792 -374 -520 -295 9 -227 -455 10 443 120 -152 253 679 -164 -302 158 -23 -131 -370 248 570 56
2812 56 -217 306 466 -253 33 265 125 -365 -232 -33 -3 -404 -48 145 -6 -99 127 421 127 -2 16
2833 16 268 -114 -46 -262 237 100 -270 -45 115 -101 -237 131 212 13 18 0 208 -41 -232 138 125 5
2855 5 -171 129 355 -10 -252 116 219 -275 -646 267 -285 -478 -507 -12 127 -431 18 187 412 123 -56
2876 -56 212 281 -124 -241 93 140 -153 -282 378 225 -523 -59 -51 -282 -257 -189 186 -307 -337 -115 -217 -129 -282
2899 -282 -31 402 154 7 73 223 272 227 198 250 -126 228 -58 140 -129 -162 84 491 24 -54 120 -40
2921 -40 118 -191 -285 17 -86 -266 -242 -16 120 -60 13 228 27 32 -24 230 67 -51 -188 58 35 -99 -12
2944 -12 184 149 111 65 294 15 91 -174 41 -55 -204 -316 -206 -148 -259 -28 -70 76 -448 -196 24 -41 -216
2967 -216 -465 -40 175 -235 107 -133 196 -66 -193 113 185 -63 77 299 -17 -25 69 -57 -206 -286 -89 -56
2989 -56 -205 -282 -69 421 -8 -227 38 167 -46 -99 147 -34 -64 -97 59 153 -196 8 464 74 -284 -321
3011 -321 348 193 -504 -52 57 -23 41 -92 160 59 -368 -501 -116 167 -279 -22 286 166 -180 149 167
3032 167 203 -242 -148 310 7 56 86 91 205 173 -52 292 -64 -243 175 54 -53 201 18 46 -187 -462 64
3055 64 -113 -165 -276 -113 -84 41 -225 -52 184 94 -126 355 474 -182 312 148 222 75 -23 181 -135 -13
3077 -13 -190 150 173 -47 -330 134 -48 -79 60 480 22 -357 56 120 140 4 96 58 -139 -137 -29 227 154
3100 154 -59 20 279 237 -390 207 -47 137 -338 -7 281 81 -99 -130 21 161 275 168 96 253 -13
3121 -13 -164 -104 -248 -550 -282 -140 -7 -81 210 81 165 63 159 349 32 171 323 86 131 -134 69 39
3143 39 190 31 -41 42 -25 -168 -150 -64 -410 -295 47 -1 4 -312 -36 198 220 80 197 536 468 15 55 264
3167 264 -10 -226 115 6 112 -23 -77 92 -78 -233 15 137 61 -280 -351 -152 -78 -123 -236 291 -383 -46
3189 -46 49 307 102 37 43 -192 -79 -228 -187 143 3 -208 -222 399 -108 -197 69 47 208 -103 329 215 -272
3212 -272 -164 99 127 -80 -302 162 -8 29 5 217 -13 -301 -67 163 -39 -494 -179 246 -23 34 207
3233 207 57 72 220 311 128 -67 -35 174 70 -42 -243 -268 -39 155 -175 -15 402 -291 -34 -56 110 -66
3255 -66 -180 20 428 -54 -211 169 216 -128 -67 168 57 182 -7 102 194 123 -37 -89 59 -268 -139 -5
3277 -5 -37 56 -174 129 -5 -33 -305 -114 -19 -210 4 45 -64 -175 -343 445 235 -196 142 324 -101 -48 -44
3300 -44 14 -15 -166 22 285 32 -91 182 -86 -157 -150 -291 -14 -72 -177 -98 120 -74 82 -26 277 35 23
3323 23 123 45 -64 159 244 282 209 38 62 -91 226 17 265 -139 -24 -160 -123 32 -55 30 50 -166 -10
3346 -10 -285 143 259 -9 268 210 -58 -37 -135 150 284 -14 64 -36 107 -117 -121 -209 -22 163 -44 -6 39
3369 39 18 60 166 403 271 276 29 -77 -95 -175 -73 -182 -277 -157 -491 72 -180 6 260 273 219 -79 318
3392 318 551 241 123 76 64 -21 70 23 243 -135 232 -97 -178 -72 -190 -145 -218 -390 -77 -291 -151 -188 -4
3415 -4 -104 116 114 202 300 112 162 128 396 215 -77 -91 52 22 -148 -85 421 131 -154 -170 154 114 -130 -159 -79
3440 -79 155 -106 -185 328 115 -10 -39 593 191 -196 357 231 7 -257 78 -35 -176 -341 -298 -86 117
3461 117 106 213 166 293 42 54 294 31 7 -146 109 -132 -410 -281 -46 -158 -96 27 106 -101 149 127
3483 127 78 -224 -351 -55 -63 -34 44 96 253 -111 -31 213 104 -44 183 102 -58 30 -106 -201 -78 -321 -473
3506 -473 -59 -195 -140 -44 197 -11 -77 -47 -51 236 -139 -85 407 84 86 371 267 301 260 144 140 98 -121 65 -413
3531 -413 -35 -311 -167 46 -223 48 75 279 -79 47 116 194 1 -312 -167 145 -191 -352 0 143 -76
3552 -76 126 136 143 140 11 -194 -53 -83 1 137 -138 294 114 214 182 178 258 9 75 124 -109 -68 -184 -405 -366
3577 -366 -172 -278 -238 -94 114 -149 35 202 4 -10 14 145 -75 124 326 -110 -80 223 -5 1 79 173 -147
3600 -147 -38 -173 -82 -140 -609 -288 -356 -210 -413 -47 421 -59 -36 -21 196 -48 -100 265 607 59 3 91 67
3623 67 17 -125 11 10 80 -106 417 211 23 -151 40 -146 -414 -260 -35 -112 -155 286 390 173 103 132 119
3646 119 -104 -1 -240 5 -29 -315 -210 24 142 -360 -94 226 -48 -187 -2 -65 -74 -371 200 48 -68
3667 -68 -230 -117 156 -153 55 256 50 171 -80 -99 103 8 -251 293 17 -257 2 189 48 115 -127
3688 -127 111 47 9 86 -145 116 -116 -87 -141 -98 -188 -110 66 -70 -364 76 35 -162 72 -190 -12 -9 -170 -68
3712 -68 -139 19 -192 -68 192 -81 -127 157 205 -250 -183 275 -26 -254 -27 -57 -33 -56 65 165 52 -123 -272
3735 -272 125 -74 -36 -178 105 157 -41 72 -164 -129 -67 -288 52 110 28 -64 61 -216 -101 -42 205 39 126
3758 126 90 -142 97 -222 186 -114 14 -174 -130 85 -120 121 -119 170 116 25 -92 206 224 -141 8 4
3780 4 2 40 -124 258 -64 197 -307 -152 -40 129 33 -89 216 -164 -108 128 135 -77 42 0 56 -4 -130 -84
3804 -84 -192 -166 -77 -43 -196 165 -184 310 188 63 98 56 6 -106 246 -26 -55 -25 -121 51 189 23 -71 -94
3828 -94 59 -71 -158 -35 -158 -190 -238 -226 -185 -183 -77 -60 -78 22 202 55 -54 -142 253 -122 -176 -100 -77 126 -10
3853 -10 76 -281 98 -24 212 19 70 35 -369 182 -99 -213 -246 -66 -3 30 -325 126 191 72 261 179 345
3876 345 64 -80 133 74 29 -435 18 151 64 -200 -374 219 -148 -181 -91 -154 -115 -37 -54 90 -42 -79 203
3899 203 -40 51 92 73 104 110 101 -31 -130 -159 -33 -98 -56 95 -204 141 221 263 3 502 216 62 173 202 -193
3924 -193 -411 135 -147 0 -7 67 103 26 -11 31 24 -46 184 -27 -131 58 74 -52 -79 -227 23 126 73 167 370
3949 370 245 269 44 50 -33 49 -140 -116 -101 170 -216 139 -142 -69 244 -106 139 6 154 149 -97 -1 45 -25
3973 -25 -3 -77 286 51 30 -8 254 45 -108 -47 -226 111 349 -192 113 -56 -175 -280 46 125 -52 210
3995 210 -70 281 257 213 -383 -54 54 133 -21 205 130 -2 -131 46 3 -155 68 266 115 155 -4 47
4017 47 -18 41 16 4 160 66 -105 78 336 55 -58 145 101 -234 -27 0 -86 32 71 137 175 191 -27 155
4041 155 106 62 -125 254 112 23 -27 -2 42 -192 43 283 70 -32 87 -11 -68 162 -41 -204 137 -211 59
4064 59 -51 262 -30 -174 274 356 -239 32 64 15 -170 19 174 77 3 -143 -122 360 168 -65 45 111 -234
4087 -234 -87 395 -78 -223 -112 4 -80 74 25 -291 65 -151 -223 194 -51 -185 -158 177 -224 129 250
4108 250 54 248 -237 16 -28 29 -101 22 -162 -40 -3 -187 126 -214 -269 219 64 -314 -81 270 -61
4129 -61 -156 -120 -6 -190 -17 -23 342 -50 176 82 232 165 115 148 -112 273 -81 -25 31 36 -293 -46 155 94 -112
4154 -112 -21 72 -162 165 79 106 45 125 -128 221 20 -120 -192 91 79 -211 12 190 200 -162 99 -41 -83
4177 -83 56 140 55 102 -61 162 -40 3 -1 26 -32 190 -28 14 -153 -211 -32 -169 -106 88 65 -118 38 105 201
4202 201 118 -30 431 14 -47 324 98 139 68 -71 276 13 29 -221 30 -33 109 -187 76 -103 -89 -229
4224 -229 -25 -79 25 50 43 -93 21 -8 -85 139 40 -40 166 10 -113 -13 -163 -127 27 195 -223 44 -142
4247 -142 24 -116 -40 134 163 25 67 104 59 -168 32 339 -49 -135 133 -21 151 133 149 -35 7 -305 -108
4270 -108 -303 -28 -286 -138 -55 12 -120 -10 97 85 94 70 -37 -183 -122 -277 71 -74 9 -58 -23 -64 -72 -101 -46
4295 -46 -18 -79 -30 -186 146 -209 -96 -2 7 -5 63 377 186 -272 -208 171 -313 -14 -143 -126 44 -42 -171 57
4319 57 -223 -190 127 4 -67 10 248 63 183 -68 43 -139 -82 -146 176 105 68 217 -164 127 41 -11 154
4342 154 -46 -73 -61 -133 -25 -210 -229 -21 39 -319 -9 107 -86 -151 195 20 -58 41 -28 -167 106 -61 158
4365 158 148 87 89 219 -1 -63 0 -106 23 -49 -75 -201 122 81 52 55 -265 -114 -38 -65 -150 -89 106 116 -120 145
4391 145 -115 -52 11 56 -52 102 103 -106 -65 73 27 -203 44 57 58 189 31 59 -98 173 -18 -310 -192 -262
4415 -262 -257 206 52 -108 -127 -126 77 -149 -52 156 147 21 249 76 -104 117 155 6 189 -1 189 -88 94
4438 94 -84 -167 207 242 -35 34 -87 -125 125 -115 -178 125 -138 -239 139 183 57 47 93 37 44 115 77 77 -94
4463 -94 -162 -13 -1 -80 76 -109 -198 142 28 -24 273 -201 -145 50 -203 -239 -161 105 -148 -34 51 11 -110 -255
4487 -255 11 -69 63 97 171 212 13 -147 -96 70 81 97 140 107 -98 -296 -34 -12 -62 87 -86 -330 34 -26
4511 -26 -109 418 140 -24 213 34 -103 -116 -253 -30 -191 -144 361 55 -134 -387 57 19 -121 -160 28 -139
4533 -139 -98 -15 135 40 -50 -131 189 202 246 -282 184 49 -349 -83 -101 -61 -28 -400 15 232 -162 22 1 41
4557 41 -135 116 -4 52 85 59 7 -69 43 281 13 -127 -132 184 106 -230 -172 -20 61 157 -158 166 127 -92
4581 -92 21 236 -37 92 148 112 315 -2 -165 186 72 -58 75 -304 166 78 -164 62 -48 116 21 -243
4603 -243 142 -58 -106 82 7 85 226 -108 233 327 31 -247 -99 82 -38 66 149 -181 -51 -274 -175 -96
4625 -96 141 174 70 -131 -94 -82 78 94 -74 -25 56 256 -300 154 38 -28 -239 -20 215 -34 36 -32 -96 -55
4649 -55 -144 -397 -63 8 -144 -42 116 270 118 -48 205 -139 -21 229 133 -139 -156 188 4 211 43 -39
4671 -39 277 -17 -382 -178 180 -219 -83 137 10 -246 240 220 140 7 66 133 -92 148 86 -29 104 -153
4693 -153 -138 -39 73 -205 219 49 31 -160 -108 227 27 -208 164 -30 155 -132 37 -248 -36 108 117 447
4715 447 -110 -228 156 43 -239 -11 -263 221 -196 -9 22 288 58 49 180 456 27 66 210 72 -74
4736 -74 -73 -81 -217 182 33 15 -130 99 119 -27 -49 -222 29 19 -98 -151 -27 -84 65 -69 29 120 427 -235
4760 -235 17 288 232 -170 -127 44 -32 -133 28 -85 24 -56 -50 47 75 -58 -84 -32 -40 -184 -287 160 260 -13
4784 -13 263 74 335 251 -9 322 -15 31 -191 246 147 -147 -21 263 -145 -272 -100 72 12 -363 -83 10
4806 10 127 -88 123 -92 -46 -54 72 155 171 -137 67 209 -161 259 -147 130 -67 -34 -14 -29 196 171 -123
4829 -123 118 81 190 109 -198 38 -17 126 -42 102 176 -249 -63 179 153 -53 128 -121 -114 87 -107 174
4851 174 -202 -200 36 30 174 -72 -113 20 106 -205 69 -464 17 -142 -113 -94 30 73 46 -32 42 141 -20 -93 -63
4876 -63 201 -80 -14 -142 -152 70 -117 48 98 -29 -117 -77 111 202 8 0 -165 -179 180 12 -88 -130 -124 134
4900 134 372 -63 -101 27 363 -127 56 -99 -27 -121 56 22 -139 140 -48 238 91 13 -184 -171 242 -43
4922 -43 -182 54 -40 -232 -93 -126 137 86 -70 -60 79 277 -208 -44 -124 120 52 55 -65 -52 47 228 1 175
4946 175 212 89 190 -66 33 -47 221 -225 12 103 -6 -219 266 89 95 105 -185 -28 132 -107 -24 -156 -174
4969 -174 67 -81 171 24 -101 -19 350 -59 -100 -101 52 22 221 100 39 -11 19 -143 -115 -253 -72 -116 -39 -5
4993 -5 -70 8 -231 -245 23 -103 121 42 -295 -232 177 -35 -219 -6 -66 188 -124 117 234 77 61 -1 254
5016 254 114 55 6 144 63 132 155 106 -143 -52 -142 -225 -35 112 163 362 10 75 149 -63 25 2 -19 185 -163
5041 -163 -140 35 255 67 -133 -30 -47 -174 38 -36 66 -16 -2 -32 -73 -165 -72 -180 -60 -40 -80 120 54 20
5065 20 -16 70 107 243 110 -78 54 -112 -11 70 105 -101 151 304 131 330 182 -198 -151 -318 97 55 -48
5088 -48 -243 -3 107 -40 78 60 -68 142 -77 34 127 -5 -172 4 28 -108 -88 -208 146 19 -76 -3
5110 -3 9 -76 237 -130 221 85 -9 312 265 52 166 204 -60 -197 -312 72 -42 -113 -30 54 -14 -42 -69 32
5134 32 301 -86 72 -58 -71 223 233 34 229 123 -106 -140 28 -135 51 -115 -62 34 -157 -151 -125 56 95
5157 95 157 144 -29 99 -123 83 76 51 207 56 -156 22 -98 -70 179 -96 -133 -13 16 103 92 -155 -344 -16
5181 -16 88 108 76 94 25 -3 204 45 -64 -5 47 2 -200 227 -2 82 -5 102 75 -35 -91 15 -95 138
5205 138 -69 258 -46 4 -7 11 43 15 -220 77 226 -133 -193 -151 -62 45 47 -100 -283 -42 137 100 -124 -17
5229 -17 204 -13 7 -125 -115 -21 141 -101 -42 175 80 156 63 -13 432 102 141 73 -199 -45 -12 -123 193 129
5253 129 -185 -256 72 211 78 -45 52 -143 -34 -12 -44 83 203 -9 -15 273 96 163 93 64 261 121 13
5276 13 180 31 247 47 60 -22 344 23 134 91 -85 -42 47 320 79 -165 -160 147 -4 -113 -200 -83 -107
5299 -107 -138 42 -60 -3 119 -293 -90 58 91 269 -291 -138 148 234 63 -52 48 -142 145 27 188
5320 188 -33 49 219 259 -139 -84 -329 -24 49 178 -83 -160 -77 -83 -224 106 16 -174 -106 197 15 80 -18 -255
5344 -255 -71 -137 -156 -93 13 -203 34 75 -206 -30 24 -170 -78 70 -17 163 28 -141 -88 228 243 107 -208
5367 -208 -119 -14 100 127 88 53 -55 -31 -159 115 106 16 -77 139 -20 -35 -16 -116 -165 75 -191 9 27 -235
5391 -235 58 82 155 -31 154 128 123 161 -165 127 133 -38 -273 -264 63 -18 43 181 50 -193 -23 -23 -98 142 -250
5416 -250 -158 5 113 212 67 171 28 -9 37 246 172 -16 -213 -97 85 67 24 4 55 -14 -174 -116 -163 80
5440 80 80 -127 -229 -276 31 29 -161 -76 -239 -68 55 17 -41 -158 -50 -132 -79 120 -91 71 11 105 12 -102 -40
5465 -40 181 17 -114 79 -115 91 103 -67 -2 266 -18 -33 -117 246 37 -27 -1 -3 141 55 -24 -193 138 -37
5489 -37 93 149 -29 -134 211 175 -115 -27 -121 31 207 -122 184 -6 65 -145 144 -12 -64 -84 150 92 -101
5512 -101 56 24 -48 45 -183 -165 -126 -32 -210 -66 146 -114 115 -39 13 169 -140 -167 -118 -119 136 -76 -11 -105
5536 -105 -214 71 50 -18 182 175 -16 293 -123 -30 -138 23 136 161 -11 -237 61 108 -105 -404 37 11 109
5559 109 -84 -133 44 168 -32 138 24 259 -47 2 -158 240 -43 -105 266 -347 37 -129 132 100 -83
5580 -83 -119 -39 122 169 31 177 140 -61 250 238 111 201 106 71 103 45 -19 -52 -120 -28 -97 -39 -117 -177 206 167 -130
5607 -130 -290 -191 207 -66 47 103 56 186 257 63 -121 -93 -9 261 111 117 -156 -230 72 -68 56 166 -171
5630 -171 102 -134 153 76 52 -105 -2 84 -141 170 77 -61 -39 -93 -90 -168 -187 -155 -13 -123 -8 232 5 247
5654 247 -12 235 -115 -127 -30 -89 103 -15 127 -11 -152 45 103 -83 -237 -130 -271 10 -309 76 -28
5675 -28 -82 41 -4 134 23 414 109 164 18 322 104 218 -220 -178 -93 -150 57 -4 75 -70 105 126 -17
5698 -17 -21 -127 136 -19 -73 -22 -123 -6 -107 122 208 84 -20 84 131 -91 -85 75 -48 20 -28 60 -145 -8
5722 -8 13 -144 165 -225 -77 41 21 94 -82 -217 -152 -52 -124 -70 115 -22 -112 92 -113 -135 -9 57 256 198
5746 198 165 20 -134 -88 76 186 137 278 -106 95 11 279 84 -14 0 241 -138 42 -117 91 113 13
5768 13 110 -87 -115 58 176 165 -155 68 -264 146 71 -312 23 142 58 -163 224 -355 -46 181 -175 192
5790 192 241 -233 -88 -164 -14 -101 6 39 -252 191 -92 97 -130 171 -39 122 -13 -31 43 -105 85 233
5812 233 -21 -6 -135 -328 40 -149 -108 127 200 -168 6 -351 -239 105 25 -82 381 312 32 218 3 215
5834 215 -15 -12 -35 23 82 -22 -39 -96 -18 52 57 246 204 -15 138 -111 216 18 -35 -234 188 -259 -11 -72 -268
5859 -268 -142 -197 64 79 105 -41 18 4 -98 -62 63 92 -123 -87 124 96 -150 143 104 -204 101 60 -100 199
5883 199 76 -335 199 -145 158 37 -117 -7 -273 20 -73 74 -137 -92 59 99 141 4 -102 101 -55
5904 -55 141 37 200 147 55 82 -176 2 -71 109 -109 143 -148 65 165 139 148 101 -114 -215 -89 -67 -5 -147
5928 -147 79 143 93 19 -50 -94 117 -62 -275 -57 -207 -77 57 176 -224 61 -24 -180 108 -68 284 120
5950 120 -29 -29 -319 -380 21 19 -21 -37 -59 -27 -182 130 339 -30 11 36 94 -16 -85 155 51 -24 -81 -185 14
5975 14 -179 23 -50 314 -8 132 58 -149 126 -19 156 7 39 -244 -335 -63 -34 -77 135 -163 -93 -99 24
5998 24 -156 74 179 169 -145 175 401 272 2 228 -131 40 22 -72 109 -15 -105 -122 -77 -90 -6 -64 32 77
6022 77 -46 -197 -57 -160 -122 -187 143 47 -186 -83 -296 141 -28 -260 404 -86 5 -145 186 242 -67 20
6044 20 256 70 11 19 -125 -48 -93 -74 323 -230 -184 -254 2 515 187 -182 51 29 283 27 225 -107 5
6067 5 -53 133 -19 43 51 39 -53 -216 -389 78 130 -28 -32 372 118 -305 219 153 113 271 69 23 3 41 212
6092 212 154 -13 -212 -34 -64 28 175 -110 22 16 126 127 172 44 -10 -87 50 -14 37 223 -163 -14 -217 -116
6116 -116 90 121 -169 193 -85 140 221 170 155 15 10 129 30 41 -54 138 -196 -114 109 0 -415 19 -47 126
6140 126 108 127 75 29 246 70 80 128 139 -85 306 182 -169 135 -109 -179 -167 17 -46 149 -74 -233 114
6163 114 152 -69 -73 173 78 -166 -120 1 -223 -128 -103 123 271 -124 166 32 93 17 -36 -106 -40 154 50 -100
6187 -100 -13 -116 -164 199 -159 -186 -39 58 101 -137 55 -133 116 102 120 90 131 162 -41 89 318 139 -114
6210 -114 -183 -93 66 102 -104 -41 -67 -236 -161 -151 197 77 69 -258 -74 80 118 43 125 352 -29 -17 -15 127 -88
6235 -88 -51 -96 221 17 226 193 78 192 72 126 104 -184 -56 -50 -50 -48 -131 -255 -61 90 -92 -84 -213 -213 60 -92
6261 -92 -40 147 159 -233 -33 -144 -2 -32 7 200 42 262 16 242 129 301 233 120 229 -156 172 26
6283 26 -74 -198 -8 24 -51 87 -171 70 -213 -167 54 -7 -161 233 143 -427 -6 -202 -99 113 -32 -156
6305 -156 86 -34 -181 86 -3 83 -149 -6 -21 36 -127 197 -53 68 -8 -138 29 -30 61 10 195 36 -100
6328 -100 212 108 -104 -41 -106 31 210 -148 92 -84 -52 -61 -139 88 -65 161 190 -29 54 120 28 366 -247
6351 -247 -262 -38 327 142 -485 193 -189 20 -56 134 -115 -139 49 -45 86 -45 45 -270 -115 -93 -157 -113 125
6374 125 -33 76 5 72 16 35 -83 -77 103 -216 -79 -93 126 -27 -264 23 -282 13 30 -16 -266 156 -99
6397 -99 -10 177 43 -42 -228 9 -74 100 -161 75 123 -34 -131 -86 30 -249 48 -95 -129 -73 191 166 -118
6420 -118 106 115 -7 151 138 140 -54 107 -128 70 54 -60 18 71 5 -127 98 15 -104 31 -160 -46 208
6443 208 -208 99 11 118 -178 137 47 87 53 -14 -32 17 -26 10 136 115 -78 11 133 18 -130 56 -86 191
6467 191 31 -182 198 -22 96 160 70 81 21 175 47 -61 161 34 194 -43 -152 -78 -70 -135 143 -271 151
6490 151 -4 -141 -38 131 -135 114 152 171 -26 223 43 -136 114 298 -101 7 28 154 -268 -148 45
6511 45 -14 191 -159 -35 3 -13 -170 -93 170 -240 68 73 89 -39 -130 135 -159 -58 -10 64 -4 -74 -81 13 -164
6536 -164 -61 68 -35 222 -130 -9 131 26 112 -301 -197 -8 2 -116 -59 -69 223 133 125 0 -162 336
6558 336 133 -29 149 157 -112 64 -10 -67 122 -119 45 -157 -82 -27 -39 -157 -114 73 39 -13 -144 -230 -28 160
6582 160 39 -65 -11 -57 16 -265 23 -162 97 -57 -110 -102 30 171 -78 -108 -94 -179 33 181 -40 -182 -261
6605 -261 -51 -29 43 -116 -11 68 42 35 -324 28 93 -217 5 114 113 -248 -144 12 -3 -3 -97 -151 26 80 -152
6630 -152 -128 -105 278 -255 84 59 82 137 28 12 -208 75 -173 48 -5 68 144 28 290 8 -88 279 -233
6653 -233 -83 50 106 151 140 164 -14 -241 -66 -32 194 -54 7 62 -250 56 -103 84 -68 -124 -63 -72 -96 -17
6677 -17 240 29 -79 -141 137 132 -178 -41 30 -38 -60 48 162 -232 157 -43 -67 -125 205 172 -140 -116 -53 234
6701 234 -194 -109 -72 -204 -270 -32 -170 -13 -77 50 -126 -229 -231 -170 108 -52 14 67 137 -138 321 62 150 189
6725 189 150 17 116 50 -200 -33 -101 -119 116 111 -101 -218 -20 -127 57 2 -61 110 16 117 134 -50 3 -11
6749 -11 -4 -25 -106 -54 -113 -6 -87 8 221 -167 47 -112 196 51 -34 30 25 -117 23 40 -46 23 -175 2 83 -161
6775 -161 183 -146 -94 44 400 189 34 -12 75 -133 -61 -117 -59 -58 -13 -74 59 68 143 43 -80 6 44 60 -8 -111
6801 -111 102 107 -222 -18 47 -19 -55 -80 -29 -102 -53 257 362 179 -14 89 222 146 -113 -5 420 -136 286
6824 286 41 -190 -94 119 203 -28 13 -77 8 31 -160 39 -81 60 -108 54 -79 119 169 196 -21 52 216
6847 216 -239 77 -56 110 -106 128 -52 16 -126 8 121 -20 98 119 -68 90 -58 30 137 240 -51
6868 -51 110 -68 -122 90 -31 56 -54 36 -178 -153 171 -147 -142 -122 -36 -21 147 98 -76 -91 73 19 21 -205 123
6893 123 -28 83 58 -96 -72 -69 -154 -180 50 149 86 277 -3 15 69 -133 -76 104 251 -237 -160 28 -124 48
6917 48 12 -75 -16 147 241 60 -62 -141 -111 -180 -153 -300 -96 -38 -94 8 -29 38 -68 -36 -92 -100 -61 138 51 -76
6943 -76 -116 -111 104 -4 232 -62 25 237 79 -242 -21 185 14 -8 67 -6 186 -317 -96 152 -187 -49 -53
6966 -53 183 1 -33 120 -234 80 192 118 -128 -21 -146 -105 41 -157 83 -48 168 -31 -57 -49 -143 -189 -244
6989 -244 -1 -32 182 -78 -140 212 212 42 152 243 50 105 154 23 128 -67 -164 -36 68 -79 102 -55 110
7012 110 -266 -188 94 64 -58 -63 68 -207 -91 -276 32 33 140 121 157 124 -127 -296 57 33 -60 -61 -213 235
7036 235 -181 -194 143 62 -17 -77 -121 -6 -148 -111 144 -149 -181 7 -172 189 8 -89 -3 -78 -155 -32 -71 -48
7060 -48 -152 -394 175 277 -30 178 109 -163 102 -123 -68 -101 -176 -7 154 293 -71 -143 -119 -30 36 -110 31
7083 31 148 8 26 36 -77 36 135 74 306 34 145 13 176 -123 109 -73 -89 182 -400 -4 128 -61
7105 -61 -219 -159 -29 -174 -93 -193 -169 -207 -295 69 128 346 -183 239 -80 -108 -111 20 -134 28 98 -136 177 1
7129 1 145 127 157 -1 113 264 -135 117 -43 223 -110 -338 54 154 253 -142 11 246 -344 -35 -59 9
7151 9 -34 -162 12 -158 -79 -205 109 199 122 29 102 104 61 -45 15 239 47 162 73 184 43 -101 43 -27 -130
7176 -130 -11 -25 33 -128 77 3 -38 -172 -11 -19 -58 -235 -176 -53 48 -232 -453 -123 -163 112 -354 13 -63
7199 -63 92 -60 182 243 -80 -142 -232 -136 -86 48 3 89 68 56 142 -222 -51 30 30 195 249 -73 -175 -66 7
7224 7 -66 -131 60 81 62 10 51 -138 -20 -302 104 -75 30 -155 -131 26 36 181 135 39 4 -162 97 173 45
7249 45 52 -15 36 99 98 209 38 7 -112 -119 405 127 -152 -35 -64 -34 -50 -246 28 -25 228 160 37 253 -43
7274 -43 234 91 214 103 121 44 2 15 -70 136 -225 -13 -133 135 0 -72 -108 -113 293 36 -37 -249 129 54
7298 54 -5 -181 53 10 -189 89 -133 -35 -8 -99 150 120 109 96 -322 -172 -201 40 49 -170 238 324 220 143 102
7323 102 -6 -194 -20 308 158 -92 -166 22 129 -11 -258 22 -19 51 -73 -109 44 88 356 85 -158 104
7345 104 -15 -19 -229 133 80 3 112 317 408 -74 -50 -137 140 -207 -124 -137 9 -71 43 130 172 65 -9 -150
7369 -150 96 -120 146 126 -239 -99 -129 -125 49 196 176 -62 135 128 -14 73 158 -209 -51 196 -265 -18 -75
7392 -75 -5 -47 -7 -291 92 -158 -142 -48 -22 -175 189 26 126 84 43 71 -43 57 42 245 -257 -193 -190 -52 -1
7417 -1 142 208 -137 -89 -357 148 128 69 117 96 -124 -74 56 -88 55 -234 -323 10 60 -16 -26 78 -139 -149 239
7442 239 80 -69 71 124 -271 185 -90 81 -157 -208 -45 -70 -58 -72 -68 208 -231 -59 -139 28 -6 -240 11
7465 11 -65 -33 -58 206 -29 -64 199 94 62 -80 168 -174 41 64 224 79 -181 311 -54 209 -94 33
7487 33 -52 73 28 -63 -236 -46 -321 95 -63 -117 -24 63 -172 -234 -149 126 -59 -33 -146 -241 117 67 -42 -83
7511 -83 31 49 75 -21 52 -226 -182 20 -77 122 164 55 118 158 150 120 -5 -161 -12 -85 -144 -5 43 46 105 168 -176
7538 -176 -432 -75 89 -149 186 45 112 -204 -169 -62 60 -63 176 -137 81 98 -226 13 81 8 60 -112
7560 -112 -204 17 -53 242 104 -23 -143 -30 246 -39 -11 105 29 -156 113 -326 63 -119 -21 -22 153 129 14
7583 14 42 -173 -106 119 214 -120 184 -67 -24 27 -70 103 4 -229 279 53 189 43 16 -38 164 32 39 134
7607 134 -52 -106 41 62 -27 115 -57 190 208 380 26 -43 -96 -152 14 47 110 -155 -84 27 19 -13 214 153 140
7632 140 -73 -12 29 71 63 104 -177 -294 165 -319 188 -16 45 193 126 127 150 212 -347 132 -269 -15 -161 -44
7656 -44 -134 -104 -121 -4 75 260 -258 45 -64 -31 -66 155 -28 -15 -163 97 -325 -66 -37 15 47 13 -6 -254
7680 -254 -54 43 -239 -79 84 -59 64 146 152 149 -19 144 288 -88 -29 187 -101 -45 123 127 138 -162 112 -186
7704 -186 -67 48 -124 0 -199 -70 257 4 57 -148 43 -41 -188 125 160 -13 303 -134 -77 -173 114 -123
7726 -123 -112 142 -168 -92 243 69 -197 111 -78 37 66 45 -60 -153 114 138 42 154 -47 37 14 18 -108 101
7750 101 13 53 -13 -141 42 -259 107 -4 -155 -93 140 21 40 227 169 -89 7 -164 -17 -7 173 -136 -222
7773 -222 -87 -183 -230 88 30 -229 -7 64 -171 0 -106 26 -24 -109 -164 33 39 79 46 -168 253 4 -301 149
7797 149 309 79 30 -43 105 -14 -16 -247 -23 -127 -43 -41 42 -96 -182 78 13 62 10 -118 -9 -91 47 -170
7821 -170 29 116 66 104 14 27 -100 17 -25 -324 -12 59 -141 -28 69 -184 -40 281 190 199 62 2 -57 167
7845 167 286 105 94 61 90 44 1 178 -85 -158 67 46 -6 95 131 94 -194 77 -221 -66 -22 -96 151 41
7869 41 167 -33 -188 22 -4 -134 -238 245 86 143 -88 -138 97 34 211 220 191 -177 55 -119 9 98 121
7892 121 -92 -88 -32 73 -26 -109 169 -34 -26 -115 -46 -102 -211 -46 102 -35 74 177 21 203 82 200 -62
7915 -62 -197 -85 -40 4 -13 -214 151 -106 130 -182 78 -26 60 5 -73 51 -203 -234 150 220 77 -10 -249
7938 -249 242 -230 -10 -25 86 95 -180 123 161 -168 -15 -287 -2 80 -265 160 55 131 -97 8 148 83
7960 83 -19 -182 76 96 -70 -10 45 80 -60 2 -24 166 -63 177 -220 -5 85 -88 55 -208 -13 -284 -179
7983 -179 -146 8 -105 21 6 92 -38 39 110 10 2 -67 -41 -72 -207 -159 -164 -1 10 -71 -115 95 -190 -30 -79 5
8009 5 -27 345 -109 71 52 125 -4 -2 -156 -77 -103 5 310 -69 -71 113 -6 134 45 -132 -100 -95 276 31 0
8034 0 72 209 -353 -15 -23 445 -174 -17 154 -2 57 -11 26 -101 6 122 -14 151 192 -31 9 -156 1
8057 1 252 -120 199 -31 -12 -28 -2 -3 12 362 71 188 -18 17 -116 161 61 95 155 -110 43 31 -75 -113
8081 -113 332 212 -172 145 -215 4 -194 -180 -178 -170 264 97 52 -59 -61 -156 119 -63 4 194 -159 -37 -225
8104 -225 80 85 -30 15 -137 -70 -106 -108 -205 -12 208 -33 -60 -143 -157 -41 89 -51 21 -91 24 6 -25 214 88
8129 88 18 -68 -122 -195 -116 252 107 132 -186 -262 83 -9 203 -81 139 183 40 -131 -62 -166 -154 128 185 -117
8153 -117 -145 191 -28 34 -25 161 -195 -55 126 178 -204 -50 262 229 -23 62 86 -217 149 162 87 -367 -46
8176 -46 175 -179 -240 263 -7 -214 41 -130 -49 -30 1 -122 -14 58 150
8191A50
$$ Imaginary data points
##PAGE= N=2
##DATA TABLE= (X++(I..I)), XYDATA
0 0 0 0 0 0 0 0 0 0 0 0 0 0 0 0 0 -8 8 -8 8 -8 8 -16 16 -16 24 -24 30 -32 40 -43 48 -56 64 -72 81 -93 102
37 102 -117 128 -142 158 -177 196 -217 240 -265 293 -323 356 -391 431 -475 523 -578 640 -709 787
57 787 -881 987 -1113 1270 -1458 1702 -2025 2473 -3144 4254 -6406 12114 -58558 -129123 56048
72 56048 120290 26234 -12895 59099 68745 33951 30440 19308 -34983 -29506 34927 31804 -60763
85 -60763 -78376 23798 76898 -11431 -75095 -12282 42980 -6895 -57988 -40830 -12781 -8605
97 -8605 -1871 -5580 -14840 16265 59497 50890 28572 32284 26590 10223 20799 12010 -45897 -61258
111 -61258 -4071 4876 -58361 -66310 6073 40156 2403 -18821 13857 33176 10339 4781 19346
124 19346 -4039 -31562 8241 42616 -13543 -50089 27238 77797 2518 -49833 7265 43462
136 43462 -7324 -45702 -28129 -17938 -27043 -21024 -15611 -22342 -4019 34154 39205 10084 6098
149 6098 40323 52706 14841 -14872 -1489 11486 -7652 -26136 -22081 -12649 -3637 2802 -12122
162 -12122 -23597 3173 20863 -10877 -29180 -1491 7391 -18731 -19000 8828 11044 785 16575
175 16575 31297 18977 12211 26952 28694 2659 -12288 -7 -1647 -28758 -34225 -9515 -5904
188 -5904 -27045 -20121 10234 9194 -8711 4631 22319 7483 -6992 4436 8891 -2964 -4092
201 -4092 4471 2850 1738 9069 8671 3361 7871 10800 411 -9881 -8315 -5067 -11449 -17887 -12793
216 -12793 -4821 -4078 -1530 6101 8207 5875 14881 21025 2599 -9483 9342 15325 -12776 -24983
230 -24983 -146 9731 -13512 -19363 3290 10187 -2936 -3162 6215 2798 -4375 2191 7185 -4556
244 -4556 -10773 5392 14377 -1044 -8656 10485 21577 3789 -8067 4630 10045 -4024 -12342
257 -12342 -7979 -6154 -9723 -10180 -7429 -5458 -2485 577 2658 4867 5088 3183 6117 8725 2954
272 2954 -1721 2053 6988 1300 -5176 521 8039 1766 -6055 149 6955 -1658 -10972 -2103 4524
287 4524 -8286 -14139 260 5863 -8137 -10269 6743 10346 -4679 -4652 9964 8814 -3902 -2705
301 -2705 7342 3827 -6171 -1733 6915 351 -7455 1344 8817 -276 -7629 2148 9400 -1079 -8112
316 -8112 428 5745 -1422 -6897 -2504 1501 -1305 -4439 -2573 302 -643 -2153 -662 2083 73
331 73 -1440 2431 4367 559 -1594 2853 5736 456 -2792 2021 5541 938 -3475 737 4976 -86
347 -86 -5577 -768 3080 -3649 -7523 -1490 1731 -4400 -6284 987 2713 -2230 -1272 4343 3827 56
363 56 1357 4515 2348 -2118 -1089 2874 649 -3905 -2610 2807 2189 -1561 -391 2701 2274 362
379 362 616 342 -400 -753 -1083 -1563 -2119 -1606 -1257 433 1603 -1141 -2269 1904 3353 -2082 -4987 -1573
397 -1573 931 -2081 -4152 -1691 1200 2128 2327 3343 4514 4322 4228 6590 4527 -2507 -2730 2860 1318
414 1318 -7421 -8058 -8 1304 -4902 -6368 -1491 1800 -17 -2699 -2501 -1118 -1060 -242 1567 53
430 53 -1869 2151 9075 5841 -1720 2940 12028 7519 -3036 -3485 2470 1572 -4988 -7251 -4645 -3044
446 -3044 -4721 -3749 -588 -788 -2881 1964 7328 -285 -7581 1510 9399 457 -8690 -1322 6948 2191
462 2191 -2853 1677 6079 3058 140 1519 2243 -3149 -5244 1826 3077 -8100 -10755 2927 8687
477 8687 -3077 -6435 6461 9572 -601 -3396 2827 3628 -1857 -3254 -1037 -2935 -6653 -3886 3517
492 3517 2519 -6350 -3977 8511 6182 -7011 -3144 9527 5800 -6727 -4169 5015 3400 -2122
506 -2122 1228 6301 3245 -2328 195 6341 2420 -7080 -4202 3433 -4329 -14503 -5739 5595 -2345
521 -2345 -10489 455 8244 -63 -3504 6051 10389 2397 -3414 2060 6269 594 -4303 2215 7308
536 7308 -703 -6230 2646 6511 -3723 -5054 3838 938 -10586 -8147 1432 553 -6333 -5377 1727
551 1727 3672 -755 -1980 4622 8969 1982 -2158 3342 3372 -3263 -1530 5288 1330 -6616 -2934 4801
567 4801 2207 -3777 -1386 4441 4147 -2718 -6096 316 4470 -1403 -4550 133 606 -4241 475 5902
583 5902 22 -4664 2992 6123 -2423 -6928 -664 4865 1272 -5733 -5850 1519 5462 1267 -1514
598 -1514 3171 4713 1856 1895 1825 -1715 207 4419 619 -6326 -5777 1499 3335 -1006 -4680 -4086 2081
615 2081 3356 -4232 -6405 2023 4960 -1517 -4501 -550 1846 2032 3629 2358 -111 989 3954
630 3954 4326 1600 -1937 -503 4848 1580 -7213 -5625 3354 3141 -4473 -4782 241 -394 -1717 597
646 597 -17 -1885 -1001 1605 715 -2132 -2524 1636 5610 1528 -5052 -1245 6619 4561 -2970 -1333
662 -1333 4009 2406 -1464 -1141 963 744 -283 215 -538 -2525 -2402 932 3122 -2017 -6523 -182
678 -182 5482 -2137 -7433 203 5777 -831 -5599 -49 3666 509 -1239 2369 2910 369 -165 3625
694 3625 4241 -1151 -1510 4200 2804 -4518 -4495 2668 2305 -5068 -4394 1814 1179 -3810 -1991 2087 1277
711 1277 -2456 -1514 1853 698 -2653 -970 3097 2001 -2975 -684 5054 3005 -2017 379 4529
726 4529 1373 -3092 -1414 2055 -489 -3589 -1504 1399 -620 -2912 712 3959 331 -2551 1392
741 1392 4039 -1127 -4522 -103 2311 -2490 -5006 -559 1874 -1117 -2346 1053 3092 123 -721
756 -721 2054 2436 -512 -1001 1835 1708 -1751 -960 3215 3088 -945 -133 3334 2414 -1439 -2666 -151
773 -151 -782 -4329 -4624 -2523 -2263 -3182 -2463 380 1188 790 1906 3704 2774 1249 1897 2780 1614 -786
791 -786 -207 1823 945 -1098 -314 1431 1168 -939 -1125 -300 -1135 -2950 -3544 -2561 -2470 -3264 -2458 85 773
810 773 289 1780 3714 3539 2034 1684 2875 1618 -815 -1265 -508 -589 -1789 -1762 -288 398 -50 -179
828 -179 1388 1243 -256 -932 326 123 -2225 -1905 347 387 -857 -1116 2144 2866 108 -513 1715 1734
846 1734 -1586 -2795 -978 -668 -3455 -2781 559 483 -1066 859 4441 3712 444 1848 4367 2448
862 2448 -1833 -1022 1625 -316 -3828 -2156 915 -522 -3145 -862 1358 -801 -3016 -741 1213
877 1213 -1538 -3842 -688 1838 194 -1674 1699 4691 2700 607 3302 4622 1279 -640 1241
892 1241 1766 -2577 -4054 -760 289 -3520 -4565 -194 1974 -1706 -3221 986 2780 -1448 -2245 1128
908 1128 1709 -1853 -1399 2420 1692 -1648 95 4820 2768 -1779 -579 3694 2136 -3323 -2185 2300
924 2300 466 -3462 -1596 1927 -456 -2973 924 3117 -1074 -2822 1308 2848 -1494 -3978 -32
939 -32 2158 -1201 -3585 -886 2230 422 -1204 783 2333 -390 -240 2883 2185 -1194 -512 2908
955 2908 1968 -2254 -2062 1567 2244 -1258 -3553 -657 1836 -899 -3191 66 1265 -2014 -2039 1562
971 1562 374 -2822 104 3637 766 -3097 -275 3839 2300 -1506 -676 2491 2052 -1533 -1491 1677
987 1677 519 -2268 -626 1278 -2110 -2913 2283 3057 -1552 -1747 2030 2460 -7 -1082 146 666
1003 666 -729 -2494 -2538 -711 -468 -1093 -70 79 -816 161 2656 1858 -287 272 1552 1020 -241 -874
1021 -874 300 2679 2629 -481 -829 2745 2015 -1121 -915 -162 -2675 -4448 -2461 -2659 -4475 -2623 204
1038 204 -271 -1267 215 2926 4786 3638 1559 2326 3654 1066 -1100 891 1445 -696 -1008 271
1054 271 -1136 -1053 1089 616 -1426 -1728 -2042 -3435 -2541 -1825 -3137 -2494 981 829 -676 2266 5929
1071 5929 4657 3041 3259 2976 841 -885 -928 -1121 -2439 -4321 -3895 -502 -1097 -3081 782 4349 88
1088 88 -2472 2122 3040 -1474 -2114 1511 738 -2660 -958 2610 2482 1875 1639 2376 1709 -1279 -2383
1105 -2383 -574 -1357 -5503 -5647 -1935 -2404 -3993 -578 4192 3515 2568 4085 5087 4420 2873 1532
1121 1532 887 315 -2444 -4165 -1714 -300 -3336 -2800 1081 232 -3637 -1566 2022 -644 -4660 -3008
1137 -3008 -575 -1670 -2778 -63 4275 4459 2728 4416 7983 5883 1607 3012 3989 -2036 -6471
1152 -6471 -3138 -2789 -7049 -6942 -2005 -1133 -3347 -1569 1982 2925 1195 960 1925 1607 -873 -1217 1177
1169 1177 1652 9 892 4094 3705 1383 2313 3340 974 -2031 -3206 -3522 -4436 -5178 -5381 -3852 -1774
1186 -1774 -808 -236 2936 5665 4226 3684 5390 3647 38 -740 523 -1307 -3814 -2971 -1243 -836
1202 -836 -2019 -792 1568 1581 -840 -709 144 -881 -3009 -1758 160 -960 -1031 2084 3969 3285 4077
1219 4077 5579 4666 1997 1057 -226 -2211 -4108 -4954 -5716 -5294 -4545 -3801 -2274 -412 1450 1850 2615
1236 2615 3027 2994 2569 1392 1193 1440 522 -118 1246 2362 1712 595 2749 2373 -480 -1423 -802 -2631
1254 -2631 -5464 -5782 -4194 -4322 -4806 -2416 755 1575 2094 3930 5879 4929 3237 3387 3201 883 -1664
1271 -1664 -1325 -725 -1927 -2670 -1276 183 -355 -762 92 611 -321 -1742 -1984 -1534 -1617 -2810 -1366 1137
1289 1137 1163 910 2908 4833 3663 1860 2553 2726 148 -3156 -2432 -1834 -3916 -5390 -2829 -452 -1229
1306 -1229 -1360 1792 3856 1898 787 3125 3252 -409 -1178 1296 964 -1753 -1783 1409 1843 -888 -404
1323 -404 1867 1071 -2028 -2298 -704 -1747 -4820 -3489 -867 -910 -2070 275 3269 3282 2102 3514 5273
1340 5273 3670 972 1131 1635 -517 -3172 -2329 -670 -1607 -3151 -1509 724 -426 -1848 -318 1012
1356 1012 -765 -2552 -843 650 -1000 -1953 872 2753 1674 827 3262 4277 2061 282 1671
1371 1671 1454 -1512 -2687 -1128 -1121 -2949 -3197 -231 166 -1479 -614 2159 2111 26 22 1601 941 -913
1389 -913 -1199 452 383 -1234 -567 1264 882 -356 423 1505 416 -1186 -696 139 -1122 -1494 -765 343
1407 343 235 -273 479 1956 1670 659 908 1444 311 -937 -405 -327 -1562 -1819 -1062 -756 -1181 -811 -170
1426 -170 631 330 43 468 622 545 179 164 905 489 -208 658 1117 536 424 702 838 -66 -316 -295 -518
1447 -518 -880 -1158 -1615 -822 -658 -1196 -592 592 208 -472 157 956 187 308 839 581 199 172 180 386 899
1468 899 464 -169 287 538 -692 -301 1027 576 -698 -377 -125 -390 -858 -275 -46 -363 -888 -1017 -556
1487 -556 -74 -331 -803 732 904 -888 -4 1563 690 -566 730 1158 -306 -572 833 964 214 -191
1505 -191 180 614 246 -683 -390 875 -528 -2136 -968 -101 -1560 -1963 492 393 -1527 -316 1628
1522 1628 1176 290 921 1562 1152 -148 -337 662 913 -573 -1112 130 811 -989 -753 1589 989 -1301
1540 -1301 -568 583 -906 -1507 -274 612 -206 -1074 -518 711 1258 86 308 2031 1182 -1345 -668
1557 -668 853 -685 -1915 -426 428 -1600 -1125 907 1740 466 421 1460 1621 261 -573 363 1143
1574 1143 -271 -1860 -213 882 -953 -1355 1153 879 -1555 -812 426 -561 -1771 -927 -473 -803 -1221
1591 -1221 -762 674 1534 990 833 2383 2209 476 682 2062 771 -1283 -807 -548 -1665 -1888 -497
1608 -497 -400 -637 -927 -728 -186 97 -685 -872 602 204 -1476 -565 1231 743 -25 1706 2055 789 764
1627 764 1312 1233 317 -473 -934 -678 -1243 -1754 -1690 -487 58 -1132 -299 947 497 71 1184 1005 -359
1646 -359 -125 135 -331 -423 -115 105 -40 333 228 -219 678 875 -299 -293 -189 -813 -1195 -672 -152 105 -139
1667 -139 109 601 1435 1078 749 1185 853 -509 -993 192 -545 -1745 -1134 -257 -1159 -1442 -446 723 345
1686 345 -25 691 758 561 -24 352 994 846 -175 27 965 846 -72 950 1374 -109 -920 -222 -34
1705 -34 -1274 -1820 -876 -860 -1185 -1396 -508 604 117 -265 893 1593 570 -180 945 1491 -71 -758 584
1724 584 918 -541 -776 588 1057 -336 -565 560 522 -686 -1114 110 288 -1339 -1590 564 345 -1163
1742 -1163 -60 1023 842 -607 225 1356 349 -853 -196 789 -164 -1142 -433 1125 314 -846 214
1759 214 1440 590 -587 231 1290 -1 -1093 136 705 -439 -1081 -167 817 -731 -1177 93 730
1776 730 -443 -1092 24 715 -316 -979 337 778 -359 -492 984 1124 57 -252 1106 1341 -292
1793 -292 -395 805 1153 -625 -866 527 115 -1159 -935 273 45 -1280 -645 581 191 -643 -222 584
1811 584 283 -484 -105 841 139 -520 302 860 392 -305 102 914 196 -559 103 616 -21 -636 -111 437
1831 437 -54 -838 -85 406 -385 -708 38 570 -451 -341 -147 285 -379 -679 -84 184 -247 -601 -15 545
1851 545 209 24 447 785 541 149 377 544 79 -492 -68 57 -673 -558 -423 -176 -402 -720 -211 -173
1871 -173 -259 -287 -517 218 -278 -469 -100 496 307 40 522 922 988 212 659 706 273 -337 -392 179 -188 -952
1893 -952 -666 216 -326 -506 -151 386 383 -187 -44 633 -159 -662 -111 281 -446 -400 118 670 70 -65 234
1914 234 886 242 -436 -33 497 -75 -754 169 588 -355 -578 353 667 -146 -115 1001 785 -238 -689 162
1934 162 164 -1041 -1036 -333 38 -989 -697 86 541 -471 -201 1064 616 -216 174 1129 621 -355 -301 902
1954 902 534 -184 64 887 586 -577 -540 673 -133 -1372 -915 394 -742 -1739 -453 476 -399 -765
1972 -765 303 963 551 94 529 938 245 -383 -49 1160 -92 -699 377 1032 -197 -790 742 706
1990 706 -687 -959 213 -273 -1021 -1068 -57 175 -404 -538 318 840 -125 -376 1076 924 -424 -461 569
2009 569 -179 -1121 -255 340 -28 -435 7 541 310 184 147 472 395 -527 -546 374 327 -498 92 626 -207
2030 -207 -665 46 395 55 -154 -65 -65 -511 -458 -370 145 182 -185 -225 869 535 -35 790 1343 200 -240 559
2052 559 430 -155 -66 103 -341 -465 -191 -142 -139 3 -294 -447 103 -578 -614 -54 279 -301 -457 257 -165 28
2074 28 494 784 278 491 558 29 395 223 189 -73 75 103 -631 -217 420 -86 -333 -39 -203 -675 -122
2095 -122 46 41 158 -256 -458 33 23 -310 -72 514 51 -700 -298 814 -15 -235 647 174 -398 105 246
2116 246 448 85 -205 -182 118 -95 -486 -241 317 -511 -867 12 305 -508 -645 430 27 -404 -313 135
2136 135 185 315 22 249 711 97 -256 390 1019 216 -302 533 67 -883 -345 573 132 -668 -611 122 -164
2157 -164 -470 -102 498 548 -641 -623 581 187 -847 -233 553 -24 -753 -219 672 -27 -598 732 498
2176 498 -162 -483 197 277 -144 -502 29 351 36 -205 494 1198 217 -290 408 196 -638 -1015 -303 -254 -938
2197 -938 -979 -356 -58 -153 -119 619 813 -1 -141 605 1015 -30 -238 749 407 -275 156 864 634 -16 64
2218 64 712 23 -518 -763 -188 -822 -1571 -878 -139 -267 -1173 -248 1006 682 95 684 1344 584 76 543
2238 543 453 -166 -282 -22 171 -538 -282 250 86 -191 -366 107 -286 -462 -594 -457 -251 -636 -636 331 436
2259 436 393 359 919 1122 692 244 282 226 -330 -793 -632 -548 -1085 -674 -200 97 -96 200 686 845 198 72
2281 72 96 321 -176 -357 -115 234 -99 -89 441 131 223 -216 178 -46 -756 -843 -855 -1038 -1124 -776 -347 91
2303 91 485 663 1101 1363 1227 1251 770 572 118 -222 -348 -386 -722 -933 -415 -206 -490 -592 -4 187 -286
2324 -286 -681 -330 -32 -627 -565 -47 312 136 445 1205 1720 1135 1051 1478 749 77 -326 -814 -792 -1412 -1298
2345 -1298 -932 -726 -789 -461 368 113 87 410 750 577 -223 -202 373 49 -630 168 566 574 30 247 733
2366 733 581 -168 -221 -329 -298 -1421 -1096 -247 -793 -747 -338 720 926 481 1088 1711 690 189 326 658
2386 658 -369 -830 -759 -493 -946 -1151 -384 643 25 -243 522 587 -112 -257 211 275 -212 -407 391 692
2406 692 373 522 1231 1205 862 413 658 192 -925 -1006 -713 -946 -1657 -1260 -688 -320 -580 275 1040 690
2426 690 397 637 1045 485 118 -156 547 63 -292 161 533 422 -92 76 777 -234 -387 -193 -297 -1002
2446 -1002 -1112 -747 -437 -542 -590 -22 813 891 319 957 890 464 255 532 187 -474 -584 -171 -367 -428 -469
2467 -469 102 19 -10 168 332 185 -94 -508 17 172 -222 -59 351 242 -33 465 478 467 191 203 142 -306
2489 -306 -522 -787 -746 -363 -542 -546 62 195 207 294 783 786 370 294 206 361 -94 -123 -116 -120 -99 -150 54 346 -11
2514 -11 -235 54 22 -464 -364 -335 -249 -535 -192 -211 131 64 184 450 575 598 209 432 393 146 -320 57 -127
2537 -127 -490 -548 88 -92 -25 -229 145 167 86 -506 -55 38 -277 -309 82 224 -24 -155 613 457 50 245
2559 245 462 57 -266 72 140 -70 -329 -284 -14 -45 -531 -185 131 474 -343 -183 562 176 -25 29 241
2580 241 -20 -556 -119 121 33 -121 -129 370 -151 -272 -47 498 182 -126 239 713 -41 -116 567 201 -589
2601 -589 -313 414 21 -278 -121 62 22 -202 -321 -22 175 -72 -393 124 155 -328 -407 217 517 -347 44
2622 44 444 180 -69 -160 470 204 -395 -135 122 -4 -172 -487 365 30 -400 -18 403 347 -610 79 354
2643 354 -175 -653 -134 -5 -172 -274 66 -30 -266 -323 37 468 159 -413 222 1 3 123 338 334 -108 73
2665 73 540 280 64 145 295 150 -454 -237 -58 -296 -540 -430 -13 -193 -204 -82 43 257 106 164 530
2686 530 309 99 126 188 183 63 -13 115 5 -158 -152 193 401 -142 -134 129 -83 -394 -357 -146 -78 -210 -126 130
2710 130 -38 111 118 310 298 139 299 143 68 -92 -202 137 -236 -306 -34 70 -141 -90 92 -235 -1 96
2732 96 -54 -1 73 -459 -225 338 173 -158 10 37 192 0 62 349 106 -257 -224 -179 -203 -185 -56 -33 -82 -230
2756 -230 33 275 254 290 329 401 177 -113 209 134 134 -399 -60 -62 -229 -16 -159 16 -5 -398 -457 42 -177 -395
2780 -395 -117 443 -49 -294 27 635 448 140 489 425 119 -152 73 63 -498 -502 -99 2 -154 -228 -75 167
2802 167 -80 -149 -6 214 -140 -208 300 -42 -74 -308 206 -42 -117 189 662 642 -133 -110 382 -17 -662 -57
2824 -57 184 -202 -322 -411 197 102 -303 125 466 165 36 -66 162 -205 -490 93 280 67 -301 98 18
2845 18 -127 168 157 233 -75 -309 131 106 -384 -326 -25 37 202 -74 230 308 111 130 309 337 -119 -118 89 -311
2869 -311 -441 -214 89 -61 -429 -315 243 211 -34 126 200 232 -87 227 297 53 -30 90 304 311 -252 -67
2891 -67 122 178 22 -41 133 82 -418 -199 90 -167 -212 -26 23 -142 143 26 -20 286 -353 100 111 -61 55
2914 55 152 -1 32 -208 9 277 44 -268 170 155 109 -41 47 156 -192 -113 -201 -167 -128 104 58 206 16 -173
2938 -173 -9 78 88 -302 -256 -30 154 -93 -115 39 59 -140 221 137 150 62 142 47 274 -180 -149 8 158 -168
2962 -168 -72 -57 8 -378 -58 73 -117 19 5 67 -67 -20 -98 178 211 -44 25 189 54 -167 71 441 -17
2985 -17 -27 334 298 -339 -84 -53 -62 -197 -259 -26 328 -171 -136 -50 116 -163 -187 201 83 72 -364 58 27 -1
3009 -1 -304 235 267 -160 59 168 167 -33 -153 345 290 -69 -107 39 222 51 -215 317 -156 -234 139 113 -150
3032 -150 -14 -10 250 -64 -306 -111 75 9 -158 -19 167 159 33 333 470 67 -196 73 171 -195 -100 154
3054 154 -94 -184 -277 18 60 -67 -410 23 161 -134 -319 125 47 -25 -209 12 -125 -183 -80 95 108 -18
3076 -18 309 83 297 47 -427 73 -70 -105 -9 131 372 -147 129 230 276 -77 347 216 -241 -15 8 146
3098 146 124 -221 -73 -191 -138 -198 192 333 335 -245 151 47 -111 -185 -44 304 16 -68 31 225 25 16 361
3121 361 176 175 -10 -149 65 -179 -261 -95 -207 -81 -287 -185 -193 33 248 -51 36 -144 -125 219 164 387 80
3144 80 92 150 121 -3 -12 210 138 -198 48 62 -173 -269 -80 -301 -269 -300 -196 -66 -114 63 -263 185 291 1
3168 1 64 62 73 -153 111 99 55 -97 240 33 262 -212 119 -44 -23 -13 -192 169 59 -234 -175 236 -44 -49
3192 -49 -20 49 30 -97 251 126 163 -305 -4 268 -191 -275 -61 23 -174 -176 340 157 -55 -50 101 198 -197 47
3216 47 106 93 -132 -94 -49 -51 -23 -129 154 -134 -151 -239 245 25 -377 -316 -43 -10 -346 -165 1 97 202 337
3240 337 314 195 -165 127 159 -215 31 252 377 -86 -188 62 -57 43 -338 131 249 -155 -95 71 -187
3261 -187 -78 -15 150 -65 61 -26 -214 316 -84 -108 116 127 334 87 78 489 -154 173 -177 177 -42 43
3283 43 103 -86 -16 -159 73 -45 -162 -224 -144 -118 -311 -92 27 -107 -59 0 198 250 121 109 165 92 -174 10
3307 10 379 -138 85 181 -56 236 -226 -40 -48 -120 82 116 44 94 -7 -297 -147 -47 -38 91 21 40 -434 -146
3331 -146 62 139 215 134 237 -154 8 -132 59 -41 44 -369 168 -168 -164 -104 144 -25 219 -2 345 -198
3353 -198 -50 -42 111 -99 -104 -202 -41 3 -174 94 -159 -72 -86 -53 335 -116 -113 -19 -146 280 -221 60 169 140
3377 140 -21 131 106 -124 -39 -297 -86 -306 -509 2 -38 -135 -233 -138 -95 -115 29 205 369 250 44 234 252
3400 252 17 -22 323 30 17 -73 141 14 65 -193 349 113 -2 -237 -208 -208 -405 32 -279 -21 -123 47
3422 47 184 315 288 93 218 173 -276 -48 124 50 65 -99 -58 -61 -137 -44 390 59 -291 -88 235 -82 -208
3445 -208 -180 216 135 -459 17 289 242 177 238 62 309 -315 -200 39 -66 -331 -255 -42 -235 10 -48 348
3467 348 196 -159 405 274 141 -205 48 58 212 -119 -9 -31 -159 22 226 144 -64 -258 -38 -27 -211
3488 -211 -227 -38 -207 -395 -180 -55 -66 -299 266 456 280 203 252 167 148 122 137 -398 -374 -382 167 -85 -15 -143
3512 -143 43 229 -99 -240 -21 -72 -187 -168 -63 200 48 16 -48 163 140 34 171 435 185 40 -353 2
3534 2 -157 -289 105 -90 -248 -149 79 282 -17 -232 149 391 12 -38 311 -135 -5 70 77 85 55 -9 22 76
3558 76 45 -139 -83 -161 -247 -38 -76 -196 105 306 173 78 264 139 -65 425 180 69 206 97 5 -174 -233
3581 -233 -215 -216 -382 -249 67 -118 68 -76 -11 358 129 -168 153 86 4 404 60 129 356 290 191 -62 16
3604 16 2 256 -358 -218 -231 -57 -216 -255 -265 -155 -160 -96 329 119 190 246 293 237 -120 -36 522 311 -5 -66 64
3629 64 -12 -34 -261 80 -50 -285 -13 95 -225 -241 -80 17 -317 -44 -205 397 62 -223 153 -20 4 34
3651 34 63 84 172 -134 -156 171 -18 71 204 -23 43 -180 303 137 -153 -149 -176 72 -213 -238 185 334 -12 -114
3675 -114 228 113 -176 -324 -188 -51 -95 -39 -180 57 -17 -217 -38 -31 43 144 69 191 428 167 254 27 -52
3698 -52 -144 168 -52 -93 -7 -16 110 -318 -16 178 -226 -130 -463 -112 -259 -110 -167 -42 -264 -201 128 42 154
3721 154 -190 22 -82 26 -274 174 28 -1 -191 -12 118 79 144 -3 205 -214 -166 -174 40 174 -116 71
3743 71 103 -33 -164 -66 -119 33 -69 -303 -117 137 261 -76 83 -64 52 -15 148 -131 83 104 89 51 23
3766 23 91 -96 53 -123 78 -39 124 7 64 -69 -223 -35 14 58 114 -99 -50 -120 -86 -96 310 278 -85 -57
3790 -57 405 -45 115 -12 -82 -44 -233 -29 -218 158 154 22 109 -148 -226 -47 171 146 -147 15 -103 160 -79
3813 -79 45 27 135 69 -95 -1 -38 -49 -72 200 -120 -117 -202 -184 58 -53 16 101 14 156 206 127 -326 15 -120
3838 -120 -220 219 -242 -527 368 -46 -46 19 -61 -103 -119 204 164 98 -5 45 53 -103 105 87 134 80 123 183 113 105
3864 105 -22 -76 -51 -247 0 -161 94 13 -279 142 96 -117 -187 42 89 308 -14 -98 185 90 58 175 72
3887 72 -52 -232 289 -59 -216 -78 226 -14 -245 -257 -34 34 -325 -126 -364 117 -96 228 415 -9 78
3908 78 -201 -48 -25 -196 -137 -352 -120 -138 52 265 362 -13 52 79 42 -55 85 89 -142 -244 192 83 -223 124
3932 124 86 -12 -54 103 260 -70 -288 -79 -53 170 -79 -306 107 -49 -241 -246 107 -126 132 -121 109 3
3954 3 20 -45 140 7 -42 -127 69 245 -127 91 122 233 -242 -120 -51 138 55 -211 170 -27 -87 -201 -84
3977 -84 80 -69 -193 99 129 97 -46 112 -113 -59 -2 198 -10 -170 -156 -141 65 -48 -101 -126 9 27 4 -33
4001 -33 -109 -94 194 74 439 17 210 107 150 13 41 -76 12 -66 226 59 79 -252 -198 -33 -85 157 243 141
4025 141 91 237 -98 -26 24 -83 -132 180 -15 -65 8 -62 -121 -86 120 143 78 -85 40 57 -112 -140 -133 -281 53
4050 53 -49 222 -87 77 -180 251 147 27 3 -6 100 113 -128 -90 127 -48 -86 220 114 231 29 29 124
4073 124 -335 141 -39 -42 -73 93 -53 285 185 -104 90 -45 -108 54 -29 34 -157 14 111 -12 -105 100 194
4096 194 -134 -252 175 7 -193 -279 -99 115 206 -3 20 224 -208 -228 -46 128 -29 37 34 210 30 -81
4118 -81 -89 127 179 -265 -74 60 10 -75 9 -140 -125 -70 -103 -191 -17 36 144 -140 -186 -13 -68 111 138 27 -159
4143 -159 20 163 -245 -47 185 -48 61 12 -20 -242 58 -145 17 -6 -109 -125 17 -94 6 -7 5 53
4165 53 169 196 -161 -40 78 -237 -103 -26 -33 96 -159 179 87 91 -339 87 -263 43 12 -66 131 12 -126
4188 -126 178 92 -132 143 -141 -85 -311 104 -288 57 -57 -156 105 -139 142 48 -149 53 16 -18 -32 228
4210 228 -15 67 -182 259 93 35 -120 13 308 288 -87 -168 -107 61 140 68 -102 32 -61 55 6 -100 -182
4233 -182 -131 173 -29 -133 218 4 94 -16 162 131 -45 165 -86 -50 -22 -172 -69 270 -78 -101 -125 55
4255 55 -85 63 -96 62 68 -70 30 79 -39 -100 441 -51 10 282 346 302 23 91 73 130 -412 -55 156 67
4279 67 18 73 26 78 -77 40 170 323 -108 -151 219 -63 29 -8 62 -27 -5 101 125 14 -263 -330 144 -122
4303 -122 -79 -262 203 -81 -101 82 163 247 89 237 140 4 -227 78 70 -9 -191 -99 67 -218 3 18 105 177
4327 177 -132 209 -277 82 -81 68 -92 170 29 -19 64 -133 -8 113 107 -61 -2 30 35 -81 55 289 247
4350 247 -51 -155 75 -37 -44 3 80 337 -118 -235 223 31 -95 210 29 15 -169 27 -58 -88 149 342
4372 342 97 20 -26 -240 61 126 29 -112 -113 188 -102 150 -4 -12 10 -40 197 39 -255 -254 80 -217 -67 -232
4396 -232 -118 -237 176 -1 -17 -127 351 106 31 -38 34 -28 -18 -58 174 87 -131 31 -431 22 -274 60 -48
4419 -48 -73 69 24 -135 -73 -60 -16 -300 -13 213 281 0 198 256 -213 182 -60 48 -55 -14 6 146 109 -90
4443 -90 -144 -137 307 -89 -102 16 -85 -82 432 127 -128 -200 -283 -132 -186 -110 -60 -161 35 196 32 177 -94 -114
4467 -114 98 40 -143 -30 -3 14 204 -213 -162 108 -281 -24 144 -39 6 -271 -40 -45 8 162 201 -3 16
4490 16 -23 200 127 -140 76 170 53 -79 76 143 -23 -97 52 235 -149 -13 -135 434 -59 26 29 -141 -194
4513 -194 -201 -107 111 -293 -42 161 28 -132 67 -74 -42 -22 -23 83 91 20 -206 -116 -91 -258 -375 -234 115 202
4537 202 92 98 222 26 -81 393 74 191 -84 -96 155 -165 90 -88 -86 -122 -64 119 -171 -207 -133 -99 -16 -221
4561 -221 -58 350 -65 139 23 -66 -2 -140 185 263 -72 -14 59 102 21 1 -188 -151 -175 -303 -146 60 160
4584 160 -181 -24 136 -115 116 21 -48 85 -119 -94 277 51 -16 -290 195 119 307 177 -138 -79 331 65
4606 65 -147 -198 12 55 -96 60 -180 -77 79 198 30 2 -38 84 -109 17 -9 -7 420 -331 -132 -82 307
4629 307 -80 -117 -392 -339 -100 126 117 -262 -72 -97 210 -237 141 178 37 -95 199 47 236 -341 -181 92
4651 92 -187 1 -128 -69 -231 160 -109 175 -5 -44 338 12 308 92 42 -121 -45 4 -191 93 -58 110
4673 110 -113 74 83 207 -184 44 -85 -21 42 -135 100 -309 -226 -297 -31 51 129 209 -26 -25 243 128 185 -81
4697 -81 -80 17 106 -114 162 -108 -78 -9 -5 7 -132 -289 83 -74 -42 -117 11 239 75 -159 -3 91 1 29 173
4722 173 -52 17 342 24 -62 -147 -86 17 -53 -77 76 168 94 245 87 414 34 -60 323 -68 -56 142 99 -75
4746 -75 -137 -128 178 37 -220 -198 160 180 78 -208 -102 -185 73 -86 -74 18 254 278 248 385 -308 -38 100 31
4770 31 -52 -9 -90 -13 -87 -192 -122 352 -209 14 29 -140 -157 -223 -46 -76 -128 -48 166 23 7 39 -174 -43 95
4795 95 104 32 241 -210 -52 -105 -172 -287 -55 -1 -335 -26 -59 -82 129 -254 -33 15 -24 39 -83 128 -91 -7
4819 -7 276 -70 -160 106 -28 -169 -8 -42 77 130 -192 -203 -47 -46 -113 38 42 100 87 -9 -66 -44 125 -163 255
4844 255 -159 -114 -66 -122 1 -54 82 -27 46 -247 -21 171 -16 37 -267 187 153 195 9 173 264 -201 -147
4867 -147 -199 47 76 -21 -85 -113 -63 36 -16 205 -140 -16 121 -245 -51 116 225 63 64 197 155 -33 61 18
4891 18 -53 -4 -87 159 39 122 145 -176 232 -139 -176 -145 65 -197 75 -29 96 -178 -162 -95 70 -251 -206 5
4915 5 86 -41 140 361 33 214 -19 165 194 -104 -76 28 -84 125 72 247 182 32 -215 60 -67 135
4937 135 -214 -121 -28 -254 -323 183 123 26 -99 7 344 -18 91 -107 -64 13 -66 144 46 9 22 -73 -31 -215
4961 -215 149 309 202 -113 47 -71 161 -220 91 67 -62 -218 -30 73 33 -24 11 238 137 -92 -71 82
4983 82 -117 -48 -113 111 -207 126 -5 140 -25 -104 73 -57 -178 -11 -161 -103 112 -45 -226 -80 52 -111
5005 -111 -70 -284 218 -158 -266 -112 -24 102 -68 -234 147 -28 -119 100 117 113 -26 235 -147 377 136 63
5027 63 38 -126 -43 107 -211 -91 -53 104 162 -64 -10 -52 154 -114 -37 -157 180 113 -44 -6 -120 14 13 239
5051 239 -81 161 -48 -181 34 -117 -126 -256 -66 114 -200 21 23 91 112 105 -52 9 -10 27 -1 -35 54 -78 90
5076 90 -79 -81 79 -14 66 36 -24 106 -122 181 111 -168 -109 -43 -23 -234 -93 216 138 -5 77 150 11 14 -136
5101 -136 152 124 -176 -70 136 -129 9 42 56 220 15 -18 -27 208 -13 -146 231 208 34 192 23 -178
5123 -178 -289 -80 85 15 -137 -42 55 160 112 -6 -27 -42 -229 -132 58 -68 74 97 263 240 371 -73 198
5146 198 192 -289 137 -205 -113 159 205 97 -175 -80 -172 -78 13 71 -11 21 -182 106 171 6 -74 -60 -116 134 110
5171 110 -67 4 61 229 -97 35 131 201 126 -145 -2 145 -16 96 88 45 -139 285 111 -85 174 -200 -72
5194 -72 188 153 -31 53 -211 -165 -320 226 -15 26 -72 -47 -157 -74 -114 -160 -189 85 -62 214 66 45 197 -134
5218 -134 169 31 130 286 -239 -164 -235 -115 -155 -210 27 -171 24 74 39 -146 82 111 66 -76 -197 -196 -58 -153
5242 -153 104 4 207 101 -69 -241 92 -216 -51 242 -77 53 -193 112 293 77 -230 95 -40 -28
5262 -28 136 20 -37 114 -46 265 79 -93 -46 32 193 144 -91 228 -111 -141 -37 129 -10 -37 131 25
5284 25 -7 -26 58 -104 37 -149 -59 46 127 -20 248 -35 134 -289 62 13 190 -93 -50 145 0 112 -33
5307 -33 254 96 12 101 -76 149 -29 89 128 -145 -240 87 62 -195 132 50 -80 -30 47 64 97 108 118 171 68
5332 68 -7 -33 91 3 -238 70 -170 -52 -54 43 -146 218 -17 104 -169 48 106 -19 254 -35 169 -107 -61
5355 -61 -14 -114 -189 -20 84 -36 -134 188 40 8 37 -99 78 -60 105 330 -148 -123 70 143 419 -145 -2
5378 -2 -132 -113 5 258 235 -32 110 211 38 -25 -218 12 -173 90 -70 -86 153 121 -190 150 1 -42 -94
5401 -94 188 350 186 -230 9 -88 -195 54 190 95 106 168 295 124 133 -50 1 -16 7 -7 71 57 12 98 -45
5426 -45 -164 63 -119 -1 77 -10 3 148 -95 -129 92 -50 -97 -113 104 189 50 10 157 74 217 -218 110
5449 110 29 91 -106 238 -3 92 13 -129 121 6 101 -95 174 -86 340 230 -54 34 -123 45 269 8
5471 8 37 18 118 -112 100 270 93 50 247 -159 -116 64 -35 -52 -11 105 -50 -21 102 -19 20 -104 69 -126
5495 -126 -205 385 87 -79 -76 105 167 205 122 301 95 214 -92 6 122 17 32 -226 -83 -29 -367 175 57
5518 57 84 -126 91 98 -20 -82 153 -163 89 -23 191 -140 -57 344 55 -82 -141 -39 -247 12 30 41 -14
5541 -14 88 -221 363 143 116 23 187 178 61 81 90 -13 -228 185 -339 77 -360 110 60 221 58 117 -119
5564 -119 -16 -353 -126 -118 -167 361 -116 -78 -40 59 48 -24 117 -16 -6 -66 40 -125 -294 -54 -21 -110 -30 -59 11
5589 11 -110 -197 -92 -66 -141 -12 -76 153 309 -213 229 254 239 -93 85 -132 -98 -141 -182 159 -24 -191 -93 -46
5613 -46 -1 -123 75 -40 -311 -153 93 38 54 -133 -173 -60 -236 -84 -106 82 9 -17 229 -89 142 -113 -62
5636 -62 -90 100 -53 -119 48 -152 221 -4 -70 70 -97 -65 -63 -58 15 -2 16 -242 -21 155 28 -44 73 245
5660 245 -147 316 265 22 -163 208 -152 -116 286 -238 126 99 163 -100 -118 164 33 -66 83 42 141 -106 -90
5683 -90 164 -129 79 145 -37 -176 15 -351 -7 69 185 17 -227 146 -90 168 389 -125 -246 129 245
5704 245 -218 146 -228 -2 80 -283 -403 -74 -111 144 -338 37 -180 -74 -178 51 -105 -4 219 -56 -70
5725 -70 -297 172 58 204 -119 145 -116 -142 95 -29 152 -154 -133 -122 6 65 -77 149 -261 -240 11 31
5747 31 -20 189 15 -174 89 -76 -370 57 -66 -128 45 294 139 -70 191 -126 79 198 137 0 89 -168
5769 -168 64 -76 33 16 -305 -101 86 -219 -248 33 -66 17 316 32 4 8 75 -63 152 100 54 -52 -23 2
5793 2 -122 -25 -127 155 -284 -48 47 -35 -118 18 -143 50 -257 -336 27 -80 -183 -97 105 -358 135 167 -88
5816 -88 72 21 142 -414 -157 46 -128 -107 -68 -49 155 174 248 5 -159 137 169 277 72 105 -64 -27 7 -346
5840 -346 -34 -33 -118 -52 18 -129 237 -243 247 -72 -23 66 61 -192 -107 2 -32 29 25 38 -29 -205 -15 163 209 19
5866 19 -94 -65 -43 139 93 -162 -137 -49 -170 -22 179 -123 227 277 11 467 244 -87 81 -27 178 -186
5888 -186 207 78 -304 -197 144 -157 4 89 -14 -11 40 3 22 -37 -76 -256 44 31 131 -76 14 18 97 -155
5912 -155 84 230 -284 1 -36 -3 99 -145 208 -7 254 260 -116 -21 -92 11 -19 151 267 -171 -76 126 -70
5935 -70 97 92 -14 53 32 143 -126 -20 83 -31 -65 -27 -198 63 145 63 -110 102 283 -9 136 169 209 224
5959 224 -87 77 271 -104 -187 74 -146 -214 -42 180 -49 76 -369 -58 -27 83 98 219 -58 -66 -30 -237
5981 -237 31 -16 -72 -76 54 -131 2 215 -211 -189 145 92 218 -142 70 263 86 -36 81 119 -296 -20
6003 -20 -62 -142 -138 -52 -56 260 -136 248 1 -227 -24 232 106 293 -191 -284 83 222 97 -190 181 108 -141
6026 -141 68 136 -200 -203 37 -97 52 91 6 -64 -395 54 3 45 -214 -121 90 257 -135 -66 -142 69 283 -63
6050 -63 60 107 -195 -373 73 304 -181 7 21 163 -319 21 207 -20 26 73 165 -76 7 -72 58 162 -69
6073 -69 -136 -89 50 -208 -134 -109 -30 63 220 230 218 9 -41 198 -217 -318 -13 -2 131 124 248 3 -170 49
6097 49 97 -97 -150 48 -134 -95 57 -301 144 84 56 69 -78 -111 119 55 130 245 -325 208 233 -15 129 -128
6121 -128 -120 -17 -86 106 7 -110 105 47 -115 -133 10 126 -142 -249 -173 35 -175 220 -184 33 171 -6
6143 -6 38 -164 240 50 35 34 -174 -59 38 194 -192 87 -35 53 103 -172 -11 -133 -104 68 -107 -261 78
6166 78 50 -42 -382 -98 -8 -436 -33 105 -366 -130 191 256 -37 -23 -81 96 186 -181 -97 281 -38 92 33
6189 33 -194 -47 -8 -27 -107 0 310 -114 230 330 104 315 -57 149 158 12 -267 183 200 13 -22 200 -30
6212 -30 87 27 -174 209 -45 -10 -106 -32 -139 -326 -354 -76 9 -3 -17 227 -2 81 96 -204 68 -192 82 -104
6236 -104 -35 80 120 -70 -13 -34 242 183 146 -76 -34 108 -256 44 -88 -25 -150 222 157 -179 -247 210 37
6259 37 164 -107 175 75 -222 -142 -194 123 67 204 -59 18 -10 -64 -59 -117 -86 -98 -10 -202 79 -110 136 -82
6283 -82 168 -62 145 -18 -291 16 -265 -14 -35 -48 182 -65 157 125 -156 21 35 13 -241 38 -12 -145
6305 -145 -232 -33 193 1 221 64 -148 -2 27 -43 68 41 -149 -110 -232 141 52 123 -167 -22 50 148 -172
6328 -172 11 202 139 -358 -34 110 -77 -150 47 1 -469 153 -67 -242 98 -82 -78 16 -5 169 -251 75
6350 75 -91 47 -41 -117 -113 -43 -142 -160 12 -65 51 1 5 39 111 -35 188 251 235 162 -92 -86 164 -39 -106 -95 -54
6377 -54 -2 -106 166 -54 137 136 -39 -21 23 -89 -56 -240 105 -41 125 20 -104 -57 -7 226 221 206 59 79
6401 79 -48 41 33 -340 -37 -173 31 125 -62 -63 197 -114 -86 39 -93 -124 -208 -346 -274 -163 -64 -55 -130 208 2
6426 2 -7 113 299 -138 155 -225 327 6 66 125 -77 115 -227 -34 83 63 -176 -24 -118 -138 57 184 -243
6449 -243 -74 21 -215 69 23 -32 140 69 -374 192 -125 -115 -53 126 117 -240 -82 -88 -123 145 104 -89 60 136
6473 136 -50 -95 82 -119 -55 -70 -218 -53 -75 87 35 63 -269 -106 -94 50 173 -12 21 -149 -8 -2 8 -58
6497 -58 -75 129 29 120 -43 -92 -21 61 -21 206 26 62 -1 26 -1 -143 -133 44 83 84 -41 84 260 24 139
6522 139 126 137 -181 -157 25 139 136 -76 -130 -157 -1 -48 -24 190 32 -128 -264 -113 -40 -158 355 27 91 -22
6546 -22 -103 -147 69 134 94 56 -33 29 -56 -119 -16 -274 71 89 -74 -202 93 168 9 -124 -194 252 -73 -70 3
6571 3 67 47 49 -35 -22 -14 185 -81 86 -213 207 -121 -77 -131 -10 -61 -66 -122 -136 82 -15 29 -52 196 36 7 -172
6598 -172 19 -178 259 151 -12 5 214 53 -51 64 -9 -22 -72 -16 -176 -161 -12 43 1 62 187 70 142
6621 142 -100 179 22 113 -23 31 45 61 -40 -63 -40 -12 33 -146 -147 376 42 187 5 -16 -98 -65 -43 -57 135
6646 135 -154 -155 118 -89 -10 -44 -229 -321 -242 -297 12 -59 18 82 -39 -213 -116 -62 -46 135 120 -189 -54 39 -120
6671 -120 -196 169 -102 102 30 8 8 89 65 -248 113 -91 152 -162 -80 -53 -86 87 -76 -27 -245 -232 -23 -184
6695 -184 211 16 -9 93 -319 -94 -143 -172 -85 -11 -93 -16 -80 107 -102 -13 43 294 25 -138 -77 -76 -244 9
6719 9 -79 -85 186 -8 230 -36 -75 -189 -33 40 161 -71 -51 30 113 -40 35 -190 -39 -3 5 -36 -126 -232 -135 -56
6745 -56 -198 32 -117 105 -55 -95 19 121 114 -149 -6 212 240 -49 43 -39 185 355 -280 -295 -34 109 -237
6768 -237 -38 -5 165 -88 128 -151 -226 -81 117 -98 120 -46 80 -26 -2 -7 90 7 -51 -28 -120 17 30 -183
6792 -183 143 108 30 -191 -104 104 -136 150 44 30 -349 -32 141 11 97 86 -104 93 9 -23 -77 -92 56
6815 56 -7 61 -337 -92 -85 -17 -134 24 76 -38 152 176 191 35 215 -73 -69 103 -78 -153 57 -29 -104 -7 42
6840 42 98 -163 46 -172 96 122 -75 231 -28 38 162 -131 4 -151 27 193 -10 226 54 188 284 103
6862 103 -45 141 171 -33 -49 17 -18 71 44 -213 95 -218 65 -143 132 -105 -153 -133 -105 -252 -38 -84 -81 -106
6886 -106 -42 50 6 8 45 137 123 80 -99 150 -166 236 -77 -219 -27 -14 126 -17 -121 183 -22 -105 102 -57
6910 -57 -139 -214 79 121 121 227 113 -96 -321 136 -202 177 -156 -193 -41 142 -75 50 -198 177 -66 141
6932 141 160 -9 -21 38 10 -57 243 3 51 86 -329 -272 30 -32 -39 193 -63 -69 -16 -79 192 -201 59 255 160
6957 160 -414 166 168 -61 -180 -10 8 -27 80 -2 -20 -115 -225 -75 -185 138 -256 -77 -113 -99 -16 82 96 -60
6981 -60 125 -13 -17 24 6 113 -77 -65 97 -52 127 -125 -54 -37 -133 106 -58 -3 -77 -26 -165 -53 223 88
7005 88 56 32 -323 -61 107 144 5 -37 49 -60 -157 152 138 -192 -82 27 -19 -21 65 -6 111 124 -249 91 -117
7030 -117 1 181 178 54 -115 -178 171 81 -155 -40 138 46 183 -122 17 24 191 -126 -109 112 -36 -139 -34
7053 -34 -253 -221 -183 2 31 -5 96 -69 101 184 -247 12 56 -74 -176 -6 -42 55 300 -37 7 17 41 136
7077 136 8 -105 13 100 -86 41 119 252 -89 68 147 65 134 -81 -159 30 -11 -50 -179 15 -27 -191 -114
7100 -114 134 258 181 90 4 -138 64 85 -118 94 129 82 22 -26 -321 6 -126 204 178 -237 91 142 -170
7123 -170 -28 -174 101 -31 -109 -77 36 26 -32 -68 -29 60 -85 65 67 224 -68 -55 63 -124 -80 -89 -135 77 37
7148 37 62 -13 -57 -52 -62 -103 116 87 -85 -146 22 -280 41 -243 -26 -59 -259 -4 -8 30 -77 -222 157 -95 99
7173 99 -4 -13 -15 -252 -162 -118 68 69 -17 -10 51 -89 31 117 101 -52 -160 68 202 -81 -215 -139 -193 -330 82 -20
7199 -20 -219 -75 58 52 -93 12 44 60 -73 80 112 7 -7 22 -312 44 -102 -60 69 96 -63 -236 -198 37
7223 37 -116 -290 290 85 -201 -10 -196 -35 -169 -249 78 -87 -152 89 145 -45 -126 -162 99 77 -176 -5
7245 -5 133 106 159 208 -32 37 -65 -77 34 -73 109 11 -155 100 4 -250 -174 -35 -21 -83 -213 192 119 51 -111
7270 -111 80 99 1 -62 -266 278 132 240 144 -209 -71 33 28 -5 -181 -95 32 82 -91 -94 87 -8 32 124 -29
7295 -29 -11 -32 -74 87 166 171 -29 -15 -3 39 -255 -215 -5 -22 -107 -239 -107 -215 -108 161 -179 -41 90 -40
7319 -40 -84 -122 6 15 150 0 271 -72 29 127 -82 73 -24 167 -124 104 -26 35 -160 105 4 200 72
7342 72 152 15 -126 -164 71 -21 83 152 -45 9 -18 -145 -39 -60 -152 33 82 198 -324 169 -215 152 -1
7365 -1 -97 37 -92 -58 429 -54 71 -33 108 374 153 -171 -111 35 -90 -7 -143 125 -18 -222 -115 -48
7387 -48 -4 -220 -5 45 -36 -84 -133 -8 -118 -253 -140 -215 -107 -64 97 -35 -53 -277 -308 -43 -63 17 -29 128
7411 128 62 -10 31 24 -24 -69 38 68 133 -111 -321 -209 -44 -55 172 158 -295 27 181 -181 87 118 -37 -11
7435 -11 -117 -3 231 155 112 5 -155 -137 189 132 60 65 8 50 -56 1 72 -79 37 63 29 133 127 81 62 -158
7461 -158 -140 -159 -303 -29 28 3 -49 -238 -57 5 235 -1 -133 85 -90 -134 6 202 52 81 25 -172 23
7484 23 335 166 -137 18 -70 -20 -51 -135 175 -3 -120 -49 85 46 -341 63 55 -135 225 297 -151 -142 -102 -174 -80
7509 -80 96 130 128 -21 120 -143 276 152 -118 122 -178 76 2 -13 69 -51 -45 -170 108 23 -42 110 -69 -84
7533 -84 37 49 386 -46 -44 -107 28 -70 -7 -62 -106 349 66 52 60 -25 403 -163 -70 35 -135 199 -121 219 -163
7558 -163 124 57 29 -111 40 -97 65 224 42 -63 1 -103 197 262 -306 -85 -328 5 217 -143 137
7579 137 67 -72 -233 -121 2 -25 -315 71 -69 102 83 251 5 89 -107 -62 39 -165 -132 -212 151 -235
7601 -235 -138 255 -23 191 -287 13 111 55 0 16 304 -38 43 -36 -40 160 157 -173 -15 -3 24 105 33 94 -144
7626 -144 -50 -61 -95 81 -139 258 154 -17 148 -172 -110 53 -35 203 143 -123 60 15 -51 33 118 -84 -89 -131
7650 -131 -49 248 118 -380 -43 91 -235 -155 80 -79 -270 -115 222 -117 167 199 -65 84 -124 27 -261
7671 -261 234 292 -255 24 58 -157 209 94 -73 -156 72 139 -203 255 123 -118 -186 -10 220 188 -54 -20
7693 -20 -70 54 106 242 17 -199 -144 -59 -18 120 358 -19 51 52 -73 -22 -183 54 339 -47 -32 -79 -112 60
7717 60 -147 106 31 -50 60 -71 -184 121 -131 159 76 -123 -160 162 -206 -61 -58 53 88 -3 -218 132 -106
7740 -106 -77 -9 76 46 77 192 -360 4 -300 214 -194 193 -188 27 -133 -211 64 -119 -70 98 71 10 -51
7763 -51 188 36 -38 108 -218 -26 118 107 73 -60 -91 -49 34 143 -69 18 -171 -35 -149 182 57 68 115
7786 115 -87 16 -6 -34 35 -15 -99 -137 81 -53 13 -127 -119 -494 159 95 -254 131 -301 230 55 36 -37 -91
7810 -91 -64 -84 -2 63 -33 54 50 9 191 -95 -105 119 -124 -249 -54 -156 -129 68 -21 -32 123 87 239 298 -83
7835 -83 -66 -36 -113 -46 117 -178 59 -243 38 -50 -115 -19 -34 -291 102 4 48 -28 -67 32 119 47 45 -55 -132 210
7861 210 -53 145 -186 2 20 53 15 -217 -224 7 289 -47 174 -54 -70 -262 -19 -100 159 127 131 -36 92
7884 92 -119 -6 -80 -27 131 -156 -43 -37 17 -109 130 140 20 -225 33 104 -117 -163 23 36 200 -60 81
7907 81 96 238 298 63 -78 -281 96 -118 -287 106 100 -104 -82 -58 -72 78 -125 -127 -36 -50 176 -12 -325 -151
7931 -151 158 51 -117 93 43 104 132 -172 54 -249 2 97 -2 -188 62 -16 -68 -35 32 -3 304 105 34 76
7955 76 -22 187 172 -75 -33 289 -83 150 17 -89 -230 101 238 24 183 -221 -5 -59 207 -153 5 35
7977 35 -54 241 120 -16 78 -1 -144 -156 7 -187 195 -69 107 -192 21 -43 6 -3 -268 29 23 139 -144 -261
8001 -261 137 -173 -189 431 -145 189 170 -79 -86 130 -130 -66 -89 -21 -88 -8 113 27 -211 -159 -119 247 -41 -91
8025 -91 219 148 81 -160 33 -84 76 -223 84 0 -62 -79 -3 98 -23 14 -24 25 15 -275 -5 66 -73 -5
8049 -5 -56 -5 36 225 -332 -211 71 89 87 73 -44 25 -106 227 50 -174 -64 -22 79 175 38 310 -35 -79
8073 -79 29 14 7 -38 -143 -195 42 -26 -63 -121 -34 -65 29 -139 -200 -63 164 -44 -118 102 -79 -37 -329 -92 -62
8098 -62 164 70 -21 38 -141 32 -168 178 -62 173 77 -110 -63 29 -153 3 223 305 137 7 64 -20 117
8121 117 -146 49 159 -128 210 -41 14 36 -40 -303 -186 187 -56 22 58 233 -19 -26 116 -144 21 174
8143 174 -122 -121 134 55 144 195 25 -76 -160 -42 176 141 -158 9 -1 -110 24 -25 43 25 -121 107 -24 -184
8167 -184 -123 -28 150 -146 -100 38 -64 -34 -19 101 -185 -64 -35 191 -119 -151 11 127 111 154 45 -16 240
8190 240 31
8191C1
##END NTUPLES=NMR FID
##END=
