##TITLE=1H_Pr Bzt-62
 CDCl3
 8 sc, 
 22.09.2022
##JCAMPDX= 6.0         $$ Bruker NMR JCAMP-DX V2.0
##DATA TYPE= NMR FID
##DATA CLASS= NTUPLES
##ORIGIN= UXNMR, Bruker Analytische Messtechnik GmbH
##OWNER= root
$$ XWIN-NMR		Version 3.5
$$ Thu Sep 22 15:25:34 2022 Russian Standard Time (UT+4h)  she@DPX200
##.OBSERVE FREQUENCY= 200.1313499994
##.OBSERVE NUCLEUS= ^1H
##.DELAY= (6, 6)
##.ACQUISITION MODE= SIMULTANEOUS
##.ACQUISITION SCHEME= undefined
##.AVERAGES= 8
##.DIGITISER RES= 18
##SPECTROMETER/DATA SYSTEM= spect
##.PULSE SEQUENCE= zg30
##.SOLVENT NAME= CDCl3
##.SHIFT REFERENCE= (INTERNAL, CDCl3, 0, 15.7039)
##AUDIT TRAIL= $$ (NUMBER, WHEN, WHO, WHERE, WHAT)
$$ ##TITLE= Audit trail, XWIN-NMR		Version 3.5
$$ ##JCAMPDX= 5.01
$$ ##ORIGIN= Bruker BioSpin GmbH
$$ ##OWNER= she
$$ F:/spectra/data/she/nmr/H-F/1/audita.txt
$$ ##AUDIT TRAIL=  $$ (NUMBER, WHEN, WHO, WHERE, WHAT)
(   1,<2022-09-22 15:24:17.81 +0400>,<she>,<DPX200>,
      <created by zg, POWCHK disabled, PULCHK disabled
       configuration hash MD5:
       00 E9 B6 7A A2 85 ED C7 34 08 36 98 17 FE 4E 26
       data hash MD5: 16K
       5C FD F3 66 F1 91 7F DF 6F DB 4C E2 F7 76 C8 D8>)
$$ ##END=
$$ 
$$ hash MD5
$$ 27 D2 10 7D 5B FB E7 61 48 87 4C 3B 70 B5 86 C3
##$RELAX= 
##$RELAX= 
##$RELAX= 
##$RELAX= 
##$RELAX= 
##$RELAX= 
$$ Bruker specific parameters
$$ --------------------------
##$DU= <F:/spectra>
##$EXPNO= 1
##$NAME= <H-F>
##$PROCNO= 1
##$TYPE= <nmr>
##$USER= <she>
##$AMP= (0..31)
100 100 100 100 100 100 100 100 100 100 100 100 100 100 100 100 100 100 
100 100 100 100 100 100 100 100 100 100 100 100 100 100 
##$AQSEQ= 0
##$AQ_mod= 1
##$AUNM= <au_zg>
##$AUTOPOS= <>
##$BF1= 200.13
##$BF2= 200.13
##$BF3= 200.13
##$BF4= 200.13
##$BF5= 200.13
##$BF6= 200.13
##$BF7= 200.13
##$BF8= 200.13
##$BYTORDA= 1
##$CFDGTYP= 0
##$CFRGTYP= 5
##$CHEMSTR= <none>
##$CNST= (0..31)
1 1 145 1 1 1 1 1 1 1 1 1 1 1 1 1 1 1 1 1 1 1 1 1 1 1 1 1 1 1 1 1 
##$CPDPRG= <>
##$CPDPRG1= <>
##$CPDPRG2= <>
##$CPDPRG3= <>
##$CPDPRG4= <mlev>
##$CPDPRG5= <mlev>
##$CPDPRG6= <mlev>
##$CPDPRG7= <mlev>
##$CPDPRG8= <mlev>
##$CPDPRGB= <>
##$CPDPRGT= <>
##$D= (0..31)
0 1.2 0 0 0 0 0 0 0 0.06 0 0.03 0 0 0 0 0.0002 0 0 0 0 0 0 0 0 0 0 0 0 
0 0 0 
##$DATE= 1663845857
##$DBL= (0..7)
120 120 120 120 120 120 120 120 
##$DBP= (0..7)
150 150 150 150 150 150 150 150 
##$DBP07= 0
##$DBPNAM0= <>
##$DBPNAM1= <>
##$DBPNAM2= <>
##$DBPNAM3= <>
##$DBPNAM4= <>
##$DBPNAM5= <>
##$DBPNAM6= <>
##$DBPNAM7= <>
##$DBPOAL= (0..7)
0.5 0.5 0.5 0.5 0.5 0.5 0.5 0.5 
##$DBPOFFS= (0..7)
0 0 0 0 0 0 0 0 
##$DE= 6
##$DECBNUC= <off>
##$DECIM= 32
##$DECNUC= <off>
##$DECSTAT= 4
##$DIGMOD= 1
##$DIGTYP= 9
##$DL= (0..7)
0 120 120 120 120 120 120 120 
##$DP= (0..7)
150 150 150 150 150 150 150 150 
##$DP07= 0
##$DPNAME0= <>
##$DPNAME1= <>
##$DPNAME2= <>
##$DPNAME3= <>
##$DPNAME4= <>
##$DPNAME5= <>
##$DPNAME6= <>
##$DPNAME7= <>
##$DPOAL= (0..7)
0.5 0.5 0.5 0.5 0.5 0.5 0.5 0.5 
##$DPOFFS= (0..7)
0 0 0 0 0 0 0 0 
##$DQDMODE= 0
##$DR= 18
##$DS= 0
##$DSLIST= <SSSSSSSSSSSSSSS>
$$ [...]
##$SUBNAM2= <"">
##$SUBNAM3= <"">
##$SUBNAM4= <"">
##$SUBNAM5= <"">
##$SUBNAM6= <"">
##$SUBNAM7= <"">
##$SUBNAM8= <"">
##$SUBNAM9= <"">
##$SW= 18.0517283424941
##$SWIBOX= (0..15)
0 0 2 0 0 0 0 0 0 0 0 0 0 0 0 0 
##$SW_h= 3612.71676300578
##$TD= 16384
##$TD0= 1
##$TE= 0
##$TE2= 300
##$TE3= 300
##$TEG= 300
##$TL= (0..7)
0 120 120 120 120 120 120 120 
##$TP= (0..7)
150 150 150 150 150 150 150 150 
##$TP07= 0
##$TPNAME0= <>
##$TPNAME1= <>
##$TPNAME2= <>
##$TPNAME3= <>
##$TPNAME4= <>
##$TPNAME5= <>
##$TPNAME6= <>
##$TPNAME7= <>
##$TPOAL= (0..7)
0.5 0.5 0.5 0.5 0.5 0.5 0.5 0.5 
##$TPOFFS= (0..7)
0 0 0 0 0 0 0 0 
##$TUNHIN= 0
##$TUNHOUT= 0
##$TUNXOUT= 0
##$USERA1= <user>
##$USERA2= <user>
##$USERA3= <user>
##$USERA4= <user>
##$USERA5= <user>
##$V9= 5
##$VALIST= <valist>
##$VCLIST= <CCCCCCCCCCCCCCC>
##$VD= 0
##$VDLIST= <DDDDDDDDDDDDDDD>
##$VPLIST= <PPPPPPPPPPPPPPP>
##$VTLIST= <TTTTTTTTTTTTTTT>
##$WBST= 1024
##$WBSW= 4
##$XGAIN= (0..3)
0 0 0 0 
##$XL= 0
##$YL= 0
##$YMAX_a= 473466
##$YMIN_a= -527075
##$ZGOPTNS= <>
##$ZL1= 120
##$ZL2= 120
##$ZL3= 120
##$ZL4= 120
##$ABSF1= 10
##$ABSF2= 0
##$ABSG= 5
##$ABSL= 3
##$ALPHA= 0
##$AQORDER= 0
##$ASSFAC= 0
##$ASSFACI= 0
##$ASSFACX= 0
##$ASSWID= 0
##$AUNMP= <proc_1d>
##$AZFE= 0.1
##$AZFW= 0.1
##$BCFW= 1
##$BC_mod= 2
##$BYTORDP= 1
##$COROFFS= 0
##$CY= 11.3945322036743
##$DATMOD= 1
##$DC= 2
##$DFILT= <>
##$DTYPP= 0
##$F1P= 2.36226072786647
##$F2P= -0.459571619588291
##$FCOR= 0.5
##$FTSIZE= 0
##$FT_mod= 4
##$GAMMA= 1
##$GB= 0.15
##$INTBC= 1
##$INTSCL= 1
##$ISEN= 128
##$LB= 0.24
##$LEV0= 0
##$LPBIN= 0
##$MAXI= 10000
##$MC2= 0
##$MEAN= 0
##$ME_mod= 0
##$MI= 1.114404
##$NCOEF= 0
##$NC_proc= 0
##$NLEV= 6
##$NOISF1= 3.799351
##$NOISF2= 2.8
##$NSP= 1
##$NTH_PI= 0
##$NZP= 0
##$OFFSET= 15.70392
##$PC= 1
##$PHC0= -18038.13
##$PHC1= 14.80069
##$PH_mod= 1
##$PKNL= yes
##$PPARMOD= 0
##$PSCAL= 0
##$PSIGN= 0
##$REVERSE= no
##$SF= 200.130013532006
##$SI= 16384
##$SIGF1= 3
##$SIGF2= 2
##$SINO= 400
##$SIOLD= 16384
##$SREGLST= <1H.CDCl3>
##$SSB= 0
##$STSI= 0
##$STSR= 0
##$SW_p= 3612.71676300578
##$SYMM= 0
##$S_DEV= 0
##$TDeff= 0
##$TDoff= 0
##$TI= <>
##$TILT= no
##$TM1= 0
##$TM2= 0
##$TOPLEV= 0
##$USERP1= <user>
##$USERP2= <user>
##$USERP3= <user>
##$USERP4= <user>
##$USERP5= <user>
##$WDW= 1
##$XDIM= 8192
##$YMAX_p= 0
##$YMIN_p= 0
$$ End of Bruker specific parameters
$$ ---------------------------------
##NTUPLES= NMR FID
##VAR_NAME=  TIME,          FID/REAL,        FID/IMAG
##SYMBOL=    X,             R,               I
##VAR_TYPE=  INDEPENDENT,   DEPENDENT,       DEPENDENT
##VAR_FORM=  AFFN,          ASDF,            ASDF
##VAR_DIM=   8192,          8192,            8192
##UNITS=     SECONDS,       ARBITRARY UNITS, ARBITRARY UNITS
##FACTOR=    0.0002768,     1,               1
##FIRST=     0,             0,               0
##LAST=      2.2672688,     0,               0
##MIN=       0,             -527075,         0
##MAX=       2.2672688,     473466,          0
$$ Real data points
##PAGE= N=1
##DATA TABLE= (X++(R..R)), XYDATA
0 0 0 0 0 0 0 0 0 0 0 0 -8 8 -8 16 -16 24 -25 32 -40 48 -64 72 -88 104 -120 142 -161 190 -217 249 -286 326
32 326 -372 420 -476 535 -599 671 -753 839 -933 1037 -1155 1275 -1411 1561 -1722 1901
48 1901 -2094 2306 -2540 2797 -3084 3403 -3759 4164 -4618 5141 -5750 6464 -7318 8363
62 8363 -9675 11380 -13689 17017 -22247 31714 -54254 225324 -22051 -451625 136618 405857
74 405857 56816 -260947 -73447 58282 46783 25905 -51975 -220253 -58858 244653 133424
85 133424 -279959 -225220 212939 250451 -163102 -247517 55317 178757 15726 -82761 -50160
96 -50160 21977 114833 132729 -49066 -147690 48919 170120 -26206 -146930 -9505 66340
107 66340 -19300 -22527 17514 -66972 -71785 103009 95172 -128054 -124472 121912 147099 -86236
119 -86236 -126555 69902 88472 -51947 -24696 49532 -42835 -59815 108608 91163 -155955
130 -155955 -125130 174763 144260 -160263 -141855 125213 125546 -77838 -87729 34962 29232 -7183
142 -7183 27473 -13520 -75424 20352 111786 -8584 -135463 -18855 127762 28597 -107908
153 -107908 -31763 75977 32528 -32897 -15714 -412 -7896 31267 35113 -51703 -43893 70036
165 70036 49174 -66824 -36350 62356 13330 -72595 -6212 59168 -23111 -63103 27752 53677
177 53677 -25792 -33976 42944 45168 -18461 -2878 33175 -18346 -37263 30909 21436 -74013 -54494
190 -54494 69011 52887 -80845 -59435 74280 62243 -45062 -45748 21431 30616 6893 960
202 960 -23075 -30074 38040 60781 -30525 -64522 31266 81732 -6408 -74290 -8716 53557 5465
215 5465 -43937 -25766 -138 9702 17240 -2032 -39209 -13427 56402 30019 -57806 -31321 56846
228 56846 37062 -38021 -27274 27697 16798 -15494 3314 9857 -15276 -4 27761 -703
240 -703 -33556 -2511 33997 -715 -37520 -831 27291 -4830 -19379 7558 10706 -16144 -8065
253 -8065 22390 370 -29814 4698 30040 -4837 -23946 4512 18342 -3217 -6673 9084
265 9084 -1279 -9551 12986 12058 -16430 -11733 18985 16074 -18144 -16867 18726 15341 -15278 -12122
279 -12122 6220 4515 -4436 -2386 -2556 -10053 3138 17236 -7998 -23321 8746 23879 -6957
292 -6957 -22812 6323 21860 -4790 -14728 6925 8885 -1702 2036 2885 -4732 -562 13097 6507
306 6507 -16597 -6352 20848 6280 -21748 -10870 14787 6763 -17658 -9074 10722 -457 -8906
319 -8906 2557 1677 -6318 1393 9609 -981 -10211 7197 16126 -5169 -11161 7823 11288 -2712
333 -2712 -7250 5151 9386 -2210 -3160 4342 -571 -4922 -716 -158 -5046 -6519 361 -401 -9669
348 -9669 -3018 6755 -539 -4723 3130 7334 1937 -2631 1497 1898 -2769 1101 2012 -2185 2835 7567
364 7567 3987 -203 -455 3202 47 -6652 -3462 -1342 -3985 -2938 -120 26 -2630 -970 8309 4382
380 4382 -6807 -1256 6080 181 -7469 -6527 -41 536 -383 3357 457 -218 9049 8050 -3840 -7867
396 -7867 306 7740 720 -9206 -3178 7794 9200 497 -7688 -1724 7417 5040 -4194 -11879 -6241
411 -6241 7849 3189 -12918 -12015 2827 10538 635 -7391 -1324 5561 7938 3195 -8747 -6669
425 -6669 10402 14737 1953 -9819 -364 16868 9712 -10364 -13734 1722 10481 -2055 -15052
438 -15052 -6993 2296 1802 -700 -8073 -10267 1219 12960 7337 -8585 -5917 14185 15140 -3731
452 -3731 -13782 -2004 15671 7706 -13869 -10835 6681 8574 -1915 -6413 -2180 712 3811 8217
466 8217 -1857 -14591 -2868 13458 5984 -15558 -14721 14399 22803 -4930 -17835 2602 14494
479 14494 -3232 -17393 -4177 4123 -3810 996 7793 -3967 -6310 13554 20789 -5053 -20865
492 -20865 3424 23131 -885 -26313 -11869 15676 9144 -16444 -9014 14891 11311 -1202 1531
505 1531 1380 -8587 -6545 6998 2128 -16762 -8982 15481 12986 -9407 -12333 11964 21565 -5185
519 -5185 -20309 1512 15133 -2347 -15513 -1772 7003 -6107 -6109 10996 7557 -7085 378 15975
533 15975 8172 -14759 -11267 14478 12253 -13220 -13071 9793 10148 -12747 -10738 10004 -348 -16809
547 -16809 -1280 10844 -7049 -15254 7926 19332 -5807 -17597 9553 25893 5238 -12393
559 -12393 2314 19355 4919 -13887 -4691 4632 -2944 -5421 -458 -4284 -11688 -3400 9840 -366
573 -366 -15924 -4574 12041 8288 -8051 -9338 10959 17152 -3427 -14134 3715 17348 2992
586 2992 -11198 -794 7359 -2346 -4721 1332 -1414 -3922 1253 7073 -141 -10368 -1240 12104
600 12104 2496 -13182 -7454 9641 4912 -11581 -4152 10865 2482 -8156 -843 6261 796 -3428
614 -3428 2918 3972 -5810 -5329 3617 4437 -1899 -5008 2701 9548 1888 -4527 1854 6272 1958 -3295
630 -3295 -3172 -1364 -2986 -1436 -625 -4494 -3727 -939 -852 311 -940 -941 5111 5216 -3288 -5453 3887
647 3887 9311 -1856 -7718 3136 9173 1560 -3837 -654 4768 2611 -3514 -3218 -1197 -1398 -99
662 -99 -264 -2691 -3316 786 4773 -1699 -5889 3163 7767 -1782 -7873 -1619 5974 2624 -4871 -3458
678 -3458 2244 5314 2454 -3204 -14 5223 1906 -1654 -1247 -2 1875 1523 -1243 -2088 -587 2536
694 2536 -237 -4572 -1917 2147 1630 -2683 -5651 -839 4613 341 -3687 -891 2734 1723 -1060
709 -1060 195 2875 177 -87 1247 -247 371 1457 531 -542 -1071 1186 1239 -1746 -2043 450 1128
726 1128 -27 -3034 -1339 1759 -821 -1710 712 415 -1142 -1223 651 1706 -69 -739 639 336 333
743 333 597 440 1077 -153 -229 1912 140 -803 490 505 -48 -298 -23 647 -1632 -1264 2228 1399 -1588
762 -1588 -2519 -480 1694 -587 -2386 320 1187 205 -454 -331 1035 226 -773 -112 -947 -461 1567 458
780 458 -1651 -609 2549 3952 -146 -2294 2198 3647 818 -2213 -2196 538 -109 -2082 -324 -119
796 -119 -219 323 -519 -1372 -1091 -491 54 -1924 -2612 1244 1827 -488 -1402 776 3816 1989 -728 1390
814 1390 2206 558 387 155 679 -432 -1018 634 171 -933 -152 -629 -1676 -1632 -1432 -873 -1870 -2196 640
833 640 1460 -166 -563 -162 1502 735 -994 926 1497 -149 335 335 929 1415 -271 40 842 48 539
852 539 161 -750 -1381 -1946 5 337 -2500 -1608 835 1503 209 -1498 -162 677 -1469 -608 970 -553
870 -553 -706 1002 1365 -200 -1734 1472 3060 -500 -681 1919 2204 -72 -1169 136 -255 -1602 484
887 484 1088 -2525 -1285 2628 1908 -2428 -3596 1650 2280 -2749 -2408 907 96 -1046 229 838 -1409
904 -1409 -1345 3378 3109 -1917 -984 3893 3049 -1781 -3177 1909 3575 -1166 -1695 1361 1021 -421 -135
921 -135 -356 -1919 -2959 437 865 -3261 -3616 -365 1678 641 -2944 -1487 3163 3458 362 -1037
937 -1037 1755 3989 -61 -2316 864 737 -407 796 1804 -448 -3337 902 4899 -1649 -6941
952 -6941 -37 6635 -34 -8065 -1792 6464 -498 -6556 543 4006 -1507 -1777 4246 2026 -5484
967 -5484 -1532 7132 1324 -6671 -757 7661 3896 -5755 -2695 6503 2822 -4972 -2440 1899 31
982 31 -2007 490 1683 -2532 -2160 3194 1728 -3000 -2283 1897 3704 -1445 -5540 -1918 3786 2301
998 2301 -3105 -2449 4371 4133 -2427 -1448 2758 1311 -1694 269 2289 -1516 -3273 3138 5883 -2774
1014 -2774 -6482 2034 6625 -2430 -8685 1587 6791 -3559 -6789 2091 3355 -2845 -1201 5136
1028 5136 789 -5453 954 5925 -1538 -6205 658 6091 385 -5652 152 5968 1704 -2555 -207
1043 -207 1759 148 -603 1164 -283 -3171 -44 1015 -2415 -2677 -90 357 786 -124 -1982 -1343 3047
1060 3047 3578 -2587 -3467 3969 3231 -2930 -2191 3034 2663 -2102 -1362 2783 -21 -2881 2256 4068
1076 4068 -2347 -5503 1378 4893 -3700 -6159 3280 4499 -3883 -3369 3317 2535 -2398 -8 2884
1091 2884 -1648 -3339 2291 2647 -2041 -2213 2220 2314 -1831 -2321 1245 2142 -195 -552 -660 -498 160
1108 160 1263 487 -1894 -72 2540 -758 -1929 1607 1521 -1373 -531 1258 -746 -2628 1644 2524
1124 2524 -3485 -2646 2936 1149 -3664 -1717 3318 1371 -2873 -304 3165 -150 -1600 2573 3217
1139 3217 -1440 -2505 2847 3198 -2837 -1569 3396 435 -3987 -297 3249 -888 -3776 863 1486
1154 1486 -3416 -1881 1996 -332 -2570 -486 1926 -129 -2011 1363 2755 -152 121 2205 1421
1169 1421 -521 285 2544 619 -2137 361 1086 -2153 -1230 1000 -422 -2504 -1101 920 -1461 -2677
1185 -2677 670 646 -2560 -737 1641 -13 -1529 1096 2826 -12 -792 2578 2228 -765 747 2753
1201 2753 901 -1924 -594 2357 -641 -3290 261 1324 -3001 -2868 1416 1132 -3248 -1770 2834
1216 2834 1 -2698 630 2357 -743 -1657 1812 2361 -1368 -959 3000 1670 -1445 433 2464 198
1232 198 -1695 -10 1786 -1241 -2638 571 -142 -1693 -784 952 -520 -1859 628 1525 -616 -1115
1248 -1115 1546 419 -1033 148 903 -234 -688 735 1245 -817 -628 1071 50 -1055 -10 978
1264 978 -535 -1392 308 1193 -1190 -717 1223 -125 -970 526 1646 33 -1693 614 1654 -1390
1280 -1390 -1134 790 -12 -1510 -198 1517 -469 -2287 295 1702 -996 -1214 1345 1062 -679 -545
1296 -545 1851 1173 -1812 -56 1713 163 -792 819 1309 -683 -1336 1001 752 -1328 -1076 597 -158
1313 -158 -1246 -961 46 -736 -1606 490 1034 31 106 964 956 350 784 614 423 -266 523 505 72 473
1333 473 -89 -257 55 46 -166 -753 -858 146 -199 -710 -54 -425 -700 -559 74 469 -301 -418 970 192
1353 192 -258 573 415 250 -61 851 923 -63 -411 594 182 -506 288 139 -373 -711 -160 607 -877 -910
1373 -910 254 -243 -814 -200 537 -265 -822 -147 1206 -26 -788 269 347 32 -12 438 631 -493 -477
1392 -477 904 733 -548 -230 507 875 -468 -849 734 6 -803 -165 701 199 -729 -340 995 -22
1410 -22 -1052 -611 19 -241 -1103 -406 1139 93 -1258 106 1424 418 -474 259 1236 -179 -700 719
1428 719 848 -410 -428 362 1269 92 -1097 542 703 -886 -1121 138 149 -1377 -1789 238 401 -1228
1446 -1228 -621 298 564 -262 -122 823 1177 -387 -148 1417 977 -370 -434 1203 1062 -1149 -531 974
1464 974 -39 -1089 -845 732 70 -1679 -1108 603 346 -1198 -646 900 340 -1436 -30 1750 -20
1481 -20 -998 396 1348 -224 -1108 667 1331 -32 -307 448 648 17 -597 243 1100 -416 -1234 -131
1499 -131 499 -328 -754 -35 513 -855 -942 177 220 -216 -735 -497 727 130 -798 594 1702 111 -962
1518 -962 654 1979 -360 -934 1440 1319 -1044 -627 991 536 -903 -854 915 65 -1488 -903 535
1535 535 227 -1375 -962 924 105 -1909 235 1334 -256 -688 404 931 -316 -562 836 903 83
1552 83 -199 -384 483 501 -282 314 754 87 -1098 -127 333 -176 -1003 -389 26 -441 -867 -305 411 161
1572 161 -1003 -229 1356 283 -1157 603 1771 -172 -1407 590 2055 -1071 -484 1548 657 -1311
1588 -1311 -519 901 494 -1282 -512 874 -418 -1423 -72 1007 -206 -1316 96 1097 -887 -900
1604 -900 1369 675 -906 -5 861 114 -859 388 777 -371 -240 401 -270 -149 253 -177 -99 150 -118
1623 -118 -342 167 418 -127 -464 205 -14 -89 -39 -151 314 -36 -1134 -131 693 -512 -639 433 771
1642 771 -1177 -857 1246 356 -1047 391 1120 -260 -939 540 927 -414 -307 1004 689 -1019 -346
1659 -346 908 380 -573 -486 889 -283 -1462 37 866 -665 -1246 410 520 -661 -558 828 255
1676 255 -782 153 786 40 138 617 648 119 67 791 262 -295 375 426 -121 -263 -137 77 -550 -452 115
1697 115 -374 -522 -185 257 -143 -706 377 284 -439 -239 820 25 -493 635 617 70 115 1001 518 -773
1717 -773 230 853 -232 -395 312 81 -259 -582 -55 133 -712 -424 508 -148 -806 -225 468 -17 -747
1736 -747 351 649 -730 -283 1301 316 -575 121 825 147 -744 563 823 -216 -410 564 534 -546
1754 -546 -589 380 -35 -846 -219 827 -533 -756 50 304 -86 -583 575 146 -519 -26 655 14 -226
1773 -226 311 411 -39 -179 791 255 -440 343 430 -237 -269 30 53 -445 -323 290 -221 -755 -24 244 -482
1794 -482 -443 322 164 -586 -138 585 99 -594 465 501 -19 -155 394 429 -560 -53 883 158 -574 23 525
1815 525 -3 -490 -140 247 -577 -552 699 298 -791 66 453 -109 -784 59 427 -566 -405 790 521
1834 521 -503 -19 545 602 -349 493 982 -3 -544 600 466 -558 -400 451 249 -394 -242 563 -138
1853 -138 -709 -175 401 31 -452 -211 -190 -553 -208 237 -51 -483 15 348 301 237 277 367 -146 302 252 50
1875 50 -293 263 -8 -202 -45 385 -225 -54 102 525 -25 -443 180 -5 -261 -275 345 -38 -826 -144 512
1896 512 -208 -741 204 728 -374 -662 162 283 -576 -319 570 386 -80 -110 489 462 -55 -7 554 286 -229
1917 -229 -198 405 -179 -279 -197 -259 -403 -344 -346 -259 -212 -235 -255 181 151 253 146 484 929 272 -28 524 380 215
1941 215 184 271 -14 -321 146 27 -30 -126 -371 -385 -52 -477 -571 106 56 -527 -144 215 -57 -147 146 734 273
1964 273 -72 56 84 337 58 -407 208 159 -512 -12 503 103 -105 -4 391 -81 -524 23 259 -174 -342
1985 -342 -176 403 83 -461 -185 269 -83 -264 -182 281 -89 -817 205 432 -523 -698 515 458 5 118
2005 118 571 266 59 142 362 303 204 -597 48 167 -223 -637 574 297 -357 -402 423 294 -470 -375 441
2026 441 -58 -393 -343 102 359 -203 -30 1000 398 -601 287 924 317 -520 385 964 -449 -713 361
2045 361 318 -452 -465 511 -6 -397 -404 241 4 -499 -359 194 179 -244 -89 685 177 -492 227 433 346 201
2067 201 181 186 4 48 197 6 271 -113 -521 -38 -69 -410 -366 -2 14 -576 -149 459 23 -405 45 476
2089 476 -23 -189 160 348 316 -395 199 669 -322 -480 492 630 -449 -568 644 311 -608 -143 683 -257
2109 -257 -328 -110 322 -5 -445 287 332 -222 -46 239 237 -119 -161 281 249 -487 -52 420 34 26 25 260 -353
2132 -353 82 690 335 -216 271 131 -436 147 338 220 -42 301 84 -547 -179 266 -58 -182 -69 -27
2152 -27 -126 -137 22 442 -93 -117 290 322 -152 55 619 364 -218 -69 369 -192 -345 256 272 -268 -14 213
2174 213 89 -261 246 299 -264 -44 41 106 -117 -241 177 -10 -111 -99 273 -40 -118 226 599 -144 -210 439
2196 439 445 -304 7 562 70 -250 76 432 -281 -288 307 42 -609 -394 87 133 -146 -142 168 -25 -391 -38
2218 -38 139 -316 26 99 168 -214 -218 199 113 -199 -83 136 73 170 126 181 -244 70 39 -13 -291 287 16 -168
2242 -168 -85 -87 -211 7 -146 -159 -232 -396 161 -228 -381 -287 77 50 -253 -114 212 177 -314 198 406 -145 -43
2265 -43 331 313 6 38 432 41 -394 133 310 -270 -519 -46 -147 -454 -454 83 -82 -275 245 164 -75 -117
2287 -117 254 553 207 -162 706 324 69 263 410 247 52 25 473 -16 -159 -123 -183 -95 -302 -88 41
2308 41 -549 -200 64 -30 -54 30 53 120 123 183 8 185 182 103 111 295 494 -277 182 410 308 -177 -166 212 10
2333 10 -283 -208 -26 -218 -297 -101 283 -283 -429 -173 302 -18 -148 364 127 -42 44 351 155 -56 346
2354 346 342 -37 -468 261 280 -312 -454 147 69 -363 99 7 -83 -107 15 -18 -184 -137 -75 335 -231 295 -69
2377 -69 117 228 23 21 181 93 63 -140 -118 -11 132 -284 10 204 330 70 72 -224 -74 -104 20 194 -441
2400 -441 -38 -169 130 69 -195 20 -106 -316 -83 -123 256 -282 -184 -88 -139 33 91 141 123 0 155 206 290
2423 290 121 197 -60 239 372 -119 -89 -63 40 -196 -156 -31 -95 -302 -92 -365 -170 52 201 245 -60 -195
2445 -195 221 383 -171 -135 431 232 -82 -317 234 498 -229 -239 114 205 -215 -191 -75 -310 -23 -236 328
2466 328 247 -192 -143 168 25 -479 -207 252 280 -255 -2 322 273 -60 99 176 -220 -236 112 145 -134 -132 116
2489 116 450 1 -200 125 388 40 -218 134 125 -206 -28 -82 3 -464 27 -339 -51 -229 -30 228 -107
2510 -107 -118 -140 233 341 -305 -67 337 261 -326 -46 503 -46 -73 124 -94 -83 -126 256 -172 -188 -79 -310
2532 -310 44 -105 -429 95 125 -13 -103 -100 61 115 -75 176 203 -173 99 106 166 -25 79 -85 240 -103 -106 368
2556 368 291 -249 -57 -194 -265 -173 132 91 -540 -142 34 39 -38 244 85 31 -353 38 175 192 64 84 5 108
2580 108 62 -132 252 -105 122 -39 28 -37 148 23 -88 -2 -4 -147 -237 109 119 -334 -121 184 -211 -118 -119 166
2604 166 38 -181 0 4 220 -24 114 60 8 -279 61 -8 29 -30 -68 -114 95 17 -88 -2 -117 121 -314 -506
2628 -506 245 -69 -278 325 246 -76 15 35 125 -277 -17 438 -287 3 -68 -32 212 6 -145 316 -11 -23
2650 -23 221 -17 88 -267 115 372 -42 -1 10 77 -349 -29 127 -105 -197 37 195 -210 -171 -140 73 66 62 -25
2674 -25 -210 -2 122 -11 178 65 103 166 10 55 122 184 52 165 82 -230 -127 101 -271 -58 -19 -185 -240
2697 -240 -305 5 54 -296 -73 292 -71 112 73 70 185 -95 65 145 -8 -10 -61 246 -65 -126 249 20 -180
2720 -180 -201 304 -136 4 89 -50 -56 -50 381 -40 -188 -59 171 158 -234 328 268 -478 -64 294 -69 106 -29
2743 -29 65 16 -156 -14 -58 -81 -232 213 192 -227 -192 210 154 -71 99 159 23 153 -42 -383 -144 336 -198
2766 -198 274 -268 -75 -83 -54 4 39 168 -343 30 61 -108 -58 162 274 -23 3 322 29 -42 41 118 -30 -215
2790 -215 139 -18 -203 68 74 -3 -74 251 241 -152 -295 116 5 53 -214 122 219 111 0 465 162 -259
2812 -259 -130 224 -195 -158 163 65 -162 0 -22 -30 -41 -302 292 159 -38 12 -348 123 -24 -90 53 13 30
2835 30 41 153 192 7 -61 199 -44 227 -131 74 -140 -57 131 -316 -41 149 -204 -162 -107 -9 72 222 -298
2858 -298 -210 -169 -41 141 -19 -136 -152 199 -4 145 132 -60 -212 -26 121 -189 -67 -27 -232 -21 152 193
2880 193 -74 -20 -278 -98 -51 -168 127 -157 -232 -82 37 -33 -318 81 378 -181 -210 97 -106 -206 -199 -11
2902 -11 167 119 -170 386 -155 -68 148 -38 109 -10 5 35 109 -363 94 48 -34 179 92 -7 118 -260 63
2925 63 194 13 241 94 145 -192 -1 55 -66 48 74 -323 104 35 43 186 -48 18 -83 -188 -4 -79 -136
2948 -136 -66 153 -155 -141 84 10 -51 -131 130 331 -151 -57 -150 -144 -37 228 271 80 -342 -134 81 -61 -208
2971 -208 7 106 -76 -107 -89 16 -290 -205 258 46 -85 -304 28 -121 -9 -166 -70 -24 75 60 -337 28 124
2994 124 -124 -73 -278 66 104 164 311 -44 119 15 170 197 132 -40 17 -227 -247 75 -125 -206 135 -87 -67
3017 -67 -96 251 -20 31 -61 147 -127 19 -198 -34 204 -33 -70 101 100 -91 19 1 -282 175 -42 103 -299
3040 -299 238 28 -51 -156 -32 89 137 -128 76 -29 -117 74 244 53 -119 -5 -143 -11 144 112 205 37
3062 37 -159 -38 -81 81 66 288 136 -79 158 -203 225 -11 298 -127 132 -30 -19 -35 -20 45 -82 -41 -170
3085 -170 28 85 -176 -185 19 -69 4 264 -142 165 -29 -84 -45 49 344 -156 -195 -12 40 -209 21 95 29 -15
3109 -15 -124 -118 352 -226 125 -41 163 91 126 29 74 67 5 12 -196 -131 156 124 -18 -4 -76 10 -25 -146 -90 -115 -137
3136 -137 291 45 51 -120 150 109 49 -71 -70 1 -90 -56 -202 -69 257 -103 38 122 169 -214 68 -9 -181 76
3160 76 -2 124 -6 151 129 185 37 312 225 -18 -35 -229 -83 -103 104 90 -194 25 103 -268 -37 -36 -192 63
3184 63 169 -128 -113 197 -88 -118 126 109 136 33 -74 -14 -66 87 -127 168 25 45 221 75 375 -54 153
3207 153 10 -144 -14 -159 225 106 -117 -303 -20 -52 -100 -48 -67 -44 -10 360 56 314 147 15 -39 122
3229 122 122 47 17 30 207 -122 -14 -13 -221 60 -94 58 153 -118 -175 13 146 86 210 -201 124 -81 1 115
3253 115 41 -37 -20 -75 199 -85 -180 -31 -105 -5 -33 79 16 -291 -185 -94 -140 -97 -41 170 -182 -106 2 -22 -1
3278 -1 -133 100 46 127 -122 83 301 89 87 155 -9 153 117 149 200 165 131 -243 -125 -294 -17 43 -245 -247 -125
3303 -125 182 90 140 -185 -188 87 -74 -346 -92 -179 169 67 63 9 36 -12 -119 -86 145 -190 -48 286 -300 0
3327 0 137 13 -211 82 -73 -42 37 99 102 -204 -39 140 -317 -140 123 79 95 39 426 -27 -156 108 187 189
3351 189 -134 170 -280 -249 -59 14 241 16 -109 13 156 -132 4 89 100 -104 230 247 12 0 69 95 67
3374 67 -221 -223 -53 91 -369 -2 -149 -156 -195 -91 -108 272 32 111 106 35 99 -56 122 -182 -115 19 -23 -137 -63
3399 -63 92 -66 43 105 -230 131 -109 -3 152 222 62 -93 -94 63 38 114 190 220 56 -110 -124 -5 -93 31
3423 31 145 -172 -27 152 122 153 -133 -230 -23 -14 -254 -59 80 -144 217 96 -166 -159 56 247 -129 -133 -55 50
3447 50 96 207 71 140 45 163 142 208 -108 122 -165 187 -45 9 145 16 -180 -94 153 -290 -44 9 -275
3470 -275 -22 -13 -39 27 -105 177 18 -107 -309 -45 -16 2 -99 59 132 -75 -48 -230 -16 -81 -122 -23 224 30
3494 30 114 225 15 -253 -215 -41 -215 -184 -42 -174 -144 -157 -138 187 85 -141 317 45 -364 -195 -40 14 -77
3517 -77 -118 -186 166 -130 144 -351 108 -121 -72 -154 -116 41 192 62 63 -184 -126 187 -21 6 -114 -165 43 203
3541 203 218 -214 5 -176 -46 -27 180 166 -141 20 119 34 99 -18 -32 120 -44 -248 -127 201 -109 89
3563 89 -76 -83 -121 -126 -185 -19 231 203 -123 -80 41 106 -99 217 -66 -234 254 -188 97 200 -142 30 -186
3586 -186 45 -12 247 -91 41 -15 60 -263 -80 -94 -279 148 18 -128 -5 -2 156 -37 -143 -63 196 -111
3608 -111 27 240 12 81 -44 128 -112 126 -22 120 -218 121 84 -249 -27 25 -156 4 241 18 144
3629 144 322 38 -238 -51 -248 -38 -202 58 197 98 -252 -132 194 14 199 -59 -125 217 -57 3 46
3650 46 -50 200 35 -144 78 -67 58 -57 78 -14 34 -137 -187 -11 107 204 48 105 -49 47 -150 245 230
3673 230 -103 29 -23 78 -38 -144 -173 187 92 -138 -250 81 -166 127 201 -54 73 -42 166 -29 -163
3694 -163 -64 -70 106 -148 -372 149 -44 -66 6 -91 64 -116 26 310 271 106 38 176 69 15 10 48 164 -49
3718 -49 139 28 -31 58 -192 309 -50 135 -76 82 199 33 15 -114 80 -27 36 -123 -52 10 70 156 -142
3741 -142 218 20 274 166 271 -113 -122 69 -55 -70 -115 -210 123 -1 -66 12 -221 -224 291 83 -260 -101 12
3764 12 -46 -65 -34 103 112 -89 99 -10 -1 -249 -95 142 94 -210 18 107 -102 198 41 -123 -117 -24 145 42
3788 42 6 -117 29 -321 -33 -37 5 -45 -69 -30 -51 8 136 87 181 103 -122 -63 -58 46 -91 50 -270 -201 -60 -44
3814 -44 177 177 145 255 -72 -55 107 3 105 -100 -27 46 -97 187 167 -252 64 -59 -152 124 -117 -20 132
3837 132 -49 77 196 144 130 -58 -13 -233 101 -37 5 -54 -60 -252 226 206 -126 48 -124 165 -58 -85 14
3860 14 -28 131 -101 104 -134 11 222 2 -85 18 158 104 -66 -16 262 256 -68 23 398 209 -48 -194 -96
3883 -96 -44 -54 -105 -42 44 94 -128 -73 -128 257 -100 -104 -239 -131 -123 -57 -117 112 249 122 137 -21 117 21 -8 79
3909 79 -142 108 105 -84 152 70 -146 52 137 331 -303 58 -29 42 54 -125 -21 -66 -45 53 8 -247 -89 130
3933 130 -207 -77 -170 81 187 -38 21 -79 -171 -29 189 181 -145 145 4 72 -129 -221 -188 -163 21 37 -3 -165
3957 -165 40 -22 -42 197 46 36 -17 120 -4 321 -39 -168 -125 239 124 181 117 32 4 -14 -22 -91 414 54
3981 54 26 19 9 -226 0 -87 109 53 87 -53 -221 77 145 -154 273 28 194 -122 2 -93 107 -121 31
4004 31 -76 199 228 134 -217 -160 98 -86 -37 -15 -253 143 -60 14 -61 -77 -105 -150 2 25 -20 54 89 21 126
4029 126 27 -46 58 103 189 163 -158 23 -225 138 -159 -78 -102 -6 158 12 46 123 182 24 -99 138 -18 -137
4053 -137 -57 -123 161 -147 -8 -203 32 18 82 82 -5 48 -214 222 -126 151 161 167 178 -106 25 -29 -64 10 -35
4078 -35 79 -2 79 -58 145 118 -47 41 -108 63 166 124 -39 96 139 -87 147 56 -38 47 277 142 -252
4101 -252 -157 17 -175 -168 191 0 70 170 -82 187 104 -145 -13 26 117 -182 51 55 157 2 -271 -86 234
4124 234 51 -7 59 43 6 -83 -66 160 28 7 22 -7 -176 104 169 -196 -192 15 92 33 21 106 89 172 101 99 79
4151 79 -35 -105 149 196 42 -193 -142 233 -8 100 -85 4 66 35 -212 -229 133 -39 -309 -114 162 -94 -153
4174 -153 -163 -135 132 21 -81 311 -48 39 -123 -193 7 -24 -139 -157 97 124 -25 -79 -47 205 -7 92 -32
4197 -32 118 36 15 -213 1 -137 119 50 -343 -109 -206 -6 145 99 179 -387 201 223 -129 -85 -301 59 -21
4220 -21 231 -21 326 264 -46 197 18 -98 13 254 229 135 -226 -43 165 -220 -49 119 47 20 128 -34
4242 -34 -103 -95 86 -35 40 -418 84 -63 -46 -154 -130 70 -353 88 -67 -148 1 45 91 -136 -33 241 138
4265 138 -63 -55 -79 28 97 39 -176 -39 216 -207 -15 -273 13 -82 34 147 72 -32 -96 -96 -133 -69 89 195
4289 195 -70 110 104 -224 225 -13 96 38 -24 184 91 -73 -118 -82 4 108 -227 -165 -66 -270 -99 186 158 82
4313 82 403 -82 106 -45 -57 -342 105 43 -125 70 225 -56 -122 83 -127 -38 37 100 34 -149 -275 85 -73
4336 -73 121 120 -248 -27 35 134 320 67 299 473 308 102 115 -285 66 -25 37 58 -70 245 -38 -114 -196 97
4360 97 14 -29 4 219 39 -131 19 185 185 141 24 40 44 -12 3 -199 -45 -43 3 136 28 -89 97 87 67 175
4386 175 -178 21 -151 47 296 297 -278 -31 182 122 18 -111 70 -93 -14 -49 -149 -55 -18 -115 209 63 -138
4409 -138 273 39 128 -58 144 -71 32 79 -140 149 32 0 -29 121 -12 105 -145 -179 -109 -114 -130 12 -284
4432 -284 -27 -90 -107 5 -276 183 -182 117 122 120 77 91 -5 -8 -107 -177 -67 -113 77 -7 158 120 -25 -12 -292 41
4458 41 52 18 31 185 134 -101 90 -1 141 -82 11 -51 -58 114 -153 -147 -27 -2 116 -350 -26 -24 44 61 15 217
4484 217 99 165 -76 155 69 -40 114 117 -1 135 -171 -120 -83 13 81 -231 -36 -204 -38 -103 145 -138 -286
4507 -286 -56 -73 -19 61 -184 -38 93 -197 -2 -47 87 -10 -7 176 106 -75 200 -29 -142 17 -105 -46 163
4530 163 -25 208 189 -330 89 240 -65 71 60 -148 -219 -163 143 59 -56 96 197 -24 48 72 76 -124 48
4553 48 -81 -155 123 79 17 -109 -309 -53 165 -149 -7 -180 89 -95 259 121 9 194 53 -9 66 -54
4575 -54 24 130 -58 -38 -7 -144 -56 104 161 67 116 -76 67 51 -47 -96 34 42 -170 -128 50 263 -74 37 353
4600 353 232 -129 -23 123 132 28 8 12 -64 87 -91 159 122 -88 129 -133 24 265 140 52 -28 -82 170
4623 170 218 -122 -348 40 117 80 169 8 276 19 -98 147 -165 144 117 -163 358 113 150 -14 59 122 47
4646 47 -44 178 -9 7 39 -128 -119 -183 28 111 -192 -65 110 93 -238 38 -90 91 13 -16 326 -2 -12 131
4670 131 -212 -226 109 203 209 -101 167 63 18 102 203 -77 1 30 103 -4 -358 -180 97 53 -316 -108 -232
4693 -232 283 97 -95 112 163 65 -174 17 -63 110 -95 -164 75 -42 -204 73 -92 81 -59 94 -155
4714 -155 45 25 -34 58 -272 -6 73 0 -25 97 24 82 -225 -8 -67 318 61 -133 -75 -72 148 168 -27 -6 308
4739 308 -4 37 -228 -202 239 -108 25 -27 189 18 13 128 142 23 -225 -157 -43 3 65 -111 70 -143 9
4762 9 29 6 97 -228 148 108 143 62 92 -105 306 52 -10 220 20 89 -28 -16 123 242 68 -151 -122 3
4786 3 -14 -129 -134 -385 93 -134 -158 22 209 127 -105 -166 124 19 66 130 41 57 -88 -152 14 197 43 -216
4810 -216 -92 -24 74 -9 -128 1 155 187 54 221 -13 -102 85 -113 -262 -50 -34 -13 151 -98 -23 -100 -139
4833 -139 162 33 144 -150 -68 -59 76 99 -33 -4 202 69 94 -44 53 -79 165 27 -250 83 144 -33 -237
4856 -237 -238 -262 189 -209 10 55 166 10 115 88 -46 -85 198 73 83 -10 124 -140 80 59 -27 187 -104
4879 -104 122 94 -216 -128 -196 129 -214 117 -92 -66 96 -10 -219 -145 -35 152 92 -99 46 135 10 141
4901 141 266 -115 189 194 -31 154 -206 -333 38 134 12 256 164 136 -26 -353 131 -205 -129 -124 -65 101 -26
4924 -26 57 123 -57 9 -53 268 -452 -30 -156 -140 -202 -139 -9 -59 -102 264 -6 199 -231 103 -56 -88 71 -149
4948 -149 84 -95 -35 -14 42 -93 -44 17 18 180 48 99 41 -84 314 -96 9 118 27 -214 16 -216 -21
4971 -21 32 216 -39 -20 306 -56 19 94 -41 -68 -7 -120 -27 -66 -74 -82 132 -13 -64 117 125 129 104 109 -284 42 247
4998 247 -77 89 -21 -103 40 67 -346 -50 -236 -198 75 -73 -137 -23 -120 4 -184 102 -100 -79 -38 -18 -102
5021 -102 -95 -36 -52 48 17 150 -34 172 -175 -120 0 6 -151 25 108 -98 -159 89 238 -37 -173 115 123 -39
5045 -39 -178 -153 -181 -135 -135 139 110 171 -55 -168 -63 -121 -15 -16 74 -52 119 -138 -209 80 -20 -48 -10 -84 99
5070 99 -256 -42 68 37 111 167 -32 65 38 67 -40 -163 -153 -269 -56 136 125 -48 -258 -84 -6 77 156 -9
5094 -9 -1 7 -90 11 150 -32 -70 273 145 -63 29 94 -37 -77 -165 -39 -29 -125 -23 -187 23 167 -208 -94 30
5119 30 -133 -78 -35 -3 73 47 46 51 106 54 22 11 -181 -50 162 214 -23 30 -184 160 -126 -54 150 -19 -54 149
5145 149 295 -62 286 -59 -63 45 -103 91 -214 139 89 -81 63 -177 33 -141 303 191 -163 42 107
5166 107 -3 168 -30 187 99 -233 -99 92 -208 101 -178 165 -33 -5 7 -91 186 -66 148 15 -59 47
5188 47 126 -124 -119 -46 -58 179 -234 -19 -2 81 -152 -37 104 175 -9 309 -6 46 55 -2 238 -112 133 380
5212 380 -2 17 -6 14 -16 -106 80 36 -98 91 36 120 104 -115 12 322 8 25 57 68 41 -50 18 30 -107
5237 -107 -75 14 69 260 -11 -110 190 41 -159 -209 -220 44 -156 -40 -118 343 72 -330 -88 -191 172 75 -103
5260 -103 -269 243 -121 -52 15 79 12 174 59 1 -7 -49 25 -37 42 -1 -47 -316 27 -238 41 -70 -63 2 79 -135
5286 -135 -7 -3 18 -50 -67 -153 139 44 -72 -150 365 -100 94 88 -32 59 74 81 -271 57 216 -150 142 138 -132
5311 -132 -100 -54 -132 -121 18 123 118 159 75 -65 -41 27 -119 170 112 -206 190 47 -20 -122 -35 -43 -263 90 -231
5336 -231 -83 -257 -85 11 -56 -287 107 -60 -27 100 149 -89 -41 -66 44 -60 78 -104 -14 -282 26 88 -115
5359 -115 -83 -139 154 -3 1 153 -44 4 -68 150 -2 139 52 268 182 -238 -143 -11 -72 -5 8 -231 -13 -233
5383 -233 -52 -135 -63 155 187 -55 114 180 222 107 23 -37 128 318 -227 -248 -199 -122 180 95 -33 88 67 -38
5407 -38 -93 56 -73 103 245 35 -43 -22 -110 -148 -104 5 -68 111 -42 48 -99 -84 133 124 -126 -154 88 70 -36
5432 -36 -110 118 146 164 17 -8 -106 194 418 25 89 -52 247 -73 -63 69 76 10 269 -52 -116 133 -51 36
5456 36 29 -98 -246 -9 153 -279 31 -133 -148 210 -249 14 30 -9 95 -39 -12 -119 263 -63 -68 41 127
5479 127 82 59 -199 230 -93 -12 -10 37 -242 -27 -137 -210 177 69 -40 44 -174 -67 34 154 186 170 245 -70
5503 -70 53 35 134 -85 -38 -90 268 186 259 45 -65 99 -5 -205 199 -1 -67 -47 -107 138 -51 -72 137 49
5527 49 -114 -163 -48 -52 108 10 -134 119 -143 43 188 -126 -199 3 -225 -2 -146 117 32 85 55 30 -173
5550 -173 -33 -108 220 57 -8 -104 93 133 -87 -140 217 -115 -1 30 -106 -45 121 -61 24 47 -89 -50 -144 75
5574 75 -112 -61 -1 -141 71 27 135 -81 60 139 5 -22 128 158 -44 204 173 -189 -28 66 206 344 -117
5597 -117 -122 154 -142 259 -104 -74 87 11 -286 41 -4 211 199 -206 81 138 -119 -112 45 -72 -217 -120 123
5620 123 140 -109 -153 -143 -60 -158 -32 -46 -346 -48 -35 -50 -10 -147 122 72 -3 -190 -57 -57 -37 105 -1 60 -30
5645 -30 71 -274 220 -78 -95 347 -19 -62 -97 -121 -71 -201 -127 137 79 -14 76 137 -118 -151 206 96 13 -111
5669 -111 -178 -4 15 -76 -7 56 -36 -27 -232 6 -100 124 -295 -68 139 -146 138 127 -41 -80 60 60 81 77 -164
5694 -164 240 63 103 -23 -20 -170 28 -8 -2 161 73 79 -112 -182 -18 165 -107 154 282 -62 -10 22 77 -53
5718 -53 16 -25 2 -110 95 -23 111 178 -33 -81 235 -34 45 133 82 111 -39 85 54 223 43 197 -127 -95
5742 -95 32 -36 90 -79 60 135 -45 174 -24 -89 136 -298 -59 -107 127 85 -61 140 -61 24 -61 32 205
5765 205 -136 149 -123 -157 60 228 -125 109 59 59 18 -82 -96 -100 -5 9 -100 194 -201 -47 -69 -145 17 187
5789 187 -125 83 285 -114 -210 -81 139 119 -188 97 42 24 130 -161 272 196 -6 151 304 78 37 -88
5811 -88 -139 -167 141 -144 3 47 -281 -389 -181 -81 -188 107 3 129 -11 69 74 -106 -223 -204 -36 85 47
5834 47 64 -21 -64 -43 188 147 212 -207 -77 102 -128 2 146 76 -206 -62 -208 86 -125 105 -118 -178 -103
5857 -103 -33 -105 100 -5 89 -58 44 38 -34 89 -98 -126 39 46 79 -84 -152 146 356 -129 -51 -61 -221 -66
5881 -66 -107 214 14 -120 -233 51 97 31 88 7 -12 10 -237 29 143 167 30 -221 -285 45 -171 -102 -39 -98
5905 -98 56 -3 -63 -11 -151 -81 -95 -220 -31 -25 -17 1 -63 429 -63 192 24 -235 -104 -14 -124 -18 -322 -178
5929 -178 37 27 54 25 -6 42 58 181 118 -27 15 45 -103 79 -62 149 -122 -206 -94 -238 170 19 89 232
5953 232 -231 6 -155 -111 -75 192 230 -89 190 -52 196 -167 340 199 -33 -113 -110 -167 2 -92 -71 1 -155
5976 -155 -6 -155 -39 -8 51 -142 116 -172 18 -65 -351 5 60 -283 -139 26 -39 64 -317 82 -81 0
5998 0 -204 -57 195 -49 119 62 -146 -171 75 16 166 -13 -137 -12 -31 19 -83 14 26 150 197 125 76 208
6022 208 46 -80 14 -35 108 -77 -148 19 -169 29 192 35 -41 -61 -123 -134 255 -63 208 63 -24 40 -35
6045 -35 -158 -21 313 59 46 -164 43 -4 27 95 92 62 147 142 173 -148 -11 119 -270 -74 -115 193 -120 -95 -57
6070 -57 -8 74 -8 -116 108 271 -36 -68 206 -156 109 -104 -97 134 -59 -13 -155 -10 164 191 161 27 218
6093 218 139 26 -47 -30 149 37 -115 -132 -167 48 -124 365 -18 165 77 -95 20 26 -63 -1 -176 -138 -171 -7
6117 -7 -36 102 52 113 -155 71 194 9 49 31 147 166 65 -66 116 -131 69 74 -88 -114 -110 181 179 37 171
6142 171 -149 -152 -152 70 88 83 -2 -85 18 -41 74 162 107 -180 -13 -261 -105 -27 -60 -42 262 132 -14 114 176
6167 176 -77 -35 180 103 -50 -186 27 129 120 188 226 -80 -173 -188 -75 150 218 23 122 -46 127 81 -167 1
6191 1 29 69 -16 -37 47 236 -91 170 271 -27 123 -70 225 263 -119 314 20 220 -7 106 -99 -110 -101 176
6215 176 -49 -65 -317 -37 52 36 200 -71 68 -7 214 103 116 -20 83 123 136 318 -99 -38 -216 -70 -34
6238 -34 -127 -83 87 20 142 -86 74 31 -22 -68 298 -3 169 158 -18 -122 118 -41 -209 -8 9 7 78 185
6262 185 -195 24 -242 8 99 -118 -148 -121 19 -58 -20 96 56 -55 166 186 -18 63 -165 -66 69 -166 152
6285 152 -94 -163 -241 65 172 -30 -92 5 -267 17 -145 -137 -80 64 46 116 -173 76 92 2 56 -20 184 -181
6309 -181 -52 -92 136 -42 122 167 -180 -83 165 -69 124 -73 -47 -113 -156 232 12 -28 -104 -103 38 68 171 -51
6333 -51 -104 -46 -245 -26 -131 -126 -141 -82 70 -73 -49 89 -104 94 -115 18 75 -242 127 -73 55 -4 157
6356 157 -12 53 240 -68 -77 111 143 -62 -11 4 40 40 178 153 111 -70 -65 39 425 43 -148 -58 73 -30 -9
6381 -9 -28 207 64 153 -105 43 -18 161 -84 -145 52 -96 -65 112 72 80 319 -20 295 109 78 -59 -244 -19
6405 -19 145 -229 -170 -54 -44 -41 -172 -403 61 44 -99 206 -342 -27 -50 -148 -114 146 -165 -90 100 -68 -106 -89
6429 -89 -26 93 -91 68 116 -83 -78 17 43 164 8 -53 -121 38 120 -55 118 249 -219 163 109 -84 120 148
6453 148 52 81 40 268 77 -146 -144 278 -125 -53 252 40 -213 191 202 -96 40 0 -170 120 84 90 -123 -100
6477 -100 171 -131 -229 24 -152 -305 340 104 183 144 -141 -75 -247 191 -11 -46 -238 -106 11 120 53 205
6499 205 -143 -31 -48 -52 117 315 -12 -56 -28 111 -122 -146 78 160 -159 39 147 -91 285 -66 98 59 -109
6522 -109 -84 -268 95 -72 3 20 -68 -62 -196 -194 -281 168 -143 43 108 -98 -61 -272 195 31 4 220 -231 -153
6546 -153 172 -295 -54 35 64 139 296 3 -138 76 -140 -137 -50 151 184 5 195 -15 31 85 214 43 -118
6569 -118 30 119 -49 59 53 294 180 -271 91 118 223 -43 -9 152 107 21 184 192 129 110 183 -134 -214 -39
6593 -39 -143 -180 10 67 -340 198 -109 -9 -163 -74 85 40 -60 285 24 -117 -82 -185 -165 -8 -163 -303
6615 -303 -131 164 -49 116 85 -138 -81 141 -60 -246 96 -24 -154 -58 -3 152 34 153 -13 217 -57
6636 -57 -75 109 -48 4 26 -199 74 32 -93 10 -248 209 225 15 94 -170 -67 127 134 -48 -41 75 -26 87
6660 87 82 -33 21 -50 152 64 36 -56 -72 -4 98 -41 -18 -111 14 -297 5 -78 238 4 94 153 -129 -125 27 0
6686 0 -66 32 45 -105 -173 -219 -31 -166 52 -84 -16 241 62 -171 -12 123 48 90 -82 -203 93 -255 19
6709 19 -59 -44 93 98 -70 -320 -12 -24 112 3 -52 -35 -109 46 234 -126 -178 -75 -106 33 33 26 13 -63 58 -22
6735 -22 -64 -223 167 -58 -122 -57 -161 -92 243 61 174 28 413 44 13 86 -138 17 93 159 -119 -185 -189 118
6759 118 -160 -12 18 215 2 321 230 -189 -199 104 162 2 287 24 -102 107 108 -156 -139 -125 84 -159 13
6782 13 -141 -27 19 3 72 19 -10 -139 41 -121 351 -166 226 115 114 -106 17 29 -134 -86 115 -119 10
6805 10 -38 -51 198 -53 -186 -407 -36 -150 -32 -113 -228 188 69 182 113 -280 185 -16 66 -94 -226 -142
6827 -142 73 32 46 379 100 18 -38 -141 26 48 17 81 -179 126 136 -320 -163 53 -112 44 -224 -166 -151
6850 -151 8 -208 8 -17 3 27 136 176 121 -135 -171 -314 -51 62 37 162 -51 -10 -64 171 77 -188 19
6873 19 -238 -129 50 47 38 33 310 -86 61 -117 -86 -76 -150 -165 55 -125 141 -198 275 -144 3 294 176 -192
6897 -192 -148 -50 121 -61 344 -9 -59 76 -146 92 138 112 46 16 1 196 -206 -277 30 -84 -53 -168 -101 122
6921 122 -96 -38 -205 -97 179 51 190 13 -193 12 -49 -73 38 -63 3 45 229 -120 109 69 75 -151 -205
6944 -205 -91 97 31 -191 14 -52 -29 -126 25 -164 10 -71 250 87 32 241 -48 -156 31 1 -96 87 14
6967 14 -151 -121 89 142 -305 26 17 41 2 79 -113 15 -76 -40 19 91 4 26 34 2 89 -163 85 7 193 -41
6993 -41 -158 101 -8 -34 67 -5 -48 115 43 -59 278 21 120 -38 -17 30 -172 -274 -35 -28 157 90 72 72 252
7018 252 -160 -1 -45 88 79 97 169 -13 49 -27 139 49 34 234 111 74 -33 61 13 -204 32 -125 104 -58
7042 -58 -11 -239 41 -3 -90 -7 18 -39 -53 71 -44 -57 -74 56 -129 91 129 -62 175 -72 -113 140 162 -8
7066 -8 -319 -75 55 -99 106 -6 -93 -95 -124 106 49 95 -7 -27 -167 63 116 -102 -125 96 348 -90 96 61
7090 61 -12 155 -128 -87 252 39 282 154 36 -319 -310 24 256 -133 97 -283 56 -198 36 92 149 -2
7112 -2 -64 -9 128 194 -53 146 2 -20 -126 -131 -155 -1 -242 -101 -24 29 28 85 -21 -147 -97 55 4 -129 -49 41
7138 41 286 109 -237 -102 228 150 205 -172 -60 130 -117 -156 136 86 202 227 363 -47 54 157 88 27 -18
7161 -18 -69 120 -7 70 157 55 -13 -149 -244 -64 186 20 -172 -121 -13 -17 -6 -197 107 46 -181 -111 -224 142
7185 142 41 117 11 -42 -111 -199 -176 -77 181 -21 -59 90 11 -113 -53 -12 -87 -17 -163 -67 -282 69 220 -227
7209 -227 -67 353 -20 -115 -222 88 0 -57 34 -146 210 212 -93 -62 -49 46 -54 18 -16 -46 -64 70 48 516 16
7234 16 40 269 -50 -88 -80 54 138 61 -6 -99 -2 82 -40 -83 39 -56 -110 82 16 -100 58 384 -173 72 87
7259 87 19 167 225 75 -217 173 65 -132 -99 6 -200 194 -114 225 -358 -104 8 -77 102 -132 -107 89
7281 89 -81 -74 27 -2 173 145 54 -144 52 -59 42 -109 152 -107 85 -247 277 123 -3 -172 69 -9
7303 -9 94 149 -101 45 51 182 358 178 76 -170 -112 106 47 120 54 138 90 -120 230 51 -144 -156 -148 156 -31
7328 -31 -204 96 -33 -30 -92 -63 -118 -228 28 -141 127 72 -110 80 318 -110 -139 -78 102 94 -56 278 109 18
7352 18 41 -93 4 -133 233 15 165 125 -73 161 -26 11 79 -66 49 88 -54 192 43 -40 114 175 155
7375 155 -278 23 102 -145 -310 72 -4 -26 76 87 22 -66 -117 86 -11 141 79 241 88 -146 104 -3 21
7398 21 50 -24 -82 -12 -393 79 119 -184 -291 90 256 141 -24 -7 -40 -23 -48 153 -86 84 -68 15 -71 13
7422 13 -121 144 -215 285 181 110 5 -88 -164 194 -123 12 -28 134 87 27 152 -178 13 -48 -30 54 124 229
7446 229 333 300 154 15 104 128 39 7 40 105 -20 -36 166 58 124 82 119 -140 -63 133 -285 259 143 -206
7470 -206 -18 -161 160 -64 22 312 -218 149 249 -145 -113 58 49 98 31 77 -227 198 -26 212 13 -17 -36
7493 -36 111 -26 -23 32 171 107 -38 -145 61 225 87 -208 23 -21 -129 8 -112 53 -195 163 -14 -66
7515 -66 -81 48 -229 55 -119 250 127 -6 -122 97 -18 28 281 -1 -52 96 153 113 18 -90 -97 -44 32 -190
7539 -190 -141 -131 -60 91 -77 -2 -34 143 396 31 17 -122 -120 -180 -285 -6 -62 -251 -89 -116 -168 -27 -76 -73 99
7564 99 -305 -14 -15 -175 -9 -43 -203 -270 168 123 235 -140 -117 102 39 -279 -209 -54 80 8 38 -81 -119 29
7588 29 -75 -174 -66 -113 236 -138 80 35 114 125 -108 -173 137 179 -241 263 -113 -80 156 -84 24 -126 -269
7611 -269 -46 214 13 -117 17 -64 -93 -385 81 96 -15 118 24 119 -41 -27 -208 16 67 109 3 -51 151
7634 151 51 45 62 -113 119 87 -6 -62 -41 320 194 246 107 55 39 77 -64 -40 -174 189 -69 56 195 112
7658 112 -152 -86 31 3 -305 106 127 365 77 -73 90 172 117 -24 13 -115 -68 -68 -296 318 106 -38 -83
7681 -83 -32 -121 112 225 -1 348 -84 -252 21 144 -119 11 19 215 140 -62 -163 -202 89 113 94 -18 56
7704 56 -42 122 71 12 26 -19 -276 37 92 -84 -35 11 115 50 74 -21 -184 -73 149 -65 43 -203 34 -112
7728 -112 -145 -148 236 -69 266 -28 -33 203 57 -14 -47 -63 -54 46 116 101 58 -176 -56 86 -97 39 66 -63 -185
7753 -185 70 -194 76 -79 256 45 35 137 -135 110 281 -189 61 26 61 207 136 92 -33 -114 137 94
7775 94 207 192 225 -129 -168 88 -11 -288 -255 170 40 102 -5 -35 -189 144 115 7 -46 -5 46 172 72 -152
7799 -152 79 234 157 -346 130 90 263 -238 -91 225 -18 40 -60 -203 -19 147 -146 -534 -17 -87 171
7820 171 230 123 -17 -61 -82 103 -47 -44 -32 -115 -100 -104 54 23 -132 -27 -256 -97 -161 -72 38 -176 105 -26
7844 -26 -158 47 -191 12 -113 33 209 -47 31 35 223 159 363 -111 124 135 46 -115 254 112 -56 97
7866 97 -143 7 2 224 -2 -24 25 191 3 155 259 210 101 185 -74 -168 287 141 -151 -7 36 94 -167
7889 -167 -185 -113 -43 -69 60 -174 -305 110 155 14 -9 58 -206 100 141 3 -10 74 45 -147 -209 44 -46 65
7913 65 22 244 132 62 -17 -81 26 -136 168 -222 96 205 9 -1 -72 57 16 -238 -89 34 102 135 164 -36
7937 -36 94 -46 -16 25 25 20 102 99 -6 171 -58 23 -232 -324 2 -55 -94 -155 -134 -234 -58 183 54 74 228 133
7963 133 110 -80 45 164 23 -191 8 -328 -43 181 25 6 129 -114 67 -340 13 -30 105 -71 157
7984 157 -6 124 -76 -55 91 -11 71 9 24 -280 -193 109 -104 -41 -118 139 79 -162 73 -232 -13 -201 80
8007 80 30 -59 -76 -38 20 -259 -13 52 -158 16 80 112 20 67 174 -73 -85 161 13 -83 51 -123 27 143
8031 143 73 -162 -154 57 -7 -11 -14 -177 135 14 -23 143 -70 -161 93 -195 -195 52 -49 60 -46 59 120 -73
8055 -73 -37 -43 45 -112 -6 -5 -119 -78 -53 -210 115 175 -213 -18 -118 -10 96 -126 -102 91 25 -73 -168 -192 53
8080 53 -96 57 -282 80 194 53 -89 194 68 -7 -112 85 270 -175 29 -285 -193 -4 -126 142 -57
8101 -57 -172 -194 124 93 -42 -59 107 217 -53 -346 -73 -104 98 23 -238 -5 146 131 -89 -34 -196 -98 -253
8124 -253 20 -37 319 -19 51 -335 -58 85 -131 -108 117 279 31 -39 97 -84 -63 -147 -18 -133 -293 29
8146 29 62 35 65 -174 175 55 -277 -44 -169 329 -4 104 162 -49 16 -63 127 -125 55 11 -130 -61 58
8169 58 17 -191 -66 -146 -5 -80 51 -92 11 40 -162 37 49 133 147 102 110 65 -120 -106 57 -35
8191c5
$$ Imaginary data points
##PAGE= N=2
##DATA TABLE= (X++(I..I)), XYDATA
0 0 0 0 0 0 0 0 0 0 0 0 8 -8 8 -8 8 -8 16 -16 24 -24 32 -35 40 -50 58 -67 80 -91 105 -120 138 -155 177
33 177 -200 224 -252 283 -316 354 -394 436 -484 536 -593 655 -725 798 -881 969 -1067 1174
51 1174 -1295 1429 -1577 1746 -1936 2152 -2407 2702 -3057 3489 -4026 4717 -5643 6948 -8924
66 -8924 12248 -18865 36961 -188441 -527075 136132 473466 41046 -273598 5675 217340
77 217340 114855 5164 -45694 -136597 -4175 231297 88310 -284453 -195166 240062 242660
88 242660 -193028 -260655 92490 193897 -47031 -161972 -67132 26577 65458 50887 -74168
99 -74168 -119265 82613 197623 -10388 -140099 24476 121997 3705 -46398 11572 -25857
110 -25857 -46025 83501 72335 -136463 -127557 117624 134790 -104618 -140136 77076 112211
121 112211 -56466 -54600 49056 -13172 -55699 77758 79744 -128751 -106859 166606 132350
132 132350 -173957 -144242 147244 137564 -100159 -106523 60123 64299 -19872 -5657 -11155 -55279
144 -55279 23187 102352 -10352 -123921 -5854 133047 23035 -124370 -38184 85768 30001
155 30001 -51635 -19462 19959 4233 12343 17881 -44113 -40635 63716 49647 -65665 -36081
167 -36081 74268 33631 -63312 -10668 63564 -11927 -65596 18609 45354 -43196 -57362 26412
179 26412 38136 -28031 -17572 39455 12011 -13259 43768 38965 -52187 -42480 64761 45607
191 45607 -86543 -68359 69382 55698 -62742 -54365 33037 37597 -8550 -16076 -14757 -15628 28642
204 28642 41292 -40450 -65019 34799 79771 -11761 -70253 9673 78030 18359 -43901 -16878
216 -16878 16729 12486 3436 -12885 -35618 -12893 42851 19310 -59861 -32762 56263 32617
228 32617 -48052 -30936 35241 24673 -22053 -8368 12495 -8094 -1740 24692 886 -28111
240 -28111 3731 39073 3945 -36853 -2545 31729 -1765 -22569 6777 13656 -12954 -10285
252 -10285 19286 3716 -28702 -541 27769 -6801 -27473 4820 19975 -5617 -14030 6322
264 6322 3952 -8873 7263 10370 -14988 -10045 19536 14683 -18950 -16899 20542 19963 -14385 -11849
278 -11849 11800 8901 -3956 -2657 852 -4985 -6 12119 -6287 -21960 7564 22013 -10299
291 -10299 -24652 6008 22015 -6449 -20787 4687 11494 -3971 -2879 1514 -4060 -694 10440
304 10440 5791 -13113 -4893 21824 9853 -17627 -5048 20472 9479 -16404 -8896 13906 3119
317 3119 -12354 -811 2639 -7101 -2258 4977 -4845 -13036 2385 13182 -5856 -13705 6919 11090
331 11090 -4846 -8418 4349 9173 -2674 -4065 7422 5521 -767 3469 4481 -178 -1485 3133
345 3133 2697 -6971 -4696 4218 -3584 -10558 -2251 2816 -1571 -4206 1665 4704 -1183 -1511 541 -4752
361 -4752 -2225 3124 -151 -1856 1782 7172 6477 -105 1778 4534 -506 -2118 -509 -2161 -4660
376 -4660 -3640 2712 1318 -7400 -899 10030 4322 -3974 -2010 2962 462 -5826 -4915 -4645 -5406 4125
392 4125 6285 -3436 -3894 5746 9696 489 -10447 -4419 6451 4995 -2735 -6934 1566 11185 6590
407 6590 -2531 -4924 1804 12554 5807 -11602 -10175 4875 7053 -6331 -14059 -4177 5697 4609
421 4609 -1153 -9700 -7032 7331 8300 -6333 -13146 -253 17429 10906 -7244 -5253 10977 15621
435 15621 425 -11507 -1205 9309 4146 -2916 -7932 -8927 48 5921 -3434 -15631 -9391 11576
449 11576 12381 -7207 -12303 3000 16970 7300 -13881 -9044 11022 10532 -3666 -7949 -1770 2075
463 2075 1975 4232 -858 -8971 1877 15161 3356 -16954 -13487 11788 16068 -10874 -19075 8433
477 8433 22445 2709 -13537 -807 8855 -3826 -6972 -465 -8890 -11033 7532 14427 -6952
490 -6952 -17832 8262 27920 3671 -19789 -3505 19689 6988 -21917 -15175 11502 7693 -8544
503 -8544 -2471 6292 2452 2772 11052 3959 -15588 -9781 11841 5742 -16741 -15212 10772 19617
517 19617 -5221 -18218 6196 20760 1660 -12542 480 9118 -6682 -11986 4066 3003 -11806
530 -11806 -4538 11960 6554 -10621 -4938 18168 13216 -13507 -11904 12951 14351 -8762 -9033 13002
544 13002 6836 -13002 -1575 10596 -7924 -17464 4015 13259 -12198 -24796 2481 18289 -3847
557 -3847 -18274 845 19990 8184 -8339 3289 15806 4910 -3220 1704 1261 -4257 104
570 104 9294 -1487 -16351 -5153 10247 1492 -14890 -12663 7681 13234 -7251 -16798 3165
583 3165 16597 2048 -11724 414 11418 1215 -3455 4070 2488 -3695 -966 3335 -1032 -7239
597 -7239 1547 12925 2549 -12028 -3884 11686 5426 -12843 -6653 10288 2980 -9698 -2498
610 -2498 5222 58 -4210 2457 4923 -4030 -4778 4695 4686 -3574 -6845 -1092 4569 -1425 -5880 2868
626 2868 8318 2941 -2144 1002 5036 3529 1063 1339 -1892 -2036 1078 -1276 -3500 -4200 -3884 1472
642 1472 2522 -5010 -6179 3562 7677 -2251 -9114 1487 7040 -1232 -5020 1419 7019 4163 -2664
657 -2664 -996 3797 2756 1097 -628 -3006 -2046 1340 3076 -2885 -7481 1638 7728 -1268 -6582
672 -6582 184 5926 1633 -5837 -3913 1663 1609 -2094 -4749 -322 5685 1603 -3433 -1051 2090 3396
688 3396 2345 -1693 -1676 1066 4059 2111 -2967 -1219 3346 1757 -1670 -3433 -261 3596 -1422 -5512
704 -5512 -768 2247 -497 -3497 -1543 2326 684 -1441 50 -753 -111 2340 1400 -456 -905 1127
720 1127 2523 259 -522 1451 1187 -229 -1146 -9 2524 -768 -2962 634 1311 -1065 -1458 -349
736 -349 348 -500 -809 332 -477 -1349 93 175 1095 -184 -1623 636 916 -294 1485 937 -368 -344
754 -344 468 1829 -94 -1385 1591 1571 -1060 -507 951 1666 -949 -2704 522 1645 -649 -2042 -1056
771 -1056 1263 1561 -100 -533 -1034 -1106 1494 682 -2567 -1966 304 936 -1444 -2413 1908 3559 836
788 836 -484 1197 3395 1621 -2145 -891 1157 444 532 -480 -1087 351 1506 1309 -1284 -3059 -493
805 -493 826 -2087 -2860 -1419 841 -434 -2877 110 2387 244 -201 1103 1650 1042 -479 419 1061
822 1061 -276 1541 2141 275 84 501 712 -310 -1893 -1020 -693 -2321 -1744 -276 634 -428 -2341
839 -2341 83 1554 -324 -1104 -430 111 1308 307 7 633 -31 1015 1848 1072 839 291 824 1313
857 1313 -1641 -1777 708 299 -985 -1454 491 1775 -1086 -1286 387 -833 -1158 176 102 -1108 -1861
874 -1861 753 2136 -1688 -2508 1050 2211 1021 192 963 1639 -151 946 1465 -2029 -1650 2621 1814
891 1814 -1737 -1837 2348 2912 -2655 -2672 1948 945 -1419 -714 -122 -1481 -2162 547 622 -3992 -2543
908 -2543 3737 2779 -2264 -2642 2330 4097 -1481 -2189 1460 1507 422 1416 2019 771 -466 1660 1939
925 1939 -2004 -2257 1048 1318 -1385 -4321 -3187 930 553 -3154 -3169 544 3578 325 -2152 1289
941 1289 2184 -221 212 1158 -417 -1981 1484 5507 -291 -5354 1329 6994 248 -7048 -604 7348
957 7348 87 -7740 -610 4182 -2355 -3699 2205 2057 -4308 -1409 6542 810 -8056 -1807 6795
972 6795 1880 -6602 -2723 7452 4426 -4399 -1562 3863 1652 -1661 -160 1780 -1464 -2348 2904
987 2904 1940 -3246 -1854 2728 3280 -1321 -4209 -402 4298 531 -4939 -4168 2324 2679 -3669 -2217
1003 -2217 3534 1999 -1496 -251 1883 -753 -2707 2637 5189 -2560 -5320 3615 7681 -1477 -7209
1018 -7209 2504 8061 -3001 -7242 2051 4294 -3392 -3262 2767 350 -5510 411 6617 -739 -6055
1033 -6055 759 5433 -797 -6852 -1130 5533 568 -3892 -240 2814 1501 -61 1376 1108 -1008
1048 -1008 1086 2894 -1184 -2072 636 653 -828 -1713 -2687 -1509 2045 2205 -3165 -3896 3237 3449 -3442
1065 -3442 -2637 3146 2346 -2610 -2052 2580 852 -2662 1461 4147 -1261 -3728 2551 5737 -2125 -5663
1081 -5663 2984 4620 -4354 -4671 2837 2956 -2515 -1245 2956 -885 -3610 2360 3285 -2461 -2641 1692
1097 1692 1893 -1412 -2541 1428 1963 -952 -1059 120 84 676 721 -112 -1654 -480 2273 -294 -2468
1114 -2468 1623 2465 -712 -792 1590 -188 -1577 1740 2755 -2229 -2922 3005 1883 -3206 -1495 2356
1130 2356 750 -4062 -1630 2749 -486 -3120 882 2433 -1477 -2084 2661 3174 -1942 -1450 4430 1831
1146 1831 -3692 -2 4060 527 -2756 1442 2606 -2633 -1873 2881 696 -3024 -1084 914 -1007
1161 -1007 -2807 -352 925 -1728 -2251 1054 744 -769 38 2145 1466 -735 1275 2683 -333 -369
1177 -369 2614 1064 -1236 91 1711 -329 -2207 1246 1097 -3080 -1953 992 -688 -2424 -548
1192 -548 929 -1604 -2566 1299 1577 -1796 -609 2347 1669 -622 613 3341 1190 -1576 1837 3254
1208 3254 -1773 -2294 1601 1733 -2452 -2076 2252 17 -3753 -205 2238 -1180 -2212 360 1526 -1776
1224 -1776 -1820 1868 944 -2264 -231 2712 964 -1157 407 2906 457 -1253 1351 1348 -1325 -467 1143
1241 1143 14 -1850 -574 1100 -1100 -1762 938 629 -1762 -279 968 56 -767 -41 766 -928
1257 -928 -504 1752 681 -1090 218 1324 238 -829 235 883 -1142 -784 1705 -50 -1750 -428
1273 -428 1093 -20 -1183 574 1846 -703 -963 1761 1084 -1263 -653 1215 -109 -1668 11 1432
1289 1432 -1485 -2090 1099 1065 -1246 -1354 690 1304 -1088 55 1958 -338 -1424 617 1326 -52
1305 -52 -823 1037 1865 -664 -414 1440 595 -807 -621 832 173 -1496 -819 -13 -1094 -948 397 -353
1323 -353 -532 22 497 552 -187 254 553 -61 776 846 20 -122 499 700 438 5 505 39 -582 355 320
1344 320 -503 -623 -414 -19 -542 -718 168 -134 -1105 -60 121 -158 -532 47 505 122 -189 742 429 -317
1364 -317 382 833 414 47 1 340 -175 -101 1166 82 -1074 -203 386 42 -1104 -813 277 -586 -615
1383 -615 335 304 -639 -698 351 488 121 -541 468 345 -646 -170 1019 589 -73 -732 1242 819 -706
1402 -706 -314 407 300 -205 -341 655 461 -786 38 920 167 -1049 -507 592 -49 -1427 -238 805
1420 805 -584 -1259 106 798 -186 -1445 194 1007 -206 -553 290 746 121 -548 918 1516 -319 -501
1438 -501 951 1537 -367 -1329 148 469 -1113 -747 320 -370 -831 -1004 117 748 -1120 -1047 582 733
1456 733 -579 -263 1571 1262 -820 -214 1826 1170 -378 -170 1007 422 -671 -678 908 303 -904 -600
1474 -600 515 31 -1742 -626 1419 -182 -1745 196 943 -494 -903 676 1019 -571 -845 458
1490 458 643 193 89 408 1082 331 -542 496 1145 -44 -507 318 703 -512 -1187 174 499 -300 -814
1509 -814 -442 147 -65 -1043 -24 1109 -728 -1499 45 1401 -330 -1039 1244 1271 -1004 -483 1282
1526 1282 1156 -546 -543 805 873 -893 -447 1202 693 -724 -975 1009 376 -1814 -274 1135 -672
1543 -672 -1664 -310 518 -211 -785 547 685 -660 -391 55 363 512 -244 -147 1059 30 -662 328 877
1562 877 487 -713 54 738 2 -571 175 399 -182 -1173 -757 705 19 -1366 -134 972 -826 -1695
1580 -1695 631 1873 -777 -1418 1099 727 -1078 -429 1461 1123 -870 200 1296 231 -981 129
1596 129 1096 -173 -1340 -221 1028 -896 -1415 874 464 -1190 -458 479 253 -496 210 802 -615
1613 -615 -540 517 86 152 275 274 -199 286 -44 -107 -21 520 174 -516 -40 -37 -225 36 73 81 214 -590 48
1636 48 682 -294 -430 494 390 -740 -823 1165 346 -1361 -220 968 -634 -1204 309 898 -316 -881
1654 -881 1088 829 -715 -381 1160 666 -344 -154 927 309 -922 241 900 -410 -875 386 458
1671 458 -889 -1006 684 48 -1350 -152 678 -470 -485 307 242 -436 -378 528 487 -191 412 760 265 -37
1691 -37 149 920 484 -263 282 153 -119 80 532 -124 -733 -40 -178 -692 -541 324 -348 -987 -111 273
1711 273 -484 -373 523 522 -460 187 948 95 -128 859 613 75 4 294 690 -216 -445 403 192 -864 -58
1732 -58 470 -420 -1114 -169 352 -598 -606 239 84 -1302 -298 1010 -5 -578 326 985 -348 -351 794 802
1752 802 -364 -275 700 939 -433 -99 676 -262 -694 171 441 -367 -755 -39 173 -859 -474 479 -474
1771 -474 -434 226 141 -253 -445 388 521 -381 230 551 -306 -313 524 449 -160 -32 229 76 -620 83 368 -377
1793 -377 -435 173 174 -509 -585 269 168 -709 -103 610 -376 -685 37 416 -274 -296 660 217 -555 280 813 20
1815 20 -235 176 696 74 -322 575 430 -296 -155 495 -20 -609 85 549 -307 -553 358 320 -845 -334
1835 -334 384 -57 -1324 -43 608 51 -575 475 322 31 -282 507 559 -385 -181 532 436 -549 198 592
1855 592 -128 -248 143 145 -31 -616 190 125 -467 -451 51 -239 -435 131 -70 -283 4 165 -229 -111 514
1876 514 -338 -276 -78 354 114 -594 -140 715 -215 -273 302 328 -208 -332 632 356 -860 -78 579 -408 -604
1897 -604 14 561 -296 -750 200 412 -299 -697 319 -17 -489 -250 469 293 -540 -207 492 236 -183 122
1917 122 518 619 19 220 188 -211 -51 100 3 -139 -283 -278 -264 -190 -190 -604 -655 33 -174 -477 372 213 -57
1940 -57 225 334 363 94 -5 371 457 80 374 220 343 -254 -262 320 473 -375 -437 -31 -215 -227 -322 -61 -87
1963 -87 -721 -9 202 52 1 -199 183 495 -81 -50 185 89 -226 149 287 163 -519 159 631 -64 -329
1984 -329 -128 82 43 -225 -9 335 -49 -489 45 218 43 -490 331 445 -450 -392 144 -108 -504 -154 56
2005 56 263 31 -21 274 520 82 87 437 641 8 -288 505 551 -510 -437 320 511 -475 -402 337 200 -532
2027 -532 -464 128 191 -737 -666 373 129 -801 -279 981 198 -502 406 942 -69 -489 631 847 -423
2046 -423 -353 342 -43 -292 -337 370 114 -539 -362 298 62 -671 -709 248 72 -603 -57 425 -192 -159 -186 204
2068 204 13 -186 426 136 391 405 -215 139 428 29 -88 409 306 -714 -266 286 184 -418 -9 209
2088 209 -170 -335 3 189 72 -434 -3 603 -290 -314 2 529 -490 -506 375 412 -802 -144 884 -238
2108 -238 -409 -7 377 -21 -395 384 335 -308 -309 -6 131 -161 -398 -82 2 -605 -366 364 57 -364 48
2129 48 206 -234 -64 300 -27 -245 142 418 -401 4 470 338 -24 167 4 -186 -249 328 266 -390 -60
2150 -60 -16 -109 -259 -78 -25 -234 -258 -218 418 -273 -150 227 378 -316 -225 217 97 -165 194 233 -301 -97 200
2173 200 376 -411 109 474 -30 -276 150 -61 -325 125 67 -314 -387 -138 119 -421 -626 -2 424 -122 -293
2194 -293 383 347 -240 4 591 159 -299 332 673 237 -499 389 488 -278 -439 245 192 -189 -225 147 189 -488
2216 -488 185 -27 -179 -312 -158 224 -141 -285 255 172 -385 -163 278 -24 -408 121 56 -157 33 132 174
2237 174 -65 31 321 -243 181 -74 -51 153 -149 164 -153 -194 289 121 -242 -109 227 -187 -204 -585 248
2258 248 -89 -532 75 171 -402 -408 306 113 20 0 363 -28 -280 200 532 -124 -180 374 302 50 -334 47
2280 47 -78 -446 -274 229 -389 -379 -54 304 -209 -142 62 220 -250 -123 245 8 112 249 440 103 -185
2301 -185 366 468 293 38 110 207 -30 -352 54 -229 -328 -325 -279 -6 -343 -425 -202 -21 -211 -8 -186 173
2323 173 211 -111 45 124 279 106 45 97 230 -171 -6 253 -274 -280 -37 174 -92 -614 190 114 -408 -350 47
2346 47 130 -285 -107 249 -118 -362 -76 343 42 -327 213 109 204 6 482 472 -186 14 330 21 -133
2367 -133 -77 96 48 -384 -260 133 43 -101 -34 54 201 -96 -193 -72 -156 -213 -217 -85 71 282 -142 116 -101
2390 -101 281 -72 18 28 46 -133 192 22 238 30 576 90 167 145 201 308 167 -3 140 -12 132 165
2412 165 -120 35 -63 48 146 -244 -499 -308 -154 -163 99 39 108 60 24 74 223 193 121 -53 -20 72 -4 -46 -16
2437 -16 157 -98 40 -47 -127 -45 -335 228 101 -245 -377 -128 154 -241 -201 259 309 124 -251 243 136 -297
2459 -297 -99 310 46 -255 -167 129 -79 -455 -227 372 382 -150 -237 136 91 -371 -226 167 91 -175 88 50
2481 50 60 -117 215 -72 -67 -278 -183 108 -96 19 225 341 -46 -286 287 480 -105 -98 428 101 -97 -74 139
2504 139 325 -88 76 150 -111 -599 -77 -53 -81 -257 -177 117 -84 -271 -49 369 85 -88 45 403 317 197
2526 197 126 54 -209 -192 161 325 -51 -149 -84 379 -82 -329 -134 -108 -125 -124 56 10 100 -72 188 45 -271 -317
2550 -317 -138 109 11 115 231 10 -102 130 100 179 -102 35 100 -150 -125 201 28 -522 -106 3 -14 43
2572 43 -224 101 -201 34 125 -388 -67 75 75 126 -18 -28 2 -60 -248 172 328 174 -23 121 68 -176 191
2595 191 357 -144 42 142 -91 -191 -234 -120 -176 -132 -94 -315 -325 345 138 -117 -79 -203 -102 268 11 -24
2617 -24 273 -110 138 71 219 21 67 157 82 -182 48 10 -161 91 70 -114 27 149 258 -374 -349 193 -21
2640 -21 -220 -12 -84 27 -198 55 30 -3 3 384 39 -96 -81 -137 315 -246 -18 468 77 -220 95 159 -18
2663 -18 -40 100 163 117 30 81 244 -45 -32 -31 40 -66 -164 9 258 -172 17 -303 0 -2 7 288 215 -77 53
2688 53 80 92 253 81 40 -39 66 -86 -152 -28 -39 -311 -43 302 -153 -248 15 59 -211 -117 -24 -78 -172 -10
2712 -10 85 219 -232 45 246 318 -129 52 338 -89 -62 -106 21 135 -130 -1 -122 -253 -63 -21 70 -261
2734 -261 84 -78 194 87 125 32 32 -25 -40 96 224 -42 143 -237 -181 -26 22 69 49 -55 38 -134 185 15
2758 15 -113 -70 -67 -54 66 -118 92 16 -36 -189 65 -112 -265 -36 -279 -198 -25 161 -150 -264 -114 21 -101
2781 -101 -128 327 47 -383 79 113 171 -61 -35 462 -70 80 49 38 -328 120 218 -388 -202 -33 175 -122
2803 -122 -289 -25 141 -20 -269 -116 117 -3 -302 218 81 161 -211 180 35 53 295 -7 -124 -188 258
2824 258 -25 -286 -69 69 130 -156 -66 -15 -190 -232 -155 142 129 -57 -50 -42 -180 -36 -78 -106 -17 246 77 -7 279
2849 279 350 -127 -137 360 3 8 -35 196 -275 89 50 -5 32 -138 -46 56 -58 -196 -294 98 50 63 98 -214
2873 -214 42 488 7 -175 32 365 -58 -221 57 161 -146 -70 -89 -77 -32 55 24 -291 25 -20 1 -250 -137
2896 -137 -12 6 -28 -193 113 79 8 1 67 120 -155 256 128 26 2 367 168 270 -60 204 105 -387 60
2919 60 158 91 -206 -192 24 122 -301 1 97 -38 -11 -28 49 -4 7 36 -76 237 -176 -74 67 322 3 -55
2943 -55 -40 142 113 -69 12 146 -251 -170 -75 -86 168 207 72 10 -86 -121 283 -18 -106 234 18 182 -244 21
2967 21 299 -415 -249 -53 154 8 218 193 53 -111 202 124 109 156 -22 -155 173 -36 -181 90 -66 8
2989 8 167 274 2 -67 -131 86 -185 -267 -506 -62 3 -177 -142 43 -63 -144 3 214 231 42 67 153 293 127
3013 127 195 78 -60 11 -13 201 -100 53 88 -50 -199 16 -203 273 -95 27 81 56 270 -5 -18 1 220
3036 220 -26 167 -95 -143 -188 0 92 -84 160 -77 -266 213 49 -359 -47 67 -177 -84 116 -93 52
3057 52 -32 107 76 -164 56 108 56 -70 -2 81 -527 -29 -208 129 102 84 31 123 93 -223 50 -93 93 -27
3081 -27 -101 94 26 -61 -63 57 37 -420 124 178 273 -114 272 206 -114 -26 68 -52 21 81 45 79 18 123 27 155
3107 155 -191 -5 192 177 -252 -116 50 -162 -194 -24 197 -23 27 -46 -105 156 2 -80 -149 -20 -68 -162 175
3130 175 -20 -132 -4 259 -41 -234 -171 -175 -166 -251 104 206 -61 314 -166 90 19 -74 -127 138 -48 -148 171
3153 171 159 -172 -40 -44 -91 -164 -101 -38 -115 -292 -1 110 76 -86 24 93 123 14 -38 118 -26 -67 98 274
3177 274 -35 -152 -100 26 33 114 -65 85 75 -7 6 -69 114 -104 211 223 60 37 -99 66 27 72 -139 -118
3201 -118 79 55 -51 -100 -115 -83 19 157 277 -244 89 -79 -212 28 -170 14 83 133 -288 94 139 -1
3223 -1 -216 -410 158 159 287 297 -19 169 277 -61 -201 -99 -23 21 -99 -190 -119 -144 -27 -104 192 -84 -24 -58
3247 -58 81 195 -9 -191 28 -195 196 -34 377 -182 -110 273 94 -68 -31 -115 21 17 -185 80 85 187 115
3270 115 -116 37 78 -74 -287 -176 -240 -166 -27 -60 -134 -164 -103 107 -34 -202 35 48 -310 -209 -165 59 47
3293 47 37 -81 -147 52 43 -112 243 59 180 -12 -150 98 -28 222 -243 48 -134 105 2 -25 -116 -16
3315 -16 206 -97 132 24 231 -151 -379 65 68 -73 231 -21 -14 179 149 -66 117 -124 9 146 131 -216
3337 -216 162 -71 -180 -83 90 178 -128 102 -186 94 -130 62 208 200 33 -64 8 -263 11 137 -152 -239
3359 -239 173 52 -46 55 176 129 -169 -118 13 45 53 -47 -147 -21 -219 151 198 -220 -233 -102 -4 -98 -303
3382 -303 83 -88 -46 -152 -4 109 -93 138 -63 18 8 -113 -54 224 94 15 -80 208 67 -8 192 127 61
3405 61 -10 25 203 -178 40 -202 15 -126 -58 70 193 -118 -71 -219 -7 -300 -104 141 -55 19 48 264
3427 264 90 -153 -47 -117 109 -93 -66 258 -106 23 113 257 -120 147 -46 84 150 -151 -81 -50 3 -69 -135
3450 -135 -62 130 -226 188 -89 -126 36 -34 253 99 -5 8 82 -58 71 -63 36 146 -28 -103 32 -13 -145
3473 -145 95 -18 -63 232 -145 34 -83 126 32 16 16 -73 59 67 121 -109 -174 59 83 51 -28 -2 123 -75 94
3498 94 -97 25 206 129 -40 -174 56 -127 -137 -26 -287 141 57 -142 -82 50 343 -148 119 -150 70 78
3520 78 -134 -109 6 153 -13 368 68 -204 -149 242 27 -34 243 59 -44 -38 -37 -170 -73 57 -69 238 60
3543 60 88 -1 -78 -87 -176 -91 52 63 28 -99 27 254 41 17 -336 -7 133 -106 19 100 10 -35 -59 169 -55
3568 -55 125 -102 -92 64 7 261 -334 38 191 -162 33 222 69 50 -67 -67 257 170 -159 -130 14 2 87
3591 87 23 236 -216 -146 63 179 -54 47 197 -140 25 -36 -196 62 -53 -208 -95 21 -11 -66 -185 39
3613 39 194 245 5 10 18 87 -82 -311 69 217 47 163 -18 -86 69 118 48 -102 302 -13 -64 250 188 229
3637 229 30 112 234 -40 -58 -114 -180 122 -191 -3 -255 -122 13 15 87 -2 -2 -117 -17 -2 -77 9 39 147 -170
3662 -170 77 47 96 -20 -86 -120 188 38 -13 63 -121 238 73 -119 146 16 179 2 124 105 220 213 131
3685 131 -37 -59 97 27 112 -191 167 -249 111 133 -11 50 -174 -96 74 -52 -189 58 212 52 -148 -47
3707 -47 159 93 -55 -71 190 -251 137 -60 -68 185 -118 51 63 -166 64 51 -83 -41 -106 61 -46 181 -6
3730 -6 -99 -187 54 -210 -94 -106 -142 -86 92 17 13 -165 -23 -134 -102 -83 67 -66 -47 183 23 139 262 245 -100
3755 -100 -145 27 -72 201 102 -56 94 -89 155 -37 44 193 -77 2 103 -263 -64 140 -103 -145 -20 254
3777 254 -32 33 309 85 -47 -176 -259 214 172 9 18 79 -61 -93 91 -74 42 100 208 75 263 26 156
3800 156 51 -103 279 386 -180 37 -58 -12 -143 -92 -123 75 -234 138 -93 -100 -77 30 37 59 122 -159 -299 -28
3824 -28 -89 -137 204 -115 -35 -185 0 30 165 -295 196 35 57 -171 -124 141 2 -28 -49 46 128 -147 -46 334
3848 334 -69 -261 40 -167 -127 116 68 199 130 -347 -159 -108 -389 -215 111 152 34 152 119 47 -60 -146 -35
3871 -35 -87 -8 226 37 -73 97 138 71 59 78 -14 104 -65 -32 85 -153 28 173 -119 -177 -257 -70 -27 84
3895 84 -126 -55 -292 107 -36 -164 -331 -177 -162 110 36 227 -149 90 -12 162 34 166 82 185 36 -150
3917 -150 -85 -278 100 104 -88 117 108 -167 55 -76 33 -165 1 14 -90 91 -146 -49 252 178 87 -8 -164
3940 -164 -56 -84 75 57 176 196 45 -147 244 46 196 -83 172 71 -23 15 -269 71 88 -137 54 -23
3962 -23 -75 43 -194 -52 -30 81 118 -33 65 -418 166 263 65 192 -83 30 -136 -18 -66 -249 89 102 134
3985 134 22 -156 129 84 -10 -73 -41 -114 -132 339 -39 94 101 -4 21 141 102 -43 84 45 -7 -48 -20 9 245
4010 245 -40 -129 -125 275 175 -303 265 -52 -65 135 -88 -85 -94 32 106 -186 -62 32 138 154 -98 -62 -255 -102
4034 -102 239 312 133 -137 -184 -193 -7 -126 122 54 120 -133 138 181 -99 125 -154 -102 -51 2 123 -238 90
4057 90 178 -148 108 -50 86 12 392 -40 -260 -95 1 27 52 166 80 120 -204 234 -147 127 -42 11 -168
4080 -168 0 49 -106 110 -25 92 -93 125 5 110 61 -97 111 127 -140 42 287 -83 -55 -96 206 -168
4102 -168 -2 138 -253 41 -232 34 220 -97 64 -41 -187 24 122 165 113 -42 63 -36 -54 -19 5 250
4124 250 145 -195 -51 63 205 127 -96 373 61 -53 70 -66 -38 -49 -18 -112 199 -18 -18 124 95 -9 32
4147 32 -159 -106 -22 -62 75 -116 286 -1 97 -168 14 -82 -1 54 -82 -37 269 -57 -29 145 148 -177 -232 -91
4171 -91 -39 273 -18 12 -29 57 -108 -37 -185 17 -54 12 -56 -168 130 13 138 -246 -49 -78 -238 192 139 224
4195 224 -123 55 186 -133 13 -94 14 -226 55 -94 340 -27 171 172 156 102 -124 -89 -119 -27 -102 246 46
4218 46 177 -155 142 4 -44 -97 178 114 -15 -78 15 158 44 73 53 30 -51 -111 -74 -37 105 -103 134 -78
4242 -78 -15 75 -2 -93 282 -165 -45 -102 70 -161 77 168 -2 155 -26 66 -179 223 -58 -217 -29 27 -129
4265 -129 141 148 87 185 36 111 188 187 119 -155 -65 114 -134 168 143 3 -198 -132 66 -176 54 174 -22 -20 3
4290 3 -35 66 -99 88 26 -228 81 -170 54 115 134 37 -152 -111 -118 -15 -24 54 -34 -47 -328 -85 -259 -162 124
4315 124 112 -31 -57 52 72 -66 -20 29 -68 120 41 -220 -13 -33 75 -84 -256 -34 61 -84 -279 18 165
4338 165 53 -39 92 126 122 -64 72 200 149 -104 -135 -56 -234 -97 29 -68 -85 144 -41 -17 183 51 -85
4361 -85 158 127 140 -292 47 168 150 158 87 -71 50 -63 -45 84 -229 -14 -141 -193 20 154 -217 -30 -47
4384 -47 -536 -228 237 -92 -18 122 22 -75 78 -218 -143 71 -96 -85 52 -33 -75 -87 173 -13 -208 154 182
4407 182 16 -28 -52 139 -4 -23 135 59 -140 28 370 34 35 111 13 -22 -186 176 100 174 102 -17 91 165
4431 165 251 -53 -5 131 -96 -87 -165 267 -187 92 191 -92 -38 172 -340 -266 -93 54 132 23 -105 26 26 207
4455 207 -27 396 13 -71 91 140 -203 -145 204 178 1 -62 114 -112 -88 -133 -232 299 -58 -18 15 1 -144 128
4479 128 17 110 -59 23 -219 71 -88 -40 -54 -42 335 -19 241 27 41 67 149 210 89 -21 -176 198 69
4502 69 -33 -245 -125 4 -19 113 -2 -346 15 77 -166 84 -59 27 182 52 -89 -23 131 -135 61 -157
4524 -157 -8 38 -14 -15 22 10 196 205 -69 22 164 38 -293 23 -35 94 106 28 40 68 127 -315 48 123 61 110
4550 110 40 -115 282 -197 -136 39 44 -1 16 385 -93 -107 -76 24 -175 105 -449 -101 -89 -138 -158 69 -58 198
4574 198 -88 -114 -175 -183 119 163 -45 67 -70 12 138 65 120 -5 -176 -227 28 188 195 52 -86 -159 80 -226
4598 -226 92 -18 85 -144 -250 -37 240 -84 -212 -144 221 114 -186 -101 139 -219 -12 63 -62 -118 142
4619 142 -2 86 64 40 126 -105 -66 -121 -353 136 175 56 -232 -64 180 -87 -39 -35 -102 54 231 -273 43 -86
4643 -86 66 -146 -212 -101 -66 -19 -41 95 32 -31 -61 112 -9 -17 99 -77 -110 -13 -201 -192 -23 189 111 -83 92
4668 92 110 45 -81 -150 -163 -92 97 -117 -126 -262 -32 -45 84 66 15 -75 110 -42 -33 -59 -137 5 -49 -78 -129 19
4694 19 -24 -219 -133 83 41 -215 -33 62 -150 -72 -115 175 -92 194 142 -189 7 293 10 113 73 160 -183
4717 -183 -42 -147 -48 -256 360 -100 53 40 -2 -179 115 -26 -11 -33 290 -8 -103 17 -189 173 -3 -172
4739 -172 90 274 -85 36 52 34 -150 21 -61 -320 -115 84 -55 202 110 -30 1 139 228 -25 298 38
4761 38 -147 37 -26 104 119 75 -79 -128 54 114 52 -84 187 48 87 120 -166 -4 -76 58 223 218 -18 -424
4785 -424 -169 -119 170 129 -39 163 -22 125 -58 49 212 -321 -94 171 -35 -185 117 145 -24 -96 60
4806 60 111 76 128 -11 36 -138 -69 -127 220 -156 144 51 15 -95 -5 -124 -15 22 -107 15 -5 204 33 -79
4830 -79 -33 -48 216 -40 -48 -109 -47 -38 38 -68 -77 24 161 163 -201 224 -446 -79 -172 66 -116 -31 49 41 9 49 -88
4857 -88 -111 141 -117 -76 -9 -174 -2 44 -55 -234 135 46 -30 209 89 -15 98 -78 -234 158 -139 -147 238
4880 238 -19 142 -56 -41 -69 169 60 -200 77 89 -90 -8 -13 -216 -28 -207 165 47 -49 62 44 1 -182
4903 -182 -58 102 40 -272 91 93 129 -20 -38 66 25 42 100 58 2 -112 -19 101 -224 101 97 -16 121 138 144
4928 144 -100 87 -72 -187 27 189 -103 87 -75 -214 65 -84 -40 -62 35 -17 -109 -18 -75 -134 22 204 113
4951 113 -37 -27 228 -62 104 -16 28 -83 54 72 142 -53 220 176 -55 69 139 1 189 -179 232 110
4973 110 10 5 -88 -30 115 -54 149 237 -60 116 -71 188 -76 55 50 54 -35 266 -357 24 132 -102 -50 11
4997 11 133 78 -32 -60 81 46 -190 -8 -177 -31 -152 -164 -194 -249 133 1 -67 54 186 107 77 -90 -113 95
5021 95 28 -144 295 -30 -134 -124 156 -90 -186 -203 -37 164 -48 -237 -12 96 -13 11 -95 8 -136 -291
5043 -291 -126 99 -71 82 56 -151 48 -300 75 -66 -181 82 -46 185 111 49 30 -40 -37 101 -160 131
5065 131 -92 78 49 53 40 -109 13 -12 68 47 -5 -145 247 -32 152 -37 -114 -143 -32 -204 -34 48 211 -99
5089 -99 -66 -26 -214 96 35 118 115 -89 39 -25 30 84 -45 36 -338 149 -127 -5 -228 -21 225 -248 39 133
5113 133 109 86 -270 -9 -62 -208 232 29 -252 -164 -4 45 75 129 -31 59 2 468 139 32 -9 78 -72 -228
5137 -228 65 54 -96 -247 -103 -222 -122 2 -110 255 -192 35 10 -45 130 67 131 71 197 52 -230 333
5159 333 178 -85 144 49 199 -233 173 -73 -100 148 111 -26 -125 -63 276 173 -165 -59 98 -208 -147 87
5181 87 -29 -84 -129 -84 -71 -12 -211 -64 -30 36 253 -90 -28 88 20 83 149 -76 211 -154 141 159 -55 -91 148
5206 148 167 -36 156 -74 -146 34 -41 -118 11 49 -111 74 4 136 114 -104 69 195 112 -132 7 64 -7
5229 -7 -58 151 -116 328 -77 -69 -182 55 0 133 89 -78 8 174 -157 292 52 290 -126 -211 -232 -45 285
5252 285 166 -34 247 182 -91 122 41 59 -113 -136 40 10 140 -44 60 -6 51 51 118 -58 40 -140 -84 -85 -114
5277 -114 -60 -76 -88 -322 137 -122 73 61 -49 39 -69 -46 57 32 -54 -25 12 29 -13 -143 46 -236 -327 119
5301 119 7 -83 -32 -88 72 -225 -229 57 287 -271 -7 14 -196 -205 -64 81 -221 57 160 -98 100 -226 -89
5324 -89 -175 179 -114 42 76 35 72 -81 -237 17 -143 60 99 81 135 -79 -205 41 -226 -72 -155 -37 195
5347 195 -407 101 -129 138 -73 60 -174 -218 -92 102 22 47 42 38 90 -191 2 -15 121 213 125 51 -173 -57
5371 -57 183 2 63 38 -378 -148 38 14 237 35 290 -215 -175 -43 -154 -208 177 -130 63 23 -92 209
5393 209 185 -6 85 142 -202 43 242 -113 124 22 37 51 -181 44 107 89 -118 225 -403 -47 4 -139 -58
5416 -58 -148 245 65 31 -27 -308 -65 -209 -1 -255 46 -180 -195 57 80 -13 101 396 52 -346 189 70
5438 70 -122 -117 -102 -120 -20 100 86 19 -27 141 20 27 -183 23 -92 43 297 137 -9 39 109 146 323 41
5462 41 50 -105 83 104 143 0 29 75 243 83 24 -34 290 190 98 -5 -79 137 133 25 -77 77 -362 135
5486 135 72 -95 33 -32 130 221 60 -124 -132 -86 63 -59 -28 -125 -66 91 49 136 173 23 -149 45 67 -103
5510 -103 -33 239 65 371 3 -276 -365 -35 -19 67 150 32 61 -133 -79 165 286 237 -228 158 -169 162 105
5533 105 -73 10 -23 -47 -105 108 -25 58 -22 55 143 209 -165 27 106 47 -122 209 -80 -53 24 237 -304 -156
5557 -156 -6 -117 32 -256 -36 -116 -168 -44 177 150 -56 185 -72 159 -106 52 -33 57 253 -123 -57 106
5579 106 -87 61 -73 157 65 -119 85 199 94 -257 195 68 173 -34 -155 93 -20 -251 -208 -89 62
5600 62 -166 240 41 -97 236 -50 47 205 -224 131 -55 -164 -135 -141 79 -103 -130 327 64 71 125 -148 338
5623 338 -100 76 -58 -120 130 -72 95 117 9 -12 136 -3 -87 -185 -153 -178 -139 -13 -87 132 63 -247 0
5646 0 -253 8 -8 253 -240 185 52 -285 -185 35 -20 36 93 38 -29 -5 -186 -39 -20 -258 62 -21 -138 68
5670 68 140 40 107 111 -42 215 -192 220 -131 -76 99 66 130 -20 -276 -19 -129 -27 -66 -114 -195 152 98 -194
5694 -194 239 104 20 171 59 78 23 -95 217 23 77 49 -168 -109 175 -32 139 209 194 -37 124 -57 -83
5717 -83 196 299 149 -211 198 279 331 341 16 53 -40 -295 -21 -72 -216 -107 -31 115 -61 -8 58 9 163 78
5741 78 155 5 49 69 -16 140 35 -203 19 21 277 174 -51 22 -238 -73 -6 277 168 166 156 -16 23 -235
5765 -235 120 -144 -101 -76 25 -53 -185 -137 103 72 50 -31 -79 -18 192 -230 -66 -123 9 39 -128 -174 156 83
5789 83 -28 9 -141 115 -144 -140 -77 -13 -123 15 -27 -85 5 -252 -64 -16 -85 -74 97 -143 169 42 -83 -89 -45
5814 -45 -48 -77 -249 6 -338 240 -192 260 -1 -34 -161 -201 -50 -112 -160 -80 -33 -8 37 -61 211 416 -47 -173
5838 -173 125 -63 -20 18 -172 -129 233 174 -47 -87 92 24 -87 239 61 136 104 21 69 -11 58 -39 43 -18 195
5863 195 -31 -149 -128 48 158 -44 -160 -143 50 -133 155 -16 50 -259 -84 -46 326 -26 -76 65 4 37
5885 37 -137 -44 117 20 -9 49 -99 75 -247 240 -208 -96 -189 138 -137 -62 -267 -59 89 133 -96 -94 -39 135
5909 135 -183 284 44 172 -66 55 27 -233 -46 77 20 -87 249 73 -154 -106 186 -95 -9 -208 159
5930 159 -175 -177 47 -71 253 143 -25 111 86 6 160 51 96 -91 -220 -77 -182 114 68 182 -77 144
5952 144 160 208 127 -55 -187 -31 -44 61 -68 -16 6 -131 100 -163 -47 20 -2 -97 108 113 75 251 37 75
5976 75 252 -76 51 120 -26 201 130 16 13 -200 103 157 -53 -303 -126 -21 -10 -98 -219 -63 -180 -177 285
5999 285 67 -275 -82 -14 -71 -11 39 0 9 70 -134 33 -13 -157 -8 80 200 44 -78 149 -271 222 -143
6022 -143 59 29 41 27 -137 -107 25 178 -13 -1 -94 235 201 116 122 297 -5 85 18 189 -23 -21 48 -8 -17 112
6048 112 100 15 355 -120 21 -267 -143 -50 241 216 19 -250 22 -235 60 59 -38 131 -115 -91 9 58 -5
6071 -5 71 22 -184 -213 -214 60 5 -35 -292 -179 173 3 24 -97 -82 -72 175 20 -120 33 -136 -81 -128 107 -2
6096 -2 63 -201 256 -55 -110 88 -28 -76 -14 24 -30 84 69 -133 93 -74 43 -121 -47 42 3 -47 128 24
6120 24 -6 51 -166 -58 -170 57 -134 -27 3 -200 44 293 63 -129 63 37 -117 -363 -183 53 85 -27
6142 -27 -187 133 -10 -29 -96 161 182 2 -48 45 52 34 32 -106 56 104 -35 -65 70 -39 67 183 241 -78 123
6167 123 -192 -68 -140 -178 17 -26 57 -50 98 -129 219 32 -150 123 141 -55 45 -152 -41 -150 -84 276
6189 276 21 108 -100 -102 -68 33 -27 8 -33 63 -312 -125 70 -22 8 298 -9 -105 37 -267 -21 96 -94 172
6213 172 166 -78 -213 -22 -191 43 -153 -147 -90 24 -29 -30 256 57 -11 56 230 148 -80 -37 -102 41 -79 51
6237 51 -27 -260 -37 -188 -376 89 -129 129 20 58 60 -310 -158 -23 -44 242 -55 -149 176 166 -38 43 9
6260 9 41 -133 -5 58 -23 -151 -55 -31 19 -29 -124 34 26 7 -72 185 -174 -52 -31 56 21 96 -107 -99 -165 -50 38
6287 38 -51 93 13 -106 96 -8 253 -5 -50 49 277 238 -75 11 -116 106 138 131 44 -94 -173 54 69 -79
6311 -79 -30 18 130 -13 5 -21 -88 62 -133 -135 42 34 -107 207 33 87 10 300 18 118 -41 122 123 116 78 40
6337 40 -184 -73 200 119 63 12 -264 -39 -43 -65 -207 149 -70 81 -115 -85 -190 -153 39 -216 -26 -105 12
6360 12 120 145 -104 242 -147 -35 143 31 -19 261 73 50 111 -110 -98 -195 -124 -119 45 -10 155 155 -117 -41 -161
6385 -161 -245 -93 -9 199 194 -142 178 -178 38 85 43 -30 -8 86 -9 -148 94 -99 48 123 -62 62 -23 271
6409 271 112 45 -198 329 -57 20 -156 -69 -80 75 85 24 -58 240 117 -208 197 36 -96 56 197 -52
6431 -52 -72 -135 -26 -65 -17 29 -128 300 134 81 227 109 178 -168 117 -10 106 54 2 5 53 -7 165 142 48
6456 48 46 84 -41 20 7 58 -282 45 96 -48 -144 -23 -81 -105 -235 261 62 -181 -298 -186 42 66 39 -207
6480 -207 -161 268 36 34 213 93 -122 -25 48 97 331 -7 282 24 -90 -12 201 -46 -127 -97 -174 158 -95
6503 -95 -65 218 24 232 8 142 -149 21 59 -237 91 -100 -118 248 67 -18 34 -1 204 47 -56 -15 -35
6526 -35 -162 151 82 94 -93 -157 202 38 -88 -37 -116 238 6 13 -154 160 216 136 41 -117 -94 -122 59 18 -9
6551 -9 -79 2 -149 -4 60 -38 -94 -46 -27 14 181 -19 14 -57 87 -90 -53 -186 112 165 -93 91 62 -148 -400
6576 -400 -47 333 -45 -53 -140 -13 112 177 344 -109 -54 -85 231 -199 23 -27 1 8 260 -113 53 103 141 126
6600 126 75 275 58 1 -32 -66 -115 -130 -5 -46 -11 -191 157 134 -150 176 -152 159 94 77 -154 37 -76 -31
6624 -31 266 182 77 -75 -210 -83 253 -146 -172 -115 -36 -126 -288 51 125 -156 12 281 129 163 70 85 52 -245
6648 -245 -113 222 85 -66 250 147 -167 -45 64 -31 153 41 -27 -51 4 76 99 -52 277 8 -228 -13
6670 -13 193 -51 134 73 -137 -89 169 -362 -14 -54 190 -215 34 -94 38 78 -125 53 100 73 -58 -17 -190
6693 -190 -222 -68 -76 116 151 -218 -126 323 167 107 134 74 -140 -17 118 -32 153 32 64 106 -26 82 -95
6716 -95 70 30 107 62 78 84 -385 54 91 -91 44 6 -147 38 31 -83 -79 -35 -107 -196 7 -183 74 -67 -108 -158
6742 -158 -181 64 157 40 8 -157 -159 -83 42 82 -20 50 160 -50 -9 -8 172 117 -111 -235 85 28 123 90 -219
6767 -219 121 105 -170 -39 21 169 23 -164 -65 129 -213 103 -22 -245 -127 192 -108 -106 19 176 333 -3
6789 -3 64 -87 91 11 23 -54 -158 -109 110 -149 -153 124 -152 100 59 -98 195 120 -33 130 113 19 153 -190
6813 -190 74 117 117 30 -78 64 148 -241 -73 -56 -22 53 -60 -87 75 -9 -43 -71 105 116 114 -75 -35 129 32 -54
6839 -54 65 160 -229 -345 -91 -372 -22 180 148 250 157 -76 -83 -79 103 -113 -116 151 -297 -52 15 42 -23 110
6863 110 -6 54 45 119 227 57 29 -113 -9 108 52 115 -80 177 84 -29 18 -221 -112 -92 65 94 -52 78
6887 78 -108 -49 320 63 18 194 129 -78 108 -116 21 -24 -49 64 50 100 -124 2 -35 109 72 162 44 -131
6911 -131 -291 0 130 -104 -114 76 33 -58 116 210 51 192 167 -320 40 -9 74 -47 16 -311 29 104 5
6934 5 -33 76 35 -192 184 -111 -166 152 7 139 132 144 33 97 -7 32 -20 138 38 6 100 -103 126 -70
6958 -70 201 13 -224 -177 -11 -41 -31 162 119 -100 43 24 -71 -75 258 162 33 134 -205 -147 -11 -143 -20 -53
6982 -53 10 -147 -210 -78 -77 238 -70 -117 -18 31 -118 82 216 228 86 143 39 -18 -159 -121 229 169 18 -75 80
7007 80 113 270 217 -219 -18 104 321 -50 13 55 38 42 -24 -298 -18 59 111 126 -246 -23 20 65 -10 233 17
7032 17 11 0 223 -64 25 2 -24 -80 -26 -176 92 -181 -144 167 -115 -80 53 -260 -128 35 -37 -26 13 -93 -130
7057 -130 57 108 -121 113 -87 31 107 -220 192 -124 22 214 65 1 -45 -237 -76 -238 143 -92 92
7078 92 189 -118 -14 74 -97 -124 41 6 -144 -157 -117 -98 -330 -8 175 -132 -19 -32 -12 -101 -164 158 203 -3
7102 -3 43 91 350 -35 -90 -143 -80 107 56 -184 172 -25 76 278 35 -176 93 -83 -130 -12 108 23 -134
7125 -134 -140 -205 -180 -262 -95 -43 302 22 135 -100 -7 79 -212 -201 -102 -90 23 104 114 -85 -66 74 329 41 -149
7150 -149 -10 -51 -56 -260 -67 170 21 68 -60 50 43 -20 -27 65 -111 12 205 -82 364 118 28 -62 106 -70
7174 -70 -177 -16 -124 -64 -71 -158 -13 74 32 -10 -73 303 -59 252 -25 157 -216 69 262 -95 92 242 178
7197 178 -242 -145 -37 1 124 42 -68 -133 97 101 -36 266 -288 -222 -30 -32 -49 -99 -60 -29 -201 -177 50 109 56
7222 56 53 39 -106 -167 -100 115 -1 93 43 -172 -118 57 -76 -48 197 -17 123 196 -126 129 -4 21 137 37
7246 37 305 47 -25 113 115 -278 -91 210 -283 -8 -42 -103 -273 141 45 3 -102 -45 36 -20 85 35 -63 11 160
7271 160 -227 -91 -136 -209 117 373 -22 -18 91 162 100 -115 -168 -25 2 68 -79 -84 -58 170 8 -68 58 111 75
7296 75 -154 -28 -61 21 -67 111 169 -179 -141 103 -37 20 41 59 -37 202 -225 -30 -50 -78 -42 -230 26 113 492
7321 492 -183 53 136 -121 -3 2 -86 142 -125 -213 103 45 135 -11 205 79 166 72 -177 137 263 5 83
7344 83 59 43 72 103 -183 -51 19 7 -65 -104 166 160 -12 -308 -195 36 51 -106 -51 -69 -191 105 -76 -11 128
7369 128 -174 -206 177 -7 -115 -155 -181 43 111 -150 135 -44 -140 141 72 -189 -50 42 -149 -57 116 -63 69
7392 69 -196 -31 -18 -20 108 -133 66 -25 7 111 40 -149 148 19 47 -148 208 85 -225 53 67 39 247
7415 247 -45 30 -139 133 199 -126 104 31 -101 35 -190 -84 -113 -61 147 13 205 236 84 111 -95 -154 52
7438 52 63 32 175 216 79 230 73 186 113 39 -56 34 -6 -17 -158 -157 -70 1 -10 -37 -143 -63 2 -39 -1 87 51
7465 51 14 3 13 39 155 43 242 162 29 -47 -86 -13 -141 5 38 109 37 74 -19 163 -116 -4 -9 166 -33
7490 -33 21 -59 -49 49 -295 199 -114 365 255 -97 -1 -127 -46 -201 131 -55 -244 146 202 -47 -10 164 -168
7513 -168 56 83 72 252 -10 -139 -115 45 -71 84 21 254 13 168 -14 -102 -121 94 119 16 6 -9 86
7536 86 172 -142 93 -16 -234 -17 59 233 32 24 -117 -72 -19 -5 -67 -172 117 14 56 142 49 -128 -205 86
7560 86 -111 -43 -179 -100 -27 -343 239 77 87 -170 6 194 27 -146 -138 108 196 63 -233 -189 -25 70 18 75
7584 75 -59 163 174 19 -10 5 -18 223 17 52 -323 -98 -129 35 -40 216 -73 263 -297 80 -99 -254 -43
7607 -43 88 160 -203 -59 76 -134 16 -93 -108 -40 -32 -67 62 -41 -6 80 -74 -115 46 1 21 -97 77 203
7631 203 145 -55 303 -99 168 166 202 -46 110 -186 -74 -116 -108 25 -29 149 8 234 -12 -62 188 8 28
7654 28 82 -48 -22 -154 43 152 7 -57 -275 -417 176 -144 -50 -113 194 95 -115 -16 -110 -194 -80 -372 201
7677 201 67 -99 157 -112 -102 -31 2 -46 140 -116 -17 -56 151 -111 -34 -66 -104 21 73 137 45 131 33 142 -74
7702 -74 219 -233 -29 74 -55 187 -27 -29 189 -14 6 -149 -101 -21 58 -2 128 -106 -173 6 130 72 143 -119
7726 -119 36 68 -135 49 -256 -8 22 -30 98 12 100 70 55 272 -101 -10 -109 6 36 -95 -114 -129 -211 -196 36
7751 36 143 -80 80 325 -224 68 -337 147 -47 -69 78 -245 -50 -13 45 108 185 -118 2 -178 -105 92
7773 92 -72 119 -92 51 -148 138 -9 -128 294 -245 -84 12 -200 80 13 -162 52 -80 -75 317 134 -80
7795 -80 65 -180 174 54 34 -61 146 17 -13 49 -72 49 -49 -167 -114 -115 -7 41 41 242 -142 -155 -11 -175
7819 -175 -125 -296 93 -111 -113 -116 101 42 83 -133 5 150 -382 34 284 -90 142 -72 -83 -227 -41 -302 40
7842 40 -50 -274 75 -54 160 206 167 32 -48 154 -70 -69 46 -261 -42 -46 -224 -163 -24 -126 -156 -153 -12 238
7866 238 177 173 27 130 213 -92 71 -78 -134 113 -77 -33 -123 132 10 46 -236 -38 -82 -256 -173 -30 -63 54
7890 54 148 15 63 -303 -5 -262 24 175 288 -128 8 -184 138 236 29 164 224 -97 55 -179 -12 36
7912 36 71 -215 4 -69 51 -113 -78 29 314 130 -51 -65 45 164 -125 -101 -86 -243 -29 106 -84 75
7934 75 143 -127 1 62 -13 5 -41 25 -19 -37 -20 25 97 38 -97 -25 114 -279 -187 -143 -215 -181 72 -198 -50 112
7960 112 -3 11 227 284 53 -80 37 -40 64 -42 -72 -132 127 167 41 -5 -52 -119 -197 -44 -22 -38 20 -142
7984 -142 -124 101 80 216 108 33 76 113 -131 32 10 66 -3 142 109 88 7 89 -23 -4 227 -21 -29 149 95
8009 95 -85 149 36 -112 -28 101 12 -105 -129 -45 -73 120 -112 29 -167 0 154 -2 30 89 -66 15 -107
8032 -107 -111 57 -39 -89 60 -146 112 -154 -7 -80 -148 -76 32 -81 -199 71 187 155 104 -41 130 145 277
8055 277 -153 -127 130 -233 32 -81 -97 -71 138 -141 -253 175 -97 109 208 94 -114 74 51 -19 -83 -397
8077 -397 187 117 -188 -170 -34 -162 -19 59 -162 64 -121 67 109 -183 -34 38 -124 97 92 71 104 -85 -29
8100 -29 -246 104 87 -195 225 -14 -200 51 -240 188 73 -130 -210 -39 -53 -96 31 -139 -53 169 -85 -80 134
8123 134 -24 -204 208 -20 16 -108 -6 -98 -251 84 189 -81 -233 226 -225 -288 -59 -104 65 58 22 -19 78
8146 78 -2 183 -96 78 -305 47 -34 92 64 -132 -73 24 108 154 -39 -131 203 -103 -115 -175 131 -43 -103 75
8170 75 69 128 -40 -15 -211 45 1 -91 -272 -68 -141 263 181 7 43 46 93 1 149 -2 -31
8191c1
##END NTUPLES=NMR FID
##END=
