##TITLE=1H_Pr Bzt-61
 CDCl3
 8 sc, 
 22.09.2022
##JCAMPDX= 6.0         $$ Bruker NMR JCAMP-DX V2.0
##DATA TYPE= NMR FID
##DATA CLASS= NTUPLES
##ORIGIN= UXNMR, Bruker Analytische Messtechnik GmbH
##OWNER= root
$$ XWIN-NMR		Version 3.5
$$ Thu Sep 22 14:01:20 2022 Russian Standard Time (UT+4h)  she@DPX200
##.OBSERVE FREQUENCY= 200.1313499994
##.OBSERVE NUCLEUS= ^1H
##.DELAY= (6, 6)
##.ACQUISITION MODE= SIMULTANEOUS
##.ACQUISITION SCHEME= undefined
##.AVERAGES= 8
##.DIGITISER RES= 18
##SPECTROMETER/DATA SYSTEM= spect
##.PULSE SEQUENCE= zg30
##.SOLVENT NAME= CDCl3
##.SHIFT REFERENCE= (INTERNAL, CDCl3, 0, 15.7039)
##AUDIT TRAIL= $$ (NUMBER, WHEN, WHO, WHERE, WHAT)
$$ ##TITLE= Audit trail, XWIN-NMR		Version 3.5
$$ ##JCAMPDX= 5.01
$$ ##ORIGIN= Bruker BioSpin GmbH
$$ ##OWNER= she
$$ F:/spectra/data/she/nmr/H-F/1/audita.txt
$$ ##AUDIT TRAIL=  $$ (NUMBER, WHEN, WHO, WHERE, WHAT)
(   1,<2022-09-22 14:00:03.43 +0400>,<she>,<DPX200>,
      <created by zg, POWCHK disabled, PULCHK disabled
       configuration hash MD5:
       00 E9 B6 7A A2 85 ED C7 34 08 36 98 17 FE 4E 26
       data hash MD5: 16K
       1C 90 1A 8C 79 E0 E5 0A 21 0D 20 16 BB CE 69 2D>)
$$ ##END=
$$ 
$$ hash MD5
$$ 9D 82 2A E0 0F D9 2D 13 09 4C 59 32 E9 A6 4D 33
##$RELAX= 
##$RELAX= 
##$RELAX= 
##$RELAX= 
##$RELAX= 
##$RELAX= 
$$ Bruker specific parameters
$$ --------------------------
##$DU= <F:/spectra>
##$EXPNO= 1
##$NAME= <H-F>
##$PROCNO= 1
##$TYPE= <nmr>
##$USER= <she>
##$AMP= (0..31)
100 100 100 100 100 100 100 100 100 100 100 100 100 100 100 100 100 100 
100 100 100 100 100 100 100 100 100 100 100 100 100 100 
##$AQSEQ= 0
##$AQ_mod= 1
##$AUNM= <au_zg>
##$AUTOPOS= <>
##$BF1= 200.13
##$BF2= 200.13
##$BF3= 200.13
##$BF4= 200.13
##$BF5= 200.13
##$BF6= 200.13
##$BF7= 200.13
##$BF8= 200.13
##$BYTORDA= 1
##$CFDGTYP= 0
##$CFRGTYP= 5
##$CHEMSTR= <none>
##$CNST= (0..31)
1 1 145 1 1 1 1 1 1 1 1 1 1 1 1 1 1 1 1 1 1 1 1 1 1 1 1 1 1 1 1 1 
##$CPDPRG= <>
##$CPDPRG1= <>
##$CPDPRG2= <>
##$CPDPRG3= <>
##$CPDPRG4= <mlev>
##$CPDPRG5= <mlev>
##$CPDPRG6= <mlev>
##$CPDPRG7= <mlev>
##$CPDPRG8= <mlev>
##$CPDPRGB= <>
##$CPDPRGT= <>
##$D= (0..31)
0 1.2 0 0 0 0 0 0 0 0.06 0 0.03 0 0 0 0 0.0002 0 0 0 0 0 0 0 0 0 0 0 0 
0 0 0 
##$DATE= 1663840802
##$DBL= (0..7)
120 120 120 120 120 120 120 120 
##$DBP= (0..7)
150 150 150 150 150 150 150 150 
##$DBP07= 0
##$DBPNAM0= <>
##$DBPNAM1= <>
##$DBPNAM2= <>
##$DBPNAM3= <>
##$DBPNAM4= <>
##$DBPNAM5= <>
##$DBPNAM6= <>
##$DBPNAM7= <>
##$DBPOAL= (0..7)
0.5 0.5 0.5 0.5 0.5 0.5 0.5 0.5 
##$DBPOFFS= (0..7)
0 0 0 0 0 0 0 0 
##$DE= 6
##$DECBNUC= <off>
##$DECIM= 32
##$DECNUC= <off>
##$DECSTAT= 4
##$DIGMOD= 1
##$DIGTYP= 9
##$DL= (0..7)
0 120 120 120 120 120 120 120 
##$DP= (0..7)
150 150 150 150 150 150 150 150 
##$DP07= 0
##$DPNAME0= <>
##$DPNAME1= <>
##$DPNAME2= <>
##$DPNAME3= <>
##$DPNAME4= <>
##$DPNAME5= <>
##$DPNAME6= <>
##$DPNAME7= <>
##$DPOAL= (0..7)
0.5 0.5 0.5 0.5 0.5 0.5 0.5 0.5 
##$DPOFFS= (0..7)
0 0 0 0 0 0 0 0 
##$DQDMODE= 0
##$DR= 18
##$DS= 0
##$DSLIST= <SSSSSSSSSSSSSSS>
$$ [...]
##$SUBNAM2= <"">
##$SUBNAM3= <"">
##$SUBNAM4= <"">
##$SUBNAM5= <"">
##$SUBNAM6= <"">
##$SUBNAM7= <"">
##$SUBNAM8= <"">
##$SUBNAM9= <"">
##$SW= 18.0517283424941
##$SWIBOX= (0..15)
0 0 2 0 0 0 0 0 0 0 0 0 0 0 0 0 
##$SW_h= 3612.71676300578
##$TD= 16384
##$TD0= 1
##$TE= 0
##$TE2= 300
##$TE3= 300
##$TEG= 300
##$TL= (0..7)
0 120 120 120 120 120 120 120 
##$TP= (0..7)
150 150 150 150 150 150 150 150 
##$TP07= 0
##$TPNAME0= <>
##$TPNAME1= <>
##$TPNAME2= <>
##$TPNAME3= <>
##$TPNAME4= <>
##$TPNAME5= <>
##$TPNAME6= <>
##$TPNAME7= <>
##$TPOAL= (0..7)
0.5 0.5 0.5 0.5 0.5 0.5 0.5 0.5 
##$TPOFFS= (0..7)
0 0 0 0 0 0 0 0 
##$TUNHIN= 0
##$TUNHOUT= 0
##$TUNXOUT= 0
##$USERA1= <user>
##$USERA2= <user>
##$USERA3= <user>
##$USERA4= <user>
##$USERA5= <user>
##$V9= 5
##$VALIST= <valist>
##$VCLIST= <CCCCCCCCCCCCCCC>
##$VD= 0
##$VDLIST= <DDDDDDDDDDDDDDD>
##$VPLIST= <PPPPPPPPPPPPPPP>
##$VTLIST= <TTTTTTTTTTTTTTT>
##$WBST= 1024
##$WBSW= 4
##$XGAIN= (0..3)
0 0 0 0 
##$XL= 0
##$YL= 0
##$YMAX_a= 562724
##$YMIN_a= -303725
##$ZGOPTNS= <>
##$ZL1= 120
##$ZL2= 120
##$ZL3= 120
##$ZL4= 120
##$ABSF1= 10
##$ABSF2= 0
##$ABSG= 5
##$ABSL= 3
##$ALPHA= 0
##$AQORDER= 0
##$ASSFAC= 0
##$ASSFACI= 0
##$ASSFACX= 0
##$ASSWID= 0
##$AUNMP= <proc_1d>
##$AZFE= 0.1
##$AZFW= 0.1
##$BCFW= 1
##$BC_mod= 2
##$BYTORDP= 1
##$COROFFS= 0
##$CY= 11.3945322036743
##$DATMOD= 1
##$DC= 2
##$DFILT= <>
##$DTYPP= 0
##$F1P= 2.36226072786647
##$F2P= -0.459571619588291
##$FCOR= 0.5
##$FTSIZE= 0
##$FT_mod= 4
##$GAMMA= 1
##$GB= 0.15
##$INTBC= 1
##$INTSCL= 1
##$ISEN= 128
##$LB= 0.24
##$LEV0= 0
##$LPBIN= 0
##$MAXI= 10000
##$MC2= 0
##$MEAN= 0
##$ME_mod= 0
##$MI= 1.114404
##$NCOEF= 0
##$NC_proc= 0
##$NLEV= 6
##$NOISF1= 3.799351
##$NOISF2= 2.8
##$NSP= 1
##$NTH_PI= 0
##$NZP= 0
##$OFFSET= 15.70392
##$PC= 1
##$PHC0= -18035.6
##$PHC1= 11.20069
##$PH_mod= 1
##$PKNL= yes
##$PPARMOD= 0
##$PSCAL= 0
##$PSIGN= 0
##$REVERSE= no
##$SF= 200.130013532006
##$SI= 16384
##$SIGF1= 3
##$SIGF2= 2
##$SINO= 400
##$SIOLD= 16384
##$SREGLST= <1H.CDCl3>
##$SSB= 0
##$STSI= 0
##$STSR= 0
##$SW_p= 3612.71676300578
##$SYMM= 0
##$S_DEV= 0
##$TDeff= 0
##$TDoff= 0
##$TI= <>
##$TILT= no
##$TM1= 0
##$TM2= 0
##$TOPLEV= 0
##$USERP1= <user>
##$USERP2= <user>
##$USERP3= <user>
##$USERP4= <user>
##$USERP5= <user>
##$WDW= 1
##$XDIM= 8192
##$YMAX_p= 0
##$YMIN_p= 0
$$ End of Bruker specific parameters
$$ ---------------------------------
##NTUPLES= NMR FID
##VAR_NAME=  TIME,          FID/REAL,        FID/IMAG
##SYMBOL=    X,             R,               I
##VAR_TYPE=  INDEPENDENT,   DEPENDENT,       DEPENDENT
##VAR_FORM=  AFFN,          ASDF,            ASDF
##VAR_DIM=   8192,          8192,            8192
##UNITS=     SECONDS,       ARBITRARY UNITS, ARBITRARY UNITS
##FACTOR=    0.0002768,     1,               1
##FIRST=     0,             0,               0
##LAST=      2.2672688,     0,               0
##MIN=       0,             -303725,         0
##MAX=       2.2672688,     562724,          0
$$ Real data points
##PAGE= N=1
##DATA TABLE= (X++(R..R)), XYDATA
$$ plain form
0 0 0 0 0 0 0 0 0 0 -8 8 -8 8 -16 16 -24 27 -32 41 -51 64 -73 89 -106 129 -151 177 -202 235 -272 313 -359
31 -359 408 -464 525 -594 668 -755 843 -944 1052 -1172 1303 -1446 1600 -1770 1958 -2161
47 -2161 2383 -2626 2893 -3185 3510 -3868 4267 -4714 5215 -5785 6437 -7195 8084 -9144
61 -9144 10442 -12066 14161 -16993 21050 -27385 38779 -65974 278964 233477 243471 562724
73 562724 46247 80930 85774 -80116 -98539 -170636 -96537 -99157 -303725 -18428 -116790 -299542
85 -299542 45227 -87770 -202972 115944 -66785 -61892 90634 -50443 94938 95325 40602
96 40602 293632 106836 98474 292970 -44103 -20970 119954 -171954 -66785 6255 -117128
107 -117128 -9756 -77282 -50284 -23804 -211860 -4252 -30820 -231185 114940 39113 -141392
$$ packed form
0@%%%%%%%%qJ6j6J6k4L2m0N1n9P3r2J15j37J62j95K35k80L28l79M37n07N85o72
31c59P67q72R89j119J262j423J598j787J996k224K475k749L046l370L728m119
47b161M544n009N519o078O695p378Q135q981R929j1000J2222j3632J5279j7228
61i144J9586k2508K6227l1154L8043m8435O6164j04753L44938m5487R994L19253
73E62724n16477L4683M844j65890j8423p2097P4099k620k04568K85297r8362j82752
85b99542L44769j32997j15202L18916j82729M893J52526j41077J45381L87n4723
96D0602K53030j86796q362J94496l37073K3133J40924k91908J05169P3040j23383
107a17128J07372o7526K6998K6480j88056K07608k6568k00365L46125p5827j80505
$$ plain form
118 -141392 184899 53707 -63578 137339 20494 45170 88437 12367 133920 -902
128 -902 -25290 125424 -115942 -41888 104483 -142829 1947 67797 -127164 10295 -48185
139 -48185 -114101 6069 -121579 -11323 73171 -91837 105557 82169 -93014 109666 3213
150 3213 -93342 89999 -12092 9008 86248 -2580 93931 14681 -28845 122825 -67083
161 -67083 -30842 133214 -106434 -22545 78048 -144872 -42981 -24999 -134617 -26641 -79560
172 -79560 -44922 20947 -92787 55453 53448 -66552 151261 88852 11600 209693 79690
183 79690 37897 119114 -40110 -10066 -37016 -132834 -1794 -99254 -103090 58877 -100365
194 -100365 -45105 63583 -111212 -9433 29017 -85400 31260 -4739 -17419 67044 -29121
$$ packed form
118a41392L26291j31192j17285K00917j16845K4676M3267p6070J21553j34822
128i02k4388J50714k41366P4054J46371k47312J44776O5850j94961J37459n8480
139d8185o5916J20170j27648J10256Q4494j65008J97394k3388j75183K02680j06453
150C213r6555J83341j02091K1100P7240q8828R6511p9250m3526J51670j89908
161f7083L6241J64056k39648Q3889J00593k22920J01891J7982j09618J07976n2919
172g9560L4638O5869j13734J48240k005j20000K17813o2409p7252J98093j30003
183G9690m1793Q1217j59224L0044k6950r5818J31040r7460l836J61967j59242
194a00365N5260J08688j74795J01779L8450j14417J16660l5999j2680Q4463r6165
$$ plain form
205 -29121 70788 96993 -25784 146622 96199 -29425 132978 10444 -73779 39099 -85304
216 -85304 -71696 -20351 -94290 1284 -41817 -62457 53512 -82339 -45340 60237 -99632
227 -99632 -1032 65053 -62695 56361 50575 -5648 88042 9379 47114 91929 -29991 78978
239 78978 54060 -69553 67802 -15948 -87607 41226 -65959 -61962 13185 -80234 -13300
250 -13300 -29580 -78518 31225 -63372 -42583 79040 -58122 17337 98373 -37730 62330
261 62330 72354 -17618 77618 24173 14390 69178 -30062 39365 30614 -80240 44833 -18735
273 -18735 -100867 33672 -59964 -81336 17370 -75916 -32454 -3658 -62095 33248 -14715 -21055
285 -21055 88617 -19839 26037 108730 -22115 57248 81811 -26186 62354 24377 -23070
$$ packed form
205b9121R9909K6205j22777J72406n0423j25624J62403j22534q4223J12878j24403
216h5304J3608N1345p3939R5574m3101k0640J15969j35851L6999J05577j59869
227i9632R8600O6085j27748J19056n786n6223R3690p8663L7735M4815j21920J08969
239G8978k4918j23613J37355q3750p1659J28833j07185L997P5147r3419O6934
250a3300j6280m8938J09743r4597K0789J21623j37162P5459Q1036j36103J00060
261F2330J0024q9972R5236n3445r783N4788r9240O9427q751j10854J25073o3568
273a8735q2132J34539r3636k1372R8706r3286M3462K8796n8437R5343m7963o340
285b1055J09672j08456M5876Q2693j30845P9363K4563j07997Q8540l7977m7447
$$ plain form
296 -23070 42613 -41317 -7805 12326 -90348 9558 -22780 -108593 22225 -46110 -78609 37373
308 37373 -46757 -17577 43213 -29297 43675 26008 -6065 87351 -1123 18507 99789 -30983
320 -30983 29226 70473 -50864 30409 18095 -49719 26237 -36108 -35443 1662 -89859 -19993
332 -19993 -26438 -102411 22019 -18695 -53840 73843 1578 5861 80181 -3560 39767 44840
344 44840 -10769 64008 2536 -6595 69478 -39533 -1180 49777 -64740 7433 15235 -66990
356 -66990 10665 -34259 -61472 -4253 -72737 -21302 4585 -58577 51995 27846 -25757 88390
368 88390 13740 -13487 70012 -12412 14741 49704 -12930 50110 14884 -17597 49569 -42981
380 -42981 -25792 30727 -77562 -12757 14430 -78157 1178 -16052 -58622 14510 -32865 -7068
$$ packed form
296b3070O5683q3930L3512K0131j02674R9906l2338q5813J30818o8335l2499J15982
308C7373q4130K9180O0790p2510P2972j7667l2073R3416q8474J9630Q1282j30772
320c0983O0209M1247j21337Q1273j2314o7814P5956o2345O65L7105r1521O9866
332a9993o445p5973J24430m0714l5145J27683p2265M283P4320q3741M3327N073
344D4840n5609P4777o1472r131P6073j09011L8353N0957j14517P2173P802q2225
356f6990P7655m4924k7213N7219o8484N1435K5887o3162J10572k4149n3603J14147
368H8390p4650k7227Q3499q2424K7153L4963o2634O3040l5226l2481O7166r2550
380d2981J7189N6519j08289O4805K7187r2587P9335j7230m2570P3132m7375K5797
$$ plain form
392 -7068 34740 -31260 43296 30900 -35266 61447 9060 -19656 78518 9861 20754 71401
404 71401 -7245 25653 7121 -45814 10675 -51738 -45483 22771 -66815 -17121 23585 -73487
416 -73487 -4276 -383 -57206 19613 -9873 -7769 44162 -16315 31670 36420 -27184 60585 29065
429 29065 -7528 89646 21029 7761 65160 -20819 -3245 2930 -58112 -2935 -43002 -62655
441 -62655 -1839 -82600 -57748 -8695 -88321 -9879 25424 -22643 71297 62987 38656 89899
453 89899 27742 36685 41939 -29352 34100 8438 -44230 42623 -15867 -42550 28942 -43927
465 -43927 -33411 1902 -56756 -12784 -28378 -58374 2227 -49188 -26727 40241 -22171 43560
477 43560 80730 9483 71960 48308 -13483 32937 -21194 -21889 17458 -35046 19940 22389 -30990
$$ packed form
392g068M1808o6000P4556j2396o6166R6713n2387k8716R8174o8657J0893N0647
404G1401p8646L2898j8532n2935N6489o2413O255O8254q9586M9694M0706r7072
416g3487O9211L893n6823P6819k9486K104N1931o0477M7985M750o3604Q7769l1520
429B9065l6593R7174o8617j3268N7399q5979J7574O175o1042N5177m0067j9653
441f2655O0816q0761K4852M9053p9626P8442L5303m8067R3940q310k4331N1243
453H9899o2157Q943N254p1291O3452k5662n2668Q6853n8490k6683P1492p2869
465d3927J0516L5313n8658M3972j5594k9996O0601n1415K2461O6968o2412O5731
477D3560L7170p1247O2477k3652o1791M6420n4131o95L9347n2504N4986K449n3379
$$ plain form
490 -30990 41139 -6756 -43613 26968 -42874 -41234 11116 -52595 -18090 -8796 -42558 17178
502 17178 -15255 -4263 60427 -7107 33410 67970 -19739 31412 28204 -33682 29823 5422
514 5422 -5852 39889 -12497 10662 10257 -52632 3721 -27672 -61366 19404 -29666 -29158 33148
527 33148 -32317 -8793 12528 -38820 11141 -4571 -17150 43713 -6502 15797 58155 -10212
539 -10212 42712 58080 -1079 61147 35387 -7690 28910 -32585 -38432 -30288 -90324 -37238
551 -37238 -46010 -81087 4685 -29724 -40901 35012 -16309 5543 55945 13554 62473 65903
563 65903 36888 78929 22824 14824 43637 -35838 -2252 14252 -57970 -2121 -15775 -65711
575 -65711 -12202 -51012 -56475 -14872 -57093 -13210 1996 -32860 35587 13675 -3250 67959
$$ packed form
490c0990P2129m7895l6857P0581o9842J640N2350o3711L4505R294l3762N9736
502A7178l2433J0992O4690o7534M0517L4560q7709N1151l208o1886O3505k4401
514E422j1274M5741n2386K3159m05o2889N6353l1393l3694Q0770m9070N08O2306
527C3148o5465K3524K1321n1348M9961j5712j2579O0863n0215K2299M2358o8367
539a0212N2924J5368n9159O2226k5760m3077L6600o1495n847Q144o0036N3086
551c7238q772l5077Q5772l4409j1177P5913n1321K1852N0402m2391M8919L430
563F5903k9015M2041n6105q000K8813p9475L3586J6504p2222N5849j3654m9936
575f5711N3509l8810n463M1603m2221M3883J5206l4856O8447k1912j6925P1209
$$ plain form
587 67959 20942 32847 82615 21973 46222 46433 -10898 18509 -22567 -38797 4316 -51640
599 -51640 -20389 14146 -51992 -1908 -623 -57956 -3633 -27852 -44793 5844 -26641 3046
611 3046 26130 -9451 51112 34557 6366 75069 24962 13061 59819 -9745 -880 11516
623 11516 -47344 -7672 -19878 -41687 10848 -28084 -16062 18085 -41070 -1430 5930 -47391
635 -47391 13403 -972 -25377 31884 -3373 2838 31762 -12200 26100 19864 -14908 45374
647 45374 7995 -8660 47935 -10074 -4428 30069 -25120 2721 2397 -32918 3830 -32323 -34704
660 -34704 908 -53608 -17246 8846 -41789 17995 19665 -14666 42093 12762 6083 44942
672 44942 -479 23252 32820 -10219 34326 8037 -18976 30111 -21972 -22057 16672 -41330 -16287
$$ packed form
587F7959m7017J1905M9768o0642K4249K11n7331K9407m1076j6230M3113n5956
599e1640L1251L4535o6138N0084J285n7333N4323k4219j6941N0637l2485K9687
611C046K3084l5581O0563j6555k8191O8703n0107j1901M6758o9564Q865J2396
623A1516n8860L9672j2206k1809N2535l8932J2022L4147n9155L9640P360n3321
635d7391O0794j4375k4405N7261l5257O211K8924m3962L8300o236l4772O0282
647D5374l7379j6655N6595n8009N646L4497n5189K7841l24l5315L6748l6153k381
660c4704L5612n4516L6362K6092n0635N9784J670l4331N6759k9331o679L8859
672D4942m5421K3731R568m3039M4545k6289k7013M9087n2083q5L8729n8002K5043
$$ plain form
685 -16287 -3797 -46628 -4640 -22509 -33404 12490 -27639 -2505 31003 -20100 28478 35244
697 35244 -9757 43399 22968 -91 40250 1334 8683 22899 -20987 13300 -4560 -35845
709 -35845 15212 -25917 -33763 13184 -38787 -20549 5766 -38830 743 -1621 -24294 23150
721 23150 -3972 2343 37278 -6308 27350 37662 -8881 38899 21532 -10818 33104 -4385
733 -4385 -8090 16886 -28517 -2892 -4497 -42276 3714 -24661 -39918 10583 -33617 -20470 17862
746 17862 -26664 5638 17235 -12218 29137 9717 6501 42583 921 24462 40712 -10825
758 -10825 29306 18803 -23027 21193 -10527 -27705 6219 -35555 -21779 -8782 -44629 -6210
770 -6210 -16725 -31863 18102 -14399 -7738 32882 -12487 12616 30068 -7171 30974 20603
$$ packed form
685a6287J2490m2831M1988j7869j0895M5894m0129K5134L3508n1103M8578O766
697C5244m5001N3156k0431k3059M0341l8916P349J4216m3886L4287j7860l1285
709c5845N1057m1129p846M6947n1971J8238K6315m4596L9573k364k2673M7444
721B3150k7122O315L4935m3586L3658J0312m6543M7780j7367l2350M3922l7489
733d385l705K4976m5403K5625j605l7779M5990k8375j5257N0501m4200J3147L8332
746A7862m4526L2302J1597k9453M1355j9420l216L6082m1662K3541J6250n1537
758a0825M0131j0503m1830M4220l1720j7178L3924m1774J3776J2997l5847L8419
770f210j0515j5138M9965l2501O661M0620m5369K5103J7452l7239L8145j0371
$$ plain form
782 20603 5100 43269 5605 11302 30887 -20147 7419 5204 -38491 5359 -15481 -37639
794 -37639 4177 -29368 -23048 -1002 -33960 645 -1696 -23254 25062 -2820 -6096 37454 -5315
807 -5315 13179 39377 -2539 31462 29482 -877 30726 -1628 -9337 12511 -31817 -9442 -1395
820 -1395 -41482 1221 -10662 -37012 6235 -22183 -22900 10568 -21006 5836 16465 -10877 29488
833 29488 11521 -2200 38299 393 8260 37099 -7387 16551 21047 -16385 13038 -7326
845 -7326 -20173 8308 -28569 -13690 2343 -39722 -5030 -9184 -39410 7568 -10257 -14157 29584
858 29584 412 15287 32010 -2346 25317 11764 -10001 28386 -3696 -2089 31643 -11746
870 -11746 6216 17178 -24414 4525 -7392 -30224 2112 -27209 -22835 773 -35131 -4530
$$ packed form
782B0603j5503L8169l7664N697J9585n1034K7566k215m3695M3850k0840k2158
794c7639M1816l3545O320K2046l2958L4605k341k1558M8316k7882l276M3550m2769
807e315J8494K6198m1916L4001j980l0359L1603l2354p709K1848m4328K2375Q047
820a395m0087M2703j1883k6350M3247k8418p17L3468l1574K6842J0629k7342M0365
833B9488j7967j3721M0499l7906P867K8839m4486K3938M496l7432K9423k0364
845g326j2847K8481l6877J4879J6033m2065L4692m154l0226M6978j7825l900M3741
858B9584k9172J4875J6723l4356K7663j3553k1765L8387l2082J607L3732m3389
870a1746J7962J0962m1592K8939j1917k2832L2336k9321M374K3608l5904L0601
$$ plain form
882 -4530 3718 -23790 23818 12937 -1689 38426 6762 6738 26020 -9884 11783 10705 -12214
895 -12214 26140 2681 -6309 25828 -16623 -9490 7337 -34487 -7233 -6397 -31472 3865 -13494
908 -13494 -17233 10533 -20652 745 14020 -18089 20344 12722 -10107 29924 4114 1260 32615
921 32615 137 18082 28474 -2924 22716 1658 -19778 6800 -32146 -28378 -2366 -40462
933 -40462 -13908 -738 -29464 4393 -5815 -16533 15065 -9396 5709 27352 -3843 28348
945 28348 28450 -279 36033 15152 256 30684 -3080 -527 11797 -24684 -6594 -16082 -37568
958 -37568 -5198 -28684 -27018 7011 -25092 -5507 12018 -19859 10941 9162 -8029 27060
970 27060 9020 10454 33260 1581 19669 21022 -11658 20523 5696 -13987 19987 -8820
$$ packed form
882d530Q248k7508M7608j0881j4626M0115l1664k4J9282l5904K1667j078k2919
895a2214L8354k3459q990L2137m2451P133J6827m1824K7254Q36k5075L5337j7359
908a3494l739K7766l1185K1397J3275l2109L8433p622k2829M0031k5810k854L1355
921C2615l2478J7945J0392l1398K5640k1058k1436K6578l8946L768K6012l8096
933d0462K6554J3170k8726L3857j0208j0718L1598k4461J5105K1643l1195L2191
945B8348J02k8729L6312k0881j4896L0428l3764K553J2324l6481J8090r488k1486
958c7568L2370k3486J666L4029l2103J9585J7525l1877L0800j779j7191L5089
970B7060j8040J434K2806l1679J8088J353l2680L2181j4827j9683L3974k8807
$$ plain form
982 -8820 -11971 6658 -27765 -11904 -10792 -34789 -3339 -19302 -24586 10857 -17487 -3874 22387
995 22387 -8751 19054 26759 2781 31617 14733 4180 23884 -9012 1051 10735 -20876
1007 -20876 8969 4719 -18607 13709 -9292 -18263 5633 -25373 -13728 -655 -27060 788
1019 788 -3411 -15947 15155 -6680 -1268 24262 -6517 14028 24538 -4799 22120 12983 -3529
1032 -3529 22615 -1590 2243 18000 -13370 6243 2410 -28575 -484 -18816 -33670 -2183
1044 -2183 -25111 -17465 4390 -17244 7567 8850 -7682 24262 6660 3980 32826 4160 15630
1057 15630 29332 -3440 17620 11368 -12963 12113 -9642 -16692 2681 -26027 -15143 -9453
1069 -9453 -33729 -4745 -11855 -23531 12087 -6466 -4144 22322 -2860 11736 19689 -1806 23590
$$ packed form
982h820l151J8629l4423J5861J112k3997L1450j5963n284L5443k8344J3613K6261
995B2387l1138K7805P705k3978K8836j6884j0553J9704l2896J0063R684l1611
1007b0876K9845m250k3326L2316k3001q971K3896l1006J1645J3073k6405K7848
1019G88m199j2536L1102k1835N412K5530l0779K0545J0510k9337K6919r137j6512
1032c529K6144k4205L833J5757l1370J9613l833l0985K8091j8332j4854L1487
1044b183k2928P646K1855k1634K4811J283j6532L1944j7602k680K8846k8666J1470
1057A5630J3702l2772K1060o252k4331K5076k1755p050J9373k8708J0884N690
1069i453k4276K8984p110j1676L5618j8553K322K6466k5182J4596P953k1495K5396
$$ plain form
1082 23590 12284 3393 29238 1703 6188 21749 -13313 1717 3680 -24134 -1644 -13760
1094 -13760 -24417 -3025 -26264 -15393 -1308 -26014 1326 2796 -13615 20049 6276 2366
1106 2366 29001 3467 12903 26055 -911 18453 12494 -4972 17229 -5530 -8032 9558 -21574
1119 -21574 -7857 440 -27385 -3406 -8854 -23962 1816 -14963 -11623 7096 -14999 5566
1131 5566 11277 -8055 22033 11840 162 28689 6772 7026 23105 -2638 10357 9016 -11300
1144 -11300 9897 -7949 -16108 5183 -21265 -13563 -535 -27383 -5636 -4762 -22526 5677 -5294
1157 -5294 -8561 14922 -4651 8488 19068 -2210 21441 15181 49 25575 5056 890 19141
1170 19141 -8852 287 5184 -18785 125 -9687 -21366 1189 -20030 -15661 2514 -22165 -3028
$$ packed form
1082B3590j1306q891K5845k7535M485J5561l5062J5030J963k7814K2490j2116
1094a3760j0657K1392k3239J0871J4085k4706K7340J470j6411L3664j3773l910
1106B366K6635k5534R436J3152k6966J9364n959j7466K2201k2759k502J7590l1132
1119b1574J3717Q297k7825K3979n448j5108K5778j6779L340J8719k2095K0565
1131E566N711j9332L0088j0193j1678K8527k1917K54J6079k5743J2995j341k0316
1144a1300K1197j7846q159K1291k6448P702J3028k6848K1747Q74j7764K8203j0971
1157e294l267K3483j9573J3139J0580k1278K3651o260j5132K5526k0519m166J8251
1170A9141k7993R139M897k3969J8910r812j1679K2555k1219M369J8175k4679J9137
$$ plain form
1183 -3028 5127 -14843 10625 5172 -3106 20502 3419 9657 22589 -581 17043 14933 -6043
1196 -6043 16424 42 -10092 10502 -13951 -9902 2494 -21454 -5427 -5579 -20797 1616 -11549
1209 -11549 -12445 8703 -11658 1601 12812 -8558 14486 11978 -2328 21990 6625 4062 20384
1222 20384 -2332 7675 9977 -11881 8428 -2664 -15888 6736 -13701 -14986 1508 -20972
1234 -20972 -8629 -4079 -19466 2614 -4424 -8110 15412 -2520 5715 20440 -1867 16197 17356
1247 17356 -1527 19403 7825 -1819 14320 -6102 -2752 3953 -17452 -1207 -6302 -21243 149
1260 149 -15091 -17408 2478 -16879 -5369 7063 -10215 9837 8661 -1413 18815 3946 5487
1273 5487 20592 -1124 11451 16648 -4934 12802 4995 -8688 7353 -10134 -10867 249 -19995
$$ packed form
1183c028Q155j9970K5468n453q278K3608j7083O238J2932k3170J7624k110k0976
1196f043K2467j6382j0134K0594k4453M049J2396k3948J6027j52j5218K2413j3165
1209a1549q96K1148k0361J3259J1211k1370K3044k508j4306K4318j5365k563J6322
1222B0384k2716J0007K302k1858K0309j1092j3224K2624k0437j285J6494k2480
1234b0972J2343M550j5387K2080p038l686K3522j7932Q235J4725k2307J8064J159
1247A7356j8883K0930j1578r644J6139k0422L350O705k1405J6245n095j4941K1392
1260A49j5240k317J9886j9357J1510J2432j7278K0052j176j0074K0228j4869J541
1273E487J5105k1716J2575N197k1582J7736p807j3683J6041j7487p33J1116k0244
$$ plain form
1286 -19995 -7540 -6460 -21758 -134 -9687 -14342 8786 -7674 -581 15181 -3150 11336 13435
1299 13435 -233 17865 7158 3752 19605 -621 6521 12540 -9912 3896 -1442 -18125 555
1312 555 -12746 -16606 -351 -16849 -8272 -606 -15124 3015 -1052 -9115 12832 -261 940
1325 940 17768 -164 10101 15513 -179 15708 8795 -220 14429 -3085 -1928 6348 -15556
1338 -15556 -3308 -3072 -20146 -1288 -9005 -16394 1367 -12807 -7615 3216 -11424 4533 5376
1351 5376 -3846 16791 6470 3883 20832 2620 8427 16458 -2883 9124 5743 -7209 6406
1364 6406 -7439 -9777 1261 -17456 -7238 -2432 -19190 -1923 -5249 -14427 4016 -6167 -3695
1377 -3695 10423 -2537 9444 13798 1325 17264 8898 1138 17102 -70 380 11010 -7686
$$ packed form
1286a9995J2455J080j5298K1624r553m655K3128j6460P093J5762j8331J4486K099
1299A3435j3668J8098j0707l406J5853k0226P142O019k2452J3808n338j6683J8680
1312E55j3301l860J6255j6498Q577P666j4518J8139m067q063K1947j3093J201
1325I40J6828j7932J0265N412j5692J5887o913r015J4649j7514J157Q276k1904
1338a5556J2248K36j7074J8858p717p389J7761j4174N192J0831j4640J5957Q43
1351E376r222K0637j0321k587J6949j8212N807Q031j9341J2007l381j2952J3615
1364F406j3845k338J1038j8717J0218M806j6758J7267l326r178J8443j0183K472
1377c695J4118j2960J1981M354j2473J5939q366p760J5964j7172M50J0630j8696
$$ plain form
1390 -7686 884 1619 -12659 62 -9270 -14023 -148 -14931 -8503 325 -14591 697 1267 -9013
1404 -9013 9914 2572 345 15915 2688 8795 14659 -359 12286 6930 -3144 11522 -2227
1417 -2227 -4544 7211 -11044 -5209 -1831 -17410 -4550 -8491 -15371 545 -10034 -5829 6129
1430 6129 -7723 5344 9264 -3503 13481 8723 1378 15801 3738 5081 12417 -3022 6155
1443 6155 4811 -8225 5102 -5180 -10544 1705 -14056 -9843 -1680 -16915 -4070 -2379 -11312
1456 -11312 3999 -2184 -2482 10661 -1752 6608 12929 -543 13452 10382 242 14257 2963
1469 2963 -215 9527 -5465 -352 1082 -12123 -316 -6879 -14698 -320 -12501 -11181 902
1482 902 -12002 -2683 2100 -7425 7433 3484 429 14608 3820 7568 15622 1971 10793 9191
$$ packed form
1390g686Q570P35j4278J2721r332m753J3875j4783O428Q828j4916J5288N70j0280
1404i013J8927p342k227J5570j3227O107N864j5018J2645n356j0074J4666j3749
1417b227k317J1755j8255N835L378j5579J2860l941o880J5916j0579M205J1958
1430F129j3852J3067L920j2767J6984m758p345J4423j2063J343P336j5439R177
1443F155j344j3036J3327j0282n364J2249j5761M213Q163j5235J2845J691q933
1456a1312J5311o183k98J3143j2413Q360O321j3472J3995l070j0140J4015j1294
1469B963l178R742j4992N113J434j3205J1807o563p819J4378j2181J320J2083
1482I02j2904R319M783r525J4858l949l055J4179j0788L748Q054j3651Q822j602
$$ plain form
1496 9191 -3519 9102 -253 -7275 4460 -8650 -6656 -499 -13501 -3993 -5897 -13845 377
1509 377 -7951 -8331 5002 -7202 170 7983 -3346 8974 8555 1851 14360 5795 5587 13711 -1174
1524 -1174 4901 6492 -7824 3078 -2219 -10382 957 -9916 -9205 -1314 -13866 -5420 -2454 -11391
1538 -11391 2535 -1609 -4261 9460 -1019 3680 12503 -517 9484 10670 262 11395 4691
1551 4691 6 8420 -4070 -1127 2717 -10489 -852 -3050 -12785 -141 -7994 -10792 561 -9612
1565 -9612 -3376 2523 -6154 5768 3844 -1381 12362 3080 3010 13074 917 5816 9153 -2563
1579 -2563 6462 1599 -5396 4288 -6394 -6090 740 -11431 -4193 -2757 -12326 -473 -4957 -8593
1593 -8593 3913 -4806 -1255 7348 -2059 7251 9022 1221 12215 5401 2556 11307 -642 2636
$$ packed form
1496I191j2710J2621r355p022J1735j3110J994O157j3002R508j904p948J4222
1509C77q328l80J3333j2204P372P813j1329J2320m19o704J2509q565k08Q124j4885
1524a174O075J591j4316J0902n297q163J1339j0873P11P891j2552Q446K966q937
1538a1391J3926m144k652J3721j0479M699Q823j3020J0001J186j0408J1133o704
1551D691m685Q414j2490K943L844j3206R637k198r735J2644p853k798J1353j0173
1565i612O236N899q677J1922j924n225J3743r282p0J0064j2157M899L337j1716
1579b563R025m863o995R684j0682L04O830j2171P238J436r569J1853m484l636
1593h593J2506q719L551Q603r407R310J771p801J0994o814k845Q751j1949L278
$$ plain form
1607 2636 6637 -6669 1347 -339 -9979 -320 -7293 -9125 -1020 -11362 -5219 -948 -10797 1158
1621 1158 237 -5459 7334 1321 1743 11205 1918 8695 11078 1123 10320 5189 -924 7919 -2695
1636 -2695 -3056 2704 -9679 -3822 -2925 -13302 -2832 -7343 -10736 259 -7840 -4104 2770 -5127
1650 -5127 4496 5111 -1267 10818 4974 2832 13121 3144 5563 9875 -801 6096 2708 -4883
1664 -4883 3527 -5620 -7688 379 -10979 -7388 -3223 -12343 -2932 -3989 -8634 2917 -2784 -980
1678 -980 7858 -710 6285 9217 650 10983 7160 1862 11272 1447 1368 6787 -4377 492 157
1693 157 -9278 -1163 -6573 -9898 -1033 -10217 -6580 -24 -9829 -597 1217 -5230 5885 2336 1251
1708 1251 10191 2028 6376 10349 518 8782 6523 -1626 7469 -455 -3424 3283 -7311 -4299 -1588
$$ packed form
1607B636M001j3306Q016j686r640R659o973j832Q105j0342O143M271r849J1955
1621A158r21n696J2793o013M22R462r287O777K383r955R197n131o113Q843j0614
1636b695l61N760j2383N857Q97j0377J0470m511l393J0995q099L736O874p897
1650e127R623O15o378J2085n844k142J0289r977K419M312j0676O897l388p591
1664d883Q410r147k068Q067j1358L591M165r120R411j057m645J1551n701J804
1678i80Q838q568O995K932q567J0333l823n298R410r825p9N419j1164M869l35
1693A57r435Q115n410l325Q865r184L637O556r805R232J814o447J1115l549j085
1708A251Q940q163M348L973r831Q264k259q149R095p924k969O707j0594L012K711
$$ plain form
1723 -1588 -11056 -3174 -5667 -10269 295 -6448 -4671 4124 -4737 2458 6426 -1392 8306 5675 1381
1738 1381 10526 2732 3343 8802 -1209 4025 3207 -5265 3117 -3218 -8143 608 -8460 -7451 -1545
1753 -1545 -10233 -3094 -2139 -7539 3230 -1228 -1419 7834 110 4600 9462 25 7953 6475 -278
1768 -278 8254 1375 -516 5368 -4106 -377 1307 -8323 -643 -4071 -9968 -216 -7411 -7416 551 -7466
1784 -7466 -1208 2365 -3854 5260 3244 834 9868 2569 4474 9741 -266 5789 6126 -2791 4995
1799 4995 50 -4438 2699 -5927 -4309 -595 -9647 -3051 -3247 -9531 -80 -4720 -5791 3924 -3553
1814 -3553 591 6043 -1044 6440 5973 1380 9923 3688 2814 9389 -839 3333 4720 -4916 1861
1829 1861 -1426 -7652 -327 -7100 -7819 -1900 -9468 -4063 -1714 -7643 1904 -708 -3106 7266 326
$$ packed form
1723a588r468P882k493m602J0564o743J777Q795q861P195L968p818R698k631m294
1738A381R145p794O11N459j0011N234q18q472Q382o335m925Q751r068J009N906
1753a545q688P139R55n400J0769m458j91R253p724M490M862r437P928j478o753
1768b78Q532o879j891N884r474L729J684r630P680l428n897R752p195nP967q017
1784g466O258L573o219R114k016k410R034p299J905N267j0007O055L37q917P786
1799D995m945m488P137q626J618L714r052O596j96o284R451m640j071R715p477
1814c553M144N452p087P484m67m593Q543o235q74O575j0228M172J387r636O777
1829A861l287o226P325o773p19N919p568N405K349n929R547k612k398J0372o940
$$ plain form
1844 326 2258 8911 729 6698 7251 668 8363 3532 503 7119 -1478 -437 2484 -7401 -1731
1859 -1731 -3046 -10690 -2855 -7557 -8785 -1394 -7606 -2919 1897 -3992 4621 4565 364 9335 3960
1874 3960 3509 10133 1902 4954 6993 -1216 4869 1629 -3169 2843 -4807 -5028 -589 -9486 -5211
1889 -5211 -3803 -11132 -2666 -4113 -6585 2498 -2148 840 7222 1159 7570 8168 2198 9839 4771
1904 4771 1706 7644 -889 87 3204 -5708 -873 -1872 -7738 -903 -6044 -7383 -628 -7778 -4100
1919 -4100 229 -6046 1783 1702 -2017 6653 2535 2206 8711 1877 5227 6659 -62 5848 1962 -2458
1935 -2458 3865 -3128 -3941 912 -7071 -3337 -1761 -7997 -1142 -3582 -5400 1658 -3548 -883 3963
1950 3963 -2550 3546 4782 -838 6478 3318 520 6673 635 2082 4945 -2533 2785 1241 -4388
$$ packed form
1844C26J932O653q182N969N53o583P695m831l029O616q597J041K921r885N670
1859a731j315p644P835m702j228P391o212M687M816n889Q613n6m201Q971n375
1874C960m51O624q231L052K039q209O085l240m798O012p650k21M439q897M275
1889e211J408p329Q466j447k472R083m646K988O382o063O411N98n970P641n068
1904D771l065N938q533R76L117q912M835r99n866O835n141j339O755p150L678
1919d100M329o275P829q1l719Q670m118l29O505o834L350J432o721N910l886m420
1935b458O323o993q13M853p983L734J576o236O855k440j818P058n206K665M846
1950C963o513O096J236n620P316l160k798O153o038J447K863p478N318j544n629
$$ plain form
1965 -4388 2140 -3108 -5257 493 -6737 -3941 -983 -7315 -806 -1628 -4484 3010 -928 -200 5820
1980 5820 -354 4043 6154 -279 5991 3616 -385 5872 264 43 4059 -3028 355 798 -5473
1995 -5473 -124 -4229 -6957 -662 -6745 -5383 -551 -5949 -825 1093 -2394 4912 2368 1630 8056
2010 8056 2275 4425 7369 428 5095 3668 -2187 3473 -1111 -3285 1363 -5190 -2973 -1144 -7273
2025 -7273 -2083 -3321 -6804 -232 -4228 -3253 2643 -2718 1747 4849 -138 5886 4538 1761 6914
2040 6914 2241 2613 5496 -1332 2185 1875 -4260 550 -2303 -5251 -321 -5223 -3900 -629 -6240
2055 -6240 -1457 -1126 -4643 1707 -935 -1610 4539 -113 2077 5286 191 4702 4644 289 5753 1752
2071 1752 321 4296 -1712 -398 842 -5200 -815 -2834 -6681 -889 -4972 -5194 -131 -4537 -1342
$$ packed form
1965d388O528n248k149N750p230K796K958o332O509q22k856P494l938P28O020
1980E820o174M397K111o433O270k375m001O257n608k21M016p087L383M43o271
1995e473N349m105k728O295o083J362M832n398N124J918l487P306k544p38O426
2010H056n781K150K944o941M667j427n855N660m584k174M648o553K217J829o129
2025g273N190j238l483O572l996R75N896n361M465L102m987O024j348k777N153
2040F914m673L72K883o828L517l10o135M810k853k948M930m902J323L271n611
2055f240M783L31l517O350k642o75O149m652K190L209n095M511n8m355N464m001
2071A752j431L975o008J314J240o042M385k019l847N792m083k22N063m406L195
$$ plain form
2086 -1342 1138 -2429 3228 2097 532 6457 2003 2274 6605 723 3328 3922 -1367 3113 379
2101 379 -2520 1831 -3777 -3389 -712 -6194 -2529 -2281 -6222 -678 -2665 -3235 2093 -1664 716 4018
2117 4018 291 4264 4307 736 5801 2341 1743 5319 -800 889 2480 -3629 -156 -1271 -5099 -825
2133 -825 -4295 -4647 -1168 -5305 -2228 -127 -4223 1556 704 -1146 4326 1401 1844 5587 1400 3825
2149 3825 4473 -19 4273 1562 -687 2965 -1760 -2110 613 -4871 -2138 -1899 -5556 -1116 -3086 -4066
2165 -4066 622 -3236 -1034 1654 -2001 2253 2010 -492 4684 2093 1193 5517 1434 2777 4425
2180 4425 455 3187 1381 -1823 1781 -2679 -3396 -738 -5955 -4036 -2466 -6155 -1907 -2322 -3720
2195 -3720 1190 -924 385 3837 492 4016 4991 1646 5848 4022 1676 4905 665 705 2236 -2833
$$ packed form
2086a342K480l567N657j131j565N925m454K71M331n882K605N94n289M480k734
2101C79k899M351n608L88K677n482L665K48l941N544j987n70N328l757K380L302
2117D018l727L973M3l571N065l460n98L576o119J689J591o109L473j115l828M274
2133h25l470l52L479m137L077K101m096N779q52j850N472k925M43L743m187K425
2149C825O48m492M292k711k249L652m725l50K723n484K733K39l657M440j970r80
2165d066M688l858K202K688l655M254k43k502N176k591r00M324m083J343J648
2180D425l970K732j806l204L604m460p17K658n217J919J570l689M248m15j398
2195c720M910k114J309L452l345L524R75l345M202j826k346L229m240M0J531n069
$$ plain form
2211 -2833 -566 -1311 -5032 -1556 -4113 -5113 -1559 -4654 -2843 -240 -3643 534 993 -1323 3408
2226 3408 1767 1555 5108 1761 3352 4771 857 4097 2639 -431 2634 -975 -2225 505 -4263
2241 -4263 -2752 -2104 -5198 -1961 -2966 -4051 366 -2110 -1197 2310 -957 1771 2959 89 3707
2256 3707 2364 1335 4320 1226 1876 3673 -520 1490 791 -2502 401 -2202 -3572 -531 -3730
2271 -3730 -3151 -1044 -3781 -856 -780 -2381 1440 -224 -169 3285 -293 1514 3053 -142 2833 2622
2287 2622 -45 3520 1023 945 2853 -936 407 495 -3243 -844 -2383 -4484 -1409 -3765 -3291 -813
2303 -813 -3394 -569 834 -1535 2475 1612 1109 4240 1742 2443 4113 457 2808 2429 -515 2002
2319 2002 151 -1165 642 -2715 -1856 -1078 -4287 -2045 -2554 -4488 -722 -2341 -2059 986 -1149 721
$$ packed form
2211b833K267p45l721L476k557j000L554l095J811K603l403M177M59k316M731
2226C408j641k12L553l347J591J419l914L240j458l070L065l609j250K730m768
2241d263J511O48l094L237j005j085M417k476R13L507l267K728J188k870L618
2256C707j343j029K985l094O50J797m193K010o99l293K903k603j370L041l199
2271c730N79K107k737K925P6j601L821j664N5L454l578J807J539l195K975k11
2287B622k667L565k497p8J908l789J343Q8l738K399j539k101L075k356M74K478
2303h13k581K825J403k369M010q63n03L131k498P01J670l656K351l79k944K517
2319B002j851j316J807l357Q59P78l209K242n09j934L766j619K82L045k135J870
$$ plain form
2335 721 2464 328 2990 2838 1627 4397 1936 1947 4034 524 1288 1554 -1685 413 -1222 -3210
2351 -3210 -1254 -3963 -4056 -1840 -4154 -1962 -1085 -2749 708 -395 -861 2463 942 1796 3968 1594
2367 1594 3763 3937 1902 4005 2180 919 2754 -1052 -930 -411 -4158 -2350 -3006 -5225 -2578 -3725
2383 -3725 -3615 -968 -2462 -208 1285 -448 2535 2829 1107 4300 2583 2416 4159 1381 2377 2723
2399 2723 28 1524 -159 -1835 -357 -2996 -3161 -1989 -4607 -2989 -2492 -4015 -910 -1192 -1286 1703
2415 1703 406 1621 3441 1416 3205 3212 1218 3442 1639 519 2435 -800 -440 302 -2216 -894
2431 -894 -1369 -2798 -1045 -2642 -2755 -714 -2687 -1084 314 -1441 771 951 36 2568 1318 1153
2447 1153 2930 796 1838 2130 -25 1748 527 -815 1252 -1153 -1354 -344 -2142 -1131 -932 -2804
$$ packed form
2335G21J743k136K662j52j211K770k461J1K087l510P64K66l239K098j635j988
2351c210J956k709r3K216k314K192Q77j664L457j103m66L324j521Q54K172k374
2367A594K169J74k035K103j825j261J835l806J22N19l747J808o56k219K647j147
2383c725J10K647j494K254J493j733K983K94j722L193j717j67J743k778R96L46
2399B723k695J496j683j676J478k639j65J172k618J618M97j523L105k82r4K989
2415A703j297J215J820k025J789Pj994K224j803j120J916l235L60P42k518J322
2431h94m75j429J753j597j13K041j973J603J398j755K212J80r15K532j250j65
2447A153J777k134J042K92k155J773j221j342K067k405k01J010j798J011J99j872
$$ plain form
2463 -2804 -452 -1292 -1907 148 -1300 -358 950 -958 948 1357 -277 2036 1268 788 2256 827
2479 827 1605 1935 -284 1347 574 -1306 320 -1547 -1874 -709 -2599 -1624 -936 -2792 -617 -626 -1335 905
2497 905 -234 139 1704 292 1589 2058 448 2044 1531 707 2526 663 467 1292 -760 -190 -547
2514 -547 -2361 -983 -2183 -2898 -933 -2717 -2102 -300 -1661 53 638 -108 1906 1352 1305 2502 851
2531 851 1556 2250 38 1375 1063 -517 1034 -284 -463 433 -1281 -905 -745 -2193 -816 -1163 -2259
2548 -2259 -634 -1634 -1269 -42 -1537 64 665 -321 1727 1306 978 2459 1183 2045 2752 1109 2130
2565 2130 1489 -333 877 -385 -2010 -1030 -2753 -2670 -2156 -3040 -1726 -1719 -1977 190 -447 -569 1424 372
2583 372 1650 2374 1606 2711 2675 1632 2715 1217 833 1404 -588 -273 -554 -2450 -1344 -2098 -2917 -1513
$$ packed form
2463b804K352q40o15K055j448R42J308j908J906M09j634K313p68m80J468j429
2479H27P78L30k219J631p73j880J626j867l27J165j890R75O88j856K175rp09K240
2497I05j139L73J565j412J297M69j610J596n13q24J819j863j96Q25k052N70l57
2514e47j814J378j200p15J965j784O15J802j361J714N85p46K014n54m7J197j651
2531H51P05O94k212J337l12j580J551j318j79Q96j714L76J60j448J377l47j096
2548b259J625j000L65J227j495J601O01r86K048m21l28J481j276Q62P07j643J021
2565B130o41j822J210j262j625R80j723Q3N14q84J314Pk58K167o37j22J993j052
2583C72J278P24p68J105l6j043J083j498l84N71j992L15k81j896J106p54q19J404
$$ plain form
2601 -1513 -2307 -2129 -466 -1331 -188 587 -302 1100 562 490 2091 1030 1689 2998 1146 2209 2120 632
2619 632 993 -201 -1100 -616 -2022 -1636 -1462 -2955 -1468 -1420 -2342 -438 -548 -379 1037 422 1524 1601
2637 1601 450 1770 1530 585 1604 729 319 789 -270 21 -362 -1738 -313 -694 -1149 356 -605
2654 -605 -207 287 -895 88 -568 -1512 -384 -740 -1273 232 -583 -54 814 -106 1222 1467 969 2243
2672 2243 1412 1007 1951 298 116 352 -1144 -638 -1067 -1977 -1169 -2274 -2369 -1538 -2213 -1196 -414 -791 786
2691 786 1015 754 2466 1208 1403 2403 1375 1561 1694 692 1232 338 -170 239 -1266 -1432 -963 -2312
2709 -2312 -1601 -1542 -2486 -1279 -1418 -1267 -125 -445 165 1254 467 1665 1241 852 1834 1571 1452 2004 1058
2728 1058 1271 1368 -521 -55 -897 -2043 -1322 -2434 -2095 -1368 -2435 -1582 -788 -1148 242 153 335 1350
$$ packed form
2601a513p94J78J663q65J143P75q89J402n38p2J601j061O59J309j852J063q9j488
2619F32L61j194q99M84j406L86J74j493J487M8r22J904j10J69J416o15J102P7
2637A601j151J320k40r45J019q75m10M70j059K91l83j376J425l81m55J505r61
2654f05L98M94j182R83o56r44J128l56n33J505q15N29Q68r20J328K45m98J274
2672B243q31m05R44j653j82K36j496N06m29r10Q08j105r5Q31o75J017P82l77J577
2691G86K29k61J712j258J95J000j028J86J33j002N40q94n08M09j505j66M69j349
2709b312P11N9r44J207j39J51J142l20O10J089p87J198m24l89R82k63j19N52r46
2728A058K13R7j889M66q42j146P21j112L39P27j067Q53P94l60J390q9J82J015
$$ plain form
2746 1350 876 1184 1742 837 1405 1289 322 1184 698 346 937 -243 -329 -52 -1374 -879 -1043 -1176 -404
2765 -404 -1016 -786 -170 -1101 -1002 -223 -1246 -245 242 -87 1056 704 1057 1589 902 1603 1841 1046 1374
2784 1374 709 197 483 -534 -984 -598 -1417 -1400 -922 -1431 -769 -640 -1502 -478 -1036 -381 184 -137 678
2803 678 1309 642 1866 1605 1212 1603 732 840 858 -40 391 39 -979 -538 -1289 -1726 -1008 -1710 -1376 -841
2823 -841 -1243 -579 -609 -714 48 106 545 1374 809 1320 1824 1034 1247 1393 621 1052 270 197 235 -694 -806
2844 -806 -987 -1988 -1512 -1508 -1922 -1090 -1669 -939 -203 -511 195 623 480 1392 1417 1418 1794 1462 1495 1618 868 1040
2866 1040 614 187 121 -540 -1029 -661 -1833 -1586 -1477 -1941 -1431 -1237 -1285 -440 -353 284 819 761 1162 1247 1210
2887 1210 1880 1506 1012 1655 920 573 238 -463 -584 -319 -1278 -947 -1348 -1972 -1302 -1502 -1002 -925 -1251 -134
$$ packed form
2746A350m74L08N58r05N68j16r67Q62m86l52N91j180q6K77j322M95j64j33P72
2765d04o12K30O16r31R9P79j023J001M87l29J143l52L53N32o87P01K38p95L28
2784A374o65n12K86j017m50L86q19J7M78n09O62J29q62J024n58O55N65l21Q15
2803F78O31o67J224k61l93L91q71J08J8q98M31l52j018M41p51m37P18p02L34N35
2823h41m02O64l0j05P62N8M39Q29n65N11N04p90K13J46p72M31p82p3L8r29j12
2844h06j81j001M76Mm14Q32n79P30P36l08P06M28j43R12K5JL76l32L3J23p50J72
2866A040m26m27o6o61m89L68j172K47J09m64N10J94m8Q45Q7O37N35n8M01Q5l7
2887A210O70l74m94O43p35l47l35p01j21K65r59L31m01o24O70k00N00P7l26J117
$$ plain form
2907 -134 -347 -111 947 600 917 1300 1164 1350 1426 647 1288 808 486 388 -76 -260 -133 -689 -1051 -559
2927 -559 -1197 -665 -880 -1297 -356 -612 -779 -144 -391 85 379 201 721 890 680 1261 792 578 1097 505
2947 505 1033 803 39 254 -169 -847 -521 -981 -927 -897 -1074 -809 -850 -871 -181 -441 -23 70 -75 647 957 624
2969 624 873 768 712 1091 953 599 1166 227 31 -106 -495 -357 -885 -991 -880 -1246 -757 -362 -915 -678
2989 -678 -704 -732 31 -427 -128 441 641 1243 1458 1100 1314 1101 535 710 -31 -179 -375 -735 -809 -902 -1220
3010 -1220 -895 -1075 -802 -258 -383 -472 79 -269 -88 221 -10 358 653 867 1014 687 511 840 394 119
3030 119 -40 10 341 130 -98 602 -265 -143 -358 -957 -576 -758 -1094 -1200 -914 -802 -756 -872 -202 407 476
3051 476 1308 1356 1586 1591 1157 1179 1115 716 643 392 -47 33 -500 -1253 -1352 -1913 -2165 -1617 -1766 -878 -609 -448 173
$$ packed form
2907a34k13K36J058l47L17L83j36J86P6p79O41m80l22r8m64j84J27n56l62M92
2927e59o38N32k15m17R41k56j67O35k47M76K94j78N20J69k10N81m69k14N19n92
2947E05N28k30p64K15m23o78L26m60N4L0j77K65m1k1O90k60M18R3j45P22L10l33
2969F24K49j05n6L79j38l54N67r39j96j37l89J38n28j06J11l66M89L95n53K37
2989f78k6k8P63m58K99N69K00O02K15l58K14k13n66J75p41j48j96l60p4r3l18
3010a220L25j80K73N44j25q9N51l48J81L09k31L68K95K14J47l27j76L29m46k75
3030A19j59N0L31k11k28P00q67J22k15n99L81j82l36j06K86J12M6j16O70O09O9
3051D76Q32M8K30Nm34K2o4l99p3k51m39Q0n33p53r9n61k52N48j49Q88K69J61O21
$$ plain form
3074 173 234 473 868 965 1231 1519 1064 1667 1122 952 984 369 171 256 -269 -213 -160 -904 -1129 -1890 -1618 -1439
3096 -1439 -1527 -1204 -486 -715 198 297 412 613 489 824 1599 1234 1932 1644 1297 1486 552 -103 -420 -807
3116 -807 -1039 -1128 -1412 -1437 -1574 -1015 -667 -500 -153 250 289 1149 749 266 763 295 -238 226 513 390 552
3137 552 497 495 135 -66 10 -238 -755 -178 -227 -106 229 -18 -130 -150 -487 -535 -770 -1068 -558 -796 -677 -170
3159 -170 -252 248 578 608 1100 1290 1378 1383 902 532 377 -380 -328 -408 -314 -311 -493 -752 -841 -1096 -1255 -913 -895 -461
3183 -461 -218 -90 450 602 659 1083 611 869 1012 643 955 855 414 507 -12 19 -36 -206 -421 -552 -937
3204 -937 -1260 -1290 -1676 -1335 -1053 -962 -199 10 733 986 960 1220 1191 1091 1257 1167 1195 919 512 435 -98 -666
3226 -666 -771 -835 -1371 -1089 -1285 -1215 -923 -1099 -777 -545 -109 382 119 418 874 460 928 684 762 792 469
$$ packed form
3074A73O1K39L95R7K66K88m55O03n45j70L2o15j98Q5n25N6N3p44k25p61K72J79
3096a439q8L23P18k29R13R9J15K01j24L35P75l65O98k88l47J89r34o55l17l87
3116h07k32q9k84k5j37N59L48J67L47M03L9Q60m00m83M97m68n33M64K87j23J62
3137E52n5kl60k01P6k48n17N77m9J21L35k47j12k0l37m8k35k98N10k38J19N07
3159a70q2N00L30L0M92J90Q8Nm81l70j55p57N2q0R4Lj82k59q9k55j59L42J8M34
3183d61K43J28N40J52N7M24m72K58J43l69L12j00m41R3n19L1n5j70k15j31l85
3204i37l23l0l86L41K82R1P63K09P23K53k6K60k9j00J66r0K8k76m07p7n33n68
3226f66j05o4n36K82j96P0K92j76L22K32M36M91k63K99M56m14M68k44P8L0l23
$$ plain form
3247 469 677 954 596 617 452 -57 -260 -400 -917 -648 -1034 -966 -758 -918 -747 -574 -588 -558 -466 -68 304 53
3269 53 455 694 608 817 1160 1171 1034 1007 832 847 264 -224 -375 -726 -986 -1140 -1110 -973 -1083 -1184 -612 -806
3291 -806 -747 -327 -427 -314 300 563 1127 794 739 1199 1018 999 1089 864 417 382 -31 89 -368 -539 -536 -1138
3313 -1138 -980 -1038 -1138 -1037 -977 -1068 -329 -199 284 505 143 613 959 770 1127 1093 819 1078 634 293 550
3334 550 -183 -244 -308 -467 -726 -847 -1147 -833 -1235 -840 -514 -783 -297 -369 -409 539 401 448 963 887 1127 1352
3356 1352 980 1023 897 329 572 -107 -204 -329 -820 -954 -963 -1060 -1062 -781 -1198 -728 -699 -600 -169 -18 314 579 523
3379 523 1103 1224 821 1208 926 932 1134 547 306 43 -523 -312 -705 -976 -722 -779 -758 -579 -1016 -824 -643
3400 -643 -805 -358 -248 274 592 634 951 1075 943 667 625 551 626 608 160 424 -110 -20 -254 -855 -377 -412
$$ packed form
3247D69K08K77l58K1j65n09k03j40n17K69l86O8K08j60J71J73j4L0R2L98L72k51
3269E3M02K39q6K09L43J1j37k7j75J5n83m88j51l51k60j54L0J37j10j01N72j94
3291h06N9M20j00J13O14K63N64l33n5M60j81j9R0k25m47l5m13J20m57j71Lo02
3313a138J58n8j00J01O0r1P39J30M83K21l62M70L46j89L57l4k74K59m44l41K57
3334E50p33o1o4j59k59j21l00L14m02L95L26k69M86p2m0R48j38M7N15p6K40K25
3356A352l72M3j26n68K43o79r7j25m91j34rr7kK81m17M70K9R9M31J51L32K65n6
3379E23N80J21m03L87k82OK02n87k41k63n66K11l93k71K54n7K1J79m37J92J81
3400f43j62M47J10N22L18M2L17J24j32k76m2p4P5j8m48K64n34R0k34o01M78l5
$$ plain form
3422 -412 -773 -573 -821 -1022 -798 -1114 -828 -227 -322 279 723 652 1183 817 880 693 638 496 673 330 700
3443 700 509 170 -42 -430 -576 -781 -1113 -1045 -870 -1073 -621 -843 -558 -149 -279 -7 610 895 1099 963
3463 963 550 1026 639 413 949 748 683 625 238 429 -219 -1180 -961 -1309 -1525 -776 -928 -931 -632 -706 -339 -190
3485 -190 -285 306 239 747 1118 1161 1152 760 651 823 686 429 189 -55 -134 -352 -1035 -856 -1136 -1325 -681 -595
3507 -595 -300 271 123 233 -31 -310 -404 -7 265 529 520 885 1167 432 426 353 -282 12 199 -45 390 8
3529 8 24 66 -767 -302 -635 -737 -465 -600 -852 -554 -772 -581 -250 -76 566 1064 813 1482 1343 952 797
3550 797 215 124 132 -373 -276 -40 -275 -143 -770 -1060 -679 -1243 -989 -653 -847 -219 -285 -320 375 358 313 1117 890
3573 890 968 1280 997 733 532 13 262 -157 -61 396 -218 -104 -501 -1033 -1261 -1376 -1738 -981 -1244 -378 166
$$ packed form
3422d12l61K00k48k01K24l16K86O01r5O01M44p1N31l66O3j87n5j42J77l43L70
3443G00j91l39k12l88j46k05l32O8J75k03M52k22K85M09j30K72O17K85K04j36
3463I63m13M76l87k26N36k01o5n8l87J91o48r61K19l48k16P49j52lK99p4L67J49
3485a90r5N91o7N08L71M3rl92j09J72j37k57k40k44p9k18o83J79k80j89O44Q6
3507e95K95N71j48J10k64k79r4L97K72K64rL65K82p35op3o35K94J87k44M35l82
3529HJ6M2q33M65l33j02K72j35k52K98k18J91L31J74O42M98k51O69j39l91j55
3550G97n82r1Qn05R7K36k35J32o27k90L81n64K54L36j94O28o6l5O95j7m5Q04k27
3573H90P8L12k83k64k01n19K49m19R6M57o14J14l97n32k28j15l62P57k63Q66N44
$$ plain form
3594 166 167 500 982 660 1067 1101 1146 1448 967 933 796 320 107 12 -641 -577 -698 -840 -323 -1073 -1232 -912
3616 -912 -943 -674 -361 -157 436 486 548 609 311 443 493 209 231 484 286 760 556 322 409 -131 -101 -151 -275
3639 -275 -183 -313 -583 -322 -939 -773 -502 -636 -605 -393 -319 229 90 62 476 395 257 1025 1026 1109 719 728 487
3662 487 83 -458 -386 -782 -482 -625 -796 -251 -438 -579 -322 -487 -716 -259 -352 -317 259 -84 307 632 702
3683 702 719 947 668 1077 660 353 867 -54 -112 -288 -478 -358 -496 -981 -658 -1000 -931 -901 -1025 -621 -316
3704 -316 -136 386 447 763 810 909 807 1022 619 593 682 215 271 -163 -512 -186 -484 -338 -374 -754 -589 -677 -783
3727 -783 -609 -609 -685 -134 -314 67 280 323 836 554 729 1013 475 602 683 334 257 465 38 -255 -291 -547
3749 -547 -279 -759 -593 -605 -538 -345 -715 -685 -332 -109 -100 380 176 514 584 615 1218 787 723 1013 558 372 714
$$ packed form
3594A66JL33M82l22M07L4M5L02m81l4j37m76k13r5o53O4j21j42N17p50j59L20
3616i12l1K69L13K04N93N0O2O1k98J32N0k84K2K53j98M74k04k34Q7n40L0n0j24
3639b75R2j30k70K61o17J66K71j34L1K12P4N48j39k8M14q1j38P68JQ3l90Rk41
3662D87m04n41P2l96L00j43j71N45j87j41K57j65k29M57r3L5N76l43L91L25P0
3683G02J7K28k79M09m17l07N14r21n8j76j90J20j38m85L23l42O9L0j24M04L05
3704c16J80N22O1L16M7R9j02K15m03k6Q9m67N6m34l49L26k98J46l6l80J65q8j06
3727g83J74%p6N51j80L81K13M3N13k82J75K84n38J27Q1l49p7K08m27k93l6k56
3749e47K68m80J66j2O7J93l70L0L53K23RM80k04L38P0L1O03m31o4K90m55j86L42
$$ plain form
3772 714 -159 -406 -316 -731 -278 -601 -1261 -555 -786 -777 -449 -731 -291 -269 -232 8 240 270 734 629 929 1139
3794 1139 508 823 719 442 373 37 -249 -122 -541 -637 -436 -767 -777 -663 -958 -588 -614 -556 91 -166 245
3815 245 564 388 423 302 377 770 428 645 788 478 326 353 78 -17 -101 -472 -220 -708 -734 -891 -1011 -851
3837 -851 -828 -715 -190 -228 -9 463 357 436 855 472 750 568 520 988 490 402 564 192 65 -17 -552 -462
3859 -462 -614 -655 -676 -721 -670 -422 -737 -468 -172 -275 262 400 295 743 306 469 1054 399 871 1019 562
3880 562 358 134 -419 -566 -945 -899 -776 -818 -415 -207 -415 -39 -274 -638 -249 -545 -19 649 440 439 801
3901 801 493 816 825 398 662 408 434 193 -423 66 -463 -1063 -576 -781 -803 -409 -309 -233 -467 -557 -609 -459
3923 -459 -175 287 305 544 1023 821 796 762 168 500 193 -4 617 60 39 29 -511 -334 -501 -952 -660 -400
$$ packed form
3772G14q73k47R0m15M53l23o60P06k31RL28k82M40K2L7K40K32L0M64j05L00K10
3794A139o31L15j04k77o9l36k86J27m19r6K01l31j0J14k95L70k6N8O47k57M11
3815B45L19j76L5j21P5L93l42K17J43l10j52K7k75r5q4l71K52m88k6j57j20J60
3837h51K3J13N25l8K19M72j06P9M19l83K78j82m8M68m98q8J62l72j27q2n35R0
3859d62j52m1k1m5N1K48l15K69K96j03N37J38j05M48m37J63N85o55M72J48m57
3880E62k04k24n53j47l79M6J23m2M03K08k08L76k35l64L89k96N26O68k09jL62
3901H01l08L23Rm27K64k54K6k41o16M89n29o00M87k05k2L94J00P6k34r0n2J50
3923d59K84M62J8K39M79k02k5l4n94L32l07j97O21n57k1j0n40J77j67m51K92K60
$$ plain form
3945 -400 -811 -277 -679 -385 -53 -454 -63 417 650 897 1049 925 917 447 222 507 253 404 489 -24 482
3966 482 -60 -385 -756 -950 -1158 -983 -1015 -693 -516 -763 -45 41 275 565 675 749 1078 680 1157 953 286
3987 286 342 -114 259 477 -59 37 -504 -755 -819 -925 -987 -898 -604 -433 60 143 245 195 -120 211 222 -135 553
4010 553 275 496 847 134 234 254 84 464 188 -342 343 -335 -492 -171 -921 -645 -773 -823 -147 -106 -333
4031 -333 191 -166 -246 77 -208 375 689 654 991 828 565 807 171 -11 -98 -454 -274 -73 -535 -328 -192
4052 -192 -331 -557 -574 -137 -206 -226 42 -144 57 176 59 115 639 172 606 606 345 611 504 30 49 -207
4074 -207 -125 207 -258 81 -252 -530 -343 -656 -1204 -588 -814 -157 -9 -136 23 537 342 792 364 461 864
4095 864 461 749 650 -23 255 -268 -252 4 -532 -403 -168 -621 -579 -295 -1136 -484 -424 -728 219 153 96 517
$$ packed form
3945d00m11N34m02K94L32m01L91M80K33K47J52j24qm70k25K85k54J51Q5n13N06
3966D82n42l25l71j94k08J75l2L22J77k47P18Q6K34K90J10P4L29l98M77k04o67
3987B86N6m56L73K18n36R6n41k51o4j06o2Q9K94J71M93Q3J02n0l15L31J1l57O88
4010E53k78K21L51p13J00K0j70L80k76n30O85o78j57L21p50K76j28n0O76M1k27
4031c33N24l57q0L23k85N83L14l5L37j63k63K42o36j82q7l56J80K01m62K07J36
4052a92j39k26j7M37o9k0K68j86K01J19j17N6N24m67M34%k61K66j07m74J9k56
4074b07Q2L32m65L39l33k78J87l13n48O16k26O57J48j27J59N14j95M50m28R7M03
4095H64m03K88r9o73K78n23J6K56n36J29K35m53M2K84q41O52O0l04R47o6n7M21
$$ plain form
4117 517 450 522 500 -55 540 347 188 438 344 344 589 -24 220 221 -256 -155 -613 -599 -463 -1122 -873 -567 -843
4140 -843 -158 145 1 523 577 400 744 446 440 385 581 567 507 198 426 -183 -176 -181 -587 -408 -498 -745 -355 -660
4164 -660 -866 -253 -416 -500 102 153 -25 517 113 1044 585 545 647 423 449 626 1 328 74 46 -242 -523
4186 -523 -663 -590 -951 -718 -455 -748 -446 30 -395 123 128 30 571 274 539 489 364 472 726 246 442 115
4208 115 283 369 76 278 -84 -538 -326 -444 -723 -648 -675 -596 -86 -727 -194 53 8 445 234 190 679 56
4230 56 301 462 256 230 780 176 80 165 -51 52 -204 6 -435 -934 -325 -579 -600 -468 -115 -415 108 -349
4252 -349 414 323 -93 422 248 126 572 570 143 399 317 88 13 -217 1 -122 -181 114 -585 -491 -158 -406
4274 -406 -389 -438 -695 -227 -217 -180 575 314 126 750 654 594 925 731 633 296 -56 317 -713 -554 -275 -605
$$ packed form
4117E17o7P2k2n55N95j93j59K50r4%K45o13K44Jm77J01m58J4J36o59K49L06k76
4140h43O85L03j44N22N4j77L44k98on5J96j4o0l09K28o09Pnm06J79r0k47L90l05
4164f60k06O13j63q4O02N1j78N42m04R31m59m0J02k24K6J77o25L27k54k8k88k81
4186e23j40P3l61K33K63k93L02M76m25N18Nr8N41k97K65n0j25J08K54m80J96l27
4208A15J68Q6k93K02l62m54K12j18k79P5k7P9N10o41N33K47m5M37k11m4M89o23
4230E6K45J61k06k6N50o04r6Q5k16J03k56K10m41m99O09k54k1J32L53l00N23m57
4252c49P63r1m16N15j74j22M46km27K56q2k29p5k30K18j23n9K95o99R4L33k48
4274d06J7m9k57M68J0L7P55k61j88O24r6o0L31j94r8l37l52L73j030J59K79l30
$$ plain form
4296 -605 -121 -19 -702 -2 -499 -475 -86 -585 -170 60 -196 258 479 121 441 82 135 594 67 525 832
4317 832 302 456 278 -144 78 -111 -192 -145 -539 -211 -456 -939 -205 -568 -516 -55 -58 102 307 403 239 342
4339 342 100 534 260 -63 647 431 471 633 38 175 64 -504 -231 -307 -485 -472 -605 -637 -376 -597 -256
4360 -256 -56 -180 663 722 469 908 79 455 263 -138 258 334 60 515 272 -253 -56 -327 -176 -343 -651
4381 -651 -562 -747 -582 -187 -623 -607 -142 -330 166 185 320 655 548 316 595 183 282 536 33 440 216
4402 216 -356 -139 -330 -781 -303 -521 -455 -11 -523 -80 -267 -428 176 -221 -60 204 15 566 447 21
4422 21 784 517 306 533 69 -169 218 -345 -88 -511 -777 -486 -459 -359 181 -350 -13 269 -605 -102 52
4443 52 -435 157 -184 46 708 269 600 549 652 511 309 -147 78 182 -606 131 -252 -98 -379 -527 -172
$$ packed form
4296f05M84J02o83P00m97K4L89m99M15K30k56M54K21l58L20l59N3M59n27M58L07
4317H32n30J54j78m22K22j89q1M7l94L28k45m83P34l63N2M61lJ60K05R6j64J03
4339C42k42M34k74l23P10k16M0J62n95J37j11n68K73p6j78J3j33l2K61k21L41
4360b56K00j24Q43N9k53M39q29L76j92m01L96P6k74M55k43n25J97k71J51j67l08
4381f51Q9j85J65L95m36J6M65j88M96J9J35L35j07k32K79m12R9K54n03M07k24
4402B16n72K17j91m51M78k18O6M44n12M43j87j61O04l97J61K64j89N51j19m26
4422B1P63k67k11K27m64k38L87n63K57m23k66K91K7J00N40n31L37K82q74N03J54
4443E2m87N92l41K30O62m39L31n1J03j41k02m56K25J04p88P37l83J54k81j48L55
$$ plain form
4464 -172 -313 -245 62 -230 -257 362 -191 -46 236 42 544 653 330 739 310 -39 318 -109 124 81 -361
4485 -361 299 -141 -389 -238 -632 -617 -190 -561 -250 -105 -237 71 -43 94 367 163 -204 421 323 552 502
4506 502 136 563 293 34 466 -123 43 373 -494 -152 -454 -935 -335 -513 -708 -41 -214 63 428 -203
4526 -203 221 265 1 636 159 351 786 318 302 373 -155 224 -101 5 -74 -445 -245 -125 -683 -116 -20 -222
4548 -222 331 -466 -192 297 -100 265 343 17 281 338 -133 336 352 374 572 -97 -109 455 -76 -89 -71 -651
4570 -651 -160 -415 -293 59 -66 -31 257 -297 64 25 -342 59 109 -55 286 -191 322 394 -95 549 473 141
4592 141 322 -218 -343 10 -537 74 -130 -218 57 -180 -310 246 -208 -128 183 -630 -154 -169 -561 153 136
4613 136 241 614 358 519 762 350 425 399 -422 316 -491 -458 -296 -911 -383 -415 -683 -168 -111 -467 302 4
$$ packed form
4464a72j41O8L07k92k7O19n53J45K82j94N02J09l23M09m29l49L57m27K33m3m42
4485c61O60m40k48J51l94J5M27l71L11J45j32L08j14J37K73k04l67O25r8K29n0
4506E02l66M27k70k59M32n89J66L30q67L42l02m81O00j78j95O67j73K77L65o31
4526b03M24M4k64O35m77J92M35m68j6P1n28L79l25J06p9l71K00J20n58N67R6k02
4548b22N53p97K74M89l97L65P8l26K64N7m71M69J6K2J98o69j2N64n31j3J8n80
4570f51M91k55J22L52j25L5K88n54L61l9l67M01N0j64L41m77N13P2m89O44p6l32
4592A41J81n40j25L53n47O11k04q8K75k37j30N56m54Q0L11q13M76j5l92P14j7
4613A36J05L73k56J61K43m12P5k6q21P38q07L3J62o15N28l2k68N15N7l56P69k98
$$ plain form
4635 4 76 305 111 251 422 80 452 743 50 672 239 212 475 30 135 32 -558 -386 -469 -735 -211 -879
4657 -879 -635 -23 -329 136 256 27 672 482 222 782 113 421 506 352 241 296 -324 82 -521 -431 -270
4678 -270 -789 -230 -144 -615 -334 -372 -493 174 -131 -166 296 -249 260 239 -164 267 277 259 501 83 54 661
4700 661 -134 84 -288 -632 -173 -319 -279 143 -562 -461 313 -596 84 148 -461 21 -25 43 454 -33 -35 307
4722 307 -24 281 296 175 514 25 -306 242 79 -270 -97 -699 -73 -364 -593 5 -117 -190 231 -53 311
4743 311 236 57 284 8 -44 238 -246 -12 337 -156 203 422 37 593 0 -170 339 97 -559 -52 -483
4764 -483 -153 -338 -636 -68 -461 -185 454 140 -46 358 58 214 71 -300 299 -106 -186 386 -470 20
4784 20 19 -272 240 49 -196 14 -280 -87 36 -378 -87 121 -653 0 120 -185 534 363 86 348 -20
$$ packed form
4635DP2K29j94J40J71l42L72K91o93O22m33k7K63m45J05j03n90J72q3k66N24o68
4657h79K44O12l06M65J20k29O45j90k60N60o69L08Q5j54j11N5o20M06o03R0J61
4678b70n19N59Q6m71K81l8j21O67l05l5M62n45N09k1m03M31J0j8K42m18k9O07
4700F61p95K18l72l44M59j46M0M22p05J01P74r09O80O4o09M82m6O8M11m87kL42
4722C07l31L05J5j21L39m89l31N48j63l49J73o02O26k91k29N98j22p3M21k84L64
4743C11p5j79K27k76n2K82m84K34L49m93L59K19l85N56n93j70N09k42o56N07m31
4764d83L30j85k98N68l93K76O39l14j86M04l00J56j43l71N99m05q0N72q56M90
4784B0jk91N12j91k45K10k94J93J23m14K91K08p74O53J20l05P19j71k77K62l68
$$ plain form
4805 -20 164 357 -143 167 70 -315 279 -200 -63 218 -402 -185 71 -345 -204 -170 -86 17 -284 -248 326 -291
4827 -291 79 123 -77 491 48 131 495 69 37 152 -103 -55 82 -209 185 -235 -334 -59 -312 -123 -112 -526
4849 -526 62 12 -368 274 -229 0 387 -190 296 231 -100 478 183 222 368 -141 -16 193 -277 261 190
4870 190 -388 -171 -365 -351 20 -611 -75 77 -411 -75 -24 -279 216 250 550 574 194 296 350 -23 300 201
4892 201 -175 127 -282 -85 107 -330 -207 -174 -651 -91 -153 -335 0 -142 24 151 -180 401 311 165 477
4913 477 611 -169 421 12 -6 318 -321 63 -138 -191 -148 -161 -157 -41 -404 -278 363 16 111 131 70 312 51
4936 51 -75 422 -57 -68 514 77 445 152 -330 144 -371 -144 -60 -469 84 93 35 392 -87 -82 370 4 -23
4959 -23 339 -604 71 -23 -373 165 -54 -160 56 -30 149 394 -179 107 129 -332 231 -174 -193 396 -37 226
$$ packed form
4805b0J84J93n00L10r7l85N94m79J37K81o20K17K56m16J41L4Q4J03l01L6N74o17
4827b91L70M4k00N68m43Q3L64m26l2J15k55M8J37k91L94m20r9K75k53J89J1m14
4849e26N88n0l80O42n03K29L87n77M86o5l31N78k95L9J46n09J25K09m70N38p1
4870A90n78K17j94J4L71o31N36J52m88L36N1k55M95L4L00K4l80J02N4l73L23r9
4892B01l76L02m09J97J92m37J23L3m77N60o2j82L35j42J66J27l31N81r0j46L12
4913D77J34p80N90m09j8L24o39L84k01n3M3j3MJ16l63J26O41l47R5K0o1K42k61
4936E1j26M97m79j1N82m37L68k93m82M74n15K27Q4m09N53Rn8L57m79NM52l66k7
4959b3L62r43O75r4l50N38k19j06K16q6J79K45n73K86K2m61N63m05j9N89m33K63
$$ plain form
4981 226 371 -100 415 -37 -309 170 -418 -533 -190 -647 -287 -43 -321 203 285 -61 552 75 111 285 -27
5002 -27 -42 100 -166 90 -194 -346 244 37 -166 89 -446 210 62 -402 137 -207 -461 -194 -24 -54 688
5023 688 -63 356 397 -125 628 -165 -97 299 -243 -6 -87 -363 -138 -342 -369 222 -225 -33 248 -320 96
5044 96 404 -180 146 10 -160 371 -144 131 447 -200 44 248 -338 348 -151 -50 10 -285 189 137 -248
5065 -248 97 -127 -289 330 -43 -77 359 -189 -19 243 -408 176 97 50 112 80 73 114 -418 -276 190 -174 92
5088 92 236 37 269 -264 153 291 -152 -25 -62 -369 -326 -280 -548 185 -223 -14 176 75 473 188 157 303
5110 303 340 36 485 -104 -145 -175 -434 98 -298 -304 217 -151 -227 90 -321 -221 -138 -357 -64 -89 -336 44 13
5133 13 341 452 159 429 518 -8 318 12 -136 -99 -446 -303 137 -274 -82 332 -383 247 -146 -413 118
$$ packed form
4981B26J45m71N15m52k72M79n88j15L43m57L60K44k78N24Q2l46O13m77L6J74l12
5002b7j5J42k66K56k84j52N90k07k03K55n35O56j48m64N39l44k54K67J70l0P42
5023F88p51M19M1n22P53p93O8L96n42K37q1k76K25k04k7N91m47J92K81n68M16
5044I6L08n84L26j36j70N31n15K75L16o47K44K04n86O86m99J01O0k95M74n2l85
5065b48L45k24j62O19l73l4M36n48J70K62o51N84p9m7O2l2pM1n32J42M66l64K66
5088I2J44j99K32n33M17J38m43J27l7l07M3M6k68P33m08K09J90j01L98k85l1J46
5110C03L7l04M49n89m1l0k59N32l96oN21l68p6L17m11J00Q3k19K93k5k47L80l1
5133A3L28J11k93K70Q9n26L26l06j48L7l47J43M40m11J92M14p15O30l93k67N31
$$ plain form
5154 118 -234 84 161 -472 213 129 -130 582 135 190 479 -279 211 29 -278 -202 -177 -491 69 -468 -379 -78
5176 -78 -386 181 90 -284 402 129 -144 390 18 117 570 -184 -117 141 -231 104 -43 -12 193 40 -316 245
5198 245 -239 -37 52 -341 -36 -90 -98 135 -300 177 16 -142 233 270 29 317 214 206 372 -57 -104 17 -344
5221 -344 96 -180 -238 229 -130 -274 181 -54 -113 250 -223 58 21 71 239 102 -99 41 -73 163 134 79
5243 79 225 -38 -198 319 -369 -184 -139 -463 -92 -69 -101 78 -209 -232 401 21 189 393 202 293 9 -189
5265 -189 -5 -59 -277 330 -316 -170 172 -52 172 119 -260 352 84 -32 91 -15 204 -65 -294 240 -95
5286 -95 -222 204 311 -3 220 39 -31 273 -283 38 -96 -259 208 -297 -203 68 -143 25 148 -44 364
5307 364 317 -22 241 -166 -59 251 -433 197 -17 -3 -72 -16 -168 60 -75 105 274 -243 143 -34 -266
$$ packed form
5154A18l52L18P7o33O85q4k59P12m47N5K89p58M90j82l07P6K5l14N60n37Q9L01
5176g8l08N67r1l74O86k73k73N34l72R9M53p54O7K58l72L35j47L1K05j53l56N61
5198B45m84K02Q9l93L05n4qK33m35M77j61j58L75L7k41K88j03qJ66m29m7J21l61
5221c44M40k76n8M67l59j44M55k35n9L63m73K81l7N0J68j37k01J40j14K36k9n5
5243G9J46k63j60N17o88J85M5l24L71K3l2J79k87k3O33l80J68K04j91R1k84j98
5265a89J84n4k18O07o46J46L42k24K24n3l79O12k68j16J23j06K19k69k29N34l35
5286i5j27M26J07l14K23j81p0L04n56L21j34j63M67n05R4K71k11J68J23j92M08
5307C64m7l39K63m07J07L10o84O30k14J4o9N6j52K28j35J80J69n17L86j77k32
$$ plain form
5328 -266 -45 -256 -268 252 -13 241 174 -53 421 313 -204 279 -105 -245 16 -353 2 313 -159 396 191
5349 191 -202 100 -9 85 30 -194 -83 29 -364 239 -15 -318 259 9 375 423 -386 83 106 -304 187
5370 187 -111 -83 -71 0 -204 30 -333 115 -145 -193 270 24 -206 51 5 -33 122 -153 241 -73 2 16 -41
5393 -41 -33 -90 -359 -164 158 -486 30 -272 -183 396 10 134 299 -153 306 97 -375 48 -345 -249 187 -153
5415 -153 -230 105 -76 -167 303 -297 493 -229 -114 -85 -384 27 24 -211 179 83 253 364 -94 -135 188 -298
5437 -298 40 -206 -319 -65 -61 -54 105 -99 107 199 -16 85 207 95 151 66 -124 359 -231 -146 332 -258 -104
5460 -104 -11 -518 165 -146 -206 206 -330 21 412 -263 177 199 -180 452 155 -114 319 -273 -193 -20 -227
5481 -227 77 186 -233 145 -66 68 80 -702 -166 16 -400 268 -161 -330 568 -157 39 545 104 381
$$ packed form
5328b66K21k11j2N20k65K54o7k27M74j08n17M83l84j40K61l69L55L11m72N55k05
5349A91l93L02j09R4n5k24J11J12l93O03k54l03N77k50L66M8q09M69K3m10M91
5370A87k98K8J2P1k04K34l63M48k60m8M63k46k30K57m6l8J55k75L94l14P5J4n7
5393d1Qn7k69J95L22o44N16l02Q9N79l86J24J65m52M59k09m72M23l93R6M36l40
5415a53p7L35j81r1M70o00P90p22J15K9k99M11lk35L90r6J70J11m58m1L23m86
5437b98L38k46j13K54MPJ59k04K06R2k15J01J22j12N6q5j90M83n90Q5M78n90J54
5460a04R3n07O83l11o0M12n36L51L91o75M40K2l79O32k97k69M33n92Q0J73k07
5481b27L04J09m19L78k11J34J2p82N36J82m16O68m29j69Q98p25J96N06m41K77
$$ plain form
5501 381 261 -50 11 19 -97 -226 -477 -287 -72 -435 -289 73 -99 216 -148 -135 354 -176 95 227 -404
5522 -404 -116 -73 -300 241 122 174 518 15 101 321 -17 33 -115 -264 -2 -455 -261 386 -314 48 98 -301
5544 -301 236 44 -123 144 -385 -273 -55 -447 -22 34 -237 416 206 36 173 -204 -22 6 -282 47 -69
5565 -69 -182 236 53 -261 12 -22 6 166 -314 44 183 -191 189 -197 127 132 -106 380 259 -90 148 106
5587 106 -247 262 -293 70 -22 -356 64 -127 -454 69 -205 -319 223 -63 -187 336 30 242 107 -57
5607 -57 607 35 -233 274 -247 225 186 -126 162 27 -103 224 -87 -198 363 69 71 309 -178 220 -102
5628 -102 -354 26 -218 91 -228 -346 -111 70 -303 471 -175 -177 449 160 87 206 41 131 273 -389 45
5649 45 -221 -110 258 24 41 -6 -226 67 -128 -376 207 -115 -118 321 -208 -68 237 -194 195 26 -168 379
$$ packed form
5501C81j20l11O1Qj16j29k51J90K15l63J46L62j72L15l64J3M89n30K71J32o31
5522d04K88M3k27N41j19N2L44n03Q6K20l38N0j48j49K62m53J94O47p00L62N0l99
5544c01N37j92j67K67n29J12K18l92M25N6k71O53k10j70J37l77J82K8k88L29j16
5565f9j13M18j83l14K73l4K8J60m80L58J39l74L80l86L24Nk38M86j21l49K38m2
5587A06l53N09n55L63r2l34M20j91l27N23k74j14N42k86j24N23l06K12j35j64
5607e7O64n72k68N07n21M72l9l12K88j35j30L27l11j11N61k94KK38m87L98l22
5628a02k52L80k44L09l19j18K35J81l73P74o46kO26k89p3J19j65R0J42o62M34
5649D5k66J11L68k34J7m7k20K93j95k48N83l22lM39n29J40L05m31L89j69j94N47
$$ plain form
5671 379 -74 -243 230 -127 -332 -52 -81 -169 -9 -153 208 -164 -243 -23 -184 -96 -64 -297 -260 89 -138 -43
5693 -43 -159 219 288 -67 398 196 -153 252 -179 -242 -98 -416 -312 278 -197 142 -82 -200 114 -11 -120
5714 -120 402 -18 -74 271 -352 -12 -68 -417 126 -108 -15 85 -190 57 94 -105 369 -46 -15 116 -56 90
5736 90 88 -417 32 -60 -195 148 -340 -349 377 -5 160 330 71 275 304 -59 453 273 225 655 26 -205 207
5759 207 -514 -95 -38 -243 77 -587 -576 -29 -187 -163 72 -348 82 138 -328 153 -218 -31 484 -173 296
5780 296 -120 -151 159 229 -256 -237 -107 127 -154 -285 -139 -224 -235 -98 -10 93 203 -61 4 -66 -9 250 55
5803 55 -201 485 174 -65 291 40 -133 86 -182 -145 136 -485 -27 -237 -96 158 -353 103 159 -288 284
5824 284 18 67 247 -109 52 528 -89 21 115 -403 -10 18 -171 408 46 83 198 -228 -24 -21 -310 191
$$ packed form
5671C79m53j69M73l57k05K80k9q8J60j44L61l72p9K20j61Q8L2k33L7L49k27R5
5693d3j16L78O9l55M65k02l49M05m31o3J44l18J04N90m75L39k24j18L14j25j09
5714a20N22m20n6L45o23L40n6l49N43k34R3J00k75K47L7j99M74m15L1J31j72J46
5736I0kn05M49r2j35L43m88rP26l82J65J70k59K04K9l63N12j80m8M30o29k31M12
5759B07p21M19N7k05L20o64J1N47j58K4K35m20M30N6m66M81l71J87N15o57M69
5780B96m16l1L10P0m85J9J30K34k81j31J46q5j1J37Q8J03J10k64O5p0N7K59j95
5803E5k56O86l11k39L56k51j73K19k68L7K81o21M58k10J41K54n11M56N6m47N72
5824B84k66M9J80l56J61M76o17J10R4n18L93K8j89N79l62L7J15m26K04Lk89N01
$$ plain form
5846 191 -51 -217 222 -95 -78 311 134 303 234 -9 199 39 205 312 -182 180 207 -358 340 -148 12
5867 12 261 -26 -150 177 -418 -33 143 -425 -6 -90 99 352 -36 -34 136 20 176 204 57 -2 65 132 254
5890 254 -60 42 59 59 108 235 -359 -24 -411 -150 -112 -353 -11 -133 -210 201 -11 10 89 -104 43 370 -50
5913 -50 192 85 -161 295 165 -73 114 -198 74 477 -86 56 42 -275 -46 -55 -214 -174 -362 19 145 -380
5935 -380 444 135 -82 234 -44 35 267 -102 -11 223 -40 -34 83 -225 115 -227 -38 137 -357 -126 -268
5956 -268 -217 24 -122 -229 146 -214 196 240 -99 29 281 48 370 197 136 386 -104 -118 139 -154 122
5977 122 -193 -241 104 -123 -300 -57 -161 -254 -51 -109 8 389 -54 184 99 -84 417 -155 275 219 -113 171
5999 171 102 -84 71 175 -154 304 -388 -11 -269 -283 -46 -142 -297 -128 -95 -118 393 -242 -7 104 -108 242
$$ packed form
5846A91k42j66M39l17J7L89j77J69o9k43K08j60J66J07m94L62K7n65O98m88J60
5867A2K49k87j24L27n95L85J76n68M19q4J89K53l88KJ70j16J56K8j47n9O7O7J22
5890B54l14J02J7%M9J27n94L35l87K61L8k41L42j22p7M11k12K1P9j93J47L27m20
5913e0K42j07k46M56j30k38J87l12K72M03n63J42j4l17K29rj59M0j88L81J26n25
5935c80Q24l09k17L16k78P9K32l69R1K34k63OJ17l08L40l42J89J75m94K31j42
5956b68N1K41j46j07L75l60M10M4l39J28K52k33L22j73o1K50m90j4K57k93K76
5977A22l15m8L45k27j77K43j04r3K03n8J17L81m43K38q5j83N01n72M30n6l32K84
5999A71o9j86J55J04l29M58o92L77k58j4K37r6j55J69L3k3N11o35K35J11k12L50
$$ plain form
6021 242 46 39 288 131 -64 145 -311 -88 -130 -2 -113 98 -246 82 -278 -184 64 -418 -198 -73 -38 318
6043 318 217 2 222 224 63 372 92 401 226 -321 369 -166 -164 246 -65 50 164 -417 208 -39 -497
6064 -497 -206 -377 -256 0 -118 120 65 -159 358 95 -112 212 132 111 572 4 34 253 -137 95 -178
6085 -178 -455 -111 -286 -336 -171 -297 -6 -61 -235 -160 -126 -203 287 -30 194 411 -98 242 96 -132 316 -17
6107 -17 -140 32 -1 -10 183 5 350 289 -79 442 -238 51 -199 -188 8 154 -176 47 3 -303 -8 -76 59
6130 59 243 -111 60 73 58 345 175 118 228 -152 -214 4 -315 -142 137 -64 75 -168 -73 -72 -79 71 -47
6153 -47 -103 21 -68 12 269 -26 -220 218 15 395 415 -65 420 85 200 360 -309 54 -202 -456 -115 86
6175 86 -278 83 -218 -217 126 170 6 -45 -98 256 177 121 286 235 203 121 323 -24 -34 -138 -184 -14 -363 -135
$$ packed form
6021B42j96pK49j57j95K09m56K23m2J28j11K11l44L28l60R4K48m82K20J25L5L56
6043C18j01k15K20Kj61L09k80L09j75n47O90n35KM10l11J15J14n81O25k47m58
6064d97K91j71J21K56j18K38n5k24N17k63k07L24q0k1M61n68L0K19l90K32k73
6085a78k77L44j75n0J65j26K91n5j74P5L4p7M90l17K24K17n09L40j46k28M48l33
6107a7j23J72l3rJ93j78L45o1l68N21o80K89k50J1J96J46l30K23m4l06K95o8J35
6130E9J84l54J71J3j5K87j70n7J10l80o2K18l19J73K79k01J39k43R5JpJ50j18
6153d7n6J24q9Q0K57k95j94M38k03L80K0m80M85l35J15J60o69L63k56k54L41K01
6175H6l64L61l01JL43M4j64n1n3L54p9n6J65n1l2q2K02l47j0j04m6J70l49K28
$$ plain form
6199 -135 -383 -199 188 -49 -21 -116 -42 233 267 -4 401 76 -169 6 -242 143 -6 53 431 115 -359 173
6221 173 -240 -16 189 54 -157 -31 -115 127 -12 -75 56 -237 -177 20 -214 176 -178 -252 84 -45 316
6242 316 290 49 220 -195 -28 202 -24 -243 105 -379 -275 -157 -345 -284 -22 -114 -106 4 -97 51 -330 -28
6264 -28 307 -50 109 299 -2 205 46 113 546 83 26 62 -6 -42 55 -181 -122 -160 -408 -261 -403 -103 178
6287 178 -24 179 55 44 74 67 65 71 153 235 404 -28 252 223 76 251 -123 -49 -49 -297 157 46 -535 -89 -97
6312 -97 7 -12 -25 -112 -8 -183 229 191 -167 119 121 106 272 -120 47 273 -179 134 -14 -68 153 -137 -240
6335 -240 -236 -41 -61 -311 -258 -206 -108 -393 163 -18 -33 394 48 94 117 154 253 214 12 159 -55 -19 332 -145
6359 -145 134 -68 -104 -69 -260 -567 52 -398 -108 154 -304 124 171 -26 141 -228 -68 13 -44 109 242 226
$$ packed form
6199a35k48J84L87k37K8r5P4K75L4k71M05l25k45J75k48L85j49N9L78l16m74N32
6221A73m13K24K05j35k11J26q4K42j39o3J31k93O0J97k34L90l54p4L36j29L61
6242C16k6k41J71m15J67K30k26k19L48m84J04J18j88O1K62r2QJ10j01J48l81L02
6264b8L35l57J59J90l01K07j59O7M33m63n7L6o8l6R7k36N9l8k48J47j42L00K81
6287A78k02K03j24j1L0pkOQ2Q2J69m32K80k9j47J75l74P4%k48M54j11n81M46q
6312i7J04j9j3q7J04j75M12l8l58K86Kj5J66l92J67K26m52L13j48n4K21k90j03
6335b40MJ95k0k50N3N2R8k85N56j81j5M27l46M6K3L7R9l9k02J47k14L6L51m77
6359a45K79k02l6L5j91l07O19m50K90K62m58M28M7j97J67l69J60Q1n7J53J33j6
$$ plain form
6381 226 422 105 104 -34 47 -51 47 -275 -27 -93 -506 -120 -244 -93 -2 -149 -258 248 -16 -27 191 71 261
6404 261 -43 74 392 97 28 357 105 -94 26 -137 -89 -79 -383 -257 -269 -434 16 -454 -32 -133 2
6425 2 -22 201 138 58 -203 318 106 -74 550 221 181 389 -59 -32 161 -158 -250 -308 -184 105 -244 -351 -95
6448 -95 -175 -219 -107 -383 -160 214 110 241 -5 -308 302 56 193 278 60 167 59 34 100 33 -80 96
6470 96 -83 -160 -235 -493 -134 -229 -236 -79 59 -157 59 -110 -2 298 87 238 -45 249 230 44 185 389
6492 389 -177 271 -14 -46 177 37 -93 -109 203 -239 -266 -131 -66 -188 -447 -160 -339 126 110 -224 101 133
6514 133 133 559 325 -194 80 76 102 262 60 -77 -15 -119 265 -167 -48 -347 -258 -272 -116 -500 -265 -312 -199
6537 -199 134 -2 -61 262 114 233 106 -136 213 153 43 227 274 63 -26 -95 -59 -221 -466 -137 -169 -307
$$ packed form
6381B26J96l17jj38Q1r8R8l22K48o6m13L86j24J51R1j47j09N06k64j1K18j20J90
6404B61l04J17L18k95o9L29k52j99J20j63M8J0l04J26j2j65M50m70M22j01J35
6425Bk4K23o3q0k61N21k12j80O24l29m0K08m48K7J93l19r2n8J24K89l49j07K56
6448i5q0m4J12k76K23L74j04J31k46l03O10k46J37Q5k18J07j08k5O6o7j13J76
6470I6j79p7p5k58L59r5pJ57J38k16K16j69J08L00k11J51k83K94j9j86J41K04
6492C89n66M48k85l2K23j40j30j6L12m42k7J35O5j22k59K87j79M65j6l34L25L2
6514A33%M26k34n19K74mK6J60k02j37O2j04L84m32J19k99Q9j4J56l84K35m7J13
6537a99L33j36n9L23j48J19j27k42L49o0j10J84M7k11q9o9L6j62k45L29l2j38
$$ plain form
6559 -307 -76 -322 -234 -17 -245 -27 233 18 232 346 146 282 161 -28 84 48 122 10 -3 38 -325 -312
6581 -312 -345 -217 140 -68 -221 183 -128 97 266 270 -117 230 83 -280 -93 140 41 245 -284 -35 -21 -8
6603 -8 218 61 2 88 -41 -7 -337 -120 -278 -182 -173 -72 -313 -141 -123 138 -110 -40 174 298 296 -50 296 147
6627 147 279 298 132 68 125 -191 212 -376 -3 64 -249 -203 -231 -99 -51 -285 -27 80 -177 -144 -64 -33 141
6650 141 -5 366 258 302 61 415 -180 -159 77 11 -204 -21 74 105 -25 -453 -317 -403 -119 -343 -175 -38
6672 -38 -246 -74 344 39 377 405 -100 393 359 58 167 328 -236 -131 6 -23 -51 -335 -109 -261 -353 207
6694 207 -35 -37 102 110 -75 -150 61 26 117 -233 152 89 -100 62 -54 -71 24 -102 -73 100 92 174 81 -39 -65
6719 -65 -419 -359 18 -378 -224 -319 -261 13 -110 -111 62 205 219 124 13 236 147 189 -93 -17 87 81 -128 229
$$ packed form
6559c07K31k46Q8K17k28K18K60k15K14J14k00J36j21j89J12l6P4j12j3M1l63J3
6581c12l3J28L57k08j53M04l11K25J69Ml87L47j47l63J87K33r9K04n29K49J4J3
6603hK26j57n9Q6j29L4l30K17j58R6RJ01k41J72J8K61k48P0K14J24kl46L46j49
6627A47J32J9j66o4N7l16M03n88L73O7l13M6k8J32M8k34K58J07k57L3Q0L1J74
6650A41j46L71j08M4k41L54n95K1K36o6k15J83R5L1j30m28J36q6K84k24J68J37
6672c8k08J72M18l05L38K8n05M93l4l01J09J61n64J05J37k9k8k84K26j52r2N60
6694B07k42kJ39Qj85p5K11l5R1l50L85o3j89J62j16j7R5j26K9J73qQ2r3j20k6
6719f5l54O0L77l96J54r5N8K74j23jJ73J43J4r5j11K23q9M2k82P6J04ok09L57
$$ plain form
6743 229 245 -83 -46 -24 -225 -243 -498 -77 -44 -402 56 -45 58 6 -174 218 289 44 281 451 331 240 204
6766 204 111 411 29 -239 -18 -219 -45 -92 -385 -227 -368 -25 -121 -205 -131 154 107 -37 1 225 375 240
6788 240 323 74 1 293 225 144 -71 22 21 -56 -46 -177 -402 -82 -219 -171 -366 -79 -302 -349 76 99 14 80 76
6813 76 210 239 49 144 89 80 66 53 -3 -14 39 -263 133 -152 -220 -199 -135 -161 -256 -353 -163 -182 -17 -108 -229 414
6839 414 101 110 108 123 177 266 -86 84 10 98 344 -263 57 35 -89 -90 -48 -261 152 -63 -403 -56 -102 -3 105
6864 105 225 82 134 57 175 52 208 482 450 -64 119 88 41 -87 -256 -30 -104 -70 -146 -115 -19 -116 -290 -346
6888 -346 -247 -340 -61 110 -92 55 -184 -60 -25 50 100 361 17 242 238 234 163 223 -63 102 -231 38 -257 -186
6912 -186 -238 -386 -106 -309 -304 -261 159 -138 453 207 199 151 14 221 142 -95 396 72 -85 57 96 -184 33
$$ packed form
6743B29J6l28L7K2k01j8k55M21L3l58M58j01J03n2j80L92P1k45K37J70j20r1l6
6766B04r3L00l82k68K21k01J74m7k93J58j41L43r6q4P4K85m7j44L8K24J50j35
6788B40Q3k49p3K92o8q1k15R3jp7J0j31k25L20j37M8j95K87k23m7M25K3q5O6m
6813G6J34K9j90R5n5rj4j3n6j1N3l02L96k85o8K1O4k6r5r7J90j9J65r1j21O43
6839D14l13RkJ5N4Q9l52J70p4Q8K46o07L20k2j24jM2k13M13k15l40L47m6R9J08
6864A05J20j43N2p7J18j23J56K74l2n14J83l1m7j28j69K26p4L4p6L1R6r7j74n6
6888c46R9r3K79J71k02J47k39J24L5P5N0K61l44K25mmp1O0k86J65l33K69k95P1
6912a86n2j48K80k03NM3M20k97N91k46qm8j37K07p9k37M91l24j57J42L9k80K17
$$ plain form
6935 33 -93 -20 -87 -290 28 -328 -137 -209 -301 48 23 18 266 392 307 303 46 237 78 -89 87 39 36 178 62
6960 62 73 5 -267 150 26 -19 -162 111 -266 -27 -245 -222 -75 -153 -172 -186 -77 118 58 -5 57 271 243 255
6984 255 138 43 215 225 63 3 -442 -105 -216 -103 -141 -49 -137 -92 -350 -161 -288 -148 88 139 -12 97 106
7007 106 63 229 210 326 149 322 246 75 2 207 -146 -98 -38 -346 -44 -260 -241 -252 -333 -307 -143 -126 -148 251
7031 251 -140 270 309 233 50 77 303 447 329 190 205 -34 249 229 -241 -150 -144 -340 -228 -223 -582 -168 -309
7054 -309 18 80 -227 349 297 158 583 176 339 341 353 47 36 31 258 -28 258 -273 -328 -201 -370 -264 -70
7077 -70 -141 -118 -5 -480 280 -34 -14 65 -106 -33 152 257 134 -114 46 13 565 32 -148 -67 -5 103 -245
7100 -245 -267 137 -268 -441 -415 -53 -97 40 -154 54 -65 57 67 169 -27 107 -59 345 354 108 349 -6
$$ packed form
6935C3j26P3o7k03L18l56J91p2r2L49k5nK48J26q5mk57J91j59j67J76m8lJ42j16
6960F2J1o8k72M17j24m5j43K73l77K39k18K3J47p8j9j4J09J95o0o3O2K14k8J2
6984B55j17r5J72J0j62o0m45L37j11J13l8R2q8M5k58J89j27J40K36N1j51J09R
7007A06m3J66j9J16j77J73p6j71p3K05l53M8O0l08L02k16J9j1q1K6J64J7k2L99
7031B51l91M10L9p6j83K7K26J44j18j39J5k39K83k0m70R1Oj96J12Nl59M14j41
7054c09L27O2l07N76n2j39M25m07J63KJ2l06j1nK27k86K86n31n5J27j69J06J94
7077g0p1K3J13m75P60l14K0P9j71P3J85J05j23k48J60l3N52n33j80Q1O2J08l48
7100b45k2M04m05j73K6L62m4J37j94K08j19J22J0J02j96J34j66M04Rk46K41l55
$$ plain form
7122 -6 54 206 -169 194 -339 -276 -12 -288 -350 -245 -342 -354 265 -16 -3 -47 157 27 -189 82 201 -60 110
7145 110 111 168 265 29 -71 178 23 -125 175 -99 66 -82 -132 -287 -23 -294 -239 -319 -128 52 116 251 114
7168 114 38 307 -57 237 384 265 114 99 -42 49 248 78 106 -298 -117 -64 -167 -125 -238 -119 -217 -80
7190 -80 -202 165 -81 -151 -9 19 224 4 6 116 175 54 417 98 469 176 101 54 67 -307 -94 -203 -110
7213 -110 102 -144 62 -243 -153 113 25 -502 -17 16 -35 414 361 -60 97 159 341 71 143 183 167 220 4
7236 4 72 -210 35 -173 -163 -36 -122 -268 -116 -145 -14 -176 -25 196 6 -25 435 352 364 245 118 117 -128 215
7260 215 135 -101 179 -154 -288 -308 -15 -204 -222 -456 -57 -46 -81 127 -69 234 135 -116 60 95 249 138
7282 138 202 158 41 161 62 -17 -81 -18 -153 -171 -166 -97 -22 -101 -162 -404 -117 88 135 439 -53 233 -9 118 355
$$ packed form
7122fO0J52l75L63n33O3K64k76o2J05r7j2O19k81J3m4K04j30k16K71J19k61J70
7145A10JN7R7k36j00K49j55j48L00k74J65j48n0j55K64k71N5q0J91J80O4J35j37
7168A14p6K69l64K94J47j19j51j5j41R1J99j70K8m04J81N3j03M2j13J19r8J37
7190h0j22L67k46p0J42K8K05k20KJ10N9j21L63l19L71k93p5m7J3l74K13j09R3
7213a10K12k46K06l05R0K66q8n27M85L3n1M49n3m21J57O2J82k70P2M0j6N3k16
7236DO8k82K45k08J0J27q6j46J52k9J31j62J51K21j90l1M60q3J2j19j27jk45L43
7260B15q0k36K80l33j34k0K93j89j8k34L99J1l5K08j96L03r9k51J76L5J54j11
7282A38O4m4j17J20r9p9o4O3j35j8NO9P5p9o1k42K87K05M7L04m92K86k42J27K37
$$ plain form
7307 355 30 264 353 201 15 -77 153 102 -31 -108 -78 -193 -120 -345 -73 -22 -325 -240 -226 -332 -75 123 -184
7330 -184 -59 -33 19 -98 -70 339 141 301 -74 176 361 237 229 376 442 -279 44 70 -183 -20 -242 -549
7352 -549 -426 -293 -35 20 -68 -51 148 376 112 206 61 364 -167 199 -6 -54 316 119 97 -58 53 -168
7374 -168 -21 -78 -305 60 -383 -474 -167 -347 -81 -263 25 -48 -34 -109 136 192 90 198 260 363 128 174 274
7397 274 26 -66 5 -70 -79 -48 -72 -73 -414 -282 -142 -215 -354 -318 -64 174 55 -83 225 236 48 68 93 368 306
7422 306 47 164 1 -164 -56 -11 -100 -76 -270 -56 -5 41 -256 -123 89 -155 -160 2 -166 67 0 -142 -38
7445 -38 2 96 82 227 -96 65 413 197 -14 69 -110 -20 -121 -71 -32 -283 -265 39 -94 -205 -200 -205 86 83 173
7470 173 436 -24 75 238 239 53 -60 52 232 -22 277 230 91 86 -190 64 -81 -119 -261 -100 -325 -240 14
$$ packed form
7307C55l25K34Q9j52j86r2K30n1j33p7L0j15P3k25K72N1l03Q5J4j06K57J98l07
7330a84J25K6N2j17K8M09j98J60l75K50J85j24qJ47O6p21L23K6k53J63k22l07
7352e49J23J33K58N5q8J7J99K28k64R4j45L03n31L66k05m8L70j97k2j55J11k21
7374a68J47n7k27L65m43r1L07j80K66j82K88p3J4p5K45N6j02J08O2J03k35M6J00
7397B74k48r2P1p5rL1k4jl41J32J40p3j39L6K54K38j19j38L08J1j88K0K5K75o2
7422C06k59J17j63j65J08M5q9K4j94K14N1M6k97J33K12k44nJ62j68K33o7j42J04
7445c8M0R4j4J45l23J61L48k16k11Q3j79R0j01N0L9k51J8L04j33j11NnK91lR0
7470A73K63m60R9J63Jj86j13J12J80k54K99m7j39nk76K54j45l8j42J61k25Q5K54
$$ plain form
7493 14 37 -82 141 -138 200 340 66 -36 36 259 351 407 188 107 86 108 -138 43 -102 -475 -153 -49 -448
7516 -448 -61 -109 138 50 -120 -43 -121 -52 -33 180 9 162 218 434 150 11 236 374 208 259 306 -211 -73
7539 -73 -109 -71 -138 -115 83 54 -5 -150 -56 -244 91 96 64 -17 11 110 414 82 64 -25 26 51 98 -98 196 -113
7565 -113 -146 -102 -59 -105 -93 -302 -336 -413 -114 -26 -129 114 -38 293 7 -17 -37 101 134 204 396 304 -62 109
7589 109 -53 25 45 -69 -79 -50 -270 -118 -252 -295 -431 -261 -9 -193 83 118 -65 144 174 109 280 264 249
7612 249 315 221 137 217 238 84 54 111 -111 -200 -214 -147 -308 -120 130 -67 -137 -110 -213 -40 131 103 53 136 45
7637 45 505 -74 79 213 348 204 38 -2 -72 -211 -498 -106 -110 72 -156 -87 -312 55 8 -102 -158 -57 201
7660 201 24 26 -185 -24 58 252 392 511 94 276 11 32 -76 82 -130 218 -93 -299 -190 -142 8 -180
$$ packed form
7493A4K3j19K23k79L38J40k74j02P2K23R2N6k19q1k1K2k46J81j45l73L22J04l99
7516d48L87m8K47q8j70P7p8O9J9K13j71J53N6K16k84j39K25J38j66N1M7n17J38
7539g3l6L8o7K3J98k9n9j45R4j88L35Nl2q1K8R9L04l32j8q9N1K5M7j96K94l09
7565a13l3M4M3m6J2k09l4p7K99Q8j03K43j52L31k86k4k0J38L3P0J92r2l66J71
7589A09j62P8K0j14j0K9k20J52j34m3j36J70K52j84K76L5j83K09L0o5J71j6j5
7612B49O6r4q4Q0K1j54l0N7k22q9j4O7j61J88K50j97p0K7j03J73J71k8n0Q3r1
7637D5M60n79J53J34J35j44j66m0p0j39k87L92mJ82k28O9k25L67m7j10n6J01K58
7660B01j77Kk11J61Q2J94J40J19m17J82k65K1j08J58k12L48l11k06J09M8J50j88
$$ plain form
7682 -180 -56 -247 -100 -372 -18 -84 164 88 -23 266 102 181 182 92 120 101 224 63 -81 -160 170 -249 -255 -165
7706 -165 -308 -117 -160 -86 -4 29 -206 -160 189 -8 23 359 -84 234 142 163 338 330 -40 216 43 -93 -59 -319
7730 -319 -313 -153 -184 -352 -173 -71 -487 -267 -43 -212 -220 137 69 -22 150 289 292 148 309 150 180 205 64 -94
7754 -94 15 -23 -118 -119 -298 -236 -264 -511 -55 -44 -118 -8 -108 -98 54 -33 -155 127 -133 180 338 58 236 196
7778 196 -32 -45 -152 -19 17 10 1 -44 -243 -123 -215 -207 -194 -434 -32 -116 95 29 79 83 42 121 377 438 8 215
7804 215 140 70 -18 7 25 166 -339 42 12 -229 -235 -253 -367 -147 -244 -181 -19 -155 -113 18 217 3 180 272
7828 272 401 140 -129 217 -33 -38 124 -81 -72 53 -218 -151 40 189 -181 -211 -383 -262 -167 -108 105 -2 -55
7851 -55 189 -10 234 303 191 210 467 368 431 -242 13 -38 -10 -149 -125 76 -329 -262 -162 -135 -63 -20 -386 -104
$$ packed form
7682a80J24j91J47k72L54o6K48p6j11K89j64P9Jr0K8j9J23j61j44p9L30m19oR0
7706a65j43J91m3P4Q2L3k35M6L49j97L1L36m43L18r2K1J75ql70K56j73j36L4k60
7730c19OJ60l1j68J79J02m16K20K24j69qL57o8r1J72J39Lj44J61j59L0K5j41j58
7754i4J09l8r5jj79O2k8k47M56J1p4J10j00J0J52q7j22K82k60L13J58k80J78m0
7778A96k28j3j07J33L6prm5j99J20r2QJ3k40M02q4K11o6N0Mm1P9K56O1m30K07
7804B15p5p0q8K5J8J41n05L81l0k41oj8j14K20r7O3J62j36M2J31J99k14J77R2
7828B72J29k61k69L46k50nJ62k05RJ25k71O7J91J49l70l0j72J21R5N9K13j07n3
7851e5K44j99K44O9j12J9K57r9O3o73K55n1K8j39K4K01m05O7J00K7P2M3l66K82
$$ plain form
7875 -104 -249 -97 36 -16 -228 112 26 66 31 210 152 310 -87 -129 140 -93 -78 -48 -173 -20 -181 -189 -171 -104
7899 -104 -132 -225 -146 99 7 -137 45 29 221 68 41 171 150 -52 212 157 275 -143 -84 193 -59 32 127 -137
7923 -137 -229 13 -206 126 -176 -36 33 -195 54 -11 -184 11 261 52 -47 132 274 195 137 314 202 110
7945 110 366 96 -100 -172 -196 122 95 -29 -156 -55 -292 -135 -341 -206 -232 -68 -225 -25 327 -113 77
7966 77 277 143 223 41 393 176 -158 92 22 -41 -55 -108 177 -297 -38 -301 -244 -56 -143 -43 -418 143 -62
7989 -62 131 -20 -39 207 198 235 149 256 175 175 9 134 75 -83 -252 -415 -189 -369 -195 -244 174 -217 -207 -26
8013 -26 -103 194 85 133 285 112 235 171 136 270 235 109 127 -142 -191 78 -70 -49 -84 -304 -291 -159 48 -61
8037 -61 -345 -266 -359 -392 -69 43 -30 62 183 28 173 263 34 55 -52 -7 284 241 313 100 -29 -16 -396 -173
$$ packed form
7875a04j45J52J33n2k12L40q6M0l5J79n8J58l97m2K69k33J5L0j25J53j61qJ8O7
7899a04k8r3P9K45r2j44J82j6J92j53k7J30k1k02K64n5J18m18N9K77k52R1R5k64
7923a37r2K42k19L32l02J40O9k28K49o5j73J95K50k09r9J79J42p9n8J77j12r2
7945A10K56k70j96p2k4L18k7j24j27J01k37J57k06J35k6J64j57K00L52m40J90
7966G7K00j34Q0j82L52k17l34K50p0o3j4n3K85m74K59k63N7J88q7J00l75N61k05
7989f2J93j51j9K46rL7q6J07q1%j66J25n9j58j69j63K26j80J74m9M18l91J0J81
8013b6p7K97j09M8J52j73J23o4l5J34l5j26J8k69m9K69j48K1l5k20J3J32K07j09
8037f1k84P9r3l3L23J12p3R2J21j55J45R0k29K1j07M5K91m3P2k13j29J3l80K23
$$ plain form
8061 -173 -105 -266 46 240 -323 -51 0 66 24 2 326 302 342 224 286 86 384 300 382 333 -67 166 91 56
8085 56 74 -143 -235 -132 -190 -311 -99 -407 19 -38 -196 -63 -250 330 -28 235 76 350 237 97 358 236
8107 236 26 281 -211 -164 -208 -81 -311 -113 -215 -367 -214 -6 70 -58 34 -424 -34 66 195 146 129 352
8129 352 573 159 -216 -2 208 207 -74 147 76 20 -144 -75 4 -281 -170 -313 -76 -196 -54 200 -185 72
8151 72 149 -55 -23 40 173 53 35 -37 306 298 222 55 -254 74 -76 -81 -68 -389 -44 32 -250 -75 -44 -333 101
8176 101 243 47 -113 -95 128 99 166 277 323 155 280 209 426 178 222
$$ packed form
8061a73O8j61L12J94n63K72N1O6m2k2L24k4M0j18O2k00K98q4Q2m9m00K33p5l5
8085E6J8k17r2J03n8j21K12l08M26n7j58J33j87N80l58K63j59K74j13j40K61j22
8107B36k10K55m92M7m4J27k30J98j02j52J53K08P6j28R2m58L90J00J29m9j7K23
8129C52K21m14l75K14K10jk81K21p1n6j64O9P9k85J11j43K37j20J42K54l85K57
8151G2P7k04L2O3J33j20j8p2L43qp6j67l09L28j50nJ3l21L45P6k82J75L1k89M34
8176A01J42j96j60J8K23k9O7J11M6j68J25p1K17k48M4
8191B22
$$ Imaginary data points
##PAGE= N=2
##DATA TABLE= (X++(I..I)), XYDATA
$$ plain form
0 0 0 0 0 0 0 0 0 0 0 0 0 -8 8 -8 12 -16 16 -24 27 -32 40 -48 56 -65 79 -89 105 -121 140 -158 181 -205 234
33 234 -264 297 -335 375 -419 465 -520 578 -641 709 -786 866 -957 1055 -1162 1281 -1409
50 -1409 1553 -1711 1888 -2085 2306 -2557 2846 -3177 3570 -4035 4602 -5308 6210 -7413 9095
65 9095 -11613 15757 -23717 44194 -200101 -293360 364816 125769 129453 427043 260923 218343
77 218343 197198 140974 180164 -50847 77650 123081 -201438 21242 26286 -279717 5624
88 5624 -52286 -226828 -6497 -134831 -148366 -55110 -208712 -12141 -22030 -119781 208263
99 208263 82605 16252 312608 77503 22406 186883 -10146 26113 57028 -4789 93406
110 93406 -58901 986 80132 -219818 -37515 33760 -276756 -3638 42995 -195295 35435
$$ packed form
0@%%%%%%%%%%%qJ6j6K0k8L2m0N1n9P2q8J04j21J44j68J94k26K61k98L39l86M39
33B34m98N61o32P10p94Q84r85J098j219J350j495J652j823K012k217K443k690
50a409K962l264L599l973M391m863N403o023O747p605Q637r910J1518j3623J6508
65I095k0708K7370l9474O7911k44295r3259O58176k39047L684K97590j66120m2580
77B18343k1145n6224L9190k31011J28497M5431l24519K22680N044l06003K85341
88E624n7910j74542K20331j28334j3535R3256j53602J96571r889r7751L28044
99B08263j25658o6353K96356k35105n5097J64477j97029L6259L0915o1817R8195
110I3406j52307N9887P9146k99950J82303P1275l10516K73118M6633k38290K30730
$$ plain form
121 35435 10103 -86148 37243 -39733 45655 56802 -31229 166848 36543 -40994 178146
132 178146 -41834 -46207 151882 -52606 22529 102301 -54953 44960 -43046 -100893 27348
143 27348 -148107 -60123 72005 -127316 39470 82198 -117446 47367 5089 -101571 29804
154 29804 -41090 5795 52346 -40390 112810 29255 -62596 156070 -5204 -42671 179411
165 179411 -8071 1420 125329 -47041 -4059 -8011 -89742 -7516 -113620 -75657 5093
176 5093 -172685 -43620 335 -166134 34627 45533 -43342 149402 95814 80782 159086
187 159086 26503 84944 48035 -82252 66736 -31055 -95399 82326 -61158 -61634 62454
198 62454 -91199 -38654 -1848 -96851 -5989 -66778 -67359 27328 -107302 -3159 76900 -75184
$$ packed form
121C5435k5332r6251J23391p6976Q5388J1147q8031J98077j30305p7537K19140
132A78146k19980m373J98089k04488P5135P9772j57254R9913q8006n7847J28241
143B7348j75455Q7984J32128j99321J66786M2728j99644J64813m2278j06660J31375
154B9804p0894M6885M6551r2736J53200q3555r1851K18666j61274l7467K22082
165A79411j87482R491J23909j72370M2982l952q1731Q2226j06104L7963Q0750
176E093j77778J29065M3955j66469K00761J0906q8875J92744n3588j5032P8304
187A59086j32583N8441l6909j30287J48988r7791o4344J77725j43484m76J24088
198F2454j53653N2545L6806r5003R0862o0789n81R4687j34630J04143Q0059j52084
$$ plain form
210 -75184 94453 123036 -11377 140191 84978 -1331 82681 -18533 -3683 15482 -71352
221 -71352 40738 -20243 -78882 69030 -64954 -82160 48002 -102189 -58116 20561 -86584
232 -86584 705 -8585 -42422 59956 -32028 17996 101936 -34080 75587 102312 -35593
243 -35593 90643 48194 -40928 69395 -11385 -16727 33241 -60161 14598 -20129 -98532 31403
255 31403 -69883 -99445 44494 -80188 -49708 51980 -62357 11072 36674 -27607 61523
266 61523 7394 19769 94305 -20423 60133 90746 -47575 68938 47876 -59197 54303
277 54303 -11724 -53252 18635 -67284 -27781 -20883 -97294 8395 -47199 -84612 48909 -49850
289 -49850 -36906 75077 -34286 24335 73877 -11135 67419 38850 10948 84076 -11837 28533
$$ packed form
210g5184J69637K8583j34413J51568n5213q6309Q4012j01214J4850J9165q6834
221g1352J12090o0981n8639J47912j33984j7206J30162j50191M4073P8677j07145
232h6584Q7289r290l3837J02378r1984N0024Q3940j36016J09667K6725j37905
243c5593J26236m2449q9122J10323q0780n342M9968r3402P4759l4727p8403J29935
255C1403j01286k9562J43939j24682L0480J01688j14337P3429K5602o4281Q9130
266F1523n4129J2375P4536j14728Q0556L0613j38321J16513k1062j07073J13500
277E4303o6027m1528P1887q5919L9503O898p6411J05689n5594l7413J33521r8759
289d9850J2944J11983j09363N8621M9542q5012P8554k8569k7902P3128r5913M0370
$$ plain form
301 28533 71056 -58882 31731 29254 -86951 21107 -26300 -83708 11068 -60892 -43691 1213
313 1213 -69593 13354 -10138 -54777 66881 -15143 -19770 96755 -14470 17638 83270 -16422
325 -16422 47729 46395 -5818 65752 -2577 3072 47394 -68999 -9043 -1853 -114639 -8794
337 -8794 -28499 -91081 19993 -28052 -31037 37180 -29439 23593 27565 -28272 68439 11690
349 11690 -13348 89430 -10076 2349 77100 -23629 27487 47279 -26963 35905 -11270 -38389
361 -38389 9649 -82914 -37906 -4086 -96764 8043 11790 -63459 44073 3231 -32558 42999
373 42999 -20644 9093 41489 -14911 63843 31921 -7890 81524 -6929 -11455 67521 -37097
385 -37097 -3513 36347 -51201 2954 -15277 -56986 4521 -55183 -28752 20760 -62679 9791
$$ packed form
301B8533M2523j29938R0613k477j16205J08058m7407n7408R4776p1960J7201M4904
313A213p0806Q2947k3492m4639J21658q2024m627J16525j11225L2108O5632r9692
325a6422O4151j334n2213P1570o8329N649M4322j16393N9956P190j12786J05845
337h794j9705o2582J11074m8045k985O8217o6619N3032L972n5837R6711n6749
349A1690k5038J02778r9506J2425P4751j00729N1116J9792p4242O2868m7175k7119
361c8389M8038r2563M5008L3820r2678J04807L747p5249J07532m0842l5789P5557
373D2999o3643K9737L2396n6400P8754l1922l9811Q9414q8453m526P8976j04618
385c7097L3584L9860q7548N4155j8231m1709O1507n9704K6431M9512q3439P2470
$$ plain form
397 9791 18820 -66023 26640 424 -43824 50719 8480 20616 73505 12583 56602 37573
409 37573 -18423 52898 -14969 -31922 53187 -37993 -19711 35221 -57344 -16030 -10202 -63311
421 -63311 -335 -35891 -33239 20359 -52339 -3030 18677 -61196 28391 21495 -28272 72597
433 72597 36285 21556 81384 16946 41261 47344 -13867 48279 3836 -34197 32193 -58849
445 -58849 -67111 -16670 -110051 -65905 -25077 -71798 7169 10093 3114 62901 7264 35028 60080
458 60080 -21367 47015 45429 -23953 60092 25024 -15981 48766 -7397 -2548 24235 -34890
470 -34890 7445 -19038 -66520 -5824 -70689 -74083 3343 -59419 -9500 49993 -7815 50417
482 50417 46118 -2134 42653 -10829 -10987 30606 -31838 26058 43397 -21884 53308 24199 -27848
$$ packed form
397I791R029q4843R2663k6216m4248R4543m2239J2136N2889o0922M4019j9029
409C7573n5996P1321o7867j6953Q5109r1180J8282N4932r2565M1314N828n3109
421f3311O2976l5556K652N3598p2698M9309K1707p9873Q9587o896m9767J00869
433G2597l6312j4729N9828o4438K4315O083o1211O2146m4443l8033O6390r1042
445e8849q262N0441r3381M4146M0828m6721P8967K924o979N9787n5637K7764K5052
458F0080q1447O8382j586o9382Q4045l5068m1005O4747n6163M849K6783n9125
470c4890M2335k6483m7482O0696o4865l394P7426o2762M9919N9493n7808N8232
482E0417m299m8252M4787n3482j58M1593o2444N7896J7339o5281P5192k9109n2047
$$ plain form
495 -27848 41940 -11388 -24911 17201 -40294 -12986 -19813 -64219 -607 -42044 -46478 38220
507 38220 -24774 -397 56546 -20053 17207 28849 -25230 27498 6812 4185 54807 1148
519 1148 32307 44103 -32409 22268 1120 -54038 20897 -16171 -32169 27304 -27432 -13466
531 -13466 1203 -51351 -2877 -25052 -48663 18864 -33149 -22363 37100 -27516 16522 52784
543 52784 3791 65907 62141 35840 75634 16480 17330 26513 -54728 -11679 -19065 -84468 -14810
556 -14810 -44083 -78760 -13642 -56458 -45833 947 -31634 22303 29777 10923 76916 32156
568 32156 26419 80444 5310 25593 58938 -11423 30090 25516 -26357 13135 -29552 -42620
580 -42620 -10787 -68032 -34364 -21970 -75404 -11658 -25565 -54307 22013 -7027 668 61381
$$ packed form
495b7848O9788n3328j3523M2112n7495K7308o827m4406O3612m1437m434Q4698
507C8220o2994K4377N6943p6599L7260J1642n4079N2728k0686k627N0622n3659
519A148L1159J1796p6512N4677k1148n5158P4935l7068j5998N9473n4736J3966
531a3466J4669n2554M8474k2175k3611O7527n2013J0786N9463o4616M4038L6262
543E2784m8993O2116l766k6301L9794n9154Q50R183q1241M3049p386o5403O9658
556a4810k9273l4677O5118m2816J0625M6780l2581N3937P474j8854O5993m4760
568C2156n737N4025p5134K0283L3345p0361M1513m574n1873L9492m2687j3068
580d2620L1833n7245L3668J2394n3434O3746j3907k8742P6320k9040P695O0713
$$ plain form
592 61381 20525 49595 58088 12998 54033 12472 -11564 42071 -19912 -6774 40029 -27449
604 -27449 5209 15096 -43386 -4298 -28708 -49723 -12294 -56030 -28460 -5168 -54657 10852
616 10852 12243 -23316 54295 28806 14031 68449 14822 22528 37832 -18578 16329 735
628 735 -27032 26592 -15959 -12515 29323 -36577 -9158 8637 -49675 -1971 -8184 -36371 12984
641 12984 -19119 -11375 17142 -31949 11765 15985 -29755 36092 14664 -13286 47886 7027
653 7027 5547 40873 -3787 23315 21884 -10747 30572 -12722 -26746 14790 -49558 -32284 1046
666 1046 -55517 -11162 -1630 -36351 16160 -6720 -12879 29455 -11827 15801 33746 -10107 41589
679 41589 26481 -6716 48926 6504 -5383 35604 -15787 527 10315 -34410 2635 -22187
$$ packed form
592F1381m0856K9070Q493m5090M1035m1561k4036N3635o1983J3138M6803o7478
604b7449L2658R887n8482L9088k4410k1015L7429m3736K7570K3292m9489O5509
616A0852J391l5559P7611k5489j4775N4418n3627P706J5304n6410L4907j5594
628G35k7767N3624m2551L444M1838o5900K7419J7795n8312M7704o213k8187M9355
641A2984l2103P744K8517m9091M3714M220m5740O5847k1428k7950O1172m0859
653G027j480L5326m4660K7102j431l2631M1319m3294j4024M1536o4348J7274L3330
666A046n6563M4355R532l4721N2511k2880o159M2334m1282K7628J7945m3853N1696
679D1589j5108l3197N5642m2422j1887M0987n1391J6314R788m4725L7045k4822
$$ plain form
691 -22187 -42717 4822 -42676 -30558 12605 -41443 -3255 18344 -24731 22896 14421 -2458
703 -2458 38722 4792 19069 37631 -9073 31926 22841 -19562 32170 -1054 -23385 22615
715 22615 -24227 -17765 5781 -40238 -8395 -12603 -40543 4412 -24904 -22586 20286 -25594 4877
728 4877 30424 -15913 29591 26845 -2683 40819 10390 8960 37715 -8823 17730 19968 -26807
741 -26807 17502 -7213 -37348 11209 -29545 -32168 4471 -37062 -13131 -4535 -33249 8755
753 8755 -11119 -15457 30440 -10781 11162 43243 -5432 31909 36934 -3509 37436 15177 -2661
766 -2661 28317 -13327 -4683 5173 -38610 -3579 -16343 -44943 5184 -24734 -30995 12305 -27520
779 -27520 -10931 9059 -24315 15277 8516 -5420 40622 8500 15172 47322 -2905 21943
$$ packed form
691b2187k0530M7539m7498J2118M3163n4048L8188K1599m3075M7627q475j6879
703b458M1180l3930J4277J8562m6704M0999r085m2403N1732l3224k2331M6000
715B2615m6842O462K3546m6019L1843m208k7940M4955k9316K318M2872m5880L0471
728D877K5547m6337M5504k746k9528M3502l0429j430K8755m6538K6553K238m6775
741b6807M4309k4715l0135M8557m0754k623L6639m1533K3931Q596k8714M2004
753H755j9874m338M5897m1221K1943L2081m8675L7341N025m0443M0945k2259j7838
766b661L0978m1644Q644R856m3783L5031j2764k8600N0127k9918o261M3300l9825
779b7520J6589J9990l3374L9592o761j3936M6042l2122O672L2150n0227K4848
$$ plain form
791 21943 30886 -16124 20998 7526 -19327 13873 -19435 -16773 1324 -39854 -7754 -8979 -41445
804 -41445 6969 -16120 -30294 16781 -20282 -8743 24401 -9645 23172 28456 4869 42326
816 42326 14364 7081 35898 -11379 5773 21605 -25063 9056 2588 -30713 5614 -21753
828 -21753 -28620 1 -34657 -10589 1811 -30097 11723 -1100 -20235 26196 -4025 -1675
840 -1675 35243 -1218 19439 30101 -1640 28945 9070 -5027 28357 -11388 -2283 18441
852 18441 -30241 -4884 -5460 -44310 -5813 -20922 -32083 8456 -16294 -352 18555 -14943
864 -14943 17683 9629 -16711 26912 1598 -3380 36432 -436 13934 31363 -6860 19465
876 19465 9833 -14346 16353 -16393 -18935 4203 -39454 -16924 -4982 -40134 1559 -728 -17841
$$ packed form
791B1943Q943m7010L7122j3472k6853L3200l3308K662J8097m1178L2100j225l2466
804d1445M8414k3089j4174M7075l7063J1539L3144l4046L2817N284k3587L7457
816D2326k7962p283K8817m7277J7152J5832m6668L4119o468l3301L6327k7367
828b1753o867K8621l4658K4068J2400l1908M1820j2823j9135M6431l0221K350
840a675L6918l6461K0657J0662l1741L0585j9875j4097L3384l9745R105K0724
852A8441m8682K5357n76l8850L8497j5109j1161M0539k4750J5942J8907l3498
864a4943L2626q054k6340M3623k5314m978L9812l6868J4370J7429l8223K6325
876A9465r632k4179L0699l2746k542K3138m3657K2530J1942l5152M1693k287j7113
$$ plain form
889 -17841 22454 -727 -100 20574 -13736 11094 13779 -13230 29290 12941 -649 37490 784
902 784 1837 22749 -18017 1710 3534 -24312 5890 -14447 -21300 7034 -28871 -12382 6072
915 6072 -31094 2811 2945 -24356 14074 -5017 -10569 23745 -2704 17563 33301 5878 38194
928 38194 23453 -1571 30136 -7204 -14894 12715 -26396 -11720 -596 -31510 -4175 -16820
940 -16820 -30874 365 -27793 -16976 10218 -22687 7724 18204 -10700 27605 18422 4767
952 4767 38819 13677 17755 32530 -2342 16147 5415 -24214 7375 -17382 -27223 5830 -27229
965 -27229 -17629 638 -32576 -7230 -6658 -25334 9260 -5953 -3059 24938 -6273 14003 25463
978 25463 -8880 23842 18536 -3244 30353 9317 5291 24671 -9669 3143 2112 -28972 433
$$ packed form
889a7841M0295k3181O27K0674l4310K4830K685k7009M2520j6349j3590L8139l6706
902G84J053K0912m0766J9727J824k7846L0202k0337o853K8334l5905J6489J8454
915F072l7166L3905J34k7301L8430j9091n552L4314k6449K0267J5738k7423L2316
928C8194j4741k5024L1707l7340p690K7609l9111J4676J1124l0914K7335j2645
940a6820j4054L1239k8158J0817K7194l2905L0411J0480k8904L8305r183j3655
952D767L4052k5142M078J4775l4872J8489j0732k9629L1589k4757r841L3053l3059
965b7229R600J8267l3214K5346N72j8676L4594j5213K894K7997l1211K0276J1460
978B5463l4343L2722n306k1780L3597k1036m026J9380l4340J2812j031l1084K9405
$$ plain form
991 433 -17280 -33462 1415 -27516 -24211 3794 -24373 -1498 10792 -8307 23225 11312 3195
1004 3195 28609 -3358 6047 21998 -12543 13936 16118 -8817 22764 5011 -7330 16214
1016 16214 -14979 -9545 1639 -27285 -3677 -9436 -26442 5874 -16146 -17404 12321 -17137
1028 -17137 -1627 14726 -11302 14906 10917 -3552 25146 4549 8677 30467 -1703 18159
1040 18159 22707 -11586 12943 -1256 -23453 564 -23108 -21523 -4485 -30163 -7755 -5798
1052 -5798 -25905 7229 -5848 -12664 20685 -3112 7162 27804 -74 22853 24337 1764
1064 1764 27506 9401 340 19081 -11240 -2899 2744 -29710 -5643 -11431 -32236 -563 -16380
1077 -16380 -19961 5055 -17638 -3400 6455 -13928 14419 7339 -3084 29191 6589 8254 31996
$$ packed form
991D33j7713j6182L4877k8931L305K8005k8167K2875J2290j9099L1532j1913q117
1004C195K5414l1967R405J5951l4541K6479K182k4935L1581j7753j2341K3544
1016A6214l1193N434J1184k8924K3608n759j7006L2316k2020j258K9725k9458
1028a7137J5510J6353k6028K6208l989j4469K8698k0597M128K1790l2170J9862
1040A8159M548l4293K4529j4199k2197K4017k3672J585J7038k5678K2408J957
1052e798k0107L3134j3077o816L3349k3797J0274K0642k7878K2927J484k2573
1064A764K5742j8105r061J8741l0321Q341N643l2454K4067n788k0805L1673j5817
1077a6380l581K5016k2693J4238R855k0383K8347p080j0423L2275k2602J665K3742
$$ plain form
1090 31996 2281 14745 21101 -4829 14109 334 -12412 7819 -20739 -16603 -2217 -32043
1102 -32043 -10631 -6950 -28515 2326 -8203 -15506 14270 -6168 2353 19736 -2287 19394
1114 19394 17560 627 26928 6698 1376 24274 -5661 2078 13629 -15106 3243 -1798 -20033
1127 -20033 1678 -17997 -18764 -6 -25630 -8398 755 -22913 5772 2079 -11484 17634 2436
1140 2436 4433 22986 1582 17504 19243 -1958 22096 7687 -4427 18660 -7778 -5647 8947
1153 8947 -20713 -5272 -3703 -25991 -2822 -14061 -20195 2147 -18063 -6173 7785 -14071
1165 -14071 10526 11062 -5586 22689 8873 4291 26095 2834 11016 18768 -4882 12706 3516
1178 3516 -13018 9679 -12904 -15268 4313 -22617 -11528 -2167 -23668 -2517 -7028 -15714 8352
$$ packed form
1090C1996k9715J2464O356k5930J8938j3775j2746K0231k8558M136J4386k9826
1102c2043K1412L681k1565L0841j0529p303K9776k0438Q521J7383k2023K1681
1114A9394j834j6933K6301k0230n322K2898k9935P739J1551k8735J8349n041j8235
1127b0033K1711j9675p67J8758k5624J7232R153k3668K8685l693j3563K9118j5198
1140B436J997J8553k1404J5922J739k1201K4054j4409j2114K3087k6438K131J4594
1153H947k9660J5441J569k2288K3169j1239o134K2342k0210J1890J3958k1856
1165a4071K4597N36j6648K8275j3816m582K1804k3261Q182P752k3650J7588r190
1178C516j6534K2697k2583k364J9581k6930J1089R361k1501K1151m511q686K4066
$$ plain form
1191 8352 -7791 -696 17422 -4945 13980 18230 -2373 21673 10774 -1520 20899 -140
1203 -140 24 12993 -11148 1163 -636 -18907 2067 -12260 -17811 3223 -18739 -10039 3476
1216 3476 -18603 1673 3447 -11129 13293 2840 1480 20107 -273 11680 18624 -4260 16517
1229 16517 10543 -6052 16062 -975 -6334 8063 -15017 -6804 -4040 -23547 -3101 -11729 -20103
1242 -20103 3970 -13319 -8332 10355 -11185 5579 13139 -4053 18135 11411 3354 21475 3629
1255 3629 7766 16748 -6433 8676 6055 -13318 6076 -8629 -17334 1376 -19134 -13564 -1230
1268 -1230 -19477 -2136 -2585 -12700 9100 -4178 -3855 15986 -3864 7641 18738 -438 17410
1281 17410 14099 1172 18466 2008 36 11348 -10777 -488 581 -20106 -1285 -10211 -21135
$$ packed form
1191H352j6143P095J8118k2367J8925M250k0603K4046j0899j2294K2419k1039
1203a40J64J2969k4141J2311j799j8271K0974j4327n551K1034k1962Q700J3515
1216C476k2079K0276J774j4576K4422j0453j360J8627k0380J1953O944k2884K0777
1229A6517n974j6595K2114j7037n359J4397k3080Q213K764j9507K0446q628q374
1242b0103K4073j7289M987J8687k1540J6764P560j7192K2188o724q057J8121j7846
1255C629M137Q982k3181J5109k621j9373J9394j4705q705J8710k0510N570J2334
1268a230j8247J7341m49j0115K1800j3278L23J9841j9850J1505J1097j9176J7848
1281A7410l311j2927J7294j6458j972J1312k2125J0289J069k0687J8821q926j0924
$$ plain form
1294 -21135 415 -14726 -12589 3800 -13162 272 4292 -8556 11287 3375 -172 20363 3298
1307 3298 9742 21393 -161 13177 11913 -6432 9701 -1992 -9419 4730 -13208 -7404 -1157
1320 -1157 -20285 -3448 -6367 -18983 2439 -8506 -10185 7877 -7563 1814 10098 -3920 13565
1333 13565 10273 2796 20695 5226 5716 18102 -4061 4851 8357 -11082 3715 -2686 -13057
1346 -13057 1480 -13647 -12090 -2520 -19719 -5483 -3541 -15896 5291 -1566 -5392 14116 -88
1359 -88 4945 16850 898 13650 13105 989 16000 3135 -829 12041 -7710 -2608 4040 -15106
1373 -15106 -2435 -5508 -18014 -2084 -13079 -13433 853 -12638 -1347 5126 -7071 11034 6901
1386 6901 -1723 17245 4622 4183 17169 1277 8703 10534 -3845 9185 -336 -8019 5096
$$ packed form
1294b1135K1550j5141K137J6389j6962J3434M020j2848J9843p912l547K0535j7065
1307C298O444J1651k1554J3338j264j8345J6133j1693p427J4149j7938N804O247
1320a157j9128J6837k919j2616K1422j0945j679J8062j5440R377Q284j4018J7485
1333A3565l292p477J7899j5469M90J2386k2163Q912L506j9439J4797o401j0371
1346a3057J4537j5127J557R570j7199J4236J942j2355K1187o857l826J9508j4204
1359h8N033J1905j5952J2752n45j2116J5011j2865l964J2870j9751N102O648j9146
1373a5106J2671l073j2506J5930j0995l54J4286j3491J1291O473j2197J8105m133
1386F901q624J8968j2623m39J2986j5892P426J831j4379J3030r521p683J3115
$$ plain form
1399 5096 -11213 -8612 430 -17776 -5830 -3884 -17056 292 -5196 -8616 7123 -4034 2187
1412 2187 10915 -3049 11393 9970 -561 16709 6220 2559 15915 -872 3087 7261 -9576
1425 -9576 718 -4351 -14379 -507 -12544 -12330 387 -15332 -5377 1414 -11694 3889 2257
1438 2257 -3825 11542 1834 4459 14472 256 10071 12253 -865 13354 4802 -2749 9803
1451 9803 -5440 -5654 2378 -13464 -5295 -4526 -15002 -1511 -9106 -11228 2165 -10082 -2778 6021
1465 6021 -6755 6901 7792 -1030 14232 6410 4214 14991 1635 7603 10323 -4190 8066
1478 8066 2064 -8607 4442 -7392 -10984 -691 -14386 -7837 -3692 -15092 -1492 -4978 -9737
1491 -9737 5630 -3187 557 11591 -775 9805 12807 358 13617 7641 624 11851 93
$$ packed form
1399E096j6309K601R042j8206J1946J946j3172J7348n488l420J5739j1157O221
1412B187Q728j3964J4442j423j0531J7270j0489l661J3356j6787L959M174j6837
1425i576J0294n069j0028J3872j2037K14J2717j5719R955O791j3108J5583j632
1438B257o082J5367r708K625J0013j4216R815K182j3118J4219q552p551J2552
1451I803j5243k14Q032j5842Q169P69j0476J3491p595k122J3393j2247P304Q799
1465F021j2776J3656Q91q822J5262p822k196J0777j3356N968K720j4513J2256
1478H066o002j0671J3049j1834l592J0293j3695O549M145j1400J3600l486m759
1491i737J5367q817L744J1034j2366J0580L002j2449J3259n976p017J1227j1758
$$ plain form
1504 93 973 6761 -7561 1004 -767 -12315 315 -8849 -13268 -456 -12600 -8273 -56 -10895
1518 -10895 128 1419 -4926 9314 2245 2294 14652 2015 8295 13565 100 9870 6840 -3033
1532 -3033 7809 -2513 -4718 3192 -10246 -4236 -2711 -14363 -2605 -7139 -12169 1712 -7786
1545 -7786 -5159 6316 -5200 3617 7747 -1250 10423 5762 2311 12982 2023 4569 10876 -2962
1559 -2962 4949 3870 -7928 2515 -4305 -9302 472 -10552 -6842 -2172 -12538 -1252 -1937 -9579
1573 -9579 5133 -1017 -2336 9841 -307 5228 10499 -296 9670 6572 5 10662 923 324
1587 324 7429 -5821 -612 1054 -11031 -1023 -5746 -12093 -766 -9448 -8030 1005 -8933 -418
1601 -418 2585 -4501 7990 3846 855 12750 2756 5319 12203 257 6852 6701 -2746 6219 -1710
$$ packed form
1504I3Q80N788j4322Q565j771j1548J2630r164m419J2812j2144M327Q217j0839
1518a0895J1023J291o345J4240p069M9J2358j2637O280N270j3465R770l030r873
1532c033J0842j0322k205P910j3438O010J525j1652J1758m534n030J3881r498
1545g786K627J1475j1516Q817M130q997J1673m661l451J0671j0959K546O307j3838
1559b962P911j079j1798J0443o820m997R774j1024L710M670j0366J1286o85p642
1573i579J4712o150j319J2177j0148N535N271j0795R966l098o567J0657r739n99
1587C24P105j3250N209J666j2085J0008m723o347J1327q682J418R035r938Q515
1601d18L003p086J2491m144k991J1895r994K563O884j1946O595j51r447Q965p929
$$ plain form
1616 -1710 -4980 3329 -9230 -5746 -832 -12926 -4508 -4650 -12071 -491 -5748 -5294 4780 -3803
1630 -3803 2628 8029 -711 10224 7870 2332 13271 4374 3457 10130 -1885 2439 4089 -7682
1644 -7682 806 -4125 -10055 -977 -9533 -8176 -1826 -11714 -3055 -1374 -9326 3645 136 -2710 8696
$$ packed form
1616a710l270Q309j2559L484M914j2094Q418j42p421J1580n257M54J0074q583
1630c803O431N401q740J0935k354n538J0939q897r17O673j2015M324J650j1771
1644g682Q488m931n930R078q556J357O350r888Q659J681p952J2971l509k846J1406
$$ [...]
8191B61
##END NTUPLES=NMR FID
##END=
