##TITLE=1H_Pr Bzt-2
 CDCl3, 8 sc, 
 7.04.2021
##JCAMPDX= 6.0         $$ Bruker NMR JCAMP-DX V2.0
##DATA TYPE= NMR FID
##DATA CLASS= NTUPLES
##ORIGIN= UXNMR, Bruker Analytische Messtechnik GmbH
##OWNER= root
$$ XWIN-NMR		Version 3.5
$$ Wed Apr  7 15:55:22 2021 Russian Standard Time (UT+4h)  she@DPX200
##.OBSERVE FREQUENCY= 200.131506
##.OBSERVE NUCLEUS= ^1H
##.DELAY= (6, 6)
##.ACQUISITION MODE= SIMULTANEOUS
##.ACQUISITION SCHEME= undefined
##.AVERAGES= 8
##.DIGITISER RES= 18
##SPECTROMETER/DATA SYSTEM= spect
##.PULSE SEQUENCE= zg30
##.SOLVENT NAME= CDCl3
##.SHIFT REFERENCE= (INTERNAL, CDCl3, 0, 15.7039)
##AUDIT TRAIL= $$ (NUMBER, WHEN, WHO, WHERE, WHAT)
$$ ##TITLE= Audit trail, XWIN-NMR		Version 3.5
$$ ##JCAMPDX= 5.01
$$ ##ORIGIN= Bruker BioSpin GmbH
$$ ##OWNER= she
$$ F:/spectra/data/she/nmr/H-F/1/audita.txt
$$ ##AUDIT TRAIL=  $$ (NUMBER, WHEN, WHO, WHERE, WHAT)
(   1,<2021-04-07 15:54:22.34 +0400>,<she>,<DPX200>,
      <created by zg, POWCHK disabled, PULCHK disabled
       configuration hash MD5:
       00 E9 B6 7A A2 85 ED C7 34 08 36 98 17 FE 4E 26
       data hash MD5: 16K
       00 FA 63 B3 57 2D F6 B2 85 D8 4D F6 82 13 4A 71>)
$$ ##END=
$$ 
$$ hash MD5
$$ 90 21 88 43 C2 31 FC 93 B1 52 49 99 8A DD 36 C1
##$RELAX= 
##$RELAX= 
##$RELAX= 
##$RELAX= 
##$RELAX= 
##$RELAX= 
$$ Bruker specific parameters
$$ --------------------------
##$DU= <F:/spectra>
##$EXPNO= 1
##$NAME= <H-F>
##$PROCNO= 1
##$TYPE= <nmr>
##$USER= <she>
##$AMP= (0..31)
100 100 100 100 100 100 100 100 100 100 100 100 100 100 100 100 100 100 
100 100 100 100 100 100 100 100 100 100 100 100 100 100 
##$AQSEQ= 0
##$AQ_mod= 1
##$AUNM= <au_zg>
##$AUTOPOS= <>
##$BF1= 200.13
##$BF2= 200.13
##$BF3= 200.13
##$BF4= 200.13
##$BF5= 200.13
##$BF6= 200.13
##$BF7= 200.13
##$BF8= 200.13
##$BYTORDA= 1
##$CFDGTYP= 0
##$CFRGTYP= 5
##$CHEMSTR= <none>
##$CNST= (0..31)
1 1 145 1 1 1 1 1 1 1 1 1 1 1 1 1 1 1 1 1 1 1 1 1 1 1 1 1 1 1 1 1 
##$CPDPRG= <>
##$CPDPRG1= <>
##$CPDPRG2= <>
##$CPDPRG3= <>
##$CPDPRG4= <mlev>
##$CPDPRG5= <mlev>
##$CPDPRG6= <mlev>
##$CPDPRG7= <mlev>
##$CPDPRG8= <mlev>
##$CPDPRGB= <>
##$CPDPRGT= <>
##$D= (0..31)
0 1.2 0 0 0 0 0 0 0 0.06 0 0.03 0 0 0 0 0.0002 0 0 0 0 0 0 0 0 0 0 0 0 
0 0 0 
##$DATE= 1617796461
##$DBL= (0..7)
120 120 120 120 120 120 120 120 
##$DBP= (0..7)
150 150 150 150 150 150 150 150 
##$DBP07= 0
##$DBPNAM0= <>
##$DBPNAM1= <>
##$DBPNAM2= <>
##$DBPNAM3= <>
##$DBPNAM4= <>
##$DBPNAM5= <>
##$DBPNAM6= <>
##$DBPNAM7= <>
##$DBPOAL= (0..7)
0.5 0.5 0.5 0.5 0.5 0.5 0.5 0.5 
##$DBPOFFS= (0..7)
0 0 0 0 0 0 0 0 
##$DE= 6
##$DECBNUC= <off>
##$DECIM= 32
##$DECNUC= <off>
##$DECSTAT= 4
##$DIGMOD= 1
##$DIGTYP= 9
##$DL= (0..7)
0 120 120 120 120 120 120 120 
##$DP= (0..7)
150 150 150 150 150 150 150 150 
##$DP07= 0
##$DPNAME0= <>
##$DPNAME1= <>
##$DPNAME2= <>
##$DPNAME3= <>
##$DPNAME4= <>
##$DPNAME5= <>
##$DPNAME6= <>
##$DPNAME7= <>
##$DPOAL= (0..7)
0.5 0.5 0.5 0.5 0.5 0.5 0.5 0.5 
##$DPOFFS= (0..7)
0 0 0 0 0 0 0 0 
##$DQDMODE= 0
##$DR= 18
##$DS= 0
##$DSLIST= <SSSSSSSSSSSSSSS>
$$ [...]
##$SUBNAM2= <"">
##$SUBNAM3= <"">
##$SUBNAM4= <"">
##$SUBNAM5= <"">
##$SUBNAM6= <"">
##$SUBNAM7= <"">
##$SUBNAM8= <"">
##$SUBNAM9= <"">
##$SW= 16.9725357007746
##$SWIBOX= (0..15)
0 0 2 0 0 0 0 0 0 0 0 0 0 0 0 0 
##$SW_h= 3396.73913043478
##$TD= 16384
##$TD0= 1
##$TE= 0
##$TE2= 300
##$TE3= 300
##$TEG= 300
##$TL= (0..7)
0 120 120 120 120 120 120 120 
##$TP= (0..7)
150 150 150 150 150 150 150 150 
##$TP07= 0
##$TPNAME0= <>
##$TPNAME1= <>
##$TPNAME2= <>
##$TPNAME3= <>
##$TPNAME4= <>
##$TPNAME5= <>
##$TPNAME6= <>
##$TPNAME7= <>
##$TPOAL= (0..7)
0.5 0.5 0.5 0.5 0.5 0.5 0.5 0.5 
##$TPOFFS= (0..7)
0 0 0 0 0 0 0 0 
##$TUNHIN= 0
##$TUNHOUT= 0
##$TUNXOUT= 0
##$USERA1= <user>
##$USERA2= <user>
##$USERA3= <user>
##$USERA4= <user>
##$USERA5= <user>
##$V9= 5
##$VALIST= <valist>
##$VCLIST= <CCCCCCCCCCCCCCC>
##$VD= 0
##$VDLIST= <DDDDDDDDDDDDDDD>
##$VPLIST= <PPPPPPPPPPPPPPP>
##$VTLIST= <TTTTTTTTTTTTTTT>
##$WBST= 1024
##$WBSW= 4
##$XGAIN= (0..3)
0 0 0 0 
##$XL= 0
##$YL= 0
##$YMAX_a= 728363
##$YMIN_a= -484645
##$ZGOPTNS= <>
##$ZL1= 120
##$ZL2= 120
##$ZL3= 120
##$ZL4= 120
##$ABSF1= 10
##$ABSF2= 0
##$ABSG= 5
##$ABSL= 3
##$ALPHA= 0
##$AQORDER= 0
##$ASSFAC= 0
##$ASSFACI= 0
##$ASSFACX= 0
##$ASSWID= 0
##$AUNMP= <proc_1d>
##$AZFE= 0.1
##$AZFW= 0.1
##$BCFW= 1
##$BC_mod= 2
##$BYTORDP= 1
##$COROFFS= 0
##$CY= 11.3945322036743
##$DATMOD= 1
##$DC= 2
##$DFILT= <>
##$DTYPP= 0
##$F1P= 15.9154993809931
##$F2P= -4.1035820241983
##$FCOR= 0.5
##$FTSIZE= 0
##$FT_mod= 4
##$GAMMA= 1
##$GB= 0.15
##$INTBC= 1
##$INTSCL= 1
##$ISEN= 128
##$LB= 0.24
##$LEV0= 0
##$LPBIN= 0
##$MAXI= 10000
##$MC2= 0
##$MEAN= 0
##$ME_mod= 0
##$MI= 1.114404
##$NCOEF= 0
##$NC_proc= 0
##$NLEV= 6
##$NOISF1= 3.799351
##$NOISF2= 2.8
##$NSP= 1
##$NTH_PI= 0
##$NZP= 0
##$OFFSET= 15.70392
##$PC= 1
##$PHC0= -11115.8
##$PHC1= 7.00092
##$PH_mod= 1
##$PKNL= yes
##$PPARMOD= 0
##$PSCAL= 0
##$PSIGN= 0
##$REVERSE= no
##$SF= 200.130013532006
##$SI= 16384
##$SIGF1= 3
##$SIGF2= 2
##$SINO= 400
##$SIOLD= 16384
##$SREGLST= <1H.CDCl3>
##$SSB= 0
##$STSI= 0
##$STSR= 0
##$SW_p= 3612.71676300578
##$SYMM= 0
##$S_DEV= 0
##$TDeff= 0
##$TDoff= 0
##$TI= <>
##$TILT= no
##$TM1= 0
##$TM2= 0
##$TOPLEV= 0
##$USERP1= <user>
##$USERP2= <user>
##$USERP3= <user>
##$USERP4= <user>
##$USERP5= <user>
##$WDW= 1
##$XDIM= 8192
##$YMAX_p= 0
##$YMIN_p= 0
$$ End of Bruker specific parameters
$$ ---------------------------------
##NTUPLES= NMR FID
##VAR_NAME=  TIME,          FID/REAL,        FID/IMAG
##SYMBOL=    X,             R,               I
##VAR_TYPE=  INDEPENDENT,   DEPENDENT,       DEPENDENT
##VAR_FORM=  AFFN,          ASDF,            ASDF
##VAR_DIM=   8192,          8192,            8192
##UNITS=     SECONDS,       ARBITRARY UNITS, ARBITRARY UNITS
##FACTOR=    0.0002944,     1,               1
##FIRST=     0,             0,               0
##LAST=      2.4114304,     0,               0
##MIN=       0,             -484645,         0
##MAX=       2.4114304,     728363,          0
$$ Real data points
##PAGE= N=1
##DATA TABLE= (X++(R..R)), XYDATA
$$ [...]
1760A498j879m88J699M9j831P07J421q21j448J200J060j658l90J478K54j830L24
1777f55J579o98j097Q75R22j552p2P31O19j617M55J181m85j060P18Q76r45p43
1795i68J307M4q12j10J171m04r74K98J050n16n64P09K00o78k31Q82k38k28kN25
1815D61o9n60N24pm64j23N50J39m16J77J19k33k65K21M85k90l52L26K13l43k75
1836a82K0Q16o41j78J68J84j08m02N10l6l20J8N42n25q1J30O15o48j29K57K13
1857B23l67p9N81J9r03M66L78l85l36L99O41p94l11Q34J11j105L07Q37n87n58
1877f29M02P74j051q3R14j04o84K37J115q22n05N30Q72j080n07P22M84j125j18
1896f58J483p41m97N16R83j157m13J003j30q10R8J047l58j176Q20P74r93o62J183
$$ plain form
1760 1498 -381 -869 830 879 -952 -245 1176 355 -1093 107 1167 -491 -881 597 851 -979 -655
1777 -655 924 226 -871 4 926 -626 -698 33 652 -965 -510 671 186 -874 -156 720 -225 -968
1795 -968 339 383 -429 -539 632 228 -746 -448 602 86 -478 231 431 -247 -478 404 166 -62 -64 461
1815 461 392 -168 356 349 -115 -238 312 451 35 212 331 98 -167 54 539 249 -103 223 436 93 -182
1836 -182 -162 654 13 -165 3 187 79 -323 187 151 -169 -151 391 -134 -215 -85 530 -118 -247 10 223
1857 223 -144 -223 358 377 -526 -60 318 -67 -403 -4 637 -157 -468 366 477 -628 -321 516 -71 -629
1877 -629 -227 547 -504 -587 327 223 -461 -224 891 69 -436 94 966 -114 -621 101 585 -540 -658
1896 -658 825 84 -413 103 1086 -71 -484 519 389 -421 -323 724 366 -810 10 784 -209 -871 312
1915C12L28j078l5J009k00q62M68O21o05o61J042M14j202j08R13l84j046Q98Q87
1934G11p39p44R54N55q84l71J146j78j047K94P90p94n37Q58O43j027j59R06j26
1953B51p60K38P86l57p82Q91M54j114k77J063K3j010OJ416q62p24Q99O51q25m32
1973d65J135j04r48M7J213o74o06N44L49n67J6M86j95m67J30N02l24o25P19L44
1993E10o08k07O91J33j113L18O85j31o20J0P63n44l25N07J46q21J88P96j79p05
2013e06M76L54k51n02L45J61k34M0K59P3n25L48K75l84j83L00J85n37%O28r8o19
2035c95L39J90Po39M32J33k22q0M90p8k31l4M11k61j08j12O11k34l88M96l28j01
2057a02R7Qk41J64j14Q3Q3k0o1K05J38l54K10r3L26k66j02j2j84K63O7P5l7j64
$$ plain form
1915 312 640 -438 -473 536 336 -526 -58 563 -42 -703 339 753 -449 -557 356 -28 -1074 -176 711
1934 711 -28 -772 182 737 -147 -518 628 450 -597 -303 487 -307 -844 14 657 -370 -529 377 251
1953 251 -509 -271 515 158 -624 267 721 -393 -670 393 416 -594 -588 828 -34 -758 141 792 -33 -465
1973 -465 670 566 -382 -335 878 204 -402 142 491 -76 -60 426 231 -236 -106 396 72 -553 166 510
1993 510 -98 -305 386 519 -594 -276 409 278 -342 -332 431 -113 -438 69 215 -606 -418 378 199 -506
2013 -506 -30 324 73 -429 -84 77 -157 -117 142 215 -310 38 313 -71 -254 46 231 -306 -306 322 224 -395
2035 -395 -56 134 141 -498 -66 67 -155 -235 255 177 -54 -88 323 62 -46 -158 453 219 -169 327 -1 -102
2057 -102 -5 3 -238 -74 -188 -105 -22 -42 -103 102 240 -114 96 3 329 63 -39 -51 -235 28 95 170 133 -31
2081c1J97j18j13P7K53m69j91L50J78k68j0L06p9l63K11r9K26l44L64j6j27k46
2103c12J85K89k72O8N5Kk7J02J19k00k55L58j27k72N7M20l3m23j06P85k61l49
2125a97N41j36J41n69K91L06o92J42O70m91l22O27P3m47j96L31J9m2j09K30k76
2146a06k6J9L86k56j37N22k43m33J72L62j81l09K12j03J1n9J51J44k47O8J59K37
2168C43o30M51K14m14k46M98K05o76M11J01J05o65M54J75m25l22N44K63n62J09
2188f7K13K64p22L07L33q3m71K20M74l47j44M10l2p11N35J97k82k64J82K15j94
2209C3m69R10j00o99K96M05k85j32K10P1k60l0J52J31m13Q4N92k46m92M06K71
2230D35m93o2M44k01j77J02p4J83m64M32J5k07k90L56J28k65L0O5K1k83L22K10
$$ plain form
2081 -31 166 48 -65 12 265 -204 -395 -45 133 -135 -145 161 82 -281 -70 -169 57 -287 77 61 -66 -312
2103 -312 -127 162 -110 -42 13 15 -12 90 209 9 -246 112 -15 -287 -230 190 157 -266 -372 413 152 -197
2125 -197 344 208 349 -220 71 377 -315 -173 497 6 -316 311 384 -63 -259 72 91 49 -60 170 -106
2146 -106 -132 -113 273 17 -120 402 159 -274 -102 260 79 -230 -18 -121 -110 -169 -18 126 -121 -53 106 343
2168 343 -287 164 378 -36 -282 216 421 -255 156 257 362 -303 151 326 -99 -421 123 386 -176 -67
2188 -67 146 410 -312 -5 328 245 -226 -6 468 121 -23 387 355 -356 179 376 94 -170 12 227 33
2209 33 -436 474 374 -325 -29 376 91 -41 169 240 -20 -50 102 233 -180 -96 496 250 -242 164 435
2230 435 -58 -120 324 123 -54 48 -26 157 -307 125 140 -67 -357 -1 127 -138 -108 -43 -22 -305 17 227
2252B27k20j64K42l5k09Q9J33J1k61K37K29m15J96r4L77l64j77L45o2j35NK36
2274A91R2l89J37J97l05j60K32K12k43l6K10O6k71M4J30j17m5k0J59l88L04J3
2296A3P5r7o5J38j83J00M2K02k15k32J52j6l7M7J69K29m21K75j10P6l68K21J34
2319A29k48K30j78K12j03K3Q3k28l7k17O03l47j75R2M32k74j1RJ85j03j50M31
2341C58l57k87J80J38p2J06O1n1j18j70L88J41n63K25K48n89K17J60J17j0l24
2362b02L21J28l49o5L58m09J84k1N67o02J4MK20k42o0O63m25j32ML13j92k27K62
2385A12J73m06J15J97J5o52K67P92o05l28N34O8n62l1O33ln69j41N19j32k34L90
2407A52L79n05l45M23P2l11R0K70N7n32O82k11l44l54P15k4k77O1M64n04L3PK76
$$ plain form
2252 227 7 -157 85 50 -159 -70 63 74 -187 50 279 -136 60 -34 343 -21 -198 147 85 -50 -45 191
2274 191 283 -106 31 228 -77 -237 -5 207 -36 -72 138 204 -67 -23 107 -10 -55 -75 84 -304 0 13
2296 13 88 -9 -74 64 -119 -19 23 225 10 -222 -70 -86 -123 -76 93 322 -99 176 66 142 -226 -5 129
2319 129 -119 111 -67 145 42 65 148 -80 -117 -334 269 -78 -253 -161 271 -3 -14 -5 180 77 -73 358
2341 358 1 -286 -106 32 -40 66 127 76 -42 -212 176 317 -246 -21 227 -362 -145 15 132 122 -202
2362 -202 119 247 -102 -167 191 -218 -34 -55 512 -90 -76 -72 148 -94 -154 509 84 -48 -44 269 77 -150 112
2385 112 285 -121 -6 191 206 -446 -179 613 8 -320 214 282 -280 -311 322 319 -250 -391 128 -4 -238 152
2407 152 531 26 -319 104 176 -135 -45 225 282 -250 432 221 -123 -477 238 214 -63 -2 462 -42 -9 -2 274
2430B74l51k26P41j89m54N9M96l69k76M39K47m22j96K33L52n86p7M99R1p32L33
2451a14N60l19n31N74l9l44l5M44r0o70N01K31n9k83J57L53m23k55M30jj95oJ53
2474C9j0l19L21J01m72Q7M31k44k56J11L27J7m09K76K02l19K39J70J00k09j84
2495aJ32jk20o9J94P6l39L4M92l91L20j78j81j01K39q7n7K7J40J03j68j5L60k21
2519H8o1k45M17j30m4KJ05r4k64M87k64m5j68K54K25m33J24O51q19q8L45K55n38
2542b40J02K16M0k39M5J94j81j13M5K09j59j22N81m06j98K98J14j70o6j54mL74
2564A66l00J86L57l85k8%M4k18Q9K35o1j77J09K36k12k37L67o4j48j18K95J7j87
2587c4rK32k16r5Q8M61l43j62K92l51j95K71Q4J80n36L53K29k94j16J22K21k90
$$ plain form
2430 274 -77 -303 438 249 -205 -146 350 -19 -295 144 391 -31 -227 6 358 -228 -305 194 285 -447 -114
2451 -114 446 127 -404 170 131 -213 -248 196 106 -564 -63 168 109 -174 -17 336 -87 -342 88 87 -108 -114 39
2474 39 29 -290 31 132 -340 -253 178 -66 -322 -211 116 133 -276 0 202 -117 122 292 392 183 -1
2495 -1 131 130 -90 -159 35 111 -228 -194 298 -93 227 49 -132 -233 6 -81 -138 -111 29 132 -36 -51 309 88
2519 88 27 -218 199 69 25 27 132 38 -226 261 -3 -48 -216 38 263 -170 -46 605 -214 -302 43 298 -240
2542 -240 -138 78 118 -121 -76 118 -63 -176 -131 78 -81 -203 378 -28 -226 72 186 16 -50 -204 -208 166
2564 166 -134 52 409 24 -4 -4 40 -178 -89 146 85 -92 17 253 41 -196 171 107 -41 -159 136 153 -34
2587 -34 -43 189 -27 -122 -34 427 84 -78 214 -137 -332 -61 23 203 -333 20 249 -45 -161 -39 182 -108
2609a08q5L71j94k21L29L0l42k8K51J39m40K16M01j15l88K78K82m32p0J62M9k38
2631a53n0M07O5m84K6K11r8J10k2K42m54L1L51j89l65K35L90k54r6O7M10n08j61
2654b89M25K1j32k63O05l37m33L31P6k13R0Q5M3l04J78K35J1k65J97J27m47J06
2676a53K05k19J61j0j06R8l94L35L18j39m05L18L1l61J84M31m44L1J65n6K03m29
2698b36K15P2j01M1N2Mk04J41L49l4m73L58L6m32j1J82L30k96R6m9J66m11J14
2721i1J31n8j32K63M2p7m92M60N0j64oP4n8k4N4J51l17J24L52k4k10j06N43k88
2745A97j66K36J42l29m8K9J09n04J15L43j57l36L43J7n5j58J95p0J76j66N1p4
2767a10q2J91J63L5n71K41M43l65j38L16o6k08J15J21n6j52K44K99p04J85j5K83
$$ plain form
2609 -108 -193 178 -16 -237 92 122 -220 -248 3 142 -298 -82 319 204 -184 94 376 -56 -126 36 85 -153
2631 -153 -203 204 269 -215 -189 22 -76 34 12 254 -200 -169 182 -7 -372 -137 253 -1 -97 -30 380 -128 -289
2654 -289 136 157 25 -238 367 30 -403 -72 4 -209 -119 -34 9 -295 -117 118 129 -136 61 188 -259 -153
2676 -153 52 -167 -6 -16 -122 -24 -418 -83 235 96 -309 9 40 -321 -137 294 -150 -119 46 -10 193 -236
2698 -236 -21 51 -50 -9 43 47 -157 -16 333 299 -174 184 220 -212 -223 -41 289 -7 89 40 206 -205 -91
2721 -91 40 -18 -150 113 155 78 -414 46 96 -68 -74 0 -58 -82 -28 123 -194 -70 282 258 48 -58 485 197
2745 197 31 267 409 80 32 61 170 -334 -219 124 -33 -369 -26 -9 -64 -222 -27 -97 79 -87 -36 -110
2767 -110 -192 -1 162 197 -374 -133 310 -55 -193 123 57 -151 -36 85 29 -123 121 420 -284 -99 -114 169
2789A69m11J53L50j55l80J73K13k89J45Q1R2n02K85J29J9k48J18J60n3L2j46J94
2811A29l39q5M27N4m06J75M76l99p8N4P1R6l20J35K39j90o3J65M8l51L4J85j21
2834f4j47M11M5j59j86L20j77m2J94L6k51J06k51M3o8L04q3l8n3R2Qj88j67L43
2858B8J99o09L88K65j5m70K42K65l61Q7k0j28O9J18k23n0L4J89J94j09k17L2j24
2881b16Q1K79q6j4q8J49P0j86l8k37L14J19j70N4OJ9q8J55k42j72L24l8j80K11
2905B6M4J49m22L8j01L06O1q9j12N41n49J69K77l88Pj33K13o6p2K19o9l8K5j99
2929a63K7K1p8K16M6m9j12P8M1k17O7K38j01m0rj7j57Q7K54J52l79L75k2m63K11
2954Fj48m1J11O5L52j84j87K67j49k76L20k4l1m4R7q2J98j73L1j2l46J79Q4q6
$$ plain form
2789 169 -242 -89 261 106 -274 -101 112 -177 -32 49 141 -361 -76 53 72 -176 -58 102 49 81 -65 129
2811 129 -210 -295 132 186 -220 -45 431 32 -46 8 79 175 -145 -10 229 39 -24 141 189 -162 -128 57 -64
2834 -64 -211 200 245 86 -100 220 43 1 195 231 -20 86 -165 -122 -190 114 31 -7 -60 32 40 -148 -315 28
2858 28 227 -382 6 271 256 -214 28 293 -68 19 -1 -129 -60 58 -165 -215 -181 8 202 93 -124 -92 -216
2881 -216 -135 144 58 44 -44 105 175 -11 -49 -286 28 147 -23 31 37 56 -32 123 -119 -291 33 -5 -185 26
2905 26 70 219 -203 -165 -266 40 101 12 -100 441 -108 61 338 -50 -43 -176 37 -29 -101 118 49 11 36 -163
2929 -163 -136 -115 -193 23 69 20 -92 -14 27 -190 -123 115 14 -26 -35 -52 -209 -122 132 284 -95 280 258 -205 6
2954 6 -142 -183 -72 -7 345 161 -26 241 92 -184 136 112 81 37 134 52 250 77 108 96 -250 -71 13 -73
2978g3M0R1L4r6j68J92j7N7n32M27p2J5j65J06K36m26L42j66k3N2J18J32j74n9
3002a29L35j67j56M6k29M51m80N53J32m88K59j92k1m5JL09j02k55M05p4k88L09
3024A74m03J92j51N00m37O2qL17k39r9j45K78M4j48j0l0J34k7r9j73J72n2Pj6
3048a57L51j8j81j30k7J87L06l24J8J98k10J8N0J73m30r7K76k29O5L49l47K71
3070A12k54R2O2J94l97J62k1k74J79Q8J54j31q9J65l5l77J68P8LP6R2J2R0m3k17
3095a11J1K7p8M11l78M7L03m5m33J74L3J04M5o8oJ39l26J67N4j44L0q4J48O8O4
3120A52l05K85j37K44l54J15o4j57O2J88J97j58j98L38k78K7j15L24l74J80j93
3141b21K61j14K42m6K7q7k0o5J9o7Q2N3J7k43K31j48j75J80O4m7J47J36l28j10
$$ plain form
2978 -73 -33 58 92 -4 -172 20 3 60 -472 -45 -117 -102 -267 -161 75 -351 -9 -175 -198 -146 -28 104 -70 -129
3002 -129 206 39 -117 -71 -300 151 -329 224 356 -132 127 -65 -86 -131 -130 179 77 -178 227 153 -135 174
3024 174 -229 -37 -188 312 -125 -63 -71 246 7 -92 -237 41 85 -63 -73 -103 31 4 -95 -268 -96 -148 -141 -157
3048 -157 194 176 -5 -135 -162 25 331 7 25 223 13 31 81 254 -176 -273 3 -226 -161 188 -159 112
3070 112 -142 -50 12 206 -191 -29 -50 -324 -145 -57 97 -34 -123 42 7 -370 -202 -124 -121 -45 47 59 149 106 -111
3095 -111 -100 -73 -151 260 -118 -71 232 187 -246 -72 -39 65 110 42 36 175 -151 16 70 -74 -44 -128 20 88 152
3120 152 -153 132 -5 239 -115 0 -64 -221 -159 29 226 68 -130 208 -70 -43 -158 166 -208 -28 -221
3141 -221 40 -74 168 122 149 62 42 -23 -4 -71 11 64 81 -162 69 -79 -254 -74 -10 -57 90 226 -102 -212
3165b12J57P6j28OK05k03J85J05j03j20n8N4M2L4Q6j56L9n1j43J39rJ55j15j28
3189a43R6N0K81l00j33K78j31N5MM8j10j08K18j95k3P5K19p0j3k74J47p6oK13
3213A02q3N0j32j9K03o4j0P1K5Lk33o7O9R0J86p8l17Q3j01L12j17R5J43k31l2
3238e2J9Mj15o8o1J38j75K97R2k03p7P1J22k3k7j07M10k03J22p6m3j04l7J88J60
3263B52l6j33N6l37P0K87k63K70j56Qloo1Rm8Q2P7L0j07J07o7j68J00K56j68j49
3289i8J9L32k32mj9L4Kr2O9N3p6k74L28m9K7k7K94k10q6j59J42k09L90N4k22L8
3315B5p0j12J12J11k40J87p5L21k29j36J79J49k00k52K41m3J11K5K8j20p5J47
3337H4k00J98N3oJ75j57n04K15N4M5j38J72k2K48m17L19k53K43l25R1K67M4n5
$$ plain form
3165 -212 -55 21 -107 -101 104 -99 86 191 88 -32 -90 -36 6 40 126 -30 9 -42 -185 -46 -55 100 -15 -143
3189 -143 -47 3 284 -16 -149 129 -2 53 57 105 -5 -113 105 -90 -113 -38 181 111 98 -176 -29 -105 -111 102
3213 102 19 69 -63 -82 121 57 47 118 143 146 -87 -154 -85 5 191 113 -204 -121 -222 90 -27 68 211 -20 -52
3238 -52 -33 -29 -144 -212 -273 -135 -310 -13 79 -124 -201 -130 -8 -31 -58 -165 245 42 164 88 45 -59 -96 92 252
3263 252 216 83 139 -198 -128 159 -104 166 10 18 15 9 -52 -43 -91 -9 68 98 -9 98 31 -137 -37 219 51 -98
3289 -98 -79 253 21 17 -2 32 34 -58 11 64 -12 -286 42 -7 20 -7 287 77 -9 -168 -26 -235 155 209 -13 25
3315 25 -45 -157 -45 66 -174 13 -62 259 30 -106 73 222 22 -230 11 -32 79 104 132 12 -63 84
3337 84 -116 82 135 129 304 147 -357 -142 -88 -43 -181 -9 -31 217 -200 119 -134 109 -216 -125 142 186 131
3360A31l58J60K48k89O3O2r4L1K85l51Q4oj29L93j92p7J14j41j37J03Q8q2q0J78
3384DRk53M04m4l3n1no9l4j01L10o8k62kJ68q5J17QJ34k17j11L91l81K46l08K78
3410D5m6J08K0Jj82N3j26m3KL84k09K31k15n5l8N0p6L9J5K85l24q2J57r1L1J43
3436G7k10L3K18Qk14N3N2K4L4n1j2l8J8k3P8j98K45J9p0n8M9q9mM0l6j17K70l0
3464F8R5j58j57K44j80K03j39P7L4k74j6P9K56k18j69M20j05q6J14M0O4j44j11
3487f3J29O0k38k5J42k2K09m30J61j72M11j31j54j91K18K56J1p9l03K54l3J3J
3510B4Kl7P1k83K17K5nj64j3L64k72oO1m70L21J72LJ52l34J57j23J09j76K83k75
3535a97J75O3j7o7k04L10l15J04N4JJ01o4j85J4R9J68l18K04K32l29L73j16j31
$$ plain form
3360 131 -227 -67 181 -108 -45 17 -77 -46 239 -112 -28 -34 -163 230 38 -39 75 -66 -203 -100 -12 -94 -174 4
3384 4 13 -240 164 120 87 36 31 -38 -72 -173 137 69 -193 -195 -27 -112 5 13 147 -70 -181 210 -171 75 -233 45
3410 45 -1 107 127 128 -54 -1 -127 -170 -168 216 7 238 23 -32 -70 -20 -96 -57 -42 243 -81 -163 -6 -97 -66 77
3436 77 -133 -100 118 126 -88 -35 17 41 75 24 12 -26 -8 -31 47 -151 94 113 43 -15 34 -55 -59 -19 -55 -172 98 68
3464 68 163 5 -152 92 -88 115 -24 53 87 -187 -203 -124 132 -86 -255 165 60 -26 88 128 192 48 -63
3487 -63 66 126 -112 -137 5 -17 192 -238 -77 -249 162 31 -123 -314 -96 160 171 92 -211 43 10 23 24
3510 24 26 -11 60 -223 -6 19 14 -150 -163 201 -71 -77 -16 -486 -165 7 10 162 -172 -15 -138 -29 -205 78 -197
3535 -197 -22 41 24 -43 -247 63 -252 -148 -94 -93 8 -56 -241 -227 -128 40 -278 -74 158 -171 202 86 -45
3558d5o5K33k90K94j55J29j46m6K26k01K69k0j90J24k62M28j73j34KL6m3j11L97
3581B57j70j9qp9j09j1K32k06l9J34j40K98q4R5L3k66k9N74m71k27J27J58j22
3604g2J2J41k05Q8J42J5l6p8M1j8l8k0l8Q3Pj02J36N2m4J50j85j27O7l2O5O5j61
3631i2K88m01K89k8k60k7J04J06lj7N9J34q2mp1K0l6J74k0j45k2J24l01o1L48
3656G6j82N5j06L43j04j5j18J54j48q0J23J76k22J80k34L12m79L15q2K91j42j03
3678A0M2O9k21k99M68pk47L4J48r3K81j54R6j03M7K27j69k57L90k13j13j29L98
3701B05j14k37K36Kj14J48k73J98m69K93K69n0n1j27J93k34L69l53J41j32L8J66
3723A04r9j00K42j58J83J09k04J33k37M8P4o7j68K71Qj38k7j5K44l05J93M5j17
$$ plain form
3558 -45 -110 123 -167 127 -28 101 -45 -91 135 -66 203 183 -7 117 -145 283 110 -24 -22 14 -29 -140 257
3581 257 87 68 60 -19 -128 -139 93 -113 -152 -18 -158 140 56 151 184 -82 -111 463 -8 -235 -108 50 -72
3604 -72 -60 81 -124 -36 106 121 85 7 48 30 -8 -28 -66 17 24 -78 58 110 66 216 31 -96 -29 -61 4 69 -92
3631 -92 196 -205 84 56 -204 -231 -127 -21 -24 -41 18 152 70 66 -5 15 -21 153 133 -12 -34 90 -211 -272 76
3656 76 -106 -51 -157 186 82 67 -51 103 -45 -125 -2 174 -48 132 -102 210 -269 46 -36 255 113 10
3678 10 52 121 -100 -399 69 62 -185 -151 -3 -96 185 31 127 24 71 298 129 -128 262 49 -64 -193 205
3701 205 91 -146 90 92 -22 126 -147 51 -418 -125 144 94 43 -84 109 -125 244 -109 32 -100 -62 104
3723 104 5 -95 147 -11 172 281 77 210 -27 21 95 28 -140 131 139 1 -26 -41 203 -102 91 136 19
3746A9M1j16N1Q0k48j00K68r7K39j38O8j03J6P5m35L65k15K93j26K21j88J01K
3769G3j32J27k60R1Q7N4J67k17n4j01L16j58k10K75j5J7r1jk46O2R2NL31k19L1
3794B4o2J38p7k43L34q0Kk5J41k28J90l46o1K88j21K99j68j2P3k13J12N1j45J13
3818a6MK1j12J20Ml5j02L31j68no8K4J97p8J73k84Q0o6M7q2J05l4j09l0R4n5J68
3845A24k3k95K21o0J19k22J07N7O0N6k51K92K6k13m8J14n3r6O5J13k24J03J19
3868I1k22M7N8J75M5k89J80K19l85%l8P8L54m29p6J71j47K32k21P3K13q0k8q7
3892f6J24L4j65%K28j31J02n1j83K3o4K38k8N2r4J52k8k80J09M5K60k19L2j3m48
3917c71L12J20k13K22J57K1r5j83j5O7l7k1J42J78k55n0NJ54r0j31n9M2p3J85
$$ plain form
3746 19 60 -56 -5 75 -173 -273 -5 -102 137 -1 67 -36 -20 55 -380 -15 -230 63 -63 158 -30 71 73
3769 73 -59 68 -192 -101 -14 40 207 -10 -64 -165 151 -7 -217 58 43 60 -31 -32 -278 -216 -124 -119 212 -7 24
3794 24 -38 100 23 -220 114 34 36 11 152 -76 114 -232 -293 -5 -126 173 5 -7 66 -147 -35 16 -129 -16
3818 -16 -12 9 -103 17 21 -14 -116 215 47 42 -26 -2 195 117 290 6 86 20 67 -15 90 56 -53 -83 11 -44 124
3845 124 101 -194 27 -33 86 -136 -29 28 88 144 -107 185 211 -2 -50 64 11 -85 -20 93 -131 -28 91
3868 91 -131 -84 -26 149 194 -95 85 304 -81 -81 -119 -41 313 -116 -192 -21 -168 64 -157 -84 129 49 21 -66
3892 -66 58 92 -73 -73 155 24 126 75 -108 -85 -149 89 61 113 19 171 143 -137 -28 17 277 58 90 77 -371
3917 -371 -59 61 -152 70 227 248 153 -30 -45 22 -15 -36 106 284 29 -21 -16 138 48 -83 -142 -100 -173 12
3941A2Q9k56K12j21K90l76K19k64K26n0J97m27P9K96n0l5J79k40J42j55N7m3m4
3964f3oL05m35J19M20j98J05k58J09l09R8L47R3l63j25J69R7j61J44J2k08j6N8
3987f6Q6o8K9k9j50L46j30j57M8J26J91k11r6p4J59J75j69j77K47J28m7r1J2O
4011H8J5k53Op2J53J52o0j83K25M2k99N1K17k9qqo2M5J69k08L2m30K94K82j18
4036D1l86M73n2L5j94L2J50N0p3l08K04j81M90l88J89j38J48k36M66m08J48j02
4058d0J99j36J38ok66K60k59%J72n9J44j44N5q6r4p2j9J73J32n8j94r7Q0J10J84
4083A17j09j89o4K06l2K7j2k0O2pO3r5J68j50l9J74k30K13k15N7J04q0L00l02
4107e3J70J70k76j37L70j99j92J42k3o5K03j50J63q9j93J91k87K84r0j20L30l73
$$ plain form
3941 12 101 -155 57 -64 226 -150 69 -195 31 -19 178 -249 -170 126 76 41 220 -20 122 -33 24 -19 -63
3964 -63 -69 236 -199 -80 340 142 247 -11 98 -211 -113 234 327 -36 -161 8 105 -56 88 100 -108 -124 -66
3987 -66 20 -48 -19 -48 -198 148 18 -139 -91 35 226 15 -81 -155 4 179 10 -167 80 208 161 70 82 88
4011 88 103 -150 -144 -216 -63 89 29 -154 71 113 -186 -135 82 53 45 37 -25 20 189 -19 13 -417 -123 159 41
4036 41 -345 128 76 111 -83 -51 99 149 76 -232 -28 -209 281 -107 82 -56 92 -144 322 -86 62 -40
4058 -40 159 23 161 155 -111 149 -110 -110 62 3 147 3 58 -28 -122 -194 -213 -40 92 34 -160 -257 -177 -67 117
4083 117 8 -181 -245 -39 -71 -44 -56 -76 -14 -21 42 -53 115 -35 -74 100 -130 83 -132 -75 29 -51 249 -53
4107 -53 117 287 11 -126 244 45 -147 -5 -28 -93 110 -40 123 34 -159 32 -255 29 -61 -181 149 -224
4129b24M42l00K74m1q6J4k26J37p8o6K60N1k74J1K80l42M59k81K78j85k24j29
4151b50L95j36O8P3j4j83N8N6k90K33J08j3j22J11k78K04j1K0j09L0J59o4J55
4174B00l32J61q9mK35L7k74O9O0L8k0o8p7Q7J06k69J00n9K18j69J80J02j94l0
4198HP4p7j12J28K37l61K9J54N9k07L0l5J90j59J95k28L32k92RJ24n5o1Q6K63
4222C31l13j14J10R5K3l00j05J28j95L29J4K55l16n1M1r6K01N7j47M1k74K51R5
4245F0j16m9J17j18Q6O3K03j80j04M1L9n7R4J72l84K72k20JL99l84J9M4m2j37
4269a81P8q1K76l4l18K18N5l0K5k26J77J7K29q2P4k04MP8J10k22K47k9j38j21
4293g8K31j11q1P9j60j6O8J02p0J48p4J66j72P5l2j1j96J38PN5l07l4M49k35l9
$$ plain form
4129 -224 218 -82 192 151 65 79 -147 -10 -88 -154 106 157 -117 -106 174 -168 291 10 288 103 -121 -250
4151 -250 145 9 77 150 136 -47 11 67 -223 10 118 105 -17 94 -184 20 9 29 -80 -50 109 45 200
4174 200 -132 29 -60 -64 171 208 -66 3 63 101 81 13 -64 23 129 -140 -40 -99 119 -50 130 232 38 8
4198 8 82 5 -107 21 258 -103 -74 80 139 -68 -38 -73 117 -42 153 -75 257 -35 -26 98 43 -18 68 331
4222 331 18 -96 14 109 132 -168 -273 -145 -340 -11 3 258 -58 -109 -68 -164 37 94 -53 -12 -286 -35 60
4245 60 -56 -105 12 -106 -20 43 246 66 -38 3 42 -15 79 251 -133 139 -81 -80 319 -65 -46 -2 -44 -181
4269 -181 -103 -184 92 58 -260 -42 13 -17 8 -218 -41 -24 205 123 197 -7 -3 75 185 -37 210 181 43 -78
4293 -78 153 42 -39 40 -120 -136 -68 34 -36 112 38 204 32 107 75 64 -132 6 13 68 -239 -273 176 -59 -98
4318i8K53j73n6l4L51j05k50m2L05Q2k43j68J42P2m3J16k26J25j2J45ok0l5J6
4342I6j00k10L66k34m5J25P6k46J46J25k57K94m2Rj90L69l14J60k99O7J46j25
4364h3J57r0QR1m6o2j39J21J65K9j66J66j21j27k6O8Q4K09j52k59N0K0J87j06
4388b2K18k21K79Nj40k30J35J48j24j04N1r5J45n9R1j53J54J9Rj71O1j52K41J14
4412A99l23l7j25M01j42R5j96J79n6K02j56j19J56J46m37J86j26K57k18K04L1
4433A21k29J15K0q6N2J66n8j0j50J16r1QN0k23K90j58Q7J01J19j96Q5k44K37r8
4457B4k4J4l9L7K50j70l00K12q6KJ06KQ9pk12J62k5L4o9j1m7M8j57q6p5K00J41
4484A3J05qn7p7j30J27m3k6L31j57Q0n2k85K26J7K0qo2k9M3J09n1j17j0K4o2m4
$$ plain form
4318 -98 155 -18 -74 -108 243 138 -112 -154 151 233 -10 -178 -36 36 -7 109 -117 8 -4 141 135 115 80 96
4342 96 -4 -214 152 -82 -127 -2 74 -172 -26 99 -158 136 94 103 -87 282 -32 128 -171 -104 42 -83
4364 -83 74 -16 -8 83 37 -25 -164 -43 122 151 -15 151 30 -97 -123 -55 29 238 86 -173 -123 -103 84 -22
4388 -22 196 -25 254 259 119 -111 24 172 48 -56 -5 -100 45 -14 77 -76 78 97 106 -65 -4 -156 85 199
4412 199 -124 -161 -286 115 -27 68 -128 51 -5 197 41 -78 78 224 -213 -27 -153 104 -114 90 121
4433 121 -108 7 27 -59 -7 159 101 91 -59 57 -34 -26 24 -199 91 -67 20 121 240 44 129 -115 122 24
4457 24 0 14 -25 12 262 92 -208 4 -82 -80 26 28 117 110 -102 60 35 69 0 -11 -58 -10 -167 -253 -328 -128 13
4484 13 118 110 53 -24 -154 -27 -70 -96 235 78 158 106 -179 47 64 84 76 14 -15 28 137 86 -31 -41 -17 -79 -123
4511a23J7QJ2J8p4J58m0pj38K32J35r4k26J28j93K82M6j64J0J32j30QJ82p0j24
4536a5k89L8K50J18J5j70O4o5J75j3j78J15J23j41J60r2n3J2k22j8M4K42J71o9
4560B02k32J87n2k16J51j97J57p1R1j35J89r6L58j96k73J04K6q4J35PQ2K66l01
4583A02k4j34j65N25o9k25ok64N00k33j6K50l00N9j0J78Lm55n1J12L57J8j21J7
4607D8L98m81K7j94m4K49J39N1k08K54q7p3lk46J69j8l4l8j49K67k4K19l48J15
4631a1m1J48o8O9q3j36J50N3j0j84J37k37L87j0j06r0P9J39j09r1j56Q1l5L4k3
4656a13O2P2k06K28J19l9j33k45J58Q3J2k26J89P7k3o5j50J12K07j41J54k49J75
4679E8j49q9P8k3J24l02K83L6k8O4j6q4O2L0o4K07j84K73l53p6Qo3J62p5J20J00
$$ plain form
4511 -123 -106 -98 -86 -68 -142 16 -24 -31 -169 63 198 104 -122 6 -187 95 141 -23 -13 119 -11 -3 179 109 -15
4536 -15 -304 -266 -16 102 117 -53 11 -54 121 108 -70 45 168 27 187 95 42 54 -168 -186 -142 100 271 202
4560 202 -30 157 105 -111 40 -157 0 -71 20 -115 74 -22 336 140 -133 -29 -3 -87 48 55 137 403 102
4583 102 78 -56 -221 304 235 10 4 -260 240 7 -9 241 -59 0 -10 168 171 -284 -335 -223 134 152 31 48
4607 48 446 -35 -8 -202 -246 3 142 193 -15 239 152 79 76 -170 -1 -19 -53 -91 -240 27 3 222 -126 -11
4631 -11 -52 96 28 97 14 -122 28 81 71 -113 24 -213 174 164 58 -32 47 186 77 -14 -170 -89 -124 -90 -113
4656 -113 -51 21 -185 43 162 123 -10 -255 -97 -14 -2 -228 -39 38 15 -50 -200 -88 119 -22 132 -117 58
4679 58 -91 -180 -102 -125 -1 -303 -20 16 -12 52 36 -48 14 44 -20 187 3 276 -77 -153 -145 -208 -46 -121 -1 99
4705I9k3j55j38K19j02k0M37l35K48q9k99K73k81L65l10l1L19J15l08m51M27j6
4727e6j65O2L52r0l21J08J20M8O9P5O8n0l94L63J04k05j22L5J32j36k0K6K74m95
4751b18L92l83J97j19k2J13N2j78N9J64J09j60m8J32k53L26j58k5KK7k73K72K84
4774B92m12K68M9n2n9J8j21r3K69j11p0j4pJ04k4k61K78O1nj27M8K2p1k06J11
4799a13J16q8j45J50R2k3L00j7l32k93J28P7J77J87j08O5l90L08k43N90n94J58
4821BN6K6q3j60P3k7Q0J0j57k1K70J11l46L30r5k97K96M5n4k24N2O5L84l04k00
4846a68K34k2j08J00K09j82j77p7K34j26K4M9J36k40J86K55j11l46L30k85K72
4867A87r8j53Q5L4M2j92k9J22j80K29o8p4L6j37l2J90j10m3K61j90Q8j24K31n0
$$ plain form
4705 99 76 -79 -217 2 -100 -120 317 -18 230 141 -158 115 -166 199 -111 -142 177 292 -16 -467 -40 -56
4727 -56 -221 -159 193 103 -218 -110 10 58 127 202 270 220 -174 189 293 88 -34 1 133 -3 -23 3 277 -218
4751 -218 174 -209 -12 -131 -153 -40 12 -166 -107 57 166 6 -42 90 -163 163 5 -20 -18 9 -264 8 292
4774 292 -120 148 197 145 86 104 -17 -110 159 48 -22 -36 -43 61 37 -224 54 115 110 -17 31 53 -18 -224 -113
4799 -113 3 -85 -230 -80 12 -11 289 272 -60 -353 -225 -148 29 216 108 173 -217 91 -152 438 -156 2
4821 2 58 84 1 -159 -86 -113 -33 -23 -180 -201 69 180 -166 164 69 -228 68 113 59 -165 -113 -48 336 32 -168
4846 -168 66 44 -64 36 245 63 -114 -191 43 -83 -59 -10 126 -114 72 327 216 -130 200 -85 187
4867 187 89 -64 21 55 97 -95 -124 -2 -182 47 -21 -95 -59 -196 -228 -38 -148 -191 70 -120 -32 -156 75 25
4891B5J8q2J37k25K75j11rM8j94J96j54J27Pl19p2L83K9j19N9k02N38l69r6M8
4915f2J04k75J91lK6q8Q2k1j49K36J17j8k06O9m4J04J14l68m0K78j19K39m4j59
4939c6J00J24M3m11K32M0k85J27K25j60r8M09l26m22M57rj63K93k19J92q3j1m1
4962b2p2J42j41J3R5MJ5J55j02k7r9J1J00q3Kj81k13M80k75J59N7j03Q6P0p1R8
4988I8O1k12O4J01k32J54j17m4R5j16K09J28j49j63Q8J48J43j06l37O8O5K67k61
5011d8K94l86K16O6j71J71O2j17k7j97J68n8k6M4rk64K30K38k52K18j22K13l78
5034a35K38L4m2k80m9K31l5J62j26J50j91q6J71j63K25l3l14M61j54l29K53j67
5056a79O1L36k56k9J14J61Om40K06j10L50r5j8lr5j02K11k04Q1j22JN39k15k13
$$ plain form
4891 25 43 -39 98 -127 148 37 28 76 -118 78 -76 51 58 -261 -333 50 79 -40 19 -183 355 -14 -110 -62
4915 -62 42 -233 -42 -45 -19 -107 -25 -46 -195 41 158 140 -66 3 -41 63 177 -191 -231 47 -72 167 123 -36
4939 -36 64 188 231 -180 52 92 -193 -66 159 -1 -99 310 -16 -438 19 10 -153 140 -79 113 30 19 -22
4962 -22 -94 48 -93 -80 15 19 34 189 87 60 -39 -28 72 -11 -9 -190 -403 77 -198 -39 18 -85 1 71 0 98
4988 98 159 -53 11 112 -120 34 -83 -127 -32 -148 61 189 40 -123 -35 113 256 150 -187 -119 -54 213 -48
5011 -48 246 -140 76 142 -29 142 204 87 60 -137 31 -27 -53 -9 -18 -282 -52 186 -66 152 30 243 -135
5034 -135 103 137 95 -185 -234 -3 -38 124 -2 148 -43 -129 42 -121 104 71 -243 218 64 -265 -12 -179
5056 -179 -118 218 -38 -67 47 208 214 -226 -20 -130 220 125 107 104 9 -93 118 -86 -5 -127 -126 413 198 -15
5080a5L3r7L13l22J82j62l8N0J90l90oJ38J33p9M7j44L3K81j33J68k94J55J4j48
5104i1m1QR2Nm5j7P7J19p1q4j19J00q6K1j61Q7J76RK6j84K21o4J07j92r1M3J45
5131a0q4m5K53Lmk58J00R3M3j62N9Q7j93N8Q7k17K43J0j62j11n4M3p8M04J5k79
5157a59P1K27k21J50j98K25J71l14J69k44L5O2J47jj34n6J7O6M2k3o7L57l93K07
5181A36k13j22J53J71j41k98J59J05J99k00J86j21o2j95L47k77K97j99J08l0j17
5202a14j24L24j39J62j06N6k24J54o0J07J37j12o6j99J94J89l37j03L76L5j91
5223d1j21L9r5J11N3m7j53K39j3K08k2m06M46j52j03P1r2M6k3M2j09J31K39n3
5247A95l93K09M4Q2r3q0K50j24Q8j35J10l9j96J71j34J15j48M7j18J12L05j5l96
$$ plain form
5080 -15 18 -79 234 -88 94 -68 -106 -56 134 -256 -262 -124 9 -70 -23 -167 -134 147 14 182 -112 43 57 -91
5104 -91 -132 -124 -32 -27 -72 -89 -12 107 36 -48 -167 -67 -153 -132 -293 -206 -30 -21 5 -179 42 -22 85 -107 -198 -155 -10
5131 -10 -94 -139 114 117 113 -145 -45 48 91 -71 -12 75 -118 -60 27 -190 53 63 -99 -210 -264 -221 -299 105 120 -159
5157 -159 -88 139 -82 68 -130 95 266 -48 121 -123 -88 -26 121 120 -14 -70 -53 13 55 32 -35 322 -71 136
5181 136 -77 -199 -46 125 -16 -314 -155 -50 149 -51 135 14 -48 -243 104 -173 124 -75 33 3 -114
5202 -114 -238 86 -53 109 3 59 -165 -11 -71 36 173 61 -5 -204 -10 179 -158 -261 115 150 -41
5223 -41 -162 -123 -218 -107 -54 -101 -254 -15 -28 180 158 -248 198 46 -57 14 -78 -32 -55 -13 -122 9 248 195
5247 195 -198 11 55 137 44 -36 214 90 178 43 153 114 -82 89 -45 70 -78 -31 -149 -37 268 253 -143
5270a43K84j95l9P3J71k52K23%l02L55k92K57K6m4j22j10R6J66k19M1l9J27K6
5293H8j20j72J60L6j73K82j99J52OL2k08Q4k48M92j78j48J28J5q8L4J22J39l81
5316a45K78k9L8j57k04J94k04L32j34k38M79m56K72K0k04L32j15L16n81K72m52
5337c86N04p1O0k69K64k55K18k55K42N5N7k45J08l89L44P1L7Q9l19N8j02R0K35
5360A41j34O8J94m04J3L27L7M6k35k96Q8K20r1L8l7j27K3L12l50K25l0K08m29
5383a93j08J22M07l68j8nM51j72O3j82J31J9n6l71P9J13J25l0J04K9r5M8K5j17
5407AQJ6J38j79ok22L94j83k42L58J7p7j12J28j21mL01j78J1J4lo0Q1J22j63r6
5433e7j90K52J79j70j18J26j29K05k07o4M38k17m6m5P8J46Nm8R7l99K44j19P4
$$ plain form
5270 -143 141 -54 -93 -20 151 -101 122 122 -180 175 -117 140 166 122 0 -110 -14 152 -67 -26 -65 62 88
5293 88 -32 -204 -44 -8 -181 101 -98 54 60 92 -116 -32 -280 212 34 -114 14 29 -59 -25 97 236 -145
5316 -145 133 104 142 -15 -219 -25 -229 103 -31 -269 210 -246 26 46 -158 174 59 375 -206 66 -386
5337 -386 118 47 107 -162 102 -153 65 -190 52 107 164 -81 27 -362 -18 53 90 179 -140 -82 -184 -94 141
5360 141 7 75 269 -135 -122 205 242 288 53 -243 -155 65 -26 12 -25 -152 -129 183 -167 58 28 236 -193
5383 -193 -301 -179 228 -140 -158 -163 288 116 179 -3 128 147 91 -280 -201 -88 37 7 111 140 45 93 118 1
5407 1 9 25 163 -16 -22 -244 150 -33 -275 83 100 23 -89 39 -82 -86 215 37 48 62 59 -1 80 202 39 -57
5433 -57 -247 5 184 14 -104 22 -107 98 -109 -173 265 48 2 -43 35 181 186 138 235 -164 80 -39 35
5456C5L2r1Q1k0J05N1q2l11J35J02m1J79P2k38J1J12j06k26Q5O5K47k43J71j45
5480b0j52K14J74k79K50l16K08k74L64k28J01L0j24p5R4J30k98J65K01l83L27
5501A09l2j39j88M10l55K19L38k46k38J04J07j66K8K7j3j57J51J56L7L6j46j27
5523h5L5K09j31j42K06j41K7o0P9Q8p4j62J7m5K97N8j21j77L3m5Q1J52r4l7J51
5548A19j26l3l6L28k04l44M63m56J73J94m0l54M71n93J92L19nM2j38j9p2M15l08
5571a2J1k59K54j0J39j38J53l27N1M05k71j4K0j71K35Nj56j82K62k28RJ02J33
5594A1j35J32l63K01K43p9j11j36M31l34R5Q9J17j48O6o7J8K3R0k05j5L9R3o8
5618a3j87J10L14l15k3R4O3j63j1K97j96J17K4k15R4l27J53J11P4j75K37j8j66
$$ plain form
5456 35 67 -24 57 37 142 193 111 -200 -65 37 -4 175 247 9 20 132 26 -200 -115 -50 197 -46 125 -20
5480 -20 -172 42 216 -63 187 -129 79 -195 169 -59 42 72 -52 -127 -33 97 -201 -36 165 -218 109
5501 109 77 -62 -250 160 -195 24 362 116 -122 -18 89 -77 -49 -22 -35 -192 -41 115 152 188 42 -85
5523 -85 -50 159 28 -114 92 -49 -22 -82 -3 85 11 -151 -134 -179 118 176 55 -122 -89 -134 -53 99 5 -32 119
5548 119 -7 -40 -76 252 48 -296 167 -289 -116 78 38 -316 155 -438 -246 73 68 110 -28 -47 -119 296 -12
5571 -12 -1 -260 -6 -16 123 -15 138 -189 -138 267 -4 -18 2 -169 66 71 -85 -267 -5 -233 -224 -122 11
5594 11 -124 8 -355 -154 89 10 -101 -237 194 -140 -45 44 161 13 79 12 30 53 143 -62 -77 -38 55 -13
5618 -13 -200 -90 224 -91 -114 -20 43 -120 -131 166 -30 87 111 -104 -10 -337 -184 -73 1 -174 63 45 -121
5641a21J39j5N7k5lj80K21j7J15k28J47j6n3K0q3l1J68k74J88m1J40J11k35M3
5665B7r1J04N6j05n1l3J59J63j23L5j50n6Q4J12j88J1m6k01K85L6k12L65r1L9
5689A29j71j0J26k38J6L35j71M1J57k85j3p9K24j09O7J64j71o5j3J25j99K44L1
5712A35j11M3j74J74p0J68k70L0K25j49n0M5N9rj76J03o4JK42M8M7k04o3K69l30
5737h1p0J42J96l18j78O73k76j93q0J84n5J94k33J5J83j93J05l30M18R4j33n7
5759GK02j23o7J18j4K6j23M5j50K10j00q9J12j41m4J70j49K14l08J15K15Nj01
5782C0j34M5j35P3Q3j65K03j92J44k04J34J09m9j9o0N0J86l11J36p6L20j76K09
5805B01J01j45j58oP6k95K20R2l0k1J2M6k00J15j03R4LK55l12l8J21k4p9p2L41
$$ plain form
5641 -121 18 3 60 35 32 -148 73 56 171 -57 90 74 21 41 -42 -73 95 -179 9 -32 108 219 -16 27
5665 27 -64 40 96 -9 -60 -93 66 229 106 141 -9 -65 19 131 -57 -46 -92 -293 -8 28 -184 181 90 129
5689 129 -42 -52 74 -164 -148 187 16 57 214 -71 -84 -163 61 -48 19 183 12 -53 -66 59 -140 104 135
5712 135 24 67 -107 67 -3 165 -105 -75 150 1 -49 -4 55 46 -130 -27 -91 -90 152 200 247 43 -20 249 -81
5737 -81 -151 -9 187 -131 -309 364 88 -105 -185 -1 -56 138 -95 -80 103 -90 15 -315 103 197 64 7
5759 7 209 86 19 137 123 149 26 71 -79 131 31 -58 54 -87 -131 39 -110 104 -204 -89 126 131 30
5782 30 -104 -59 -194 -121 -38 -203 0 -192 -48 -252 -118 -9 -58 -77 -137 -87 99 -212 -76 -152 168 -8 201
5805 201 302 157 -1 -7 69 -226 -6 86 56 35 47 93 -107 8 -95 -1 2 257 -55 -93 28 4 -75 -147 194
5830A94k74LMM4j4r0M42m06%j02J96j33L71j35o1J12k30j1K96k14r4r2j96L06
5854h4K67j06J69k61J08j0l8k23J01L5l58L06m5J65j43M6m5j1J72k9l18K76K36
5877B10k79J44Rn3j7j23M00j75j60o9J02J11k25K71K5j09n7j69J76r8j13K99q4
5900A6K5J46J05m67J94q0Rj61K19o9P4j8k97L06p1K07m16K29Q9O3Nk88J42L22
5924B84k59J09k02pJ12j74J86J18j79m6K75k86K28m7j35m4n6M18k94k16J17j83
5946b81L75R3l60p5J84L1qL00k43J76j91j96J62Rj26L23k52O5J36j74j66L12j64
5969g0J73j12J64j94q0J78N8k25k6J60j4J72j06j7J29J1l69J44L3J17j22P1k92
5992b17k8N48l80J42J13j48k21K08q1O6j11J62k40K91q8r2j26K11o5R2n5j45J29
$$ plain form
5830 194 -80 -77 -73 -29 -43 -133 309 -97 -97 -199 -3 -136 235 100 39 151 -79 -90 206 -8 -102 -194 -390 -84
5854 -84 183 77 246 -15 93 83 45 -178 -77 -42 -400 -94 -139 26 -117 -71 -116 -127 45 16 -302 -26 210
5877 210 -69 75 84 31 14 -109 291 116 -44 -113 -11 100 -125 146 171 62 5 -164 12 -86 -199 100 16
5900 16 41 187 292 -175 19 -61 -52 -213 6 -63 11 -7 -304 2 -69 138 -278 -49 40 103 108 -180 -38 284
5924 284 25 134 -68 -75 37 -137 49 167 -12 -58 217 -69 159 112 -23 -67 -123 295 1 -215 -98 -281
5946 -281 94 187 -173 -248 -64 -33 -41 259 16 192 1 -195 -33 -24 -150 173 -79 -14 122 -52 -218 94 -70
5969 -70 103 -9 155 -39 -119 59 117 -108 -134 26 12 184 78 61 190 201 -168 -24 9 126 4 75 -217
5992 -217 -245 303 -77 65 178 30 -191 17 -64 2 -109 53 -187 104 16 -76 -202 9 -56 36 -19 -164 -35
6015c5N4J90m09L15j94Ok8R1J36o5P1j4J74n03K68r4j40N3j34R4K01K7k46K73
6039I1q2k91K93N3k75L79m3l23J46K98j58o4j33J59J25l8j6j14J8P4l6J18r7k18
6063a34J57j49J3J60j75J64p6m6j2K13r7n0j31L3J04R0j61M6J44n2p2J19j34l5
6087h1J33q8J33P2l8j60J63r9j33Q6k20m5J30J06o2j58L12o8n3P6j77M1J62j16
6111h4p1j15K38L8m1O6k30O5lN2j26q5L57LK2l67L08p5o4J2J07K2j74J43j75K45
6137F8k67L88Qk79O1k5J16k21K27Q0k16O9j62R0j3J13nr1mJ45J18j32k41J62J83
6162A72r8m37J54J31j07J84R8k33J35J47m9j67k0J22j36J00J27j65J25N1k85K45
6184I4j86m8J49RljR0k28J11L47j97j7j38J33j15N5o2K8j73K47k87jK71J4J25
$$ plain form
6015 -35 19 209 -200 115 -79 -73 -101 -10 126 61 132 118 292 -211 57 -37 -177 -124 -258 -164 37 64 -182 91
6039 91 9 -282 11 64 -211 168 125 -198 -52 246 88 24 -109 50 175 137 121 7 25 99 63 181 84 -134
6063 -134 23 -126 -113 47 -128 36 -40 -86 -98 115 18 -32 -163 -130 -26 64 -97 -51 93 41 -31 88 -46 -81
6087 -81 52 -36 97 169 131 -29 134 35 -98 -12 -232 -277 -147 -41 -103 -261 51 -17 -70 6 -171 -130 32 -84
6111 -84 -155 -270 -32 6 -35 31 -199 -134 -137 -85 -211 -296 61 64 86 -281 27 -48 -112 -100 7 29 -145 -2 -177 68
6137 68 -199 189 197 -82 -21 -46 70 -151 76 156 -60 9 -153 -63 -76 37 32 -59 -63 82 200 68 -173 -11 172
6162 172 74 -363 -209 -78 -185 -1 97 -136 -1 146 97 -70 -90 32 -104 -4 123 -42 83 134 -151 94
6184 94 -92 -140 9 18 15 14 104 -124 -13 334 137 120 -18 115 0 55 -7 21 -152 95 -192 -193 78 92 217
6209B17k46j1O1J51o1j89q1J63j50J36K64j31m02m4N57k73oJ2J89m8J17j55k13
6232a43R5j25P9k06J69j3J24l0M9Q8j33j07L05R0k86Q9j7N4j27L6L35m94J28K00
6256A60j16J46j22l28J33j37K43O8j7K13l8k47j40k1J4L01j04J81k80K2J23o3
6278in9j05mQJ03K34l67Q3K0J20p0K35j60Kj40L8r7L18j19N4j43J39j60l9J28
6303A0Nk52M7K31Qj23l0K48r6j72r6K27l1M5Lq8J14n1K00j48j46l3J44J18K6j79
6329a9J45l69L65j48r2J35j82J88p9J96P7j60k16K79j17m19K48K07k47J96Qj38
6351a42j9K51j60J65q6kk14J98Q5L1p6K58j47j58J91l90K22j71K61J39m70K14
6373b0P6j48J37m4Q9K34k71r1j3K20k24J92j40r6oR6K3j71K51o2l34L89N2p4P1
$$ plain form
6209 217 -29 -40 21 172 111 -78 -159 4 -146 -10 254 123 -279 -323 234 -39 -45 -33 156 108 225 70 -143
6232 -143 -48 -173 -94 -300 -131 -144 -20 -50 -1 87 -46 -153 152 242 -44 45 28 82 -45 -9 326 -168 -40 160
6256 160 44 190 68 -260 -127 -264 -21 47 30 243 205 -42 -182 -203 -189 112 8 189 -91 -69 54 -9
6278 -9 -68 -173 -177 -169 -66 168 -199 -116 -96 24 -46 189 29 31 -109 -71 -168 150 31 85 -58 81 -79 -118 10
6303 10 15 -237 -190 41 49 -74 -104 144 48 -124 -220 7 -24 21 24 -64 50 -1 199 51 -95 -128 16 134 160 -19
6329 -19 126 -243 122 -26 -118 17 -165 23 -56 140 217 57 -159 120 3 -416 -168 39 -208 -12 -4 -142
6351 -142 -161 90 -70 95 9 7 -207 -9 76 107 31 289 142 -16 175 -215 7 -164 97 236 -234 -20
6373 -20 56 -92 45 1 90 324 53 -38 -51 169 -55 137 -3 -99 -105 -9 14 -157 94 32 -302 87 139 65 136
6398A36j40k75L22K0k25J71r3K21j90J19J56k25J88m7j53QJ20K01k92K5r2J07
6420F2j98K03n5r1J1K9J20p4j70K62k1k84K0K80j68K14j88j64J62L35m10pJ75
6443D3j24o2Q7J48k6j5N9J2R0j71P6l36R5J47q3o2J86p1k1J32l3J15k98j5J49
6468B2o3J25r9k39J94K18j81Rn1q5M03n00O4L33k40q5P1o9J81n6L95j43k62K54
6492A96N1l30M3O1K01Rk36J63j52J96j4m01N7K64j65K00O3l69L6L37j40k91J38
6515h3P1N2l2N8k27J84o8J33J74m49K43j60L26j59L9O4l58L3K49K7J00k03K2J71
6539B07k26q6Q5o3J03K4Kj3j53K27MpLk31Q0r4K21j37j46L00k1Mj84J57m26N48
6565A78j74J58k5j89J40J74r2j21M0j53l1J08J64j88J24q3j03M1L12k99N5l4j35
$$ plain form
6398 136 -4 -279 43 63 -162 9 -84 137 -53 66 222 -3 185 138 -15 -7 113 314 22 47 -45 62
6420 62 -136 67 12 -79 -68 -39 81 7 -163 99 78 -206 -186 94 -74 140 -48 -212 -50 285 -125 -132 43
6443 43 -81 -143 -56 92 66 51 110 122 212 41 117 -219 -124 23 -60 -122 64 -7 -28 104 71 186 -112 -127 22
6468 22 -41 84 -15 -254 -60 158 -23 -14 -65 -150 253 -247 -183 150 -90 -175 -104 -173 8 -48 347 204 -58 196
6492 196 247 -83 -40 21 222 231 -5 158 6 202 188 -213 -156 108 -57 143 206 -163 -127 210 70 -221 -83
6515 -83 -12 40 8 66 -161 23 -45 88 262 -187 56 -104 222 63 102 166 -192 -159 90 117 217 14 36 207
6539 207 -19 -105 -20 -83 20 44 46 33 -120 107 111 104 107 -124 -44 -138 83 -54 -200 100 79 83 -101 56 -370 178
6565 178 4 162 137 -52 88 262 170 49 89 -64 -95 13 177 -11 113 30 -73 -32 280 -19 36 2 -133
6588a33o0K84l49J54P4J00j57R9k88r6N41k98r8J57O2j36J72L97n72J27J78k81
6610a23J30j17N87p19K64k4Pl5K18k01j90K49q1Q2j70O5K31m56L59j06J40j19
6632il1K73k98p5O6j66K10J79j56J44j66Q8n1L4l80M26j80J25j16j73M42k45n5
6655a14K86p7pj64J26O3l16K12nN8n1L6J80j67o6K87k39j57j1K30P9j04q2o3j41
6680b07J50qQ7J87l16OL21N5l77R4M3J41k13J16p0j5OJ37j39N8j80K03N9Qk08
6705f2J26j89m6K60J21o2k28J19K1K54l46J66k19R4L37l54J93k24j0R0o3j34J29
6728b7M0oL2J79l67K90m09N63k11j53K04l4l05K47r9J21km62L36L0RK18j77k01
6752a84R1j73L91R0j73m9L3j11K9K88j97p6p8J35O2j85K09j65J52r9m00N17L8
$$ plain form
6588 -133 -193 91 -258 -104 -30 70 -87 12 -276 -372 169 -129 -227 -70 -8 -144 28 425 -147 -20 158 -123
6610 -123 7 -110 477 -242 22 -2 5 -30 188 -13 -203 46 -35 47 -123 -58 173 -283 76 -30 110 -9
6632 -9 -40 233 -65 -140 -74 -240 -30 149 -7 137 -29 59 8 42 -338 88 -92 33 -83 -256 186 -59 -114
6655 -114 172 95 88 -76 50 113 -203 9 4 62 11 47 227 60 -6 281 42 -115 -126 104 183 79 -3 -66 -207
6680 -207 -57 -65 22 209 -107 -101 220 275 -102 -8 35 176 -37 79 9 -6 0 137 -2 56 -124 79 138 146 -62
6705 -62 64 -125 -171 89 210 148 -80 39 60 314 -32 134 -85 9 346 -8 185 -39 -49 41 -22 -156 -27
6728 -27 13 7 39 218 -149 141 -268 295 84 -69 135 101 -204 43 -56 65 63 -399 -63 -33 -24 194 17 -184
6752 -184 -93 -266 125 215 42 -7 26 -85 -56 232 35 -41 -119 16 78 -107 102 -63 89 -10 -410 107 145
6775A45l28K51j08O8L5J37p4j52K25O4k11r8J79l6j37kJ59j55P3j49j17K77r3
6798d7m3K1M4QN6j90K03j32j44K07R4j00J25j72J97k26O0J72k57j71K38K99l46
6821a04J15M1P3k21J01j64J22P5M0q8n3J42j07L4J07j24j26K65m3J10l26J63J73
6844B05k34L7j03R9o8O4J07j03p8p2J75P9k02L33k46r7J69P2j30j4J56o9Q7l06
6868a39J83m6J10%k12O3J65k53J41k44L23k16K48R4l00n4O3j00m4k6L31j10o5
6891h8M1k4L14l56M8J58r8J5K61lj10J0k25j8L5j49K00Q5m7p2l0j08J82O2k52
6916a69J47QK7k48L77j12J37j54j4J62l04r0J8L12K52m84J58j31K50j42N2rJ8
6939F1j28J38J28l96K14k23J07K32l8j29M5M0j18K9J07J16k06j50L53m27K07j39
$$ plain form
6775 145 -183 68 -40 28 63 200 126 -26 199 263 52 -46 133 97 -40 -42 117 -38 35 -114 -231 46 -47
6798 -47 -90 -69 -25 -17 39 -151 52 -80 -224 -17 77 -23 102 -70 127 -99 -39 133 -124 -295 -57 242 -104
6821 -104 11 52 125 -96 5 -159 -37 38 78 -10 -63 79 -28 6 113 -11 -137 128 85 195 -131 32 205
6844 205 -29 8 -95 4 -64 0 107 4 -74 -146 29 108 -94 239 -7 -104 65 137 7 -7 149 80 167 -139
6868 -139 44 -2 108 108 -104 -41 124 -129 12 -232 91 -125 123 217 -83 -137 -74 -174 -218 -244 87 -23 -88
6891 -88 -47 -71 243 -113 -65 93 -5 10 271 268 158 168 -57 -75 -40 -189 11 96 49 -23 -53 -161 21 83 -169
6916 -169 -22 -14 13 -235 142 30 167 13 -1 161 -143 -233 -215 97 349 -135 23 -108 142 0 52 43 61
6939 61 -67 71 199 -197 17 -206 -99 133 95 -34 11 51 -67 -38 69 185 -21 -171 182 -245 -38 -177
6961a77J56rJ80j49M7k51J94q6J69q3K14j84n0J6J45l78J52J39J28j60j35J78
6983E6j3ll15M39k48K4J55O8k83K13j62J52k3r5L4R6P2m34L33k12O6K04Lk96K31
7008F2KJ5k90J29J88k46J20j64n1P2K70k60l9K58L1k70M44l04j52K70j71P5j37
7031a48r7K06j69K79L8q3J53J07j62r9J8R0j48p3J44P1R8l28J52m6q5M8m3L24
7055B47k69M9j17kK17k16P5J2P1m5mj28K66k61L90k87J00k25j41L92l40m1N39
7078B82l51K34l1j4j24P3R3n4q6q5J07Jk8J5J66k36J79j24k2N1r7l04L07N3J20
7103A25J07m47J98p2J82M5j61q9K41p8n1R0R4j81m5P1R1j20j15j30J17K03l9j0
7127B6k33J35J41j73J30nk97M06q3j00j43J03L01k91O7o3J64k3j26J18J1J13m04
$$ plain form
6961 -177 -21 -30 150 1 48 -203 -9 -95 74 -9 205 21 -29 -13 132 -246 -94 45 173 13 -122 56
6983 56 43 40 -275 164 -84 -60 95 163 -120 93 -69 83 60 -35 -1 95 167 -267 66 -146 -80 124 127 -169 62
7008 62 64 79 -211 -82 106 -140 -20 -184 -235 -163 107 -153 -192 66 97 -173 271 -33 -185 85 -86 -11 -148
7031 -148 -245 -39 -208 71 109 26 179 286 124 25 43 133 -15 -88 56 127 225 -103 49 3 -82 -34 -77 247
7055 247 -22 27 -90 -92 125 -91 -16 -4 67 22 18 -110 156 -105 285 -2 98 -127 -268 124 -216 -257 282
7078 282 -69 165 134 120 -4 69 162 108 22 -63 44 45 17 32 198 -38 141 17 -5 46 -51 -355 -48 5 125
7103 125 232 -215 -17 -89 93 138 -23 -112 129 51 0 90 184 3 -42 29 120 0 -115 -245 -128 75 36 26
7127 26 -207 -72 69 -104 26 21 -276 130 47 -53 -196 -93 208 -83 -16 -79 85 62 -64 54 65 178 -226
7150b26L43R3l08K16k33K20q0o8J27Q1k34N5r9r9K09J52o3l11L16Q8m0k00K1j4
7174e4k0J49P0r3Pj35K26j68r2K28q6k53L05j79J22J01m48K97J21j41R8k23L00
7197A32k54M8p1J64RqQ2Lm3r9l32K73J20N7Q8mm00N11k43j10Q0R8j13R7J97j64
7223A18j53K29j42m9j46K10j08K8K16n9j40r3o2J70j94K21K23j29j48K9j23j1
7245a13J5J65o6m0L5K4J6j48J47q0j0Q9N6k0j23K62k19K7k34L79j03P7j22k17
7269b03K03Qj17K44k35n3J57j07J93k7J71j91j24M34k12j07k73l5M02j8j19l7
7291d6j1K11k30J63j11J30JJ36j36r1l4j55J40jk34L18o3k80K69p8M8j97L26J03
7315A78k67J73j93J5m4J58J3J00j46n3M0J08J5j02l8J47j15L71m08K19l9j7j22
$$ plain form
7150 -226 117 210 -98 118 -115 105 25 -43 84 165 -69 -14 -113 -212 -3 149 86 -225 91 179 139 -61 -40 -54
7174 -54 -74 75 145 52 59 -76 150 -18 -110 118 32 -221 84 -95 27 128 -320 -23 98 -43 55 -168 132
7197 132 -122 -74 -145 19 28 20 102 105 62 -37 -369 -96 24 81 169 165 -235 276 33 -77 3 101 -12 85 282 118
7223 118 -35 194 52 3 -143 67 -41 -13 203 144 4 -89 -151 19 -175 46 269 140 -8 21 -102 -113
7245 -113 -98 67 1 -39 -4 20 36 -112 35 -45 -55 34 90 70 -53 209 -10 17 -217 162 59 136 14 -203
7269 -203 0 8 -109 135 -100 -153 4 -103 90 63 234 43 -81 353 141 34 -239 -274 128 110 -9 -46
7291 -46 -57 154 -76 87 -24 106 107 243 107 16 -18 -173 -33 -34 -268 50 -13 -293 -24 -102 -54 -251 75 178
7315 178 -89 84 -109 -94 -138 20 33 133 -13 -66 -26 82 97 -5 -43 104 -11 360 -48 171 132 115 -7
7338grl1L61k82k98O9Q4J20j20J51k86K71J14j66J41J77j45k10j06J19J17j5k80
7361b31J39M4J34j53J14J18N7m08K14l35L65n3N1l25K49Q4k00J55o1m9M2J07k46
7384a88J33l31M41q2K7j79K12k23j28L86l5k1l3j11K8J09m8K7J97o4l61J61l5
7407a18N7L1J03m9J2q7K8k04J09K00j31J36l35L69j80J22O9r7Ko8J00N5j03qj86
7432a73J61R2q9m2mJ39j07P9Q9q3j54J41k04L95l00N2j70Q1j47K81l12P3L42k30
7456i0m3K24q2j1M4j79J10Q4j39P3J18q4r0N0j18L43p5j19pJ22J02j98k31m3L21
7481H2J22l2j48j25Q5j92J40J06k92K04k77K22J51l13J04OM09k72M3l9j06J62
7503D0r5J28K7Nl1P0k37J05K4m4%k9P7j89RJ86J60j74l6O7J9r1J14L5Lj73J16
$$ plain form
7338 -7 -16 -47 314 32 -266 -197 -113 7 -113 38 -248 23 137 -29 112 289 144 -66 -172 -53 64 49 -231
7361 -231 -92 -48 86 -67 47 165 222 -186 28 -307 58 5 56 -269 -20 64 -136 19 -42 -91 -49 58 -188
7384 -188 -55 -386 55 -27 0 -179 33 -190 -318 68 33 12 -21 -132 -104 5 -43 -16 181 117 -244 -83 -118
7407 -118 -61 -30 73 24 36 -51 -23 -227 -118 82 -49 87 -248 121 -59 63 132 35 37 -31 69 124 21 13 -173
7432 -173 -12 80 -9 -51 -55 84 -23 56 145 62 -92 49 -155 240 -60 -8 -178 -97 -244 37 -275 -202 140 -90
7456 -90 -133 91 9 -2 42 -137 -27 57 -82 -9 109 25 -65 -15 -133 210 135 16 9 131 233 35 -196 -239 82
7481 82 204 172 24 -101 -16 -208 -68 38 -254 -50 -327 -105 46 -267 -163 -157 252 -20 23 -16 -122 40
7503 40 -55 73 100 105 74 144 -93 12 36 -8 -8 -37 40 -149 -140 46 206 32 -4 63 82 -9 105 140 143 -30 86
7530H6j2j41J50k01K16n9j44J70j81r1O3J50J10l03P7Q7j18N9Q0J06j35l7J25
7553E7k66J61K18k15P9J8P0O9j29k21J44J00l40L99P8p3k10N0j39L57j81P9k11
7576a06R5m7L6J23J04o6k22K04q9J83k21J2k4p0Q9N7k5k96K57K02k73J40J92k31
7600B4o5K49k55K37j17k42Q0j55N82l06J2q6j04J09KP0oL4O4J46j26J29j03j80
7624gL1p7J40O5l26K64k26M12l42L2J04j58J22Lk19JL5K14l5J15j53RM5k15K39
7649G3P0l79K56j33l0J61j44J39m0J63Q8j02p6k78N17k72J78k23J42nl26L36k52
7672a37L21j28p1J27j62J13j16J79J0k32J50J51m6j0k5k26K81j35k83J84J23n7
7694A1O3k19K93k50J51L0R7r1k3j24J65j29K7K19j98K03l19mK88k44R4l30K72
$$ plain form
7530 86 74 -67 83 -118 98 39 -105 65 -116 -207 -144 6 116 -187 -110 -23 -141 -82 -2 104 -31 -68 57
7553 57 -209 -48 170 -45 34 52 122 191 62 -159 -15 85 -255 144 222 149 -61 -11 -150 207 26 105 -106
7576 -106 -11 -58 -22 101 205 139 -83 121 32 215 -6 6 -18 -88 1 58 33 -263 -6 196 -77 63 255 24
7600 24 -41 208 -47 190 73 -169 -89 -244 338 32 44 -42 -146 -37 -35 35 29 63 127 273 147 276 173 -7
7624 -7 24 -53 87 152 -174 90 -136 276 -66 -34 70 -88 34 37 -182 -181 -146 68 33 148 -5 4 49 -166 73
7649 73 143 -236 20 -113 -143 18 -126 13 -27 136 224 122 46 -232 285 13 191 -32 110 105 -221 115 -137
7672 -137 184 56 -15 112 -50 63 -53 126 136 -96 54 205 159 149 124 -102 179 44 -239 -55 68 11
7694 11 74 -145 148 -102 49 79 176 85 62 -62 103 -26 1 220 22 225 -94 -98 190 -54 40 -290 -18
7717a8q1J17k84K29R7j33P6n5J20O1QL0j27k96M92l42M0K2J06j34P9l8R5j9j71
7742a26J11j4L64k72r7p7J97k99R3J39N7j25J29l4N8r5R1j97k8J32pJ17l47K11
7766a9m14L68m9J40J6j96Q7O3p5O6K2o7J54k78L48k97n6J47K16j11l70K59K09
7789A63j54N8n6O0rj95p0J11J2J8K09j24k27mK95j15j53K55k3j16n7J43L1j45
7813i3l1P0J53j81K62k22J29Q5k65j7K6p1K06J36j10l9j69J26J65m39L24J6L6
7836I7K7J20l90l3J9L8L87m40L48Ln1p1L2k03R3J05Pp7j6K98m85J09K63m5N1l68
7862a82P3K06k22K77k27j73K19N1K8j17K41j99J10J10k05K68j19K4k70Q8K5j74
7884a68K17J28L7Mm03K31K40l22J30K9nl97K43jm4N7J4K32k56o6N36k80j07M3
$$ plain form
7717 -18 -99 18 -266 -37 60 -73 3 -52 68 129 137 167 40 -256 236 -106 -66 -44 62 -72 7 -31 64 45 -126
7742 -126 -15 -29 335 63 -34 -111 86 -213 -120 19 76 -49 80 46 104 9 100 -97 -125 7 0 117 -230 -19
7766 -19 -433 -65 -114 26 42 -154 -67 -4 -79 -13 9 -58 96 -182 166 -131 -187 -40 176 65 -305 -46 163
7789 163 9 67 11 71 62 -133 -203 -92 -80 -62 147 23 -204 -208 87 -28 -181 74 51 -65 -122 21 52 -93
7813 -93 -124 -54 99 -82 180 -42 87 172 -93 -110 -84 -155 51 187 77 38 -131 -5 160 -279 45 61 97
7836 97 124 244 -146 -179 -160 -122 265 -175 173 176 125 54 86 -117 -24 81 88 11 -5 293 -192 -83 180 135 186 -182
7862 -182 -109 97 -125 152 -75 -248 -29 22 50 -67 174 -25 85 195 -10 258 139 163 -107 -19 6 -168
7884 -168 49 177 214 218 -185 46 286 -36 94 123 118 -279 -36 -37 -81 -24 -10 222 -34 -100 436 156 49 92
7908I2M7k91J19QL09j86Qj14j25j27M9K85k60J65J19j7J35j02l33P8rK40nj89
7932a04J01k55L80k77J84j15M2j00p8L48k30J85j69O0j00K4L25j55l8k26L54o1
7954I5P8k06j45KQ2J50L1o4J03J63j59R9j13O9j16M7j79K25m06J36O8K7k23J50
7978h6j3J87j55q6K51P2o0k14o0M4J74K35k57p4M3K8R7j65l1J9j60L02j59j59
8002b27L0J68j09L7NP5k2p7R2J86J01k73J6J17l8l27K67Mj35J60N3k38j13K12
8026c6j06J38J09k00J9J76k65M26k73O3J4j88J93j26P0J39k32K34m5J87j23j92
8048a8O2M7Pj9k94J93K07j85l85M99j14q8J31N8k15J39N5N3j29K8m9R8R1j27j1
8073C4n6R2m9M1K8j44J08j45J05J7p6J70j67Rn8K08j49J89o9k99K25L01l53J61
$$ plain form
7908 92 139 -152 -33 -25 284 98 106 -8 -133 -260 -211 74 -186 -21 98 81 216 114 -219 -141 -150 90 85 -104
7932 -104 -3 -258 122 -155 29 -86 -44 -144 -222 126 -104 81 -88 -28 -128 -104 221 66 28 -198 156 95
7954 95 173 -33 -178 -176 -94 56 87 23 126 289 130 229 116 185 69 116 -63 162 -244 -108 -40 -13 -236 -86
7978 -86 -99 88 -67 -153 98 170 110 -104 -164 -120 54 289 32 -42 1 29 126 -39 -70 -51 -211 91 -68 -227
8002 -227 -197 -29 -138 -101 -96 -21 -43 -120 -28 158 259 -14 2 119 81 -246 21 25 -110 50 103 -135 -248 -36
8026 -36 -142 -4 105 -95 -76 100 -165 261 -12 51 65 -123 70 -56 14 153 -79 155 110 297 174 -18
8048 -18 44 91 98 79 -215 -22 185 0 -385 114 0 -88 43 101 -114 25 80 133 4 32 -17 81 172 45 34
8073 34 -22 70 21 62 90 -54 54 -91 14 31 -45 125 -42 -33 -91 117 -32 157 88 -211 14 315 -38 123
8097A23j58qm1K99k17K57k13K16l37J73rj30j15J84l5%j01J69J74k94Q8l20L70
8120G5J06m07J53J18j26O4J14r9j22L09k31K94k53K33k84Q2m3l7k40M04j56J60
8142A14k10J27N2o0J6l4n9J84k61J17K10l91L21J2j99J89j41j65J61k65O75k36
8164A57k31J74L1j82R8J06l53J38J41p3n8J09L4o0J38l04j2Q4J23j69M11k69j55
8187a22L21pk11J21
$$ plain form
8097 123 -35 -43 -84 215 -2 255 42 258 -79 94 85 -45 -160 24 -11 -11 -112 57 231 -63 25 -295 75
8120 75 181 -226 -73 45 -81 -17 97 -2 -124 185 -46 248 -5 228 -56 26 -17 -54 -294 110 -46 114
8142 114 -96 31 83 23 39 5 -54 130 -131 -14 196 -195 126 138 -61 128 -13 -178 -17 -282 393 157
8164 157 -74 100 131 -51 47 153 -200 -62 79 6 -52 57 91 31 169 -135 -147 -63 60 -109 302 33 -122
8187 -122 199 192 -19 102
8191A02
$$ Imaginary data points
##PAGE= N=2
##DATA TABLE= (X++(I..I)), XYDATA
0@%%%%%%%JrJ6j6J7k5L9m7N6p2Q9j12J36j66K04k40K82l34L94m60N33o15P10q16
31d35R32j061J204j365J542j734J947k182K439k720L025l360L727m127M565n044
47b647N566o135O760p447Q203r039R965j0995J2150j3457J4942j6647J8634k0980
61a1127K3801k7269L1655l7409M5333n7032P6302j15530L35524n66115Q4595R45635
73G28363o85049l42286N11917J28711m45699q2163L54734J91504n70576n6748
83b67292O23372j68847o15008M04007L26672n23014o7846M68470o7847l74218
93b61551O9564L49468o9465l28086J53374L41685l11622j78858L86539J1475l34550
104a72027J10785K51799q6172k01189L3275K52737r9487k41363K33036J33742
$$ plain form
0 0 0 0 0 0 0 0 0 1 -8 8 -8 9 -16 23 -24 32 -40 49 -63 73 -93 111 -129 153 -181 213 -247 286 -329 381 -435
31 -435 497 -564 640 -725 817 -917 1030 -1152 1287 -1433 1592 -1768 1959 -2168 2397 -2647
47 -2647 2919 -3216 3544 -3903 4300 -4739 5226 -5769 6381 -7076 7866 -8781 9853 -11127
61 -11127 12674 -14595 17060 -20349 24984 -32048 44254 -71276 264248 -301867 -217272 728363
73 728363 43314 -298972 212945 341656 -104043 -186206 168528 360032 -210544 -267292
83 -267292 356080 187233 -427775 -23768 302904 -220110 -287956 180514 112667 -261551
93 -261551 -191987 157481 88016 -240070 -86696 254989 -56633 -235491 151048 162523 -172027
104 -172027 -61242 190557 104385 -96804 -63529 189208 89721 -151642 81394 215136
114B15136l25265k0101L30974j13932k59425J44487J68130j53333j20525J36771
124B917P8189j52166o4844K34448j8379k69152J19786K24399j72279j22932K05083
135F5070J7403j62722L8480J53217n8080j37686J04280J16482j16056q5933J29229
146F3684K3318j10319J6651Q9440m7329j07832P4302P6511q1535o9056P4172L5561
158C7568r0014l551P5606l3780p6492P1663M4088o8990l2613N3483M2013m7286
170b8305j430L8361j2314k2586L7909K4334k3556j6300J0392M9357k2632l6815
182c585L3494J5392l0192J4141J8995m1729L67J4511J261p749r790j5972j064
195a1920K6691j8501k0806J0671J3833j9393m518K2477l646l0999P251O5289l4671
$$ plain form
114 215136 -110129 -130230 200744 86812 -172613 -28126 140004 -13329 -133854 2917
124 2917 81106 -71060 -135904 98544 80165 -188987 -69201 155198 -17081 -140013 65070
135 65070 82473 -80249 -41769 111448 53368 -84318 19962 136444 20388 -65545 63684
146 63684 87002 -23317 -6666 82774 35445 -72387 1915 78426 -3109 -72165 2007 37568
158 37568 -52446 -55997 19609 -14171 -90663 -19000 25088 -43902 -76515 -23032 18981 -28305
170 -28305 -29735 8626 -3688 -26274 11635 35969 12413 -3887 6505 55862 33230 -3585
182 -3585 29909 45301 15109 29250 48245 6516 6883 21394 22655 14906 5116 -10856 -11920
195 -11920 14771 -3730 -24536 -13865 -32 -19425 -23943 -1466 -5112 -36111 -28860 36429 1758
208A758n2643N2347L6259m3693p994N4441p001m8770J4782P8409l9266q1644O8798
221B5783O2958q1483m3566R4105o181r1678L2797Q5209o4835r0479Q3386O3942
233F9958r2567n7632J08437J5019j23130L3330J12266p2155r6944J08606O6216
244G1404j05798m6047J16310K8183j25394K5035J24378n9813j15989J09118R2427
255A13814j29357n4717J38095K2957j47054K8053J26181o6701j16690R8454R5245
266A08280j40200o3784J48016K3812j59663K7918J34258p3714j07122R6828Q9960
277H4589j29935n5345J43525K6724j48874J9157J44044o1263j08768R4045R3576
288A01475j25763n3581J45264J9200j42799J5018J39713n9823j15076Q8355R1978
$$ plain form
208 1758 -50885 1462 37721 -5972 -13966 40475 33474 -15296 -514 77895 38629 -43015 25783
221 25783 88741 7258 -36308 57797 51616 -40062 -7265 77944 13109 -77370 6016 69958
233 69958 -22609 -80241 28196 43215 -79915 -46585 65681 -6474 -103418 5188 71404
244 71404 -34394 -80441 35869 64052 -61342 -36307 88071 28258 -87731 21387 113814
255 113814 -15543 -70260 67835 90792 -56262 -28209 97972 31271 -85419 13035 108280
266 108280 -31920 -95704 52312 76124 -83539 -55621 78637 4923 -102199 -5371 84589
277 84589 -45346 -100691 42834 69558 -79316 -60159 83885 22622 -86146 7899 101475
288 101475 -24288 -77869 67395 86595 -56204 -41186 98527 38704 -76372 11983 103961
299A03961j24851o0731J44679J0278j43997J5172J35063n9347j17800Q6729Q7702
310G6858j18100o0293J43186J2100j39751K0193J35017n2798j16630R0644Q6958
321G7384j08904n3703J35162J2837j32148K4666J27055n0023j12642Q5897P9167
332H4748j02036m9626J16244J2062j22411J9749J10016m5623j06365P5421P3824
343F6003r4807m4693R9714J4983j08080J7110R9271l8498r2243O6735P2053q2690
355b5142l7358Q9559J9128r3990J7229R0698l6547p6901N8532O4043p3358l4016
367c8123P3610J6028p8648R189P4791l5640o3226M6109M9980o3705k9990N8389
379A8764J0425o1032M198N7716l0867m4677L8019L5954m7204k1324M7475Q594
$$ plain form
299 103961 -20890 -81621 63058 73336 -70661 -55489 79574 20227 -97573 -10844 76858
310 76858 -41242 -101535 41651 53751 -86000 -65807 69210 16412 -100218 -9574 77384
321 77384 -31520 -85223 49939 62776 -69372 -44706 82349 32326 -80316 5581 84748
332 84748 -17288 -66914 49330 61392 -61019 -41270 68746 23123 -83242 -7821 66003
343 66003 -28804 -73497 26217 41200 -66880 -49770 49501 11003 -81240 -14505 57548 -25142
355 -25142 -62500 27059 46187 -47803 -30574 60124 23577 -53324 5208 69251 -4107 -38123
367 -38123 35487 51515 -27133 -17944 56847 21207 -42019 4090 54070 -9635 -39625 18764
379 18764 29189 -31843 -27645 30071 -796 -45473 -7454 28500 -18704 -40028 7447 16041
391A6041m1108K677M4078k0344k9652K9494K4648l1152j5877L7363M144k8456
403h144K834K6353j4887j6410J7498O807j5147j0936J6870J743j2970l034Q886
416e37k249p036N477j975n43l127M510O9P2K006o349O130R535l616j3266J5675
432D776R500j5128j415J7270K7k3900J4546J8700j8264j8913K3075J3017k9214
445e923p205K5753K200l8862R665L5305k5071l5223L1783K8331m8818j3082M9398
458H251J28n4445J9582N1006l6880l5559M4481L0096n2943j1963N7615J398n6933
471c6166J5188O1009l4754m7933M8237M1255o4878k2808P5782m313p2784K2689
483a9476O6013m6997m9631N5327L3420o5232k1132P2883l171p0497J7410O8949
$$ plain form
391 16041 -25067 -22390 21688 1344 -28308 1186 25834 -5318 -21195 16168 20312 -8144
403 -8144 -5310 21043 6156 -10254 7244 14051 -1096 -12032 4838 6581 -6389 -9423 -537
416 -537 -2786 -9822 -4345 -6320 -6863 -9990 -5480 -5411 -5339 -3333 -9682 -3552 5983 2367 -10899 4776
432 4776 14276 -852 -2267 15003 15030 -8870 5676 24376 6112 -12801 10274 23291 -5923
445 -5923 -13128 12625 14825 -24037 -14372 20933 -4138 -39361 -7578 20753 -28065 -41147 8251
458 8251 8379 -46066 -26484 24522 -12358 -47917 -3436 26660 -26283 -38246 19369 20767 -36166
471 -36166 -20978 40031 5277 -42656 5581 46836 -18042 -40850 34932 30619 -42165 -19476
483 -19476 46537 -460 -50091 5236 38656 -26576 -47708 25175 22004 -48493 -31083 37866
495C7866l9424n9569N8736M2295o8956k5080Q3207j550p8599K6151P2547m4163
507C461o0566O6257L8880p2535k0152P9867m299p6922K4846O6571l9356o3259
519e7207N8718M5150p4347k7448Q2495N87q7245K8472P2949m8640o0391O7790
531H83L7381p5898j2031P4278k690p3526K6124O6388l8814n6614N8986M4647p3821
544b4707j6929P9016k162p8747K8653O9604m8540n2962O1347L6115p4561j1972
556c5845P1949p640p1189K3590O4186m4727n0470N3609L5997o7413j6278P0011
568B5780l782o8814K0222O7301m2838m9619N6033L3847o2764j2100O7021p354
580B2933n8568K1254N5548l5580m1864M5427L0108n0210j8654N8504p67n6953
$$ plain form
495 37866 -1558 -61127 -2391 39904 -29052 -54132 29075 27525 -51074 -24923 47624 3461
507 3461 -57105 9152 48032 -24503 -44655 35212 30913 -46009 -21163 45408 6052 -57207
519 -57207 1511 46661 -27686 -55134 27361 27948 -59297 -30825 42124 -6516 -66907 883
531 883 38264 -37634 -49665 24613 21923 -51603 -25479 40909 2095 -54519 4467 49114 -24707
544 -24707 -41636 37380 35218 -43529 -14876 54728 6188 -46774 14573 50688 -23873 -35845
556 -35845 36104 28464 -42725 -19135 45051 324 -50146 3463 39460 -27953 -44231 25780
568 25780 21998 -46816 -26594 40707 -2131 -51750 4283 38130 -24634 -36734 30287 22933
580 22933 -35635 -14381 41167 5587 -36277 9150 39258 -10952 -29606 28898 28131 -28822
592b8822J5322N3548l3298m3766M5510K3824m7778j2798M9821m390m6182J5532
604a3477L9463k3766l4946L4332K2397l5537j3666M0515J743l9585J3151L3190
616B3814j8075k7730K6982J8545k7615j0075K8346L421l0418Q602K2658j2887
628E568k0542J7196J3407j9989p955J6885M164k0783L181J5018p352j3788R072
641e918J0888j3590m404J0901K340r993K988O992l789j476J732M952k822j058
655b257K038K391K96j340L53J19M663m026j524L834J781o241j748J0286n421q880
671e676M746R843j0274q234J2316L348j3441k875J8489o595j6781J0746J5093
684A0705j4860j2560K0471N700j9224k234K4247n790k2172J4159J8929j7464j7013
$$ plain form
592 -28822 -13500 40048 6750 -37016 8494 32318 -15460 -28258 21563 17173 -29009 -13477
604 -13477 25986 2220 -32726 1606 24003 -11534 -25200 15315 17058 -22527 -9376 23814
616 23814 5739 -21991 4991 23536 -4079 -14154 14192 17613 -12805 -4203 18455 5568
628 5568 -14974 2222 15629 -4360 -12315 4570 8734 -12049 -8868 6150 -1202 -14990 -5918
641 -5918 4970 -8620 -13024 -2123 217 -9776 -6788 204 -3585 -5061 -3329 1623 -1199 -2257
655 -2257 -219 2172 2468 1128 1481 1600 6263 2237 713 4547 6328 87 -1661 8625 3204 -5676
671 -5676 -930 8913 -1361 -9595 2721 6069 -7372 -10247 8242 1647 -15134 -4388 10705
684 10705 -4155 -16715 3756 9456 -9768 -12002 12245 6455 -15717 -1558 17371 -93 -17106
697a7106K5872Q336k6572k314K8716o404k8208J6179K1182k0919k0314K8519J1667
710A8634l3674k852L2691o147l3851J8338K6026k4881k0695L1877J3599l7441
722a8376j645L6911n581l6582J9156L0876k7399k1504L4588J4986m0962l31L9836
735B3973q026l7991J9232L3442k9864k3694L6049J4787m4324r53M3733j1477m1069
748b6182K0785L5617l3096k4778L8335J4505m4700k061M6642j2405m1908K1751
760g495L8465l4237k5830M1018J4225m3649k487M6828j1924m1544K1414L7717
772C2501l1817k8713M0765J4387m2610m245M5792j1290m1560K0983L5327l0509
784i89k8482L8608J4632m0875m668M2617q264m1138K0626L4133k8477k7007L7586
$$ plain form
697 -17106 8766 17102 -9470 -11784 16932 10528 -17680 -1501 19681 -1238 -21552 6967 18634
710 18634 -15040 -17892 14799 8652 -25199 -6861 19165 -5716 -26411 5466 19065 -18376
722 -18376 -20021 16890 11309 -25273 -6117 24759 -2640 -24144 10444 25430 -15532 -15863 23973
735 23973 15947 -22044 -2812 30630 766 -22928 13121 27908 -16416 -17369 26364 14887 -26182
748 -26182 -5397 30220 -2876 -27654 10681 25186 -19514 -21575 25067 12662 -29246 -7495
760 -7495 30970 -3267 -29097 11921 26146 -17503 -19990 26838 14914 -26630 -5216 32501
772 32501 684 -28029 12736 27123 -15487 -19732 26060 14770 -26790 -5807 29520 -989
784 -989 -29471 9137 23769 -17106 -21774 20843 12579 -28559 -7933 26200 -2277 -29284 8302
797H302J4651l9022l548L9844o601l8541K0459L1164k6224k4732L4208J4774l6919
810a2185k818L5415n753l5402J7702K8092k4754k1829K9333J3509l3525k794L0623
823A5614m685l0826J4232K5419k1719j8468K4923J2661k9056k808K7502m098k5106
836a6415J1696K2019j9193j3555K0642J0262k3931k485K3223l955k0163Q368J8590
849A5103j5388j1836J6714P625j9275l079J9916m413j5857O207J3702j1548r017
862a1146J3359M398j3572j992J4965l293j0366L846Q875n728o227Q830K519p434
876b966k006R956j520p279K995M851k443m114N626p57l295M46L253j136l015J585
892A81k91J815j432o28k97P51R53j428M37K85P2k322L542J936m113j964N057K964
$$ plain form
797 8302 22953 -16069 -19617 20227 13626 -24915 -4456 26708 484 -24248 9960 24734 -12185
810 -12185 -15003 20412 14659 -20743 -3041 25051 297 -21532 7801 21310 -12215 -15009 15614
823 15614 10929 -19897 -5665 19754 -1965 -20433 4490 17151 -11905 -14713 12789 8691 -16415
836 -16415 -4719 17300 -1893 -15448 5194 15456 -8475 -10960 12263 8308 -11855 -3487 15103
849 15103 -285 -12121 4593 12218 -7057 -10136 9780 5367 -10490 -4283 9419 -2129 -11146
862 -11146 2213 6611 -6961 -8953 6012 2719 -7647 -3801 5074 -654 -6881 1949 4468 -2966
876 -2966 -4972 4984 3464 -3815 -820 4031 1588 -2526 3100 2343 -952 -506 2747 1611 -1404 181
892 181 -110 1705 273 -355 -652 99 1052 -376 61 346 418 -1904 1638 3574 -539 -2503 2554 5518
910E518p567J743N531k845n482O436M088r433j354R257J410j1663K477R381n684
925A813p444P229O768j2433l156J2494K226j5897K065J5218p379j2417J0813J0409
939A0309j6959m041J8283j32j8356M197J8423r689j3767J2365J2359j7028p224
952a1260K0960J461k1721L401K3348j1271j8658J5492J3793j9368q493K3511N48
965A1743k3367M652K3365j0574k0713J5819J5256j8736j1018K4163K425k4398
977a1383L604K4647r689k3592J7353J7167k0020j2113K5236K732k5941N219K4005
990A7225j0586k2955J7404J6316k0043j1756K2923M854k6357M117K4209j0142
1002E209k3794J7404J8451k2825j1264K4371M317k6110N085K3156j0751k1417
$$ plain form
910 5518 -2049 -306 5225 2380 -3102 3334 7422 -2011 -3365 5892 7302 -4361 -1884 7497 1813
925 1813 -5631 1598 8366 -4067 -7223 5271 7497 -8400 -6335 8883 1504 -10913 -100 10309
939 10309 -6650 -10691 7592 7460 -10896 -6699 11724 2035 -11732 633 12992 -4036 -11260
952 -11260 9700 11161 -10560 -7159 16189 4918 -13740 1752 15545 -3823 -12316 11195 11743
965 11743 -11624 -6972 16393 5819 -14894 925 16181 -2555 -13573 10590 13015 -11383
977 -11383 -7779 16868 7179 -16413 940 18107 -1913 -14026 11210 13942 -11999 -6780 17225
990 17225 6639 -16316 1088 17404 -2639 -14395 8528 13382 -12975 -8858 15351 5209
1002 5209 -18585 -1181 17270 -5555 -16819 7552 11869 -14241 -9156 14000 3249 -18168
1014a8168J6945J7556k1814j0566K3167N359k4602L246K3066r802k0225J5829
1026iJ7472k1602j0030K2330M933k3120J942K2441r925j8049J4382J5546k0414
1039d103r374K1475L843k0936P57K0838q514j7072J2643J5008j8186r646K0813
1052G546L756k0055N16J9674p004j5880J1242J2383j4480r060J8049L469j7337
1065g181m62J7511m745j4920R640J0076j1660q308J5442K897j5003m97J4133l098
1079C825j3168P922Q280q832o554J1582L018j2618R15J0840k220j0484N813O914
1093E233o240m903Q225K811r898J173Q427j753p560L606N847n256k364L992K576
1108C916o516Q14N147p35n152J245M820l016j927J880J882l693N73K370p68j700
$$ plain form
1014 -18168 -1223 16333 -5481 -16047 7120 12479 -12123 -8877 14189 4387 -15838 -9
1026 -9 17463 -4139 -14169 8161 13094 -10026 -8084 14357 4432 -13617 765 16311 -4103
1039 -4103 -13477 7998 11841 -9095 -8338 12500 3986 -13086 -443 14565 -3621 -13267 7546
1052 7546 11302 -8753 -8237 11437 4433 -11447 -205 12178 -2302 -11362 6687 10156 -7181
1065 -7181 -7643 9868 5123 -9797 -157 9919 -1741 -10049 5393 8290 -6713 -7210 6923 3825
1079 3825 -9343 -1421 6859 -1973 -8527 3055 6073 -6545 -5630 5210 2990 -7494 -1681 5233
1093 5233 -1007 -5910 2315 5126 -4772 -3599 4828 3075 -4485 -879 4968 -288 -2652 1340 3916
1108 3916 -2600 -1786 3361 2626 -2526 -1281 3539 523 -1404 476 2358 -1335 -762 1608 840 -860
1124h60m07K771p39n68p04Q16L61n48K29l3R70j758L43J552N09k912j65M066j781
1143A142k335Q18L524l193k310M017R02m522j170O344j607n531K378M781l678
1158d40m235N776J714o041j425P787q58p807L185O887m359o490P786L002p971
1173c489j116R346r75j0125M403Q394n501p534Q365M758r639k278J1005p30j1791
1188f907M825R849o643q648R098O036j1620j892J1695n54j2993M777J1859p943
1202I39r663J0057P034j2562k403J2940p52j3348M791J2506q581r842J0356Q286
1216I758j3508l343J3694o24j3543L916J3056q395j0492J0409Q173j3089m424
1229h412J4249m7j3790L549J3560q439j1208J1274Q192j3116m963J4840m0j3598
$$ plain form
1124 -860 -1267 1504 765 197 -507 309 670 122 351 318 1288 -470 -127 1425 1934 -978 -1143 2923 1142
1143 1142 -1193 -375 3149 -44 -2354 1663 2565 -1957 -3127 3217 1610 -3921 -1543 3238 -440
1158 -440 -4675 1101 2815 -3226 -4651 3136 2278 -5529 -2344 4543 184 -6306 1480 4482 -3489
1173 -3489 -4605 4741 3766 -6359 -1956 6438 937 -6597 1768 6526 -3113 -5391 5614 4884 -6907
1188 -6907 -2082 7767 1124 -7524 1574 7610 -4010 -5902 5793 5239 -7754 -2977 8882 939
1202 939 -8724 1333 8367 -4195 -6598 6342 5590 -7758 -2967 9539 958 -8884 1472 9758
1216 9758 -3750 -7093 6601 5977 -7566 -3650 9406 1011 -9481 928 9101 -3988 -8412
1229 -8412 5837 5790 -8000 -4451 9109 670 -10538 736 8928 -4188 -9151 5689 5649 -7949
1243g949L172J3630p727j1226J1118Q126j2809n049J4647J50j3272L175J2236
1256H222o580j0875J0464P305j1333n244J3662Q55j3411L090J1635n923j0313
1269h446R532O836j0822m402J2147J561j2555K883J0437n072r521Q314P003j0434
1283b539l427J0508J465j1694K995R655m728q724P096O693r440l139R182J539
1297E442j0231J729Q777m367p274N789O101q195l142Q312J281q593O97Q446l929
1312H43o151M746N269o475k907O909R04o356K72O865k958m866L424M111m295k977
1328c642N194J060m795k52N249j527m178K594L128l144k359L862R07l541j28L292
1344A720n18l148J621J874r73k146K081J148k098m43J695O13k016M31R77L0j333
$$ plain form
1243 -7949 -4777 8853 1126 -10100 1018 9144 -3665 -8714 5933 6083 -7189 -4014 8222
1256 8222 1642 -9233 1231 8536 -2797 -8041 5621 6476 -6935 -3845 7790 1867 -8446
1269 -8446 1086 7922 -2900 -7302 4845 6406 -6149 -3266 7171 2099 -7422 892 7895 -2539
1283 -2539 -5966 4542 6007 -5687 -2692 6963 2235 -6489 607 7300 -2140 -5279 3903 5442
1297 5442 -4789 -3060 5717 1350 -5924 -135 5966 -2229 -5371 2941 4222 -4371 -3674 4772 843
1312 843 -5308 -562 4707 -1768 -4675 2234 3138 -3218 -2946 3919 961 -3905 -481 3630 -665 -3642
1328 -3642 1552 2612 -2183 -2435 2814 1287 -2891 -297 2831 -313 -2672 1190 2097 -1444 -1572 1720
1344 1720 1202 -1946 -325 1549 576 -1570 511 1659 -439 -882 813 1426 -590 -159 818 848 -485
1361d85N48Q06l58n52j66J262o06q68K35Q47j32j690J151J017p70j649J789P76
1379A155j951m17J664O35k512L49K152o08k739J633K540k634j449K822J161l794
1395a993J28M176j427l380J689L586l403j916L197J797m328m67M830j063m265
1410b839J628M868l942l217M655K130n526p53N833j194m736K034N049m218l495
1425c723M991K174n101j453O375p95n767K354N330l967m671O076K183o138r43
1440c075O763r67o715K927N664m371m920N917K799o324j222P162j079o869K671
1455a639N803l989n326O212L082o764j300O958l56p268K757N964m040m995N835
1470I34L224o803j208O777j17p111K370O487l947n479N424L456o357j327O518
$$ plain form
1361 -485 63 869 511 -41 -207 1055 449 -419 -184 663 531 -1159 -8 1009 239 -1410 379 1155
1379 1155 -796 -1213 451 1086 -1426 -1077 1075 467 -2272 -639 1901 -733 -2182 640 1801 -1993
1395 -1993 -1865 2311 884 -2496 -807 2779 -624 -2540 657 2454 -1874 -2341 2489 1426 -2839
1410 -2839 -1211 3657 -285 -3502 1153 3283 -2243 -2996 2837 1643 -3093 -1059 3990 -228 -3723
1425 -3723 1268 3442 -1659 -3112 3263 2468 -3299 -945 4385 418 -4253 1823 4006 -2132 -3075
1440 -3075 3688 2721 -3994 -1067 4597 226 -4694 1223 4022 -2302 -3524 3638 2559 -4310 -1639
1455 -1639 4164 175 -5151 1061 4143 -2621 -3921 3037 2681 -4587 -1830 4134 94 -4901 934
1470 934 4158 -2645 -3853 2924 2807 -4304 -1934 4553 606 -4873 551 4007 -2350 -3677 2841
1485B841j48o873K291O348l923m978N194L681o193j491O324l90o234J770O129
1500D348l761m720M703L686n493k014O073N0n914J317N828l201m574M150L402
1515C880m686k485N710K07n048P62N034k292m397L702K742m091k346N150M38m608
1531b328O35M367k090l710L235K623l528j975M141O51m352Q21L416j173l313K436
1547a44K258k727j753L223O50l305N43K748r35k787J848K135k328j237K478R22
1563A589k649N0K323p56j808Q84J680j321j063J413R36j812Q9J415k32j366K41
1580c87J653j106o92Q36O43r53n24J013P5n64k18Q95l62o62M82K62k85m45K23
1599a16N14k56k94n3M99k69k83oN15l22j61L45q6m89j75J118m81m16j69R45k24
$$ plain form
1485 2841 2693 -4180 -1889 4459 536 -4442 752 4433 -1760 -3251 3073 2683 -3551 -1781 4348
1500 4348 587 -4133 570 4256 -1237 -3251 2822 2872 -3042 -1725 4103 902 -3672 478 3880
1515 3880 -806 -3291 2419 2626 -2422 -1660 3374 1082 -3315 387 3129 -962 -3308 1842 2280 -2328
1531 -2328 -1693 2674 584 -3126 109 2732 -796 -2771 1370 2021 -2331 -1510 1906 733 -2580 -144
1547 -144 2114 -613 -2366 857 1507 -1798 -1255 1493 558 -2229 -381 1754 -574 -1811 667 1589
1563 1589 -1060 -1010 1313 557 -1251 -367 1313 -8 -1071 342 1278 -534 -445 970 738 -628 -387
1580 -387 1266 160 -532 304 947 -6 -530 483 558 -6 -224 671 309 -353 129 391 106 -339 -116
1599 -116 398 142 -152 -205 294 25 -258 -264 251 -71 -232 113 27 -462 -637 481 0 -416 -585 360 136
1620A36j230J161K68n29p54J555K0j454J97J297l99j332R95J056j484r73K075
1637F05K80j510l84K142l47k233J370J539j498j394K182N85k454J09K219k10k307
1654a306J223K054j936j538K335J066k681l76K717l24k749J019K558k059j790
1669a787K231J336k760j50K783n56k650J016K453j888k051K400J603l063l50K817
1685A384j50k986R63K596j823j830K235J520k786p75L063k89k682P21K801j933
1701B9k033K319J341k612o10K693k38k491J135K177j590k168K692J190k446r80
1717a592K802j06k726J079K364j492k118K256J502k479r58K512Rk493Q76K559
1733A995j564j954J711J733k600m31K241J18k423Q49K014j462j622J694J376k075
$$ plain form
1620 136 -1094 67 335 -194 -948 607 627 -827 -630 667 268 -1064 -69 987 -497 -1470 605
1637 605 885 -625 -1009 1133 786 -1447 -77 1462 -36 -1430 752 1337 -1117 -1008 1211 1001 -1306
1654 -1306 -83 1971 35 -1503 832 1898 -783 -1159 1558 1234 -1515 -496 2062 3 -1787
1669 -1787 444 1780 -980 -1130 1653 1097 -1553 -537 1916 28 -2023 377 1980 -1083 -1433 1384
1685 1384 1234 -1752 -789 1807 -16 -1846 389 1909 -877 -1652 1411 1122 -1560 -839 1962 29
1701 29 -2004 315 1656 -956 -1566 1127 889 -1602 -467 1710 120 -2048 644 1834 -612 -1592
1717 -1592 1210 1104 -1622 -543 1821 329 -1789 467 1969 -510 -1468 1044 1053 -1440 -564 1995
1733 1995 431 -1523 188 1921 -679 -1110 1131 1249 -1174 -325 1689 227 -1395 299 1675 -400
1749d00p76K153J18k250N11J882p88j707J414R39j415p26J761L28k107L86K014
1766A337j175j587J186J765k185n90J944K23j780J14J676p98j067N16J375j257
1782c03o47J199J40j074l6J332p7j209N55R49r86o34J152M94j357j62J344k95
1800C85p81M13Q69m46q76O98L06p77k6N54J04o31L43K28R2o41L41N32p00l6K63
1821B14M97p93l0K56K5l54J06K18O2l38j27M05j44j31R8K41k00n72M70J78k84
1842b03r4L32J14m67K62K73j23n64L16K83k23k30L83L18o95j39O69j04l09k9N81
1863C51k29m00K73L86l38l18L49M13p82j36J024l09q25M00P65p29l46R45J40p44
1883a10r1Q77k33q04M66N06m36o85P69M61r22m5Q30k85r47Q30N24p23n56Q79N20
$$ plain form
1749 -400 -1176 977 1095 -1155 -644 1238 450 -1257 157 1096 -319 -1045 716 1044 -1063 -677 1337
1766 1337 162 -1425 -239 1526 -659 -1249 695 918 -862 -748 928 130 -937 -421 954 -303
1782 -303 -950 249 389 -685 -721 611 534 -675 -120 829 -157 -791 361 855 -502 -664 680 385
1800 385 -396 17 886 440 -436 262 568 -209 -235 319 423 -208 135 363 455 -186 155 687 -13 -49 214
1821 214 711 -82 -112 144 169 -185 -79 139 201 -137 -264 141 -3 -134 -36 205 5 -567 -97 81 -203
1842 -203 -297 35 149 -318 -56 217 94 -470 -154 129 -94 -324 59 377 -318 -457 212 108 -201 -230 351
1863 351 122 -278 -5 381 43 -275 74 487 -295 -431 593 284 -541 -141 624 -105 -451 494 634 -110
1883 -110 -201 676 443 -361 105 611 175 -510 259 720 -202 -247 583 298 -649 181 705 -18 -574 305 825
1904H25j459K37R38j36j149P21M38m73r25J454L95j348k06R35J48r59M46O99o17
1923c6p98Q45P95j214j18J059j03j049J73J174o43r61Q88O54j090j19J067J76
1941G00j559L45J083m75p55P85P94j191k74J068O1r28O0R46n55o63O40O02q82
1960a98l37J363k87j016QJ246n46q85N53P91r08l27J000j05r32N9J248o57q15
1979g45O06N85l03p07R67n5r11Q9N96J16j063Q51L72n51m04N59L16p68J3O01J93
2000C57q57L66P15q41k24M35O47r31K2O52j06r02O30M02l80k99M09M52o93l4R2
2021h8K73k72k45O81k66m5J28J78k98k54N30j49k02l75R14m21p6j66M21r4l50
2042a76K31K1k25j88N84j28j76R4J94k28l85N10j30j86j6L84k84k6l2l4K48k51
$$ plain form
1904 825 -634 -397 541 405 -744 -23 415 -58 -983 471 866 -482 -688 247 395 -564 -118 581 -36
1923 -36 -834 11 806 -408 -526 533 430 -619 -446 728 85 -876 12 666 -424 -543 524 700
1941 700 -859 -514 569 94 -661 124 918 -273 -547 521 582 -346 -286 660 105 -558 82 684 -198
1960 -198 -535 828 541 -475 -467 779 233 -652 -99 692 -216 -543 457 352 -580 -521 727 70 -745
1979 -745 -139 446 143 -564 403 348 -563 -474 122 238 -825 26 398 -153 -557 2 318 -450 -437 164 357
2000 357 -500 -134 581 -260 -484 -49 598 -333 -311 341 235 -667 -37 365 -15 -314 95 547 -146 -180 -88
2021 -88 185 -87 -332 349 83 38 166 344 46 -208 322 173 -29 -404 510 89 13 -153 268 174 -176
2042 -176 55 76 -149 -337 247 119 -57 37 231 3 -382 128 -2 -188 -204 180 -104 -130 -162 -196 52 -199
2064a99K58j57r4P6n0K44j56k91K92J12k10j0K84j59J43k18K91m37K82J28j01
2085B8n5j20K53o2N5l56J87O0l32M1L66J67n10L75J07k77j72N18N8q67L17M24
2107B05q4j91K15K09k31m13M44Kk66L2K27Q8j98l08P22l39k97K24K95k89j72J96
2129G1K35m34o3O01m37k74L41K44m61o1M48n8l32n0L82j77l13J85L26n23l4P40
2151C56j01l62p4M00J3n00K59ok3p9N4K59m34k58O40m8j45Q9K32k70m04O30K45
2174D73p12L20K02j84l18J71M09j83q21M78O88p63O0O46N0q19K46M29k31p7M2
2195A06L05n97j55N76K21n25j61M87j2m55J60L23m30M5J40J62n48K86M13l25k16
2216b00K13N28n71l75L22K23l42L0N63m93j40J9K53r0n17O19J69m48M0N06l41
$$ plain form
2064 -199 59 -98 -192 -116 -166 78 -78 -369 -77 35 -175 -185 99 -60 83 -135 156 -281 1 129 28
2085 28 -27 -147 106 44 99 -257 -70 -10 -342 -301 65 232 -278 97 204 -73 -245 273 331 -536 -219 205
2107 205 121 -70 145 354 123 -290 154 156 -110 -78 149 237 39 -269 453 114 -183 41 336 47 -125 71
2129 71 306 -128 -191 410 -27 -301 40 284 -177 -238 210 152 -180 -230 152 -25 -338 -153 173 -350 -384 356
2151 356 255 -107 -181 219 232 -268 -9 -15 -38 -117 -63 196 -238 -496 144 96 -49 40 272 2 -402 228 473
2174 473 -239 81 283 99 -219 -48 361 178 -643 -165 523 -240 -180 466 516 -303 -57 372 141 64 106
2195 106 411 -186 -341 235 456 -69 -230 257 245 -210 -50 273 -157 -112 28 190 -358 -72 341 16 -200
2216 -200 13 541 -30 -405 -83 140 -202 -172 391 -102 -242 -223 30 -60 -577 42 211 -237 -197 309 -32
2237c2k73K10L49k81k46K41J30q8m03O28k50j05J25N7k14n6J23K83l03oJ46K84
2259C19m50L55n1j10j20M0K20j94j77J35L31n06k1M71j07l54L50j8Q3l10J28Q7
2281A01k23J63J08k99j96K24K61P6k91M5K07j76R6J45l80J6m4L34K5k69J60K63
2303C46j66k32M8J9J95l93J24K81l46J62j82K24l84J33K48K6l4j47K22j48P7q9
2325a6J99m07RN09k64j9L01j9m16n0K63ln4k11J95j12M1m0J60M8l79Q1L61j67
2349A0j11K27K5l89J42L24n4n12L13R4q0q6J34J22o20L52L41p0m77K16O10l94
2371A17l58N65j68m04Q8K29R8m46L83J28k51j77J83N7j92J10L63k11j56p4M57
2392C41k42l80K15K49k95m75P40m4k80J67L91m16k20K17O9l0k95L98J02k99P6
$$ plain form
2237 -32 -305 -95 254 -27 -273 -32 98 10 -393 235 -15 -120 5 62 -152 -208 -85 198 -105 -111 35 319
2259 319 -131 224 173 63 -57 -17 203 9 -168 -33 298 -208 -229 242 135 -219 131 113 196 -114 14 101
2281 101 -122 41 149 -150 -346 -122 139 215 -76 -31 176 0 96 241 -139 -123 -167 167 192 -77 83 346
2303 346 180 -52 -4 15 210 -183 -59 222 -124 38 -144 80 -304 -171 77 103 69 -78 144 -4 73 -16
2325 -16 183 -224 -215 294 30 11 312 293 -123 -173 90 87 33 -178 17 -95 -54 -94 66 114 -265 -184 177 10
2349 10 -101 126 151 -238 -96 228 174 -338 -25 69 -11 -97 37 159 -461 -109 232 162 -315 -99 511 117
2371 117 -241 324 156 -248 -160 69 167 -279 104 232 -19 -196 -13 44 -148 -38 325 114 -42 -116 341
2392 341 99 -281 -66 183 -112 -587 153 109 -171 -4 387 -29 -249 -32 37 7 -288 110 212 -87 -11
2413a1K82j88j72l0K17j94j21K24K72n36J73K11j81k05K23K30l31k36K72L86n92
2434c07R3M35j48j73k7M43j96m78K89L94o69K36N16l93j0j36O42l49l50K28K38
2455B78k92j59M45j32m62K42L45l71j11K08K75m32j11N53k44l18L04L4k7l61O23
2476B87ml78j30L08K30m78J0M19l59J9o6K40k55l34J039k62m73O8J96j00n8K25
2498A44K09k57j77L31m5l49J48J24K65m24j2O9R5k68Q2M44l90K42o2J6j97k09
2520b21M29o0j59r5P22n26k50K06J17k20Q1K26n2j35j67K47j2j67k10M07M4n06
2542c01J15K80r8j42J34L17l92n3J77p8M5m7J02j53K2J68K03l02r2L10j61P5l36
2565b07M93m74j75M15M4k27j19M26K4j06q9K11j93K2J83K07n32r7L45K2k44j29
$$ plain form
2413 -11 271 83 -89 -119 98 -96 -217 7 279 -257 -84 127 -54 -259 -36 194 -137 -373 -101 285 -307
2434 -307 -214 221 73 -100 -127 316 120 -358 -69 325 -344 -108 408 15 5 -131 511 162 -188 40 278
2455 278 -14 -173 272 140 -322 -80 265 -106 -217 -9 266 -166 -277 276 32 -286 18 52 25 -336 287
2476 287 283 -95 -225 83 313 -165 -155 264 -95 -76 -142 98 -157 -491 548 286 -187 -119 77 -23 -81 144
2498 144 353 96 -81 250 205 -144 4 128 393 -31 -43 26 121 -147 -65 379 -11 231 169 185 -12 -221
2520 -221 208 148 -11 -106 616 90 -160 46 163 -57 24 250 198 63 -104 143 131 -36 -246 161 205 -301
2542 -301 -186 94 -4 -146 -12 305 -87 -140 37 -41 4 -43 59 -94 -72 96 299 -3 -95 215 54 129 -207
2565 -207 286 -188 -363 52 96 -131 -250 176 200 94 5 216 23 45 228 435 -97 -194 151 173 -71 -200
2587b00L46k01Q9q2J57L0k96J88J69l01p8L91l93J01M0K74l54p8L66n3l61m2L97
2610A09j28L9m2L78l97k38M96p3k02P2j01K54k63K77Kj50k29K53J06j49K32l74
2632a28K69k95K74j77k2J9L5J33k20l3K68K91m57L4K92l30n5m3K00q9j93P70o46
2655a03k57J25L65jl96L24K40k53l63L28J10m19L32K17j77j16j06L38l25%K40
2676A03k96J00l1L17n6j90r2M18j49l81K11q1J63m11O22j11j95M2K30l37k00L23
2698aJ06k92j3K08K9j67M2K30j37k10J39L62o95K82K33j36j37J78L64o53m6K20
2720i4R9r0k9o1M05m49N5J50K35l1k67J59K02m11M83l88J9k00J26L57l51j73M24
2743A70o6q6K7O4l3J98j70k98p0J85J61l8k40K41J63k66j18K92k33J78l4o1K0
$$ plain form
2587 -200 146 -55 34 -48 109 139 -157 31 200 -101 -179 212 -181 -80 -40 234 -120 -198 168 115 -246 -288 109
2610 109 -19 20 -22 356 -41 -279 217 144 -58 14 -87 167 -96 181 183 33 -196 57 163 14 246 -128
2632 -128 141 -154 120 -57 -79 -60 -25 108 -112 -145 123 414 -43 -9 283 -47 -102 -145 55 -34 -227 543 -103
2655 -103 -360 -235 130 129 -267 57 297 44 -319 9 119 -300 32 249 72 -44 -150 188 -137 -137 103
2676 103 -193 -93 -124 193 137 -53 -145 273 124 -257 -46 -127 36 -375 247 136 -59 -17 213 -124 -324 -1
2698 -1 105 -187 -200 8 37 -130 -88 142 5 -205 -66 296 -399 -117 116 -20 -157 21 385 -268 -314 -94
2720 -94 5 -85 -114 -175 230 -219 -164 -14 221 190 -77 82 284 -127 356 -32 -13 -213 -87 270 -81 -254 170
2743 170 104 18 45 109 76 274 104 -194 -264 -79 82 44 -196 45 208 -58 -176 116 -117 61 27 -34 -14
2766a4k80K43M00k62k31J62l3P8k03K71l1j94L55j45l4j86N7M04o53M43l11M00
2788B36k81p2L0Jl7j6K32L4m44M17l0k21P8L53l29j12L30o0j36k14K06K33o17
2811d19L24O4L1K6k8o9K13l10J29J88j00k08RM28n17L78M2ll51j01M56j01P2r0
2835F3J96l10m8K04l00j43R9J70j24n7J65L19k14j74o9K58j09Q4J99o21M83L8
2857A09k18J10j21K42j17J17l30M09L4l48j44K22J25k40L45qj17R8j64j26l1J98
2879D5j9Q5J79k04R0j87j31M55l31j07J60P7j96J73k06J43J3kj49J74o8L1J53
2902A78k09j88L06qj63m9J59pJj12J32j24J69l51K69j9n3J07l4j6QM0jM3J05p4
2928A09m9j1j83J96j10J16J15j05j08k4O2J48qj45j2J36k26J98lj74k19M52P9
$$ plain form
2766 -14 -294 -51 349 87 -144 18 -15 63 -140 131 100 -94 261 116 82 -104 -47 357 -296 147 -164 236
2788 236 -45 -117 -87 -86 -123 -139 93 127 -317 100 70 -151 -73 280 -49 -161 169 109 -27 -241 -35 198 -419
2811 -419 -95 -31 0 26 -2 -71 142 -168 -39 149 49 -159 -150 278 -239 139 181 178 -173 -274 182 81 153 63
2835 63 259 -51 -99 105 -195 -338 -239 -69 -193 -250 -85 234 20 -154 -223 35 -74 10 209 -412 71 109
2857 109 -109 1 -120 122 5 122 -208 201 235 -113 -257 -35 90 -150 195 187 70 168 4 -122 -153 45
2879 45 26 111 290 86 176 -11 -142 313 -18 -125 35 112 -84 89 -117 26 39 37 -112 62 -6 25 178
2902 178 -31 -219 87 79 -84 -133 26 19 20 -92 40 -84 85 -266 3 -16 -69 38 4 -12 -4 36 35 78 183 109
2928 109 60 49 -134 62 -48 68 183 78 -30 -54 8 156 148 3 -9 127 -99 99 96 -78 -297 155 234
2951B34k48k41L27j53K03k02M07l13j70K47J92l78j34K20Oj01rj7pM0J52J40j92
2974Cq6M30ln59J58K51l34K28j3J85l96L18j73J90k45K61k45j58M35l70J97j50
2996g6j65K93n5l21K14J87J48l34K68o9k10K30K2k85j8l24Q89j39l84J35K05J0
3018B21l66J31p6j12M2K86j7k78o3M14j59k36K34M3l03J72k2J02J5k8P7K7o3n8
3042a7rm3JK6J22k39l3K75j93k33L04M9M4k31J52OJ12j42J29J98m83K9J58j39
3066a57r7M00j26j89P9n7K58l6k09L16l18O5OJ31p4j08L79n19M12j99n5M7J67
3089A16N6J48m52R2J67j73j06K36m8j24J4n3J39o3NN9N9l3L4k4j60J23K26j17
3113A21m07M65J3l68N9J01J44k37J58p2q5j50K49k35J85q7K35j91l9J60k38J07
$$ plain form
2951 234 -14 -255 72 -81 122 -80 327 14 -156 91 283 -95 -229 -9 -3 -104 -113 -130 -137 -97 55 195 3
2974 3 -83 347 344 -215 -57 194 -140 88 75 260 -136 182 9 199 -46 215 -30 -188 247 -123 74 -76
2996 -76 -241 52 -3 -324 -110 77 225 -109 159 90 -120 110 132 -153 -171 -495 394 255 -129 6 211 221
3018 221 -145 -14 -90 -202 -160 126 109 -169 -232 182 23 -213 21 64 -239 -67 -89 13 28 0 77 104 41 -17
3042 -17 -26 -69 -68 -42 80 -159 -192 83 -110 -343 -39 10 54 -177 -25 -19 93 -49 80 278 -205 -176 -18 -157
3066 -157 -254 146 20 -169 -90 -147 111 75 -134 182 -136 -71 -65 66 -8 -116 263 -256 156 -43 -98 -51 116
3089 116 172 320 -132 -40 127 -46 -152 84 36 -88 -74 -127 12 -51 -46 13 72 39 73 49 -111 12 238 121
3113 121 -286 179 192 -176 -117 -16 128 -109 49 -23 -108 -258 -9 -244 -59 -146 89 -102 -141 19 -219 -112
3135a12J74j35l6J49O9j60J32m3r9j26K29n9j88q4J15M31j84J5N3k8j29K9pJ60
3159A66j81j94K80j5j40N3J88r6M1Q9O8k4k20K51l73j7O9J93l13J95q5K16j90
3182c9K8J99l21J94j18N6P3m4j28P9K75k08M9o7j22l47N59k40K64k37J23qj62
3205a42J65n2l8M9NL3j25O4J9K0O1r4JM9k7K08k52J50pM1j80J16m03J73K42kj86
3232a12Q8L9m0j8j18J98k70M0J33N6K30j43q5J35m1j68Q3j21J68O2L1j35MJ68
3256A84j48M3j5m5j55L15j88J15o4j32L2R3p7j07K67o5jq7j89L24j8j69L13q8
3280A38k79k18L82J18jk68K86j72l46M68k67k10K24P8J47o6o2J12j88j78N36j80
3302E4n1M5j95k7J33j6r8K05n1p4Q1mJ07j81Lj12j90K41J95j44j12J9M03j87J92
$$ plain form
3135 -112 62 -73 -109 40 109 -51 81 38 -61 -187 42 -17 -205 -289 -174 257 73 88 141 113 -16 13 6 166
3159 166 -15 -209 71 56 -84 -31 157 61 102 191 259 235 15 266 -107 -124 -55 138 -175 20 -65 151 -39
3182 -39 -11 188 -133 61 -57 -1 72 28 -100 -21 254 46 95 28 -94 -441 118 -122 142 -95 28 20 -142
3205 -142 23 -29 -67 -18 -13 20 -105 -41 -22 -2 59 -35 -34 15 -12 196 -56 94 87 128 -52 64 -339 -166 76 74 -112
3232 -112 -24 15 -25 -43 -161 37 -233 -193 -60 -4 226 83 -2 133 92 -76 7 -114 54 116 147 12 16 184
3256 184 36 79 64 19 -136 179 -9 106 42 -90 -58 35 -42 -149 118 53 52 -35 -224 100 82 -87 226 138
3280 138 -141 -359 23 141 140 -128 158 -14 -360 108 -159 -369 -145 -67 80 14 -48 64 -124 -302 234 54
3302 54 3 48 -147 -174 -41 -57 -155 50 -1 -75 6 2 109 -72 -69 -181 -371 -130 65 -79 -191 -172 231 44 236
3327B36r9j30L04m01J24j62J03Q5j46K13M5j28p4J78l03J69l53M84j24p5m1K22
3349A27j31M0k5l1j1K30j89m6O2J2j68m4N5J67j68Q8j1qK34l46L79m14L9J9J25
3374a5j90L23k4J15j85J18r8J71k85m0l9J17j89L92j16j00K80j07J24m66M77k79
3396a6Klj36J67o2o7K29l54R6K40j12K32j84O3m3R0q7Q3j12r1j34N1J89o2L9J74
3422A92k19J68k4k25M29l28JR4p4P4l95K4J91J8L8N6O2N3j51k0Q2j53N1R7l8r2
3448h9K96k79%J65J09j66j00P3l4J64qN2r6lj38M2N8q6N7m9J16j50Q6J88j11q0
3474A7k35L47P1o1j69Q2P7r7r2J99l69K13j91L9L38j45Q5k18N5J16P0k15K46l28
3498a65K41O2m08J88j6Q5q8J8K26k32J06q9J12j56O7r6N2K80l51J07J3j2k5Q4
$$ plain form
3327 236 137 7 311 -90 34 -128 -25 60 -86 127 172 44 -30 148 -155 14 -339 145 21 -54 -95 127
3349 127 -4 36 11 -20 -31 199 10 -36 26 38 -130 -174 -119 48 -120 -32 -43 -51 183 -163 216 -198 -159 -140 -15
3374 -15 -205 118 94 209 24 142 44 215 -70 -110 -149 -32 -221 171 55 -45 235 128 252 -214 263 -16
3396 -16 -14 -17 -153 14 -48 -115 114 -240 -144 96 -16 216 32 95 52 142 55 138 26 -65 -199 -148 41 -21 18 192
3422 192 -27 141 117 -108 321 -7 -6 88 14 88 -307 -283 -92 -74 -36 20 82 135 -16 -36 46 -107 -56 41 3 -89
3448 -89 207 -72 -72 93 202 36 -64 9 -25 139 131 183 87 84 -54 -12 46 -40 17 -32 84 -66 20 208 97 17
3474 17 -218 129 200 139 -30 52 129 32 -60 139 -230 -17 -208 -169 169 24 109 -109 -54 62 132 -83 163 -165
3498 -165 76 138 -270 -82 -98 -13 -101 -83 143 -89 17 -72 40 -116 -49 -145 -93 187 -164 -57 -44 -56 -81 3
3522Cj29J89MR3k10j9Q3J32k11k36K95j82K22P0j89oM2J13l2j53j23K77J85m5
3546A73k98J60k11L1K89n9j86J21j07J44J5j18O7j10J78O1R8k99K14jk88J05l1
3569e2Q3O6k13K98q4K6k26R7j50O9J58j10r9K94k24J0J63k04J99m9j71K9M8J90
3593A48j94m2J82n7o8OJ77j43m3O6J44k06n5OJ9n2K38j25p7J4O1o8j57K51k28
3618b03L79p8j28R0K8J69j41p7j16r5P6J23m3L6k33K21L11k33k33J18J46j19M7
3641D5k91M46j37j25R7j68J64j49J67l7K41j83j37J48l02L56r2k16K93k61K44
3662A03M5n5K97m98Q8J30k58J93k2N8n4K28k14J27j11j69J90j17J15l26K40R8
3684H8O9M2k91J94j23j03L05k08j4k13K17J56j13J2m5K04l12L48o21M70k76M3
$$ plain form
3522 3 -126 63 67 160 -50 -69 14 146 -65 -301 -6 -188 34 104 -85 -91 -49 64 32 -121 -244 33 218 173
3546 173 -125 35 -176 -145 144 85 -101 20 -87 57 72 -46 21 -89 89 150 248 -51 163 162 -126 -21 -52
3569 -52 31 97 -116 182 98 124 -102 -5 -155 -86 72 -38 -137 157 -67 -57 106 -98 101 52 -119 -90 -42 148
3593 148 -46 -88 94 37 -31 -25 152 9 -34 32 176 -30 -85 -79 -60 -112 126 1 -76 -62 -1 -69 -226 25 -203
3618 -203 176 98 -30 60 88 257 116 39 -77 -172 -96 27 -16 20 -213 8 319 86 -147 -29 117 -2 45
3641 45 -246 200 63 -62 35 -133 31 -118 49 12 253 70 -67 81 -221 135 43 -173 120 -141 103
3662 103 148 93 390 -108 -20 110 -148 45 23 81 27 255 41 168 57 -112 78 -39 76 -250 -10 88
3684 88 157 199 -92 102 -21 -124 181 -27 -41 -254 -37 119 6 18 -27 177 -135 213 -408 62 -214 -171
3706a71M20m27N59n37J03J99r0o3p9K96k19K28j03k50J26q8O7J25k19K59r3j03
3728f0J04K12k31k64M5L64j74J32J6k73k24L37P0q2O0r6J31j63p8L8k15M43Oj2
3752H6Mj35k00J76j30K68j2k53J27j04P7j2k7K73l94L63J6l05L16o0j32p9K10
3775G3N6k38j43K56K92l16m6J77o2j67K50j5j82p7P6jN5j38K31J09j53P7o7J48
3799A95l1j09m0R6j98k81N11J14m07J34o5j3j5m9O3L2J21j24o6Q6J28m8J2J48
3823A94n1j01l6J62m8K2m31J53J21j21L49l89K30J26j27K59n78K23K04j70JK24
3845B16k08Rr1J12n3M4m5l2j20J17k9k0kO4J66L7n11K99N2J39j77J32j14L15m09
3870a09mK10m3R0l0Lj27J97j71p0L6j4K42P6k77j8J7J76p1j92L2J48j54K38p9
$$ plain form
3706 -171 249 -178 381 -156 -53 146 56 -7 -86 210 -9 219 116 -134 -8 -96 -29 96 -123 136 43 -60
3728 -60 44 256 25 -239 -194 170 -4 128 144 -129 -353 -16 54 -28 32 -64 67 -96 -174 -136 -351 92 98 86
3752 86 90 -45 -245 -69 -199 69 57 -196 -69 -173 -96 -108 -135 138 -256 107 123 -182 134 74 -58 -137 73
3775 73 129 -109 -252 4 296 -20 -66 111 49 -118 132 117 -65 -142 -66 -67 -12 -150 81 190 37 114 47 195
3799 195 164 55 15 111 -87 -368 143 257 -150 -16 -81 -94 -109 -158 -95 -63 58 -66 -132 -46 82 34 46 194
3823 194 143 42 6 168 120 142 -289 -136 -15 -136 213 -176 54 180 53 312 -266 -43 161 -9 -8 216
3845 216 8 17 -74 38 -15 29 -16 -48 -168 -51 -80 -100 -102 -38 128 165 -346 -47 5 144 -33 99 -15 300 -109
3870 -109 -113 97 54 144 114 117 -10 187 16 -54 -18 -32 210 286 9 -9 8 184 113 -79 -47 101 -53 185 106
3895A06j87J84k14l2K63k61j65L11n5n2J04j37Q4J27k46MK39l3j26o4J39M8Jj41
3919a03J1p6L02J3p0K7q6O7j48O0r8K23k2k44L10o8r4Q8j55J81J6k93M13m03K31
3944H2k64K33o4J34k11L42j41R8j4P9k12j3k54K63K95k73P2q2L5K35l01j14k70
3967c45K30J48nj96L5M2K14j81M1l0O4k31K78j7o0m9K73j07o6j44K08j06J59l20
3991a65J07K94j61p7k77J34J84o7k83p4N24N4k36P0o0N5k36L30j1n2m8m04K85
4014a14K54n5k17J27K53k55j10L8J32J72l92K89k06K46j09L1j18Nj73J05J86j03
4036a4L0M01m41L2K8j22J28J29k94K19Q3l72K80j72K05k9Jm5m0k45N78l87PJ39
4060I9Mm58M38o8P2n0Q4k44R4J77k96J35J75k21J90j35m5pJ96r2J21j16q5q4J72
$$ plain form
3895 106 -81 103 -111 -143 120 -141 -306 5 -50 -102 2 -135 -51 76 -170 -166 73 40 -86 -150 -11 37 38 -103
3919 -103 -92 -168 134 147 77 104 18 85 -63 -3 -101 122 100 -144 166 98 4 92 -63 118 134 -159 254 -149 82
3944 82 -182 51 -13 121 -90 252 111 209 195 274 62 49 -205 58 353 80 152 70 105 340 39 -75 -345
3967 -345 -115 33 28 -168 -133 -91 123 -58 -17 -47 17 -214 64 47 -13 -62 211 104 38 -106 102 -4 155 -165
3991 -165 -58 236 75 -2 -279 -145 39 -28 -311 -385 139 193 -43 27 -33 22 -214 116 105 53 5 -399 -114
4014 -114 140 85 -132 -5 248 -7 -117 -79 53 225 -167 122 -84 162 53 84 -34 -29 -202 -97 89 -14
4036 -14 16 417 -24 8 36 -86 42 171 -123 96 179 -193 87 -85 120 91 92 47 7 -238 340 -47 -40 99
4060 99 103 -355 83 15 87 37 121 -123 -29 148 -148 -13 162 -59 131 -4 -49 -56 140 48 169 53 -32 -116 56
4085E6J40j99j7R2l2j63L8J33l17L11K7j4N0k44J82k5M4k0j10L8J28j90J53kj4
4110D5m8k86M9K23o2lK1j27K65J87k00P6j75L89j92r5J44j64k1l0qj46L26j4k93
4135a39N1J90k69K75j98oK16j41r5m3J35n5J84o6O5j8k64J02J28j12kK9J93Rm73
4160c04L02M7j32m2K24p9P0L9j87J69j92J53m25N86l71Q1P3J43l16j73J15J55
4182f4mn4L82m17J85J42j62j88J0J93P5Q9j93k15O7J05R3K18l08J5m8k02M47n8
4206A08lj48J58J5j37j26L91k19j4q8J8J13Oj58R0k55J89m4o7K31p6k76L71J7
4230I6j30K20l96J57L07k48J35j19j76J57J59j11j78M0L8K39j77j6j44K51J23
4251B27l34K52O9k70J26k5j0J17j05p2m3L1j06P8k39L52J98l21P6K4J33k13J60
$$ plain form
4085 56 196 -3 -20 72 40 -123 -85 48 -269 42 69 55 105 -139 43 18 62 42 -68 -30 98 -92 61 59 45
4110 45 -3 -289 -240 -17 -79 -82 -61 -188 77 264 64 140 -35 354 162 67 211 47 26 -4 -12 -158 168 154 -139
4135 -139 -88 102 -167 108 -90 -96 120 -21 -116 -159 -24 -79 105 39 104 86 -178 -76 52 -60 -62 -33 160 169 -304
4160 -304 -2 45 -87 -129 95 16 86 125 -62 107 -85 68 -357 229 -142 -61 12 155 -161 -334 -219 -64
4182 -64 -68 -122 260 -157 28 170 8 -180 -170 23 98 187 -6 -221 -154 -49 44 262 -46 -31 -79 -281 166 108
4206 108 105 -43 115 130 -7 -133 258 39 25 -63 -45 68 74 -84 6 -249 -60 -104 -171 60 -16 -292 79 96
4230 96 -34 186 -210 -53 254 6 141 22 -154 3 162 51 -127 -87 -49 190 13 -3 -147 104 227
4251 227 -107 145 214 -56 70 45 35 152 47 -25 -68 -37 -143 -65 -304 48 246 -75 1 25 158 -55 105
4274A05J6Pl10L45o8m04K04J96m1K8l04J83Q8l12K95j3j60K93p8nj34n8J84k2
4298C5J46j81J91k55M2j9pL08m01j0J15J64k18J51J04r9j11Qj06P7P8j52K35J52
4322B47l0l31L46qj78j40R9o7o0N7K71k8m16M34k62k81L63l5L0o9R7n2O9r9J74
4347A31j39k95J89J42J05p8J36j01k98m9J51K70k96J90r7K31j73N9Q3j76M1J4
4369D0J21j16J05k52j35K07J82o4j71P0j52J70rK33k86J4j87M14J38J2K9l85Q0
4392E8r5p0k24J95M24m22K40j2j16o1J94j58J68Q1j95L0J0L8k4o5l0O6j59n9L17
4417A31l26L67j06M8J0j68L4L5n2j27k5K16Mk91K96l9n2J12k01j01N71j69kj72
4441gj7OJK63j24j63l89M51k77L63j31J6p1L9L04k43J6R1k43J10qj18J06j12K04
$$ plain form
4274 105 121 128 -182 163 95 -309 -105 91 50 78 -226 -43 45 -267 28 15 -145 148 70 65 -69 -127 57 35
4298 35 181 0 191 -64 -22 -41 -48 260 -141 -151 -36 128 -90 61 165 66 -45 -37 -143 -66 12 -140 95 247
4322 247 217 -114 232 224 46 -94 5 -62 -122 -65 206 178 -238 196 -66 -347 16 -19 11 -58 39 -13 56 -43 131
4347 131 -8 -303 -114 28 133 55 191 90 -208 -257 -106 164 -132 58 -39 192 19 78 161 -15 26 40
4369 40 161 45 150 -102 -237 -30 152 88 -83 -13 -165 5 -4 229 -57 -43 -230 184 322 334 363 -22 58
4392 58 -37 -107 -331 -136 288 -134 106 94 -22 -83 111 -47 121 202 7 37 47 85 61 -4 -34 32 -127 -186 131
4417 131 -195 172 66 114 124 -44 -10 25 -27 -154 -179 37 41 -250 46 7 -45 67 -134 -235 336 167 165 -7
4441 -7 -24 -18 -17 246 122 -41 -430 21 -256 107 -24 -8 -79 -40 264 21 37 128 -115 -5 -13 -131 -25 -137 67
4466F7qK9j36k6K55m24L87J00p2n5o0R1q6j53j09K97p7J40j63J53l00L78m8o0
4490A20j77J66j07Kl2K3kj69L43K2j18j63J6L5r9n9N89n96M18l5n8k58J11R2o0
4515DR8p0M8k25Q8L1k4K5L32k90J55j11m3L66k37q1q2Pk07J62j24J62L1k20K30
4540B5j12J5q3O9O7J78r0R9p6p9N6n3N6O7k29J76l35J76j16J56j40P3K10j49m
4565d3M7J79q9J22j83qj14J07n1N6Oj53L4J42l0L9Q7r3o7j40J20O4J23K4j82R4
4591I1j67j80K21L3O7k88L08L5j43r4J13J0J56o1l6K2j55M7j02j48K32J01R0J23
4615B75k90M2j69K74k9r1J77l11L34j12M5M7j14j56J36m3k04L04Rj46M2K8J4K69
4639C31m42J82J41j36l3n6J74jj59J77j27j38J49p2r9P2P0Nk82K79n7r9J91mq
$$ plain form
4466 67 59 88 -48 -74 181 -243 144 244 172 117 57 148 62 -91 -200 97 20 160 -3 150 -150 228 180 120
4490 120 -57 109 2 4 -28 -5 -7 -176 167 189 71 -92 -76 -41 -140 -199 390 -206 212 177 119 -139 -28 64 4
4515 4 102 32 80 -145 -57 -26 -50 -25 307 17 172 61 18 384 147 66 -16 -9 -216 -54 -178 -16 15 -205 25
4540 25 -87 -72 -155 -86 -19 159 69 168 92 13 69 16 72 139 -90 86 -249 -73 -189 -33 -173 -100 110 -39 -43
4565 -43 4 183 94 216 33 25 -89 18 -33 23 29 -124 -90 52 22 61 148 55 -12 -152 -32 32 155 179 -3 91
4591 91 -76 -256 -35 -2 65 -223 85 120 -23 -117 -4 6 162 101 65 87 -68 -21 -123 -271 -39 62 152 275
4615 275 -15 27 -142 132 103 12 189 -122 212 100 145 192 78 -78 58 15 -189 115 124 -22 20 48 62 331
4639 331 -111 71 212 76 43 -13 161 160 1 178 51 -87 62 -10 -109 -37 33 38 -244 35 -22 -121 70 66 58
4664E8l6P6j61j42N84l27J6j16R6mk19K59O9K1l62J36J33m8K52k82J8n2J28l55
4688b58L18o5N1k6P4l44P9L14j47O5J03r1jk09J82N2k91J04Q7r8o4O2K28j24o
4713ep0N6J58k94K15K06m91J25R6k5K7r2J80j01j13K59k86K61J1l6J6Nj65K4J16
4738G7j21K66j96QJ1j2J3p3J32o6o4K04J10k49k21Q9J96p5j19J33pJ78l07K44
4762A51k56k65L50n6J21P1l84L65o8j88P0J50j80J58J54k07j03J1K95j88k5L29
4784C05m66l8L99m0l61J10L06m1j53j01o9j7J67m6P2j59J55J68k97J09P8M9j90
4807f0m2Q0J94j90rK4j7j81J07J47q7k26K44J19k21O5J36j27K41k70j5oo2J03
4831e3L2J87k83M03j68R6m56J27J27J4k34L46l95M73%l22O2m5k78L54m9j46M93
$$ plain form
4664 58 22 98 -63 -205 379 52 68 -48 48 44 -175 84 153 174 -188 -52 81 33 285 3 21 -31 97 -258
4688 -258 60 -5 46 20 94 -250 -171 143 -4 61 164 73 72 -137 45 97 -194 -90 -3 -101 -165 -103 125 1 -5
4713 -5 -75 -19 139 -155 60 266 -225 -100 -4 -29 -2 -94 86 -15 -128 131 -155 106 117 81 97 102 -63 -39 77
4738 77 -44 222 26 34 45 33 46 -27 105 39 -25 179 289 40 -181 -92 104 29 -90 43 36 214 -93 151
4762 151 -105 -370 -20 -76 45 116 -268 97 29 -159 -89 61 -119 39 193 -14 -117 -106 189 1 -24 305
4784 305 -161 -199 200 160 -201 -91 215 174 21 -80 -149 -166 1 -45 27 -132 23 191 -106 3 81 130 -60
4807 -60 -102 -22 172 -18 -27 -3 -20 -201 -94 53 -34 -260 -16 103 -118 -53 83 -44 197 -73 -88 -94 -156 -53
4831 -53 -21 166 -117 286 118 214 -242 -115 12 26 -208 138 -257 216 216 -106 -44 -89 -367 -13 -62 -208 285
4854B85k80J34j04p1J01k0pj93P3J43l11L60j46J7J5N5j9K26k45j18kP4M9N5p9
4879hj46J99k21L05j78L0K24l94J84m2q7O6j8kK11n6p7k9j77K13K74l14J81l3
4903A05R3p0l64L42k68L10q8l6k04J84R9j82K38k26J61p4N5K5j23J63n4o2L2q0
4927b4J74l28K09n8R5J39k02J05j65L1q1J15Q0n5K5n5J8j67N0J30k2K80l33l7
4951g6L16k37R8k41J80J13l44K01l59K55K04j41J14j19j38J89K3k8P5j24j5o7
4973a21J27k57K69j49J04j27M3P6K04m01J70M0k68L30Km4j47R7j53K30j28nq1
4996a89L64j70R8l46J92K97l52mL99k45j25J32k28J49L2m0j4M8j70K68j66kO4
5019hk0j35M21n63J65P2q9K98j28Q1l8R4o9k46M9J67Lj68M6Ml5p9J39k61J70K61
$$ plain form
4854 285 5 139 35 -36 65 45 38 -155 -82 61 -250 110 -36 -19 -4 51 32 258 13 -105 -107 -33 16 71 -8
4879 -8 -154 45 -176 129 -49 -19 205 -189 -5 -47 -134 -68 -86 -88 123 67 -10 -39 -216 -3 271 -43 138 105
4903 105 198 128 -236 106 -162 148 60 24 -180 4 103 -79 159 -67 94 20 75 100 -23 140 86 24 56 -24
4927 -24 150 -178 31 -27 68 207 5 110 -55 -24 -105 10 90 35 60 5 23 -144 -94 36 14 294 -39 -76
4951 -76 240 3 101 -140 40 153 -191 10 -349 -94 110 -31 83 -36 -174 15 38 10 85 -39 -54 -121
4973 -121 6 -251 18 -131 -27 -154 -111 -35 169 -232 -62 -22 -290 40 42 -2 -149 -52 -205 25 -103 -108 -189
4996 -189 175 5 103 -243 -51 246 -106 -110 289 44 -81 51 -177 -28 4 -36 -50 -2 -172 96 -70 -72 -8
5019 -8 -28 -163 258 -305 -140 -68 -157 141 13 94 56 150 81 -165 -116 51 54 -114 -68 -64 -99 -178 -39 -300 -130 131
5045A31l03m1jJ91L7j17J02l5J98k97Q3k2J05P6J16j23j89K80p7r2q0j54K51Q0
5069A19M4M1j43J75k41j22P0n3J37O2Q0m20K14J23k68J65Ok43L45j73oJ30r8K81
5093B25k82J44k7K0k23M3K80k9j40k35K43p4p9K55m4j63J54j43o0J16n2n0l6K15
5117E8qm8k40L37J53j43j03n9q5J67o0jj7l9PR6k00J74j11L75j58j56N3q1K5N9
5143eJ76m59N92k30O0k98J53J11j66j4r2K95o2q7K8N4L3k08K53n7J58k17j49L70
5167B39j96n7L7j46L1J55r3K56l63K00%j11j40m0R4J98Q9k6j6mr7M8k1j27N5J3
5193b2L36j60m54L32k07J58j26J50m2O9j32K74l66K90j29j30K60l07K33M0J12
5214A79k25K1N7j11Q0L4O1j18R7r5RQ1j42l2J97j72m3K02K5j03J52j22j86K88
$$ plain form
5045 131 -172 -213 -214 -23 14 -103 -1 -36 162 -135 -52 -74 31 107 223 100 -89 191 114 22 -58 -212 39 119
5069 119 163 204 61 236 -5 -127 -57 -110 27 89 169 -251 -37 86 -182 -17 -11 -254 91 -82 -88 42 -56 225
5093 225 -57 87 60 80 -143 -100 180 151 11 -224 19 -55 -134 121 77 -86 68 -75 -135 -19 -71 -121 -157 58
5117 58 50 2 -238 99 252 109 6 -53 -138 29 -31 -32 -49 -88 -81 15 -185 -11 -122 253 95 -61 -8 -89 -64 -5
5143 -5 171 -288 304 74 134 -164 -11 100 -66 -80 -172 123 61 -26 2 56 89 -119 134 77 235 18 -131 239
5167 239 43 -14 23 -123 -92 63 -30 226 -137 63 63 -48 -188 -228 -134 64 153 127 111 107 10 58 37 -90 -35 -22
5193 -22 314 154 -300 32 -175 -17 -143 7 -35 34 -98 176 -190 100 -29 -159 101 -206 27 67 179
5214 179 -46 -25 32 -79 1 35 96 -22 75 -20 -11 70 -72 -104 93 -79 -122 80 105 2 154 32 -154 134
5238A34m0j54J9P5j36o7K40L53n20k86L65j33K33K08m08J71j8l09K76J17j44m8
5260g2J95K1j94J68l3j81j49K43n1J42k46K51P3l74L53J0N5k16j56K35r3N7R5
5283A33j39Q4O8l6p1J34k99J24m57N87j80O6l1m1K02J11J31l56l8k0r5J26K4k17
5307a90L18n8j58J72J44j83O7K9j58J16J4n8J6N8j22L0j56M54j69k75o6L24o2
5330H7Q4j60j88J07nK76l55J54L18k30J4K0pk4k37K69J5N8k4k08k40L03P2k64
5354a65P3o7J08L97k05Jl04J18J93j25k92L17j22P6O5j11J36p3l6J03r6J80n7
5377A14j49J85k8k37R3j71R3K88O9k54nO4k71K33j69J13r6K16m25K92M6J22k22
5400i9m4J81j01K00J08k69NL8r4k9M0j78M0J73N2K3j15o1K71j09k8l1Jn8o8J95
$$ plain form
5238 134 94 -60 -41 34 -102 -169 71 424 -96 -382 -17 -150 83 291 -117 54 36 -273 3 120 -24 -72
5260 -72 123 144 -50 118 85 -96 -245 -2 -53 89 -157 94 167 -207 146 156 211 -5 -161 74 -19 38 133
5283 133 -6 78 146 110 39 173 -126 -2 -459 128 -52 14 -17 -58 144 255 386 30 -8 -28 -123 3 27 -190
5307 -190 128 70 -88 84 228 45 112 141 -17 99 113 55 71 129 7 37 -119 335 166 -109 -175 149 87
5330 87 171 11 -177 -70 -75 201 -154 0 318 88 102 122 115 91 -146 123 138 196 172 -36 -276 27 99 -165
5354 -165 -92 -159 -51 346 141 142 -162 -44 149 24 -268 49 -73 3 68 -43 93 20 -16 87 -9 171 114
5377 114 -35 150 122 -115 -22 -193 -100 188 257 3 -2 62 -209 24 -145 -32 -128 88 -337 -45 1 123 -99
5400 -99 -143 38 -63 137 245 -24 -19 19 -75 -104 -64 -242 -202 -29 23 46 -69 -130 141 32 4 -27 -26 -84 -152 43
5426D3j68P5K33l27K43j27r4O6Qk9N0J6L09k53pO4J07K4k03K6k60K25L1j19J3
5451e4j02J76j20J64j1o3K07j66l3p6O1j5j56J52k42J21L2Q9J29j46Q1J12l10
5474a70R1K33k88J19O2Kl1p6k0O3p4K50k20j52J49RQ9J01j27Q3o0l20L61j72J13
$$ plain form
5426 43 -125 -50 183 -144 99 -28 -122 -56 -48 -77 -27 -11 298 45 38 102 209 233 30 56 -204 21 52 -67 -54
5451 -54 -156 20 -100 64 53 -10 197 31 -2 -78 -17 -32 -188 -36 -278 -157 -125 -36 93 -53 28 140 -170
5474 -170 -79 154 -134 -15 47 49 18 -58 -78 -15 -89 161 -59 -211 -62 -53 36 137 10 93 33 -287 74 -98 15
$$ [...]
8191A57
##END NTUPLES=NMR FID
##END=
