##TITLE=1H_Pr Bzl
 200.13MHz,CCl4,
 8 sc
 
 11.7.2025
##JCAMPDX= 6.0         $$ Bruker NMR JCAMP-DX V2.0
##DATA TYPE= NMR FID
##DATA CLASS= NTUPLES
##ORIGIN= UXNMR, Bruker Analytische Messtechnik GmbH
##OWNER= pz
$$ XWIN-NMR		Version 3.5
$$ Fri Jul 11 15:57:33 2025 Russian Standard Time (UT+4h)  she@DPX200
##.OBSERVE FREQUENCY= 200.1308
##.OBSERVE NUCLEUS= ^1H
##.DELAY= (6, 6)
##.ACQUISITION MODE= SIMULTANEOUS
##.ACQUISITION SCHEME= undefined
##.AVERAGES= 8
##.DIGITISER RES= 18
##SPECTROMETER/DATA SYSTEM= spect
##.PULSE SEQUENCE= zg30
##.SOLVENT NAME= CDCl3
##.SHIFT REFERENCE= (INTERNAL, CDCl3, 0, 14.3821)
##AUDIT TRAIL= $$ (NUMBER, WHEN, WHO, WHERE, WHAT)
$$ ##TITLE= Audit trail, XWIN-NMR		Version 3.5
$$ ##JCAMPDX= 5.01
$$ ##ORIGIN= Bruker BioSpin GmbH
$$ ##OWNER= she
$$ F:/spectra/data/she/nmr/H-C/1/audita.txt
$$ ##AUDIT TRAIL=  $$ (NUMBER, WHEN, WHO, WHERE, WHAT)
(   1,<2025-07-11 15:55:56.32 +0400>,<she>,<DPX200>,
      <created by zg, POWCHK disabled, PULCHK disabled
       configuration hash MD5:
       00 E9 B6 7A A2 85 ED C7 34 08 36 98 17 FE 4E 26
       data hash MD5: 16K
       71 B6 F9 64 2F EE D5 8D 5C 96 D4 8A 91 C6 F8 9F>)
$$ ##END=
$$ 
$$ hash MD5
$$ A3 15 70 3E 3B 90 63 48 48 8E 2E 10 58 AE C6 9D
##$RELAX= 
##$RELAX= 
##$RELAX= 
##$RELAX= 
##$RELAX= 
##$RELAX= 
$$ Bruker specific parameters
$$ --------------------------
##$DU= <F:/spectra>
##$EXPNO= 1
##$NAME= <H-C>
##$PROCNO= 1
##$TYPE= <nmr>
##$USER= <she>
##$AMP= (0..31)
100 100 100 100 100 100 100 100 100 100 100 100 100 100 100 100 100 100 
100 100 100 100 100 100 100 100 100 100 100 100 100 100 
##$AQSEQ= 0
##$AQ_mod= 1
##$AUNM= <au_zg>
##$AUTOPOS= <>
##$BF1= 200.13
##$BF2= 200.13
##$BF3= 200.13
##$BF4= 200.13
##$BF5= 200.13
##$BF6= 200.13
##$BF7= 200.13
##$BF8= 200.13
##$BYTORDA= 1
##$CFDGTYP= 0
##$CFRGTYP= 5
##$CHEMSTR= <none>
##$CNST= (0..31)
1 1 145 1 1 1 1 1 1 1 1 1 1 1 1 1 1 1 1 1 1 1 1 1 1 1 1 1 1 1 1 1 
##$CPDPRG= <>
##$CPDPRG1= <>
##$CPDPRG2= <>
##$CPDPRG3= <>
##$CPDPRG4= <mlev>
##$CPDPRG5= <mlev>
##$CPDPRG6= <mlev>
##$CPDPRG7= <mlev>
##$CPDPRG8= <mlev>
##$CPDPRGB= <>
##$CPDPRGT= <>
##$D= (0..31)
0 0.7 0 0 0 0 0 0 0 0 0 0.03 0 0 0 0 0 0 0 0 0 0 0 0 0 0 0 0 0 0 0 0 
##$DATE= 1752234955
##$DBL= (0..7)
120 120 120 120 120 120 120 120 
##$DBP= (0..7)
150 150 150 150 150 150 150 150 
##$DBP07= 0
##$DBPNAM0= <>
##$DBPNAM1= <>
##$DBPNAM2= <>
##$DBPNAM3= <>
##$DBPNAM4= <>
##$DBPNAM5= <>
##$DBPNAM6= <>
##$DBPNAM7= <>
##$DBPOAL= (0..7)
0.5 0.5 0.5 0.5 0.5 0.5 0.5 0.5 
##$DBPOFFS= (0..7)
0 0 0 0 0 0 0 0 
##$DE= 6
##$DECBNUC= <off>
##$DECIM= 32
##$DECNUC= <off>
##$DECSTAT= 4
##$DIGMOD= 1
##$DIGTYP= 9
##$DL= (0..7)
0 120 120 120 120 120 120 120 
##$DP= (0..7)
150 150 150 150 150 150 150 150 
##$DP07= 0
##$DPNAME0= <>
##$DPNAME1= <>
##$DPNAME2= <>
##$DPNAME3= <>
##$DPNAME4= <>
##$DPNAME5= <>
##$DPNAME6= <>
##$DPNAME7= <>
##$DPOAL= (0..7)
0.5 0.5 0.5 0.5 0.5 0.5 0.5 0.5 
##$DPOFFS= (0..7)
0 0 0 0 0 0 0 0 
##$DQDMODE= 0
##$DR= 18
##$DS= 0
##$DSLIST= <SSSSSSSSSSSSSSS>
$$ [...]
##$SUBNAM0= <"">
##$SUBNAM1= <"">
##$SUBNAM2= <"">
##$SUBNAM3= <"">
##$SUBNAM4= <"">
##$SUBNAM5= <"">
##$SUBNAM6= <"">
##$SUBNAM7= <"">
##$SUBNAM8= <"">
##$SUBNAM9= <"">
##$SW= 18.0517779522481
##$SWIBOX= (0..15)
0 0 2 0 0 0 0 0 0 0 0 0 0 0 0 0 
##$SW_h= 3612.71676300578
##$TD= 16384
##$TD0= 1
##$TE= 0
##$TE2= 300
##$TE3= 300
##$TEG= 300
##$TL= (0..7)
0 120 120 120 120 120 120 120 
##$TP= (0..7)
150 150 150 150 150 150 150 150 
##$TP07= 0
##$TPNAME0= <>
##$TPNAME1= <>
##$TPNAME2= <>
##$TPNAME3= <>
##$TPNAME4= <>
##$TPNAME5= <>
##$TPNAME6= <>
##$TPNAME7= <>
##$TPOAL= (0..7)
0.5 0.5 0.5 0.5 0.5 0.5 0.5 0.5 
##$TPOFFS= (0..7)
0 0 0 0 0 0 0 0 
##$TUNHIN= 0
##$TUNHOUT= 0
##$TUNXOUT= 0
##$USERA1= <user>
##$USERA2= <user>
##$USERA3= <user>
##$USERA4= <user>
##$USERA5= <user>
##$V9= 5
##$VALIST= <valist>
##$VCLIST= <CCCCCCCCCCCCCCC>
##$VD= 0
##$VDLIST= <DDDDDDDDDDDDDDD>
##$VPLIST= <PPPPPPPPPPPPPPP>
##$VTLIST= <TTTTTTTTTTTTTTT>
##$WBST= 1024
##$WBSW= 4
##$XGAIN= (0..3)
0 0 0 0 
##$XL= 0
##$YL= 0
##$YMAX_a= 608824
##$YMIN_a= -671095
##$ZGOPTNS= <>
##$ZL1= 120
##$ZL2= 120
##$ZL3= 120
##$ZL4= 120
##$ABSF1= 10
##$ABSF2= 0
##$ABSG= 5
##$ABSL= 3
##$ALPHA= 0
##$AQORDER= 0
##$ASSFAC= 0
##$ASSFACI= 0
##$ASSFACX= 0
##$ASSWID= 0
##$AUNMP= <proc_1d>
##$AZFE= 0.1
##$AZFW= 0.1
##$BCFW= 1
##$BC_mod= 2
##$BYTORDP= 1
##$COROFFS= 0
##$CY= -3
##$DATMOD= 1
##$DC= 2
##$DFILT= <>
##$DTYPP= 0
##$F1P= 0
##$F2P= 0
##$FCOR= 0.5
##$FTSIZE= 0
##$FT_mod= 4
##$GAMMA= 1
##$GB= 0.15
##$INTBC= 1
##$INTSCL= 1
##$ISEN= 128
##$LB= 0.25
##$LEV0= 0
##$LPBIN= 0
##$MAXI= 10000
##$MC2= 0
##$MEAN= 0
##$ME_mod= 0
##$MI= 1.114404
##$NCOEF= 0
##$NC_proc= 0
##$NLEV= 6
##$NOISF1= 3.799351
##$NOISF2= 2.8
##$NSP= 1
##$NTH_PI= 0
##$NZP= 0
##$OFFSET= 14.38212
##$PC= 1
##$PHC0= -1198.801
##$PHC1= 14.19254
##$PH_mod= 1
##$PKNL= yes
##$PPARMOD= 0
##$PSCAL= 0
##$PSIGN= 0
##$REVERSE= no
##$SF= 200.129724274929
##$SI= 16384
##$SIGF1= 3
##$SIGF2= 2
##$SINO= 400
##$SIOLD= 16384
##$SREGLST= <1H.CDCl3>
##$SSB= 0
##$STSI= 0
##$STSR= 0
##$SW_p= 3205.1282051282
##$SYMM= 0
##$S_DEV= 0
##$TDeff= 0
##$TDoff= 0
##$TI= <>
##$TILT= no
##$TM1= 0
##$TM2= 0
##$TOPLEV= 0
##$USERP1= <user>
##$USERP2= <user>
##$USERP3= <user>
##$USERP4= <user>
##$USERP5= <user>
##$WDW= 1
##$XDIM= 8192
##$YMAX_p= 0
##$YMIN_p= 0
$$ End of Bruker specific parameters
$$ ---------------------------------
##NTUPLES= NMR FID
##VAR_NAME=  TIME,          FID/REAL,        FID/IMAG
##SYMBOL=    X,             R,               I
##VAR_TYPE=  INDEPENDENT,   DEPENDENT,       DEPENDENT
##VAR_FORM=  AFFN,          ASDF,            ASDF
##VAR_DIM=   8192,          8192,            8192
##UNITS=     SECONDS,       ARBITRARY UNITS, ARBITRARY UNITS
##FACTOR=    0.0002768,     1,               1
##FIRST=     0,             0,               0
##LAST=      2.2672688,     0,               0
##MIN=       0,             -671095,         0
##MAX=       2.2672688,     608824,          0
$$ Real data points
##PAGE= N=1
##DATA TABLE= (X++(R..R)), XYDATA
$$ [...]
3323G678l240l291l977l623k509r32j58Q86K487L233L805L590L076K613R11n15
3339A0034j602k419l778l295l862l093j160j208P45K038K621L500L599L263K896
3354H279J513J82m89k505l358l503l290l400k118j385qJ604K254L256L501L631
3370D164K705K164P50k94j382k865l355l318l509k774j587o29Q20J708L043L212
3386a147M013K760K333J771j87o94k500l186l192l431k925k546r82N12J156K680
3402e565K782L954L182K402K341L76n43j510k898l064l160l618k263j846k07J181
3418h456K170K255L585L113K993K589J076P5j445k219l128l186l264k672j991
3433h505q66M07J664K325L098L211L278K440J724M51n35j957k571l011l534k995
$$ y = [7678, 4438, 1147, -2830, -6453, -8962, -9894, -10052, -9166, -6679, -3446, 359, 3949, 7025, 9638, 10549, 10034, 8432, 6013, 2235, -1060, -4922, -8015, -9175, -10383, -9638, -7600, -4979, -1479, 2120, 5383, 8279, 9792, 9974, 9485, 6980, 3622, 119, -3171, -6571, -8689, -10074, -10082, -8478, -6224, -2968, 533, 4164, 6869, 9033, 9783, 9489, 8107, 5242, 1887, -1431, -4940, -7714, -9301, -9930, -9110, -7402, -4359, -1147, 2866, 5626, 7959, 9730, 9543, 8849, 6349, 3163, -29, -3460, -6385, -8931, -9913, -9401, -8245, -5565, -2783, 1171, 4353, 6755, 9096, 9472, 8929, 7419, 4521, 1457, -1703, -5321, -7584, -9430, -9637, -8456, -6286, -4031, -446, 2667, 5660, 8249, 9325, 9400, 7955, 5736, 2608, -578, -3842, -6514, -8505, -9371, -8964, -7300, -4975, -1877, 1334, 4612, 7052, 8776, 9227, 8692, 6735, 4164, 1153, -2381, -5376]
3449e376k342j139m93J159K135K749L367L326K854J738J003k60r50k511k871l274
3465h85k990k906j538j011N66J964J907L480L252K937K485J214N54q49j750k707
3481C723l112l309k898j778j425j9J129K061K761L485K708K573K208O49p1j470
3497G215k415k592l322l103k528j227r77P22J476K703L036K902L001K119J348
3512H358J96o37k025k808k561l281k788k126r23K14J153J887L060L223K847K277
3528F066J682Q09l74j402k292k924k695l484k012j678l28R10J572K625L087K900
3544B462K552K151J024L71q52k254k826k634l218k636j430j351M73J294K010K895
3560a969K941L041K138J634M75l24j591k394k605l228k723k141j274l37J007J523
$$ y = [-5376, -7718, -8857, -9350, -8191, -6056, -3307, 60, 3386, 6240, 7978, 8981, 8721, 7771, 5260, 2389, -885, -3875, -6781, -8319, -9330, -8764, -6800, -4893, -1413, 1839, 4776, 7261, 8475, 9029, 8180, 6430, 3723, 611, -2698, -5596, -7374, -8799, -8818, -7689, -5628, -2867, 618, 3326, 5899, 8107, 8756, 8685, 7215, 4800, 2208, -1114, -4217, -6745, -7972, -8949, -8227, -6751, -4048, -1012, 1890, 4891, 7010, 8358, 8554, 7917, 5892, 3084, 523, -2758, -5546, -7672, -8595, -8381, -7228, -5341, -2281, 942, 3789, 6066, 7748, 8557, 8183, 6781, 4489, 1565, -1130, -4614, -6626, -8304, -8632, -7722, -6150, -3525, -438, 2462, 5014, 7165, 8189, 8560, 7708, 5454, 2628, -6, -3224, -5860, -7290, -8641, -8168, -6874, -4864, -1969, 972, 4013, 6151, 7785, 8260, 7936, 6345, 3951, 1346, -1882, -4605, -6746, -8020, -8357, -7350, -5827]
3576e827K506K966K968K426J964J029M7j215k091k182k975k867k262k072p63P90
3592g558J036K253K510L090K580K226J446L72l88j839k120k685k874k810j736
3607f497j219j71Q60J716K427K956K606K393J977N50q0q93j973k530k637k917
3623c432k316j334p28M95J339J896K711L093K259K207J432r1j74k153j989k623
3639E92k926k458j631j255K22P87J739K197L133K349K563J510P46r8j405k063
3655D002k189k814k845j787j472k75L87R33K622K707K198K843J827J146K59r04
3671F638j670k192k563k836k118j749r14N7J232J634K197K815K682K225J370N99
3687G407m75j063k125k193k844k463j897j457j6N40J091K452K586K496K275J769
$$ y = [-5827, -3321, -355, 2613, 5039, 7003, 8032, 8079, 6864, 4773, 2591, -384, -3251, -5513, -7585, -8348, -7558, -6522, -4269, -1759, 1331, 3911, 6137, 7583, 7955, 7567, 5728, 3608, 923, -1951, -4761, -6497, -7716, -7887, -7027, -5311, -2884, 72, 2678, 5071, 7048, 7598, 7518, 6625, 4652, 2122, -515, -3432, -5748, -7082, -7810, -7315, -5976, -4080, -1369, 1724, 3983, 6190, 7622, 7531, 7357, 5204, 3215, 592, -2334, -4792, -6423, -7678, -7456, -6669, -4930, -2733, 400, 2749, 5312, 6822, 7568, 7470, 6065, 4002, 1813, -1001, -3846, -5633, -7105, -7380, -6993, -6060, -3438, -731, 1467, 4310, 6137, 7283, 7542, 6638, 4968, 2776, 213, -2623, -4741, -6490, -7404, -7347, -6115, -4481, -2284, 531, 3213, 5438, 6808, 7407, 6932, 5869, 3744, 1551, -1293, -3756, -5653, -7110, -7126, -6586, -5495, -3043, -457, 2039, 4314, 6083]
3703F083P82K37p86j643k250k449k768j725k031n98J2J355J577K139K855K385
3719C175K310J137M88k96j393k136j959k634k369k018j286j70O95J583K206K379
3735b88K441K066J976Q03j71p32j519k401k522k653j923j592m33L36Q89J810K492
3752a421K646K261J963J097J52k85j342j981k085k798k257j570j151P2L26J684
3768d689K520K160K346K056J553O41J83j160j801j936k566k088k229j460r3K26
3784f337J126J937K237K333K269J606J119M28p27j251j628k712k624j731j363
3799e318j387M57O83J287K261K427K267J906J529K99n5p73j808k279k734k049
3815c287j761j002l04M45Q78K049K268K356K107J329J113J31m37j618j778k458
$$ y = [6083, 6865, 7102, 6316, 4673, 2423, -26, -2794, -4519, -6550, -7148, -7136, -5781, -4204, -2065, 790, 3175, 5485, 6622, 7110, 6814, 5421, 3285, 1326, -1308, -3677, -5695, -6981, -7151, -6456, -4873, -2667, -288, 2153, 4219, 6195, 6998, 6827, 6095, 4576, 2175, -347, -3000, -4923, -6515, -6948, -6612, -5723, -3913, -1421, 1225, 3486, 5449, 6546, 6698, 6413, 5071, 3090, 1005, -1793, -4050, -5620, -6771, -6699, -6373, -4689, -2169, -9, 2337, 4393, 5946, 6587, 6770, 5610, 3809, 1873, -693, -2781, -5010, -6470, -6563, -6337, -5211, -3274, -1037, 1296, 3565, 5171, 6290, 6718, 5991, 4740, 3112, 400, -2224, -3955, -5318, -6705, -6248, -5565, -4278, -2017, 410, 2677, 4583, 6112, 6411, 6356, 5583, 3775, 1496, -1238, -3287, -5048, -6050, -6354, -5909, -5031, -2982, -714, 1642, 3749, 5078, 6191, 6322, 5885, 4267, 2489, 31]
3831C1k191j910j444r68L50O97J839J825K204K275J839J518L77n40r62j331k303
3848A306k432k139j345j532k43N33J100J813K606K125J940J386R10J86p42j678
3864C794j502k435k267j697j551m89%P94J577K517J779K417J773J081K88j98j075
3881D806j860k239k414j861j464r50k99Q73J213J633K496J912K247J250N55j9
3897E879o92j440k031j979k156j447j667o36J23P78J861K435J906K071J343J134
3913E482O48n48j271j939j829k066j987j351q50k04M81J583J766K064K030K080
3929D089J019Q19l09r58r61k166j977k201j784r51n06L62R88J695J755K018K350
3946C282J535N57M76o93j073j721k136j984j599j672o08J7M85J959J320J796K063
$$ y = [31, -2160, -4070, -5514, -6482, -6132, -5435, -3596, -1771, 433, 2708, 4547, 6065, 6442, 5902, 4940, 3609, 1306, -1126, -3265, -4610, -6142, -6385, -5852, -4752, -2939, -333, 1792, 3732, 5118, 6028, 6214, 5472, 3794, 2292, -143, -2410, -4107, -5658, -6147, -6147, -5353, -3776, -1259, 520, 2937, 4710, 5791, 6079, 5881, 4806, 2946, 707, -1707, -3568, -5032, -5982, -6281, -5408, -4195, -2562, -66, 1846, 4093, 5343, 5898, 5879, 5187, 3747, 1716, -263, -2419, -3866, -5533, -6169, -6046, -5268, -3407, -972, 934, 3005, 4348, 5482, 6130, 5582, 4311, 2372, 543, -1523, -3510, -4861, -5711, -5915, -5434, -3851, -2085, -21, 2009, 4089, 5108, 5927, 5618, 4660, 3699, 1533, -444, -2645, -4429, -5380, -5886, -5524, -4536, -2841, -1086, 932, 3282, 4817, 5374, 5850, 5157, 4084, 2363, 227, -1757, -3356, -5028, -5636, -5619, -5134, -3175, -1855, -59, 2004]
3963B004J964J256M53M8j067j436k045j766k048j677j009k87M71Q82J564J985
3979g08J955K102J300Q11J87n28j314j674j984k018j796j068n46l39Q48J316J907
3996a549K044K152J625O35P41n56p61j245j971k043k008j508j025J5K53J341J384
4013b476K079K064J651J237P56J61p40j051j776j846k266j341j214m29j72Q90
4029d473J278J799J899J964J658P58M90m56q70j449j809j952j983j179j001J04
4045e222L10J294J764J884J872J434J159O24J3o95j194j846k094j143j992q28
4061d660m10j43P09J728J873J855J926J335N84M49n77j074j374j937j740j779
4077c235j171p67J52L39J285J663J873J743J842P17Q41m78j230o15j641j801j936
$$ y = [2004, 3968, 5224, 5677, 5725, 4658, 3222, 1177, -589, -2637, -4314, -5323, -5610, -5139, -4257, -2693, -708, 1247, 3349, 4649, 5460, 5647, 5119, 3805, 2131, 147, -1871, -3667, -4735, -5281, -5620, -4772, -3456, -1549, 495, 2647, 4272, 4907, 5648, 5092, 4331, 3086, 1115, -928, -2936, -4444, -5469, -5454, -5201, -3860, -2476, -397, 1667, 3318, 4555, 5311, 5472, 4732, 3681, 1905, 59, -2207, -3548, -4762, -5191, -5363, -4473, -3195, -1396, 503, 2467, 4125, 4883, 5373, 4917, 4047, 2598, 789, -1163, -3146, -4325, -5326, -5222, -4912, -3618, -1854, 30, 1902, 3336, 4495, 5119, 5132, 4437, 3243, 1397, -697, -1840, -3832, -4660, -5070, -5213, -4504, -2776, -903, 952, 2878, 4213, 4797, 5246, 4669, 3595, 2221, 284, -1456, -3235, -4406, -5173, -5021, -4682, -3397, -1734, 139, 1882, 3724, 4441, 5282, 4804, 3574, 2959, 1318, -483, -2419]
4094b419j267j129q4R4R38J531J638J697J648J503N19O16o79j273j233k064j895
4111a859j311j139p87K42M76J422J457J843J873J254J224M22j4j026j429j514
4127A134j920j811j270p59p9J27J007J422J641J650J862R92R10L7o95j093j541
4144A614j738j736j667o43n33r0P78J352J563J614J828J082J140M07m11j159j131
4161B270j673j720j608j004r85j58M06Q72J885J077K232J578Q20O60m7m87j082
4178C036j801j683j366j710q30m41L13O99J175J805J543J826J087J049J31n42
4194D291q49j348k071j229j712j162n13kL51J276J361J802J686J525O99O98l50
4211D453o09j157j768j535j595j179j060j00P3Q58J606J347J813J460J037J083
$$ y = [-2419, -3686, -4815, -4899, -4805, -3867, -2336, -698, 999, 2647, 4150, 4669, 5285, 4606, 3333, 2100, 36, -1859, -3170, -4309, -5096, -4854, -4378, -2956, -1499, 344, 2217, 3471, 4695, 5117, 5103, 4077, 2648, 1134, -786, -2597, -3867, -4626, -4705, -4578, -3571, -2149, -508, 1142, 3004, 3996, 4906, 4943, 4248, 3155, 1614, -124, -1860, -3527, -4170, -4703, -4793, -4015, -2663, -1100, 514, 2342, 3424, 4564, 4971, 4560, 3401, 2270, 597, -1123, -2731, -3735, -4720, -4878, -4472, -3600, -1715, -638, 1594, 3172, 3992, 4652, 4605, 4118, 3036, 1235, -448, -1814, -3524, -4354, -4795, -4482, -3783, -2608, -803, 740, 2566, 3653, 4702, 4833, 4291, 3442, 2094, 23, -1206, -2918, -4080, -4593, -4595, -4244, -2968, -1607, 195, 1881, 3406, 4105, 4803, 4453, 3844, 2687, 919, -616, -2211, -3390, -4450, -4550, -4477, -3619, -2013, -666, 1147, 2607, 3644, 4727]
4227D727K16q80q46j277j914j475j656j007p5l78P92J043J216K103J493J393P55
4244D230N89m71o08j054j830j504j549j456o68r0K35O97J647J667J467J674J161
4261D137N19j07k79j153j473j681j677j531p87n13J15P56J005J527J798J610J520
4278C786M18N19n11q24j429j300j698j520r85q66r8J56J236J319J625J679J410
4295B917J007P46j47p47j155j539j439j682j143p68n67K22P95J366J300J682J528
4312B376J124Q46J22l81r57j230j705j583j474q55m83l05O76J233J188J369J917
4329A878J089Q62O96m39o70p70j651j673j403j056j169J51Q0Q67J119J693J444
4346A048J440J034O29J56n7j425j125j821j483j302j064k71j67J030Q02J406J402
$$ y = [4727, 4943, 4063, 3217, 1940, 26, -1449, -3105, -4112, -4187, -4565, -3773, -2730, -1514, 589, 2082, 3475, 4230, 4819, 4348, 3740, 2686, 856, -648, -2197, -3653, -4321, -4411, -4176, -3479, -1832, -165, 1302, 2976, 4137, 4656, 4549, 4270, 3117, 1644, -37, -1714, -3245, -4032, -4545, -4430, -3674, -2669, -1142, 656, 2266, 3786, 4204, 4723, 4212, 3388, 1959, 659, -1039, -2559, -3544, -4410, -4508, -4352, -3116, -1797, -172, 1507, 2917, 3924, 4670, 4523, 3776, 2621, 1082, -357, -2039, -3182, -3950, -4517, -4295, -3500, -2134, -834, 848, 2376, 3500, 4346, 4468, 4087, 3130, 1900, 195, -1388, -2862, -3717, -4200, -4505, -3829, -2596, -1408, -39, 1878, 2967, 3829, 4525, 4086, 3416, 2646, 995, -678, -2081, -3137, -4306, -4155, -4075, -3208, -2089, -396, 1048, 2488, 3522, 4151, 4307, 4250, 2825, 1700, -121, -1604, -2906, -3970, -4241, -4408, -3378, -2576, -1170, 232]
4363B32J538J609M25O65k56n47j149j966j507j534r03p38l40N28P46J372J564
4380b61J690J069J194N75N0n32j005j349j824j187j448q49n16K09O89R89J489
4397a017J651J232J303P44L21m44m71j154j479j580j644j184l98K54J48R13J238
4414a567J603J394J600P22N10j53m59j117j362j808r69j303j030j30Q2O52J222
4431b113J233J486J568J127P89K41o68r75r70j592j330j716o21m08k84P52R62
4448b519J202J545J504J339P21L86j63m80j248j447j576j204j503m28l29N00Q25
4465b875J304J240J481J209J060N64j62m76o37j251j506j020j696o45o67k22Q76
4482c423J103J163J563J665Q68J149Q1k94p21j107j328j740j212j276m52L11J34
$$ y = [232, 1770, 3379, 3804, 4469, 4213, 3666, 2517, 551, -956, -2490, -3393, -4131, -4471, -3943, -3197, -1825, -261, 1429, 2498, 3692, 4267, 4317, 3785, 2780, 1431, -393, -1580, -3028, -3877, -4393, -4184, -3495, -2506, -1017, 634, 1866, 3169, 3913, 4234, 3790, 3319, 2165, 686, -894, -2538, -3722, -4120, -3866, -3718, -2805, -1567, 36, 1430, 3030, 3752, 4262, 4109, 3650, 2533, 1171, -637, -1606, -2909, -3939, -4069, -3987, -3335, -2113, -880, 606, 2174, 3301, 4090, 4331, 3663, 2688, 1718, 126, -1204, -2920, -3541, -3949, -4233, -3481, -2519, -1317, 228, 1732, 3071, 3792, 4178, 4015, 3535, 2287, 840, -736, -1940, -3443, -3871, -4200, -3700, -2875, -1571, -331, 1150, 2359, 3419, 3983, 3821, 3345, 2708, 1457, -49, -1069, -2765, -3410, -4077, -4299, -3423, -2320, -1157, 406, 2071, 2939, 4088, 4169, 3875, 3154, 2047, 719, -1021, -2233, -3509, -3961, -3650, -3516]
4499c516O02J305J330J632R13J250O44l12p53m81j597j101j393j766j87o10J2
4516d028P66J002J160J713J172J041J100M9k72o09j473j386r04j515j159p71L6
4533d078O07Q76Q96J835J143J139R56O75Q9o98r87j380j468j522j220o59l67L51
4551c812P13J101J216J772J149J126P23Pm75o62j515j329j332j027j213m57J69
4568c846K24R41J652J219J273J060Q01N85j99l71j242j273j394j356j326k57k68
4585c777k9R57J073J534J181J223J181M55J19m88q52j239j355j219j248q33m30
4602c747P8K47J304J308J256J141J324Q79r4j67m21j229j360j226j700p69p55
4619c931k0K34J522N25J472J290J185O71N91L37o09j046r56j515j330j052j120
$$ y = [-3516, -2914, -1609, -279, 1353, 2266, 3516, 4160, 3848, 3095, 2614, 1017, -84, -1477, -3243, -3430, -4040, -4028, -3262, -2260, -1100, 613, 1785, 2826, 3926, 3975, 3703, 3094, 1621, 235, -669, -2184, -3343, -4114, -4078, -3471, -2595, -1699, 136, 1279, 2418, 3374, 4049, 4138, 3440, 2453, 1073, -395, -1917, -3137, -3796, -4163, -3812, -3099, -1998, -782, 990, 2139, 3265, 3988, 3995, 3520, 2858, 1343, 14, -1318, -2345, -3558, -4015, -3846, -3622, -2681, -1029, 190, 1463, 2523, 3324, 3909, 3710, 3339, 2097, 824, -570, -1926, -3252, -3509, -3777, -3806, -2849, -1776, -242, 939, 2162, 3343, 3798, 3917, 3429, 2577, 1338, -17, -1236, -2484, -3317, -3747, -3669, -3422, -2118, -810, 446, 1587, 2911, 3790, 3696, 3529, 3108, 1879, 519, -707, -2407, -3176, -3931, -3951, -3717, -2195, -1670, -198, 1092, 2277, 2948, 3539, 3876, 3267, 2221, 1265, -250, -1580, -2632, -3752]
4636c752J81l69O69J261J157J738J121R88N14K63m2p83j279j422j286j416q04
4653c261k19l42L47R80J034J506J061J532P62J65J5k41j037j244j207j473j016
4670b638q21j49L0N95J159J162J498J235J028O90k17k44p48r66j586j302j147
4687b421o78o81J01M40P98J503J000J527Q86J056J83N0q27j279r64j444j004j156
4705b910o13k95K23Q55Q76J290J465J212J268J68J24k70r35r79j423j329j283
4722b556p18k81k9N10R33J159J232J336J125O53M37l21p52r19j095j264j400r11
4740b861m73n02L85P06J282J258J612R28N67Q07Q7p34o55j208j334j294j165o34
4758c228l79p3P92P96J375J036J700Q60K86L47j64p44r01j348j326j011j068n95
$$ y = [-3752, -3571, -3940, -3271, -2010, -853, 885, 2006, 2994, 3508, 3771, 3729, 2946, 1667, 245, -1041, -2457, -3261, -3480, -3822, -3475, -2495, -1461, 45, 1106, 2638, 3400, 3565, 3580, 3339, 2302, 1058, -149, -1622, -2638, -3459, -3608, -3578, -2983, -1824, -662, 836, 2071, 3099, 3789, 3572, 3328, 2580, 1614, 28, -1274, -2421, -3099, -3780, -3679, -3239, -2441, -938, 62, 1589, 2475, 3531, 3714, 3764, 2937, 1658, 694, -750, -1754, -2910, -3523, -3818, -3595, -2740, -1864, -574, 891, 2103, 3371, 3539, 3663, 3393, 2458, 1479, 56, -1273, -2556, -3274, -3555, -3584, -3074, -2141, -982, 250, 1586, 2711, 3364, 3801, 3480, 2728, 1809, 714, -550, -1950, -2861, -3334, -3836, -3451, -2745, -1463, -205, 1407, 2335, 2902, 3709, 3796, 3062, 2407, 1199, -135, -1429, -2594, -3228, -3607, -3680, -2888, -2092, -717, 319, 2019, 2879, 3165, 3512, 3348, 2604, 1703, 355, -971, -1982, -3050, -3645]
4776c645l1P19P55J064J101J376R90Q06M32J16p26q75j210j185j264p86r25p08
4794c996M81N91J215J230J306J098Q78M14L26k96l51j617r65j340j247p57p24
4811c754K03L37J065R77J155J852O52R39n4K01m27j135j334j008j206j039p65
4828c341k22M66M40J060J452J285J057P48K80J55j57o33j303j209j369r65r54
4845c210k55J4N33P39J577J007J163P42Q89J08M6p58p53j198j245j347r59m25
4863c332j02J88R65P91J328J300J159Q14N16Qn84q03j100j257j195j366n03o57
4881c830L83O23Q61R17J807R69O15P78K58M5r29r99j148j052j301j104l71Q3K92
4900c103O22J168J373J084J087P59L14j10o09n34j141j566q02r67o12o56L34O92
$$ y = [-3645, -3676, -2957, -2202, -1138, -37, 1339, 2329, 3135, 3567, 3683, 2957, 2082, 872, -313, -1577, -2363, -3288, -3996, -3515, -2924, -1709, -479, 827, 1925, 2803, 3217, 3543, 3247, 2896, 1279, 314, -1026, -2273, -3030, -3754, -3551, -3214, -2149, -1172, -17, 1835, 2487, 3426, 3372, 3573, 3146, 2011, 677, -331, -1537, -2576, -3341, -3563, -3097, -2657, -1597, -145, 1140, 2197, 2945, 3225, 3380, 3223, 2590, 1287, 78, -1291, -2256, -3210, -3465, -3451, -2918, -2179, -602, 405, 1568, 2310, 3199, 3307, 3353, 2595, 1842, 644, -601, -1948, -2907, -3332, -3434, -3246, -2281, -1490, -162, 1138, 2297, 3111, 3627, 3635, 3051, 2248, 1148, -109, -1304, -2670, -3173, -3830, -3447, -2824, -1963, -1046, 761, 1730, 2345, 3123, 3381, 3426, 2497, 1498, 350, -702, -2003, -3107, -3478, -3395, -3103, -2481, -1313, 60, 1144, 2231, 2990, 3304, 3194, 2585, 2051, 910, -656, -1458, -2425, -3037, -3693, -3359, -2667]
4918b667R70J020J364J237Q09O19Q4k08r35r94j198j373j075o65m38K3N83P75
4936b069J001J184J436O48J178j2r5n71o75j360j122j429q00n37j87K39P48J021
4954a402J035J064J050J430K33J67q09l08j352j145j183j102o50n39Q2N44P74
4971b111J085J182J440Q78P43N5j32m86r45j111j342j076j172m39J11P3O22J212
4989a413J357R46J094Q10L46R3m25o18j172j261j329q08o84k14P7N24Q41J248
5007e88J065J090J286L20K15j36n11j300j309r31j335m87q52L6N07O77J076J170
5025gJ121J360N05M40J7n91p23r90j592j090r57p28k62K35R08Q49Q95J427Q09
5044A626J078N30L1k95o43j211q41j436j137o61o42K73M38R69Q98J159J159J091
$$ y = [-2667, -1697, -677, 687, 1924, 2733, 3352, 3436, 3228, 2293, 1299, 101, -1272, -2347, -3012, -3450, -3427, -2844, -2069, -1068, 116, 1552, 2200, 3378, 3366, 3271, 2700, 2025, 665, -457, -1886, -2686, -3223, -3410, -3171, -2423, -1402, -367, 697, 1747, 3177, 3410, 3577, 2768, 2460, 1108, -37, -1220, -2322, -2972, -3511, -3429, -2885, -2111, -1026, 156, 1596, 2474, 3217, 3272, 3140, 2654, 1709, 598, -744, -1820, -2992, -3431, -3320, -3247, -2625, -1413, -56, 890, 1984, 2794, 3140, 3233, 2808, 2190, 1018, -243, -1572, -2380, -3064, -3278, -3201, -2677, -1836, -588, 477, 1567, 2853, 3173, 3388, 3252, 2741, 1441, 132, -799, -2134, -2621, -3473, -3437, -2930, -2253, -1177, -7, 1114, 2474, 2979, 3419, 3436, 2845, 2122, 1132, -460, -1550, -2507, -3235, -3497, -3262, -2354, -1505, -610, 817, 1626, 2704, 3234, 3265, 2970, 2327, 1116, 275, -1161, -2298, -2959, -3601, -3328, -2890, -1921, -1023, 136, 1295, 2386]
5062B386N93M61j0m55j135j014j141j180r85o40l74O0Q14J071J164J202J176P69
5080B762M43L24o00p21j122j174j188j058o83k87K01J65J034R85J294Q49J311
5097B535N39L37j34m50j078r08j251j454p49o22m04M72J067P25J218J307J300
5114B450N66L28l6o11n59j282q02j165j204n62p37L16O19N64J367J066J454P20
5132B492O18K10l3p74r31j296j316p41r62n13m2N48L10J323J124J227R52Q71P0
5151C137J79l52p68j102j137j459j090m73j06k22N68J225R99J409Q18J114N49
5168C289R6m06l45j331j010j116j094p89o44k51L46J313Q15J375J114R96N90K13
5186C161L3n9j508q31j131j426q60n36l24L92J85J244R68J172J493Q40M15J87
$$ y = [2386, 2979, 3440, 3430, 2975, 1840, 826, -315, -1495, -2480, -3120, -3494, -3434, -2620, -1549, -385, 817, 1993, 2762, 3205, 3529, 2929, 2208, 1086, -88, -1276, -2334, -3017, -3304, -3103, -2938, -1904, -919, 375, 1224, 2535, 3074, 3411, 3277, 2827, 1749, 841, -410, -1864, -2613, -3235, -3639, -3167, -2100, -1375, -157, 1150, 2450, 3016, 3344, 3308, 2697, 2138, 856, 54, -1111, -2315, -2877, -3614, -3298, -2679, -2115, -748, 318, 1772, 2492, 3110, 3320, 3287, 2513, 1582, 286, -1030, -1771, -2733, -3246, -3288, -2740, -2430, -1107, 17, 1244, 2196, 3067, 3137, 3316, 2964, 2196, 1094, -43, -1502, -2592, -3065, -3171, -3393, -2825, -1600, -601, 808, 1626, 2740, 3289, 3385, 2979, 2634, 1303, 293, -823, -1917, -2706, -3350, -3601, -3255, -1942, -1127, 248, 1362, 2358, 2948, 3161, 3194, 3135, 1627, 796, -335, -1761, -2621, -3157, -3481, -3089, -2904, -1660, -692, 480, 1973, 2813, 3228, 3415]
5204C415n24n99j139j009j209j194q12m45M2N77R44Q76J406J125R27P70L61o09
5222B903l42p57j379q44j296p39p97j73L33P16Q46J479R77J045Q08L09Q0k62q15
5241B092r79j040j527n67q63n08K01Q1J366R63R47J574M83R47J57k38o18j047
5259A424j159q70j274q16p24N5M48Q48R31J065J352P87R85K88o1k61j101p52j288
5278a23j100j077o67m01J46N45Q09J245J043J310P54N95M10l92n81j064j217q98
5296f63j499n65o31j29M81P10J180J261J094R56R61M70j81o43q63j124j134j177
5314a496q57p97Q8k78Q15R28Q69J634Q16R20O01J0k43p79o91j131j588o42q46
5333b667p01m6L98R52J003J407P83J248N53M86j68m79o84j338j223j206q07o72
$$ y = [3415, 2891, 2292, 1153, 144, -1065, -2259, -3071, -3516, -3474, -2897, -1953, -1077, 329, 1454, 2381, 3151, 3512, 2903, 2561, 1804, 425, -419, -1715, -2454, -3251, -3424, -3091, -2375, -1529, -50, 927, 1972, 2780, 3089, 3169, 2907, 2092, 1113, 73, -1454, -2021, -2884, -3392, -3191, -3110, -1744, -781, 166, 1740, 2223, 3170, 3327, 3089, 2471, 1424, 265, -605, -1879, -2695, -3419, -3364, -2916, -2068, -1137, -72, 1280, 2067, 3052, 3340, 3279, 3018, 1917, 1165, -123, -1223, -2300, -2967, -3368, -3222, -2677, -1868, -623, 420, 1730, 2484, 3079, 3489, 3097, 2516, 1452, 235, -663, -2162, -2727, -3358, -3487, -3006, -2296, -1116, 145, 1239, 2195, 3156, 3626, 3445, 2802, 1939, 815, -319, -1496, -2353, -3150, -3062, -3340, -2525, -1597, -728, 906, 1722, 2642, 3243, 3253, 3010, 2231, 1540, 409, -1179, -1821, -2667, -3368, -3414, -3016, -2064, -1061, 346, 1129, 2377, 2930, 3416, 3248, 2769, 2085, 747, -476, -1682, -2489, -3161]
5351c161l47L46O80R29J144J061J123O77P84K0m26m52j021j284j011j361m58n33
5369c290j3L40J111J114R74J246P07J011PK7m02j122j029j412p87j160p03k21
5387c602N83P33N91J440R19J329O00P11L4n95o70q88j425j092q16j001m25L37
5405c237M27Q51J410J183P19R87O39M91k02q42o85j241j147r92j061p55L67K63
5423b825O32J082R07J388R00O72L29K59p97m66j000j240j092j254p12j41L31K12
5441b815J019J122J032J373O56P92K75o21l12j117j230j045q53r15p93L38N0J093
5459a951M47J516J056J175M54M59M32j089m73j072j373j157p41q99j76N81L21
5476b490R43J040R59J442Q10J39J08l6r90q49r16j463q66p21l57j7K43Q01J160
$$ y = [-3161, -3508, -3162, -2482, -1553, -409, 652, 1775, 2452, 3236, 3256, 2830, 2378, 1357, 73, -938, -2299, -2757, -3290, -3303, -2963, -1852, -738, 236, 1482, 2189, 3200, 3207, 3234, 2832, 1710, 681, -731, -1518, -2678, -3381, -3602, -3019, -2286, -1695, -255, 664, 1993, 2593, 3304, 3338, 2743, 2073, 1185, -240, -1332, -2148, -3149, -3574, -3237, -2810, -1959, -549, 634, 1353, 2340, 2979, 3470, 3268, 2426, 1741, 500, -647, -1639, -2700, -3455, -3088, -2825, -2193, -1111, -204, 1184, 2084, 2756, 3085, 3344, 2547, 2081, 1081, -159, -1251, -2505, -3217, -3358, -3027, -2815, -1796, -674, 358, 1731, 2387, 3179, 3454, 2833, 2521, 1404, 174, -871, -1724, -2639, -3432, -3094, -3044, -1951, -1504, 12, 1068, 2243, 2697, 3156, 3588, 2499, 2026, 954, -419, -1576, -2317, -3216, -3392, -2811, -2490, -1547, -507, 452, 1894, 2704, 2843, 2951, 2915, 1925, 1076, 160, -1303, -2169, -2890, -3247, -3264, -3021, -2220, -1060]
5495a060J332J425N73O95L43Q0q17n53j240j209j035j186o53M7K69M00J052J354
5513a83R38J195P38N95r6m01q30o60j478j049q27q11k30k59P17Q61Q53J364J034
5532A471O49R62J53J23p44q14j405j102j031p17o31k5K60N26J062Q77J565M97
5550A676J126M72J09p60o91q93j108j256p64p77m77K48N15R10R90J153J309N97
5568B379M39K11j62j85j099j362r19j044q68n42R6M9P25J221Q79J323R24O70L02
5587C037l3m24n70j355p35j016j197o82j61r6P05Q36J238J010R81J050K03M49
5605C240o02k57p19j088j498j077p99k60j93O71N30J036J126J068P59J071J79
5622C187j29m40o33j016j300j244o71o19n46L69N01J173Q57J150J266P97M28n1
$$ y = [-1060, 272, 1697, 2270, 2965, 3308, 3388, 2571, 2018, 778, -431, -1466, -2652, -3305, -3258, -2989, -2589, -1537, -183, 755, 1950, 2688, 3283, 3187, 2786, 1956, 1296, -182, -1231, -2058, -2869, -3099, -3358, -2641, -1780, -927, 437, 1471, 2120, 3082, 3235, 3358, 2614, 1800, 395, -707, -1738, -2455, -3086, -3111, -2851, -2325, -1263, -386, 1179, 1676, 2802, 3274, 3383, 2623, 1932, 1039, -69, -1325, -2089, -2866, -3343, -3095, -2580, -1670, -680, 473, 1782, 2379, 2818, 3029, 2867, 2682, 1583, 221, -698, -1742, -2610, -3152, -3056, -3007, -2282, -1061, -182, 1141, 2065, 2735, 3037, 3004, 2580, 2010, 655, -80, -1096, -2293, -2975, -3136, -3232, -2527, -1691, -453, 557, 1538, 2588, 2791, 3240, 2638, 2381, 1662, 574, -924, -2001, -2800, -3060, -3253, -2582, -2052, -1016, 110, 1178, 1937, 3008, 3187, 3058, 2618, 1985, 969, -331, -1575, -2246, -2865, -3411, -3042, -2541, -1368, -511, 639, 1905, 2702, 3130, 3079]
5640C079l59m16j154r67r79j115p39l80j1K98Q65R60R48J440R20N85K45m9p56
5659B415o03j221j086r54j042m16O1m9M77J328P56J275R89Q43M93p6m20o34j189
5678I47j007j191j049l81n10J11M47Q48R63J094J298P05O05M65m32m66p89j407
5696B51r80j012r68l26nK61P95N99J113J155J045N04O35p9m30m81j003j368r29
5715a223j019q15j21K22M54P72R01J257J118O95P06J78l14m49p86j065j429o32
5733a550q44o00p1K00Q63R32R20J367Q00P98L38J97o61p22j162j186r68q16o78
5752b843m59M80N00M75J261J362Q60R27L92J70k74o93o22j474r25r94q30n66L7
5771c216M87R46Q73J053R81J224O54K24k82j97r76j145j298q98r67m49k04K36
$$ y = [3079, 2720, 2304, 1150, 183, -796, -1911, -2650, -3030, -3041, -2743, -1878, -918, 30, 1470, 2390, 2975, 3220, 3171, 2415, 1812, 591, -495, -1449, -2491, -2907, -2846, -2895, -2418, -1090, -334, 941, 1930, 2773, 3266, 3190, 2770, 2136, 947, -60, -1251, -2300, -2681, -3191, -3080, -2633, -1785, -822, 272, 1570, 2275, 2880, 3345, 2913, 2447, 1658, 251, -729, -1741, -2709, -3035, -3040, -2779, -1984, -1385, -272, 883, 1928, 2432, 3067, 2988, 2558, 2077, 1074, -294, -1223, -2242, -3057, -3178, -2956, -2502, -1730, -829, 428, 1546, 2241, 2947, 3125, 2811, 2362, 1576, 511, -918, -1550, -2394, -2994, -3065, -2865, -2002, -1070, -150, 1217, 2017, 2815, 3153, 3350, 2689, 1967, 805, -381, -1349, -2165, -2843, -3302, -2822, -2322, -1847, -586, 776, 1636, 2563, 2955, 3125, 2851, 2158, 1536, 62, -863, -1857, -2687, -3253, -3216, -2729, -1783, -910, 143, 1124, 2348, 3002, 3226, 2944, 2747, 1771, 626, -672, -1570, -2537, -2986, -3190, -2954]
5789b954K88J344J013J019J021R07M28q6j97j058n83j017j237q72r04j50J5M68
5807b555P80P63J148J152J168M66M5k64k40j080p65j188j081p58n20n1J36N46
5825b298J058Q81J053J232N20M93o4k40o49r18j085j244n94p86l45j86L72J080
5843a720Q86J338J007P07O50K08k19o82m13j306r78j140r68k46j54O0R99Q74Q47
5862b50J338J076M81P22o14j58o74j086j039j061q92p74J89q1K83Q88R25J131
5880D04J204Q56N75J90l71m65j005j375o74j188q04j50k88N46O36Q88R38J036
5898I53R86O98P28n4q88n19j154j021r72q98q31j49O7L69R97J425R29R53P37N80
5918B936L57o80m78q59j020j070j389m44n06K38L23O32Q22J321R45J009O00O72
$$ y = [-2954, -2666, -1322, -309, 710, 1731, 2638, 3066, 2980, 2783, 1725, 1142, 125, -1112, -1984, -2888, -3038, -3023, -2555, -1775, -1012, 136, 1288, 2456, 2922, 2967, 2703, 2463, 1383, 618, -570, -1651, -2409, -2929, -2980, -2844, -2298, -1240, -359, 694, 1926, 2446, 2939, 2875, 2635, 1986, 1068, -17, -1261, -1855, -2641, -2986, -3172, -2800, -1720, -834, 504, 1511, 2218, 2868, 3076, 2857, 2175, 1762, 456, -522, -1662, -2630, -2876, -3030, -2970, -1971, -1097, -250, 1088, 2164, 2645, 3367, 2753, 2595, 1921, 835, -204, -1265, -2157, -2931, -2742, -2823, -2540, -1652, -727, 404, 1608, 2464, 3039, 3229, 2858, 2393, 1388, 13, -661, -1849, -2653, -2803, -3091, -2545, -1909, -1021, -83, 953, 1939, 2637, 3365, 3311, 2423, 1904, 750, -271, -1243, -2141, -2972, -3121, -3054, -2685, -1688, -263, 666, 1619, 2356, 2936, 3293, 2613, 2135, 1276, 256, -814, -2203, -2647, -3153, -2915, -2592, -1960, -1138, 183, 1128, 2137, 2737, 3409]
5936C409o84q2q56j237o73j414p06o87J43j0N22N72J236J130J150J021L0K15m78
5955B601n62q36j110r67j156p14l70QK76R27Q87J290Q18J225M43L80r1n35q96
5974A618r41j247r08r64m54k35K49N39J064R17J431R47P17J23P2k54o12q32j006
5993B24j482q37p49k56R3L83Q40P83J362J219N99P03K09p5j53j365q03j210j150
6012a665r48l91q9K13R28Q71R31R68J259M88L16R5k37p83q77j311r65j137j62
6031b496l09R7K20Q01J129J322O84R48M10M51k68o06r52r32j151j225n63o56j60
6050c256N30N15J038R72J391P40J008K15m38j19r03r38j232n04j511l90j97l3
6068c112O51Q38J032J011J162R89L64L07l72m74j137j016j113j034p83k77j22
$$ y = [3409, 2725, 2643, 1787, 550, -123, -1537, -2243, -2930, -2787, -2797, -2275, -1703, -467, 663, 1813, 2834, 2864, 3079, 2601, 2039, 1203, 93, -874, -2030, -2744, -3114, -3106, -2830, -1903, -1016, 274, 1092, 2317, 2760, 3140, 3049, 2514, 1618, 677, -570, -1478, -2442, -2896, -3131, -2882, -2343, -1279, -362, 1069, 2016, 2733, 2856, 2928, 2674, 2062, 1230, 224, -1258, -2095, -2844, -3100, -3007, -2624, -1784, -1001, 361, 1580, 2179, 2882, 3091, 3016, 2863, 1498, 695, -515, -1665, -2613, -3004, -3093, -2880, -1952, -1081, -150, 818, 2077, 2565, 2881, 2976, 2739, 1956, 1079, -232, -1197, -2334, -2496, -2805, -2708, -2488, -1687, -558, 764, 1448, 2396, 2806, 3257, 2989, 2383, 1431, 499, -652, -1877, -2440, -3096, -3256, -2726, -2211, -1173, -201, 1190, 1930, 2938, 3153, 2715, 2596, 1693, 755, -477, -981, -2492, -2882, -3079, -3112, -2461, -1623, -591, 420, 1582, 2571, 2935, 3242, 2870, 2396, 1259, 243, -870, -1904, -2687, -2964, -3086]
6085c086M09Q05Q17J160J024P12Q40n3M69n15q74q53j106j086j232l73j96J71
6103b967N06O18J297J391P83R73N05o3r0r81o77j037j348p99q51m54K90K25O11
6122b068J251R71R68O85Q75M15N3m63r76q77j076j375o96n31k85N14M17O53J261
6141b84R73J015P18L16M68k52r42p29j203r65j068n49o01Q6L95P58R73J098R87
6160A194Q62N42M18J34p60o22j343p67j423m19p26m07P25N30N71R03J266R09P49
6179B336Q26j22m7p80j248q57j147j050n06m37L64j45J115P31J248J029R12Q67
6197C089R1k21m33r55j206r32r63p90l85l36L28M67Q44J124J243R12P98L82j81
6216B876j41o11j345q10j278p07n38l40l1L46Q95Q50J155J067Q16N12L55k07o26
$$ y = [-3086, -2677, -1872, -1055, 105, 1129, 1841, 2681, 2628, 3097, 2582, 1708, 855, -251, -1337, -2569, -2942, -3138, -2967, -2461, -1843, -546, 845, 1628, 2601, 3106, 3043, 2953, 1972, 1295, 258, -1090, -1889, -2740, -3194, -2904, -2679, -2068, -817, 154, 1122, 1807, 2682, 3097, 3150, 2687, 1711, 834, -242, -1617, -2313, -2844, -3129, -2615, -2198, -1545, -284, 689, 1704, 2422, 2738, 3206, 2954, 2012, 1283, 80, -885, -1953, -2502, -3103, -3017, -2622, -1864, -891, 207, 1194, 2056, 2598, 3016, 3150, 2390, 1768, 425, -342, -1765, -2184, -2910, -3317, -2592, -2062, -1491, -588, 678, 1587, 2336, 3162, 3040, 2993, 2213, 965, 108, -1039, -2089, -2595, -3032, -2668, -2813, -1698, -967, 281, 1310, 2222, 3089, 3180, 2959, 2526, 1571, 365, -567, -1530, -2320, -2705, -3041, -2713, -2246, -1402, -278, 965, 1877, 2675, 3057, 2876, 2735, 2124, 779, -31, -1309, -2016, -2554, -2894, -2925, -2579, -1684, -834, 321, 1388, 2204, 2716, 3071, 2864, 2238]
6235B238q39j034q27j301n38p55p1N05M47J246R09Q29Q65R82N64n1n13r03o84
6254A069j412q50q76o61j85O3L89J066O00J026J205Q75P39m0k30n57q31j210j145
6273i65j136p09k23m6M68N33J119R12J074J058O13J99j36j60o09j009j093j176
6291a286p39n49m78K54M12Q94R66J246Q14R86J24O25n71n55r45p25j252q20r06
6310b505o66K68L58P01Q82R48Q75Q89Q85K87j75k90p26r75r15j045q47o42m60
6329c153J22Q49N74J168Q80J330O17N27m6k73n26p72j023j187j051o34k64r4Q4
6348b872Q12R98J139R30J251K84M16k33l34m41j298q71j114q50o93k08L46M46
6366b292Q65J064R03R06J002L19L44m01p33p82q94j256o10q43m54J73J83N82J147
$$ y = [2238, 1399, 365, -462, -1763, -2301, -3056, -3127, -2622, -2175, -929, -20, 809, 1674, 2656, 3220, 3169, 2656, 1753, 1069, -343, -1193, -2069, -2730, -2915, -2852, -2463, -1397, -797, 229, 1434, 2309, 3048, 3008, 2778, 2221, 1390, 180, -965, -2101, -2810, -3033, -3079, -2611, -2078, -959, -47, 1027, 2085, 2698, 2897, 2761, 2601, 1992, 983, -110, -1286, -2025, -2574, -3052, -2798, -2386, -1492, -526, 720, 1534, 2520, 2644, 3269, 2698, 2143, 1198, 473, -779, -1599, -2505, -3171, -2903, -2545, -1844, -962, -14, 861, 1750, 2635, 2922, 2747, 2457, 1731, 756, -159, -1204, -2051, -2693, -3153, -3031, -2182, -1608, -440, 440, 1770, 2387, 2914, 2868, 2595, 2069, 1297, 274, -913, -1964, -2598, -2862, -2956, -2872, -2060, -1062, 77, 1007, 2258, 2542, 2958, 2725, 2391, 1950, 652, -219, -1333, -2183, -2876, -3084, -2738, -2292, -1427, -363, 540, 1446, 2448, 2767, 3111, 2710, 1977, 1195, 301, -955, -1565, -2408, -2862, -2689, -2506, -1924, -777]
6385g77J003R81P76O86L96j07m21p94q45j468r72q15l73k05q0Q17Q90Q58J305
6404H55P22R30L70l3K8p40p25j286j356o85p26l58K22N44L81J035R51J158Q58
6423B145M85J90n7l92p64j093j089j064m56n99j70J94N91P77J010J072R88J042
6441B810p4J22k91m47j112j271r21p49q76k90M36O0R76J074Q59Q75Q93P82j50
6460B706R3m73r31j120j145m23j082k65k26J87M35J046J184Q56Q69R61K11m4l16
6479B523o49j008j216r57o15p68r3Q2J57Q91J149J062R51N28P42K7k07m94r73
6498A132q53j033j074n39n18j92L93O92Q76R66J122Q25O65L47Q7l32q64r20j226
6517d46r55o18m96k26K4K64J108P09J301P73O95O15J54k51n16p97r25j041j230
$$ y = [-777, 226, 1207, 1983, 2669, 3065, 2958, 2537, 1743, 898, -570, -1542, -2357, -2730, -2935, -3015, -2198, -1308, -450, 855, 1577, 2507, 2877, 2844, 2872, 2132, 1407, 121, -1235, -1920, -2646, -3004, -2782, -2238, -1857, -822, 129, 1287, 2145, 2630, 2820, 2763, 2371, 1607, 514, -575, -1639, -2095, -2694, -2864, -2670, -2079, -1302, -292, 780, 1768, 2810, 2736, 2858, 2567, 2120, 1008, -263, -1184, -1933, -2809, -3099, -2663, -2603, -1627, -553, 306, 1181, 2074, 2856, 2706, 2799, 2326, 1395, 275, -870, -1293, -2375, -2640, -2866, -2679, -2244, -1198, -14, 842, 1711, 2672, 2883, 2839, 2523, 1874, 866, -350, -1307, -1922, -2690, -2783, -2701, -2544, -1653, -504, 558, 1509, 2037, 2779, 2806, 2599, 2105, 1132, 279, -754, -1828, -2367, -2885, -3077, -2684, -1992, -1116, -150, 972, 1797, 2462, 2809, 2896, 2564, 1700, 780, -446, -1401, -2019, -2515, -2741, -2717, -2453, -1345, -636, 665, 1438, 2133, 2748, 2902, 2651, 2135, 1338, 413, -628, -1858]
6536a858n91o84q2Q17M25R02J177Q31Q48J152j41J65m54p55r15j124p04j040r49
6555b980J26K07L48J183O97J065P34P00N95J23k30m35q61r91r93r54o47k91m84
6574c088L28Q76P97J081R91R78K82P53j89o01p04r51p79j225o74m44m66L99N56
6593b080O45J131R81R14O44P16j58l33l24j183l80j563r91n68l48J51K59O16J245
6612f26Q75J103P05P11j2Pk99j120p78j114q47j129j00j78K38N01P23R53J257
6631H70P46O23O84R2p55m78o77j249p37j125n37m71N26L5P22J152Q22R82R19M31
6651B575N7Q5m11q63q32j074q52j011m73J67J23L70J021R78J018R15M15O92j02
6670B798l76o40r80p09j178q47o04l19J63K08P34R96Q34J250Q62L93K58q3o19
$$ y = [-1858, -2449, -3133, -3215, -2398, -1973, -1071, 106, 937, 1785, 2937, 2796, 2961, 2507, 1752, 837, -287, -991, -2031, -2980, -2854, -2647, -2299, -1116, -419, 646, 1380, 2080, 2675, 2798, 2568, 2133, 1272, 281, -712, -1666, -2313, -2604, -3088, -2760, -1884, -1087, -6, 985, 1963, 2245, 2998, 2809, 2208, 1504, 553, -226, -1451, -2125, -2569, -3035, -2636, -2080, -1435, -304, 677, 1591, 2235, 2951, 2793, 2460, 2136, 953, 573, -990, -1981, -2549, -2897, -2746, -2487, -1871, -626, 249, 1352, 2057, 2768, 2756, 2763, 2464, 1344, 566, -548, -1395, -2524, -2624, -2802, -2564, -2063, -1340, -387, 870, 1616, 2239, 2923, 3015, 2260, 1782, 1105, -144, -881, -2006, -2543, -3014, -2488, -2453, -1731, -579, 243, 1225, 2144, 2575, 2632, 2717, 2306, 1443, 611, -463, -1315, -2326, -2799, -2632, -2509, -2139, -1118, -140, 878, 1793, 2208, 2900, 2798, 2422, 1782, 802, 93, -1085, -1932, -2536, -2855, -2692, -2484, -1750, -754, 80, 1330, 2192, 2585, 2843, 2760, 2141]
6689B141o36j052r43r30q15m19j0M7N60R68Q56J065R91L39M42J53n46n03o97j107
6709i6q10j082m34m72j1P64O01R48R86R01N70O84L43j78n89q31q17j013p77j035
6729b348l31l7J72K93J040J286Q82O45P60O15l19k37n64j221r34q64p06o97k70
6748b835K79K36P37J051R84R86O85L20L41j44p58o62j062r16j075m30q10P4O66
6767b333O07P58R22J087R45M92L31p6n33l70r89j014p96j124m10m77J44O59P58
6786a419Q70P24J272Q26O24k15m37k01q28j160j031m48r00n53J15Q1R13N58J454
6805B45J082L86N74M86r9k89q96q65q82j242o25l08m63J40P75M92Q70J439N60
6824A380J090L33N3k63o78p65r99j028r92n66l59J0M27O32Q66J012J055O64N93
$$ y = [2141, 1505, 453, -490, -1420, -2235, -2654, -2664, -2617, -2057, -1089, -233, 832, 1823, 2162, 2604, 2757, 2211, 1708, 1011, -96, -906, -1988, -2422, -2894, -2905, -2141, -1540, -592, 394, 1295, 1865, 2549, 2892, 2714, 2125, 1294, 477, -536, -1313, -2348, -2679, -2716, -2544, -2251, -1211, 75, 957, 1602, 2362, 2977, 2658, 2421, 1857, 636, -298, -1162, -1868, -2565, -2835, -2556, -2320, -1583, -532, 452, 1438, 2123, 2443, 2784, 2640, 1882, 1220, 158, -758, -1833, -2263, -3073, -2999, -2333, -1726, -968, -46, 1041, 1986, 2478, 2809, 2733, 2200, 1830, 841, -173, -969, -2093, -2503, -2980, -2836, -2177, -1419, -549, 175, 1447, 2273, 2897, 2682, 2245, 2044, 1216, 56, -975, -1423, -2323, -2876, -2761, -2680, -1767, -1209, 245, 1327, 1713, 2287, 2773, 2674, 2385, 1489, 624, -258, -1500, -2125, -2433, -2896, -2756, -1981, -1489, -619, 820, 1380, 2470, 2803, 2856, 2593, 1915, 1150, 151, -877, -1869, -2435, -2794, -2784, -2357, -1725, -859, 153, 1208, 1872, 2465]
6843B465J31O5j99q42j170p57j231l93o84m57N69N74L61J290R16R07Q35J66L92
6862B938l28j068o23r43j001n90j004L0m34O27Q56N80J389M86Q77Q30q4K29o06
6881B161j095l76j049r12q59o83r3L16P43N99P47J219J196L75M69K53n69o61n86
6900A195j174p38j080m12o64P9O55Q06L47J182J217N26O76J75j23o30n19j027
6918D91r35j331n13l52l38M09R07M95Q07R42J209O50L50j70l71p58n14j086j150
6937a258n41n95k22l08O31P04Q20J041R61R95M14PJ17q00m58q64j194j167o32
6956b349n81J32M82O61M86J115P85J108M49O39k81k63o05j160q85r06p25n21k83
6975b702l3N72O35J185Q53Q41Q22M10K89k23o72q63r55p37r89n39m70k90L63L13
$$ y = [2465, 2596, 2661, 2462, 1620, 450, -307, -1538, -1931, -2615, -3072, -2503, -1929, -1568, -278, 638, 1545, 2380, 2546, 2938, 2610, 1542, 919, -24, -1025, -1615, -2619, -2589, -3023, -2396, -1540, -960, 429, 915, 1792, 2622, 2538, 2767, 2161, 1066, 690, -359, -1271, -2130, -2813, -2906, -2590, -1847, -1248, -501, 718, 1914, 2289, 2758, 3011, 2442, 1781, 1195, 21, -717, -1797, -2209, -2873, -2794, -2139, -1333, -986, 196, 1413, 1939, 2615, 2790, 2667, 2037, 1518, 491, -444, -1775, -2288, -2640, -2978, -2569, -1662, -1167, -360, 582, 1791, 2441, 2791, 2621, 2250, 1492, 978, -108, -1258, -1799, -2394, -2616, -2924, -2293, -1589, -769, 272, 1233, 2228, 2642, 2649, 2766, 1966, 1508, 644, -550, -1717, -2349, -2930, -2798, -2316, -1655, -1169, -54, 731, 1839, 2288, 2927, 2646, 2383, 1778, 618, -267, -1173, -1898, -2419, -2702, -2735, -2163, -1528, -343, 510, 1351, 2173, 2583, 2872, 2649, 1977, 1114, 159, -578, -1567, -2106, -2576, -2866, -2503, -2190]
6995b190J169J173P29P43P67J06K32n47o22q08q36r37q81p31m7J57R9P69J037
7014f18Q49Q49J142N14M6n0n11r87r90r72o91q27k27l61O04L73R57J003J060O58
7034A821N55K72j27k58o55q75r65r25p62n09l72L36K68P62R63R27O54J227O93
7053C030l48j07o41p58o44j289p80p24k56L6L38K10J380O56Q00J132M44L10j98
7072B591m04n00j028r86r34p57o10o5K84J83P43J034R61P06R81K13M53k10o83
7091A972j060p51j021n04q88m69R7L14O23Q91J147N17J168R6P27k73l24l78j072
7110H12j315r67m51o60j06L11L06N07J196N87J298P25L94J06k25q69n38r05j185
7129i79p94m11m74j79L86O32R44P40J210R79N51o0K6l21p57r65r13q97o40n35
$$ y = [-2190, -1021, 152, 881, 1624, 2391, 2497, 2729, 2182, 1560, 752, -84, -1021, -1902, -2633, -2680, -2523, -2424, -1655, -618, 231, 1080, 2222, 2736, 2782, 2732, 2221, 1234, 244, -728, -1419, -2246, -2473, -2834, -2230, -1857, -900, 103, 1163, 1821, 2376, 2648, 2521, 2263, 1608, 733, -232, -1157, -1919, -2428, -2800, -2464, -2196, -1434, -471, 456, 1110, 2337, 3030, 2682, 2575, 1934, 1176, 532, -757, -1537, -2261, -2517, -2481, -2143, -1933, -553, 103, 903, 2035, 2479, 2789, 2591, 2187, 1687, 659, -327, -1261, -2018, -2628, -2693, -2409, -2226, -1483, -449, 512, 1218, 2199, 2412, 2865, 2655, 1972, 912, 161, -860, -1364, -2252, -2721, -2624, -2310, -1687, -796, 351, 868, 2036, 2132, 2859, 2586, 2262, 1884, 812, -503, -1470, -1921, -2581, -2687, -2376, -2070, -1563, -367, 220, 1518, 2243, 2637, 2743, 2518, 1649, 1111, 206, -979, -1773, -2184, -2658, -2837, -2451, -1819, -875, -135, 1075, 2054, 2605, 2545, 2571, 2250, 1493, 528, -385, -1282, -1922, -2457]
7149b457m9J72J94R81R89O72Q60O52L79K81k92o17n74j065q96p68o79n53K69L39
7169b162M39P29J206J115O33L63K99j41m90q68o75p63j007j041K1l21K31N25J007
7188i00P12R16J071N08Q3M81o64m69r01r74q20p97m99m23O5O93K29R59J052Q60
7208A182R08K27M16k63l14r04r18p18p28r07k24k28J35N48O57Q79R12Q17Q22J56
7228B455M44m27p93n72j209p77p50o69j53j65N86O54R16Q80P42N85N68M40k17
7247B538m15q14r83q30p99p95l55Mj58Q14Q33Q44J028M90Q55M31j77k82n31p05
7267I93j205r70n24o97N8k30N01N81R36J180O98M97N39N1P4m50p65p24r72j178
7287a607n30l29j07K26M81R22Q21J246L90J069J01l90Lr25o54j089p20p31n41
$$ y = [-2457, -2506, -2334, -2140, -1159, -170, 502, 1362, 2014, 2393, 2674, 2382, 1765, 1191, 126, -770, -1538, -2217, -2770, -2501, -2162, -1723, -994, 212, 1327, 1960, 2323, 2622, 2481, 1991, 1123, 448, -315, -1322, -2363, -2342, -2663, -2432, -1907, -900, -188, 728, 1799, 2307, 2390, 2871, 2207, 1738, 837, -137, -957, -1754, -2253, -2676, -2611, -1918, -1689, -730, 322, 1182, 2090, 2317, 2733, 2470, 2156, 1252, 334, -384, -1112, -2019, -2243, -2471, -2336, -1788, -1131, -252, 660, 1477, 2299, 2455, 2899, 2472, 1679, 1107, -102, -879, -1629, -2298, -2451, -2616, -2030, -1376, -460, 420, 1162, 1747, 2315, 2755, 2538, 2123, 1309, 326, -504, -1303, -2098, -2453, -2449, -2607, -1793, -960, -116, 912, 1402, 2257, 2688, 2511, 2229, 1698, 993, -212, -1182, -1706, -2403, -2345, -2575, -2074, -1493, -557, 623, 1321, 1818, 2357, 2408, 2482, 2032, 1267, 543, -429, -1607, -2137, -2466, -2573, -2347, -1866, -944, -123, 1123, 1513, 2582, 2683, 2293, 2296, 1371, 717, -372, -1092, -1823, -2364]
7306b364j80J27M11N80J077N63R11Q30N61l1k13m89o27o68r86j008n94m25J05
7325b420J26N58Q99Q59Q18O15M44O41l88p0l35j195n42r60o95o41r3l6K27Q71
7345a317P93J107R00M36M19N78p50k02o99j049r41p95m87n85L71pM05O79J379
7364B35N54R25N96M36o90R1p85q07m96j038j173j85j86J23N23P24Q61P67R65N86
7384B026N98l53L6m90o15r64r25j002o33J1o8J70O02Q33O70J076Q83J90M15J71
7404B631k54j060p01q94q43o60p80q3M53M70O23Q74N83J213K28O51M9k81o28o56
7424I35r58p89j017j30l65j20L27P04M47J167P08P51O20J59k2j17p77r73p61r51
7444a162q39k74O2m28P73O11R22P66P88O31O73j51l94l08q51p12j108n85n61j10
$$ y = [-2364, -2544, -2417, -2006, -1426, -349, 214, 1125, 1955, 2516, 2485, 2272, 1783, 1156, 488, -498, -1506, -2100, -2525, -2420, -2294, -1736, -837, 22, 840, 1455, 1899, 2540, 2152, 2082, 1747, 552, 10, -950, -1645, -2286, -2379, -2415, -2188, -1317, -524, 583, 1483, 1919, 2338, 2916, 2166, 1964, 1265, 216, -725, -1520, -2007, -2592, -2221, -2228, -1823, -1144, 235, 789, 1714, 2310, 2746, 2056, 2147, 1362, 555, 59, -979, -2152, -2337, -2523, -2400, -1877, -1153, -292, 475, 1440, 2026, 2624, 2271, 2307, 1817, 1202, 238, -687, -1689, -2322, -2311, -2379, -2209, -1607, -774, -104, 972, 1855, 2045, 2460, 2631, 2377, 1317, 616, -278, -1121, -1781, -2561, -2644, -2191, -1721, -1098, -224, 359, 1572, 1800, 2451, 2500, 2219, 1591, 935, -23, -812, -1829, -1959, -2324, -2444, -2117, -1413, -966, 201, 909, 1660, 2280, 2439, 2417, 2300, 1523, 550, -211, -1162, -2001, -2275, -2213, -2641, -1868, -1257, -335, 431, 1219, 1850, 2523, 2372, 1978, 1670, 819, 107, -1001, -1586, -2147, -2257]
7464b257j55K68O07J105Q05N35N47O60M23k07j66o27j059n79r76q93o30L53j13
7483b359M64Q00R31R49P01P30O7K7j36n37p09o96j217n58n82l85K32J14Q93N25
7503g46J142N23P88N87L11k17p21k57j314n36j118k1o39m21M83K87R23P00Q07
7522E61J027K75O43k02k26o16p47q51p42r38l67k55K3N42M70R80P06P16P83M70
7542B252r2O9k43q96p54p00r56m49n72k95L04P69O12R15P22N08Q37Q6l3J16q11
7563A389o96p21p78j011l58p2J04K77P55O79R56Q66L37N04K4l79r3p75m54j415
7583h61n35n19k08l92N03L73P13R02P49R96K57L07o7l29l03j185m41r27q70n2
7603a889o08M48J29R38N16Q11O20N30O17K41n78p3o11q85p29o38p09n00L3N57
$$ y = [-2257, -2412, -2144, -1537, -432, 373, 908, 1455, 2115, 2538, 2331, 2165, 1538, 479, -100, -1076, -1969, -2599, -2246, -2359, -1895, -1095, -164, 785, 1486, 2216, 2283, 2310, 2174, 1637, 928, 232, -985, -1543, -2125, -2510, -2278, -2164, -1271, -746, 396, 919, 1707, 2294, 2605, 2388, 1667, 1410, 96, -440, -1558, -1579, -2218, -2639, -2156, -1869, -946, -246, 561, 1588, 1863, 2506, 2304, 2078, 1462, 715, -136, -878, -1816, -2183, -2438, -2415, -1873, -1403, -423, 283, 999, 1782, 2252, 2160, 2229, 1986, 1090, 336, -364, -1320, -1769, -2341, -2636, -2332, -1563, -951, -36, 686, 1194, 2031, 2117, 2084, 2200, 1389, 693, -28, -806, -1817, -2175, -2247, -2143, -1866, -1111, -432, 524, 1390, 1727, 2231, 2255, 1876, 1783, 1008, 554, -861, -1396, -1915, -2123, -2515, -2012, -1639, -926, -24, 725, 1721, 1978, 2285, 2218, 1889, 1586, 401, -40, -967, -1837, -1889, -2497, -2049, -1920, -982, -466, 345, 965, 1495, 2112, 2353, 1775, 1702, 1091, 206, -523, -1161, -1870, -2370, -2337, -1780]
7623a780K13O17R30P78J083L8M73M7o12m30r49m01p92q64n56n9n3M20P42Q72Q25
7644E42L90P38O93J51l49n78m93o57j138o76o48l76J81L6P48N28Q62J123O15L15
7664B007L26K5k11p58q89p51q16n10m84j43M0L37R29P50O28Q15N43L52J51k49
7684B092m88n74n45j300m10o79j12j02J47P06O91Q13N05M65Q61N14l32k89p01
7703A262o23r67q35m90o75j59M26L78P07O33R70J56P56P74k89P9q77k51q48q65
7723g38o40o33l88L6M75Q55K30Q41P48Q51N74J32M9o54n10o05j138o34n98n10
7743b257N6K51M0R44O75L63R90R36M08m16M6o37p24p04n81o29m64m07m4L56K96
7764a502R61Q64O00M61M71L32l2l81m69q94p29q71n22j72j81J68L92N20Q70N24
$$ y = [-1780, -1567, -950, -20, 758, 1841, 1879, 2352, 2399, 1787, 1357, 408, 7, -785, -1649, -2205, -2264, -2317, -1897, -1155, -283, 542, 932, 1670, 2363, 2514, 2165, 1587, 1094, 437, -701, -1377, -2025, -2401, -2220, -2184, -1436, -908, -46, 1077, 1692, 2007, 2333, 2358, 2147, 1389, 500, -251, -1067, -1577, -2061, -2204, -2164, -1827, -898, -148, 480, 1295, 1838, 2190, 2341, 2092, 1604, 1030, 485, -815, -1225, -1904, -2016, -2118, -1971, -1265, -574, 239, 744, 1209, 2070, 2584, 2252, 1963, 1262, 639, -328, -1163, -1653, -2328, -2487, -2061, -1683, -976, -343, 627, 783, 1539, 2313, 2024, 2103, 1226, 975, 127, -738, -1378, -2011, -2399, -2363, -1888, -1033, -803, 38, 786, 1637, 2211, 2343, 2392, 1738, 1228, 623, -515, -1149, -1747, -2257, -2201, -1950, -1910, -966, -291, 72, 1062, 1998, 2406, 1990, 2036, 1399, 675, -29, -610, -1239, -1703, -2110, -2154, -1798, -1502, -541, 323, 923, 1384, 1855, 2187, 2155, 1774, 1305, 411, -318, -1189, -1711, -1883, -2064, -1896, -1504, -984, -114, 410]
7784D10O81R22J34O7j07q51o34o25q91m55n19l82k19O40M58R29N23P86N32P21
7804B120L13j76p64k2j075l84j192q64j97p6K25O28P22M46P89Q92N97o3O0k01
7824A778j42j138n33r44o52l65k68p5M35O30N49J077P49M18L59L69p0k04p35q94
7844C44q21p01o62k40j10pN86O59N94R28Q60L29L74J02m37n63l74q54j157l42
7864a492m75j56J61L34N38L61O93J109N00N04J81k08k88q61o71p35q45p34lo7
7884b154j98R03O08O11R34O83N46M20k21m66k54m66j061r04l59q03j61M4P22O32
7904i44J91J186L72Q70M19p2k4l64n36r49r56m81m55l35R8p0O15P50O63P95O80
7925A453O47J79j44o72l79k91q03r80n07n65k53K97L88N85N43P94Q20O53Q7K09
$$ y = [410, 1091, 2013, 2147, 2214, 2107, 1256, 622, -3, -894, -1349, -1868, -2250, -2469, -1829, -1371, -442, 81, 867, 1399, 2120, 2433, 2257, 1493, 1471, 396, 12, -1180, -2044, -2241, -2317, -2092, -1464, -742, -296, 493, 1385, 1982, 1919, 1979, 1778, 1636, 498, -35, -979, -1631, -1996, -2264, -2339, -1904, -1274, -725, 352, 1101, 1519, 1878, 2247, 2177, 1973, 1238, 344, -477, -1178, -1840, -2080, -2190, -2197, -1611, -952, -358, 570, 1430, 1759, 2133, 2235, 1798, 1235, 861, 7, -1150, -1492, -1967, -2123, -1962, -1628, -1090, -729, -36, 1073, 1573, 2077, 2258, 2050, 1762, 901, 230, -505, -1350, -2084, -2087, -2154, -2352, -1449, -841, -230, 704, 1387, 1933, 2353, 2132, 1666, 1412, 946, -115, -1019, -1378, -2181, -2342, -2298, -1576, -944, -753, 433, 805, 1675, 2094, 2022, 1998, 1634, 1098, 149, -807, -1288, -1743, -2078, -1980, -2050, -1435, -685, -22, 773, 1453, 2100, 2279, 2135, 1463, 1084, 793, -10, -990, -1497, -2062, -2315, -2018, -1630, -1045, -502, 292, 1112, 1765, 1852, 2061]
7945B061j42m58o20n50j021m72p59j25j44J26O20N65J019P64O21M05m1J59q1m25
7965A502r48j034p09l53l52l52J90P68K2Q70R84M39P59M60R3m16o60l64o88p66
7985e55m58p73l01J22j6Q44L12Q00Q14Q09L59J46k25m3n62r98m98o64o68o09R2
8006b072P0L50O70Q92O72P02L32L28K4q5j35q54q54p03q30m92N8j89L89O45L55
8027g27P40Q42M13L16O50o0k78p15n58q61p42p42k65P7Q3J99O90O12Q92N47L05
8048A418M68J38j98n06j72j100q33n91m54l97J55J11P37P09P19L75R20N67L5j83
8068A918l25k96j058o15r36l58m08j5J51O37M88P30N93Q35L08L84K12m33n46o41
8088F25o54n56p78k89m27J05J60P35J91J053P23P24M87k70K54n25m15q41m46q92
$$ y = [2061, 1919, 1461, 841, 291, -730, -1202, -1961, -2086, -2230, -2104, -1484, -919, 100, 864, 1485, 1890, 1849, 2008, 1927, 1502, 554, -480, -1189, -1542, -1894, -2246, -2056, -1288, -1266, -396, 588, 1027, 1786, 2246, 2339, 1923, 1263, 899, 211, -555, -1013, -1786, -2087, -1965, -1981, -1137, -825, -25, 789, 1598, 1957, 2103, 1878, 1835, 1273, 275, -223, -887, -1555, -2164, -2072, -2002, -1652, -982, -90, 582, 1284, 1616, 1944, 1968, 1883, 1748, 894, 40, -663, -1493, -1985, -1927, -2116, -1727, -1082, -727, 13, 855, 1268, 1584, 2234, 2174, 1896, 1181, 623, -238, -980, -1722, -1987, -1910, -1827, -1628, -938, -326, 566, 1113, 1418, 1886, 2024, 1826, 1320, 1148, 48, -785, -1376, -1830, -2227, -2072, -1961, -1224, -515, 204, 579, 1499, 2066, 2101, 1918, 1593, 1297, 239, -376, -1312, -1670, -2078, -2093, -1942, -1305, -817, -87, 506, 1341, 1649, 2033, 2245, 1812, 1266, 625, -29, -585, -1363, -1652, -2079, -1974, -1814, -1079, -888, 165, 888, 1612, 2099, 1829, 2083, 1558, 1143, 302, -144, -1036]
8108a036q58P2m17K71M95P15N25O37Q85P94j90j32K64q64n45p07q03o49l34k19
8128b096k13Q10M12O75O45R73M92L79J40l67k84o14n28p66m48r09m76J40N0L39
8148a646O40Q65P79O17O09L72j81l71r4j061o10l46j151j80l49O4N47L95M98J138
8168E35K97N78P45Ol32m42n92o39o65m93r44l9k52K58L82N37Q12Q84O96N26J98
8189B056k49k58
8191A549
$$ y = [-1036, -1894, -1822, -2239, -1968, -1473, -758, -233, 404, 1289, 2083, 1893, 1761, 2025, 1161, 616, -91, -894, -1543, -1877, -2096, -2309, -1499, -1087, -412, 233, 1206, 1698, 2077, 2217, 1850, 1566, 952, 424, -342, -790, -1699, -2175, -2035, -1985, -1646, -1006, -141, 638, 1255, 1864, 2236, 2055, 1684, 1590, 529, -81, -427, -1578, -1758, -2107, -2043, -1496, -1101, -603, 535, 832, 1410, 2155, 2161, 1829, 1387, 795, 156, -509, -1002, -1946, -1985, -2237, -1979, -1597, -1060, -248, 636, 1332, 1858, 2056, 1807, 1549]
$$ Imaginary data points
##PAGE= N=2
##DATA TABLE= (X++(I..I)), XYDATA
0@%%%%%%%%QqQj6J6k4L2m0M8n6O6p8R8j19J40j64J95k25K60l04L51m05M63n28
32b82N99o81P70q68R76j092J224j365J522j691J878k082K303k546K810l101L416
49A790l767M151m572N039n559O141o791P532q379R361j0513J1887j3560J5650
63H410j8350K1990k7204L5346n0004Q4842l32706l93419J28658N7310K16330J81185
75h7612K33873J84627J66966P8360L2610p7670j14450j80226k07654k11075j70248
86c52499j50490o3427J126O9979J34336J84235J91303K04091J64948J14034N8354
97E55990j7105r2840j32728j84761j99197j80347j55617j04648k8387K8592R8779
108d12269J55624J77060J92411J82107J30559Q4477K1942n8123j08616j53064
$$ y = [0, 0, 0, 0, 0, 0, 0, 0, 0, 8, 0, 8, -8, 8, -16, 16, -24, 24, -32, 34, -44, 54, -65, 75, -89, 106, -119, 141, -163, 188, -217, 246, -282, 317, -364, 406, -462, 514, -578, 646, -719, 803, -888, 990, -1092, 1211, -1335, 1475, -1626, 1790, -1977, 2174, -2398, 2641, -2918, 3223, -3568, 3964, -4415, 4946, -5567, 6320, -7240, 8410, -9940, 12050, -15154, 20192, -29812, 55030, -277676, -671095, -542437, -485127, -268797, -87612, 146261, 330888, 497854, 576214, 608824, 531154, 416704, 236478, 28824, -182251, -352499, -502989, -566416, -565290, -495311, -360975, -176740, 14563, 218654, 383602, 497636, 555990, 538885, 446045, 313317, 128556, -70641, -250988, -406605, -511253, -539640, -511048, -412269, -256645, -79585, 112826, 294933, 425492, 509969, 531911, 473788, 365172, 212108]
118B12108j89026j80505j61367j25775n8432J808O1042J27266J58366J73976J80799
129B00260J44986R7923N1343k2300q1688j21921j65876j74405j57749j38092q4714
140d52233k2264K8235R2347J39150J56450J71732J56573J13680P2962J1292n4216
151D13708r7569j42316j68705j57807j45033j09100m7252M487O0198J18001J44462
162a26926J60742J61774J27093Q8803L9957k6807p5564j15868j54841j56427j43257
173b21321j22962p0366j6999L1222R0208J26798J43889J56883J36108R9139O2865
184D15464L197n2851r0538j32074j50500j41487j29486r1378l8222N469O0493
195c41913J08900J29084J47042J44527J10351P8599L1628k8382p0043j10016j40584
$$ y = [212108, 23082, -157423, -318790, -444565, -502997, -501189, -440147, -312881, -154515, 19461, 200260, 345246, 443169, 494512, 472212, 390524, 268603, 102727, -71678, -229427, -367519, -452233, -474497, -446262, -353915, -214765, -58315, 113417, 269990, 383670, 456632, 467924, 413708, 316139, 173823, 5118, -152689, -297722, -406822, -454074, -449587, -389389, -271388, -126926, 33816, 195590, 322683, 411486, 451443, 424636, 349072, 233204, 78363, -78064, -221321, -344283, -414649, -431648, -400426, -310218, -183420, -39531, 117352, 253460, 352599, 415464, 418661, 365810, 275272, 143198, -7302, -148789, -278275, -369653, -407875, -402406, -341913, -233013, -103929, 43113, 187640, 297991, 376590, 408218, 379836, 309793, 199777, 59193]
206E9193j40219j31548j08360n8281j4033L2971Q7287J15745J32898J43458J20264
217B39375Q8735N2785l430n0288q6291j24211j35115j27580j16395p6690l0843
228c69948Q904O1885J00014J17675J34775J26581R6993O7958K1324l0037o5194
239B70930j04053j27919j24159j18516r3404m7311r962L5651Q2528J05453J23357
250g405J28557J04795P8868M3040r145m7874q2034j16161j21657j15737j03563
261b48316o4915k4774J2707O1604R2250J09527J23886J11842Q5556N9397J3058
272C31822l1381o2185r8314j16569j12677j06754p9926l9374o255L8685P8295
283b04633R6676J14536J15325R2358O9797L4153j3129m6301p9689j07434j09718
$$ y = [59193, -81026, -212574, -320934, -379215, -393248, -360277, -272990, -157245, -24347, 119111, 239375, 328110, 380895, 377465, 327177, 240886, 116675, -18440, -146020, -262415, -339105, -369948, -361044, -299159, -199145, -81470, 53305, 179886, 276879, 344837, 366161, 336124, 270930, 166877, 38958, -85201, -203717, -297121, -344432, -354394, -318743, -236215, -130762, -7405, 121152, 225947, 304815, 347855, 338710, 290836, 208802, 92641, -29016, -144753, -248316, -313231, -338005, -325298, -263694, -171444, -61917, 61969, 173811, 259367, 318764, 331822, 300441, 238256, 139942, 23373, -89304, -196058, -275984, -315358, -321613, -282928, -204633, -107957, 6579, 121904, 214262, 284059, 318212, 305083, 258782, 179093, 71659, -38059]
294c8059j06652r1508n3821j9982J6549O1369Q5893J02469J13869R9496P6571
305B46194N0232O377l1388o1536r4701j05967j03356r7402o8312l2364j681M1253
317b52651P4310R1169J06713J03936Q2378O2043K4592j6013m5196p7881j00251
328E3149r9997r7787q0336m5335j5701K1269N9929Q0097R7098J04278Q8427O9441
340B34532M1543M63l1572o0280q9791r7104r5154q8346n8517k7542K837M2889
352b26042O9878Q5956J00217R3106P4479N4433J8468j7927m4927p5491r2860r2159
364e2869q9916p1096l8939j1897K4181N8119P5521R2128R5660P9204O2261L5265
376B57622m056l0894n9774q5276q9307q8921p8692n0700k3369O645M3837O5985
$$ y = [-38059, -144711, -236219, -290040, -310022, -293473, -232104, -146211, -43742, 70127, 169623, 246194, 296426, 302803, 271415, 209879, 115178, 9211, -94145, -191547, -259859, -292223, -293904, -252651, -178341, -87172, 19541, 123477, 205855, 267898, 292490, 276477, 231281, 153400, 53149, -46848, -144635, -224971, -270306, -286007, -264738, -204809, -124712, -27614, 76664, 165091, 234532, 276075, 276538, 244966, 184686, 94895, -2209, -97363, -185709, -244226, -271768, -268931, -226042, -156164, -70208, 30009, 123115, 197594, 252027, 270495, 252568, 207641, 132150, 39290, -52869, -142785, -213881, -252820, -264717, -240536, -182417, -106896, -14768, 80892, 160096, 222357, 257622, 253566, 222672, 162898, 77622, -11685, -100606, -179298, -229998, -253367, -246722, -202885, -136900]
388a36900Q1662R3754Q3931O7698M7929J1784j8700m5041p3926q5370q6095q2979
400a42253o1710l3514p765K7473N5763P1885Q7429Q7027P2232N6448K7205o727
412B33493l1047n9802q0206q2327q3628p0595m3378j9703J0589M3884O2857P8621
424d1242Q6847P6230O2038M1047O811j9269m5423p0904p9502q0774p6482n4239
436a94862k9103m241K9864N3273O9034Q3127P9364O6251N0776K1506q480l1633
448A84876n9272p5078p7154p7862o3490l8298j6532J4470M2827N9321P6133Q0719
460E0660O9116N7495L5020L735k0134m5429o7922p4199p6156p0222m7468k6109
472b11613p72L0965N0932O6342P8887P2755O1229M5486J6617r447l2105n8666
$$ y = [-136900, -55238, 38516, 122447, 190145, 238074, 249858, 231158, 186117, 112191, 26821, -59274, -142253, -203963, -237477, -245242, -217769, -162006, -90121, -2692, 84335, 156567, 213015, 240220, 233493, 202446, 142644, 62438, -19889, -103517, -174112, -217490, -237193, -226604, -182720, -119863, -41242, 45605, 121835, 183873, 224920, 231731, 212462, 167039, 96135, 16633, -64141, -140623, -194862, -223965, -228206, -198342, -145069, -76035, 7092, 86456, 152707, 203483, 224989, 216509, 184876, 125604, 50526, -26628, -104490, -167980, -206278, -222810, -208340, -165513, -106192, -30059, 50660, 119776, 177271, 212291, 216026, 195892, 150463, 82541, 8342, -67814, -138036, -185504, -211613, -212385, -181420, -130488, -64146, 14741, 87496, 148725, 194211, 210828, 201381, 169276, 110610]
484A10610o9933p3050p2846n6682l4317j2964J6964M2027N7192P2962P4474O4160
496A18597N2939K9277O88k0251m5858o5106o9481p2052o4049m2345k2834K702
508a97773L1688M8887O4576P4096O6688N7263M0625J2075j0568l3219n6609o6288
520C1441o9159o8140n0295l1081r969J9623M0764N5592O9689O9275N9516M8562
532A65818K4301n89k1825m6268o1340o5652o8857n7897l7924k0145O000L1991
544a52387M7071O3003O9409O1477N3881L5089R405j1862l4130n5027o2387o6318
556d2776o2970m5222k8011o555K1315L9643N4303O6892O3977N5761M4162K0022
568A80541k615k2726m6468n8302o2633o5060n2277l4165j7185Q896L1951M6150
$$ y = [110610, 40677, -32373, -105219, -161901, -196218, -209182, -192218, -150191, -92999, -20037, 54437, 118597, 171536, 200813, 201501, 181250, 135392, 70286, 805, -71247, -135296, -177641, -200475, -197773, -166085, -117198, -52622, 21474, 88162, 145425, 186050, 198125, 187557, 154338, 97729, 31441, -37718, -105858, -156153, -187234, -197203, -177580, -136816, -81224, -11535, 57740, 117256, 165818, 190119, 189530, 167705, 121437, 60097, -5555, -74412, -132309, -170233, -190378, -184378, -152387, -105316, -42313, 27096, 88573, 142454, 177543, 186948, 175086, 140956, 85929, 23542, -42776, -105746, -150968, -178979, -185534, -164219, -124576, -70273, -3381, 60596, 116357, 160519, 180541, 177926, 155200, 108732, 50430, -12203, -77263, -129540, -163705, -180890, -171994, -140043, -93893]
580i3893O1282O4713N7867M9719L0170O182j2419l5590n3124n9180o3271n8232
592a05776m0575k5202k784K2185L8655N3838O3467N9126N2972L9379J6176l898
604A67563k4097m6166n5599o0075o1000m7351l1379j4192J2242L0834M5530N9460
616b4230O0679N4502M5880K5954M103j3797l6223n1281n6809o0929n3108l7203
628a42462k2255M01K3384L7441N3113O0263N5587M9860L5152J2756n346k5353
640A32541m5676n2892n8226n7320m3028k8732j0462J3892L0111M5745N7686N7062
652D0701N1459M2187K1947K610j5349l7546m9164n4718n8270m8606l4210j9575
664a58534L465K3511L7690N2178N7287N2349M7015L0695J0465o612k7457m4329
$$ y = [-93893, -32611, 32102, 89969, 139688, 169858, 176040, 163621, 128031, 74907, 15727, -47544, -105776, -146351, -171553, -174337, -152152, -113497, -59659, 3808, 62934, 115906, 155285, 171461, 167563, 143466, 97300, 41701, -18374, -79374, -126725, -158104, -172296, -160054, -129220, -83690, -24230, 36449, 90951, 136831, 162785, 166888, 153091, 116868, 65587, 8778, -52151, -105259, -142462, -164717, -164316, -140932, -103491, -50378, 9885, 65472, 115332, 150484, 163240, 157894, 132541, 86865, 33973, -24253, -81573, -124601, -153333, -163795, -149903, -119792, -74047, -16361, 40701, 92160, 134347, 156294, 158904, 143555, 106009, 56845, 2127, -56143, -104749, -138959, -158534, -155069, -131558, -93868, -41690, 15597, 67946, 114961, 145656, 156121, 149509, 122052, 77723]
676G7723n1224n6338n3094l9562k6682p212J5808L0198M5488N5697N3434M9245
688I3481L8452J8588J180j6978l7930m7243n3525n5140m5229l1592j7088O192
700a46832K3732L7667N1854N3981N0179M4199K6932Q193q073k9109m3415m9284
712B0024n4788m9382l6681k4173l842J6567L0505M5024N3722N0551M7005L5064
724A29596J5373n6j9208l7646m5941n2066n2818m1320k9360j3700Q184K4050L7830
737g7082N0384N1499M7992M1292K3640O455r933k9796m2088m8560n2808m6183
749h5188l4204k1854j149J7850K9958M5575N1012M8480M5028L1250J3505j691
761A38572k1121l7464m4083n1003m9618l8474k7645j0779R800K4084L8488M8948
$$ y = [77723, 26499, -29839, -82933, -122495, -149177, -156389, -140581, -110383, -64895, -9198, 44236, 93481, 131933, 150521, 151701, 134723, 96793, 49550, -3975, -59115, -104344, -135936, -153024, -146832, -123100, -85433, -33579, 20402, 70581, 114780, 141712, 149905, 141832, 112723, 69308, 20024, -34764, -84146, -120827, -145000, -148842, -132275, -101770, -56746, -3024, 47527, 94532, 129596, 144969, 144913, 125705, 88059, 42118, -9948, -62766, -104086, -133446, -147146, -138962, -114912, -77082, -26698, 24801, 72793, 114085, 137725, 144180, 134247, 104451, 62363, 13803, -39005, -85188, -119392, -141246, -142395, -124545, -94587, -49012, 2000, 50480, 95508, 126758, 140263, 138572, 117451, 79987, 35904, -15099, -64717, -103191, -130836, -141615, -131815, -107731, -69243, -20295]
773b0295M8735M6623L7985K0575N183j1541l0570m0869m7567n1219m2730l2601
785a18291j8941J513J7518L1139M5071M8662M6642M2439K8245J1740l171k2465
797A10101l6648m3628m9798m6887l5622k5711p935J1042K3813L9145M7360M6908
809C2140M4468L4829J8211M308j3805l0991l9350m6902m8945l9945l0180j6657
821a32819L047J7979L1685M4224M6484M5109M0662K4674J0250m734k3531l5719
833F7311m2999m8396m3530l4390k3604n142J1464K4814L8877M5915M4726M3032
845G8078L1793J6014K978j5391l0864l8663m6187m6199l7204k8846j4248N060
857a23679J8116L2362M3201M4283M3876L7344K2697R153o541k4915l4372m2415
$$ y = [-20295, 28440, 75063, 113048, 133623, 138806, 127265, 96695, 55826, 8259, -42960, -85690, -118291, -137232, -135719, -118201, -87062, -41991, 6671, 53313, 95752, 123997, 135737, 132566, 110101, 73453, 29825, -19973, -66860, -102482, -128193, -136128, -125086, -101273, -62128, -14768, 32140, 76608, 111437, 129648, 133956, 120151, 89160, 49810, 2908, -46037, -85982, -116162, -132819, -129772, -111793, -80108, -35884, 10600, 55709, 96371, 121045, 131295, 126561, 103030, 67311, 24312, -24084, -67614, -102004, -125608, -130750, -119286, -94472, -55595, -9680, 35046, 78078, 109871, 125885, 128863, 113472, 82608, 43945, -2242, -48441, -85645, -114491, -128739, -123679, -105563, -73201, -30000, 14283, 58159, 95503, 118200, 127353, 120812, 95897, 61525, 19110]
869A9110m7269m0449l2480k1482k892J2125K4807L9395M3727M3126M1250K8780
881A07748J4612J492j6685l0352l8155m5668m3434l5410k6972j1222N723J8434
893i9889L2817M2087M2440M2335L4799K0433Q068q291k4937l3756m1636m5254
905c0784l8394l0845j9099j112J2497K5333L8809M1828M2015L9508K5582J3619
917A18957m03j8024k9675l7563m4025m1307l3609k4982q830O398J9261L2970M0713
930b0119M1142M0952L1980J8608O096j0279k4667l3410m1351m2795l6077k9495
942i9415j6358Q62J2688K6308L7931M0224M0813L6567K3823J2318k389j8931k8719
955F5722l7454m2914l8651l2009k3360o324P258J9482L3456L8815L9519L9498
$$ y = [19110, -28159, -68608, -101088, -122570, -125462, -113337, -88530, -49135, -5408, 37718, 78968, 107748, 122360, 123852, 107167, 76815, 38660, -7008, -50442, -85852, -112824, -124046, -118323, -99889, -67072, -24985, 17455, 59790, 94589, 115022, 123090, 114799, 89862, 56106, 14470, -30784, -69178, -100023, -119122, -120234, -107737, -82404, -43595, -1767, 40248, 79756, 105338, 118957, 118554, 100530, 70855, 33292, -10733, -52040, -85649, -110631, -119461, -113063, -93802, -60832, -20119, 21023, 61975, 93955, 112563, 118659, 108380, 83713, 50303, 8952, -33843, -69920, -99415, -115773, -114911, -102223, -75915, -37984, 2240, 43053, 79620, 103443, 115761, 113372, 94441, 65722, 28268, -14646, -53297, -85306, -108666, -114990, -107732, -88250, -54794, -15979, 23540, 63038]
967F3038K9143J7035N445j1584k4793l2696m0746m0793l3966k8149j3619J431
979a10254J3070K7144L6522L8734L9748L3958K1982J0965l901j9308k8022l6951
991B3687m1369l5765l1320k0885n127P708K0431L3027L7553L8651L7405K6909
1003I0905J5619L762j3072k4102l2569l9977l8545l2509k6065j1598K432J3844
1015i1875K7967L5294L7808L8472L1269K0120R498n681j9960k8026l6890l9273
1027b1277l4009k9498j8009k988P978K1414L2692L5558L7887L4929K4743J4540
1039A03960J644j4182k3592l2376l8778l6139l1584k3651r905L191J4825K8133
1051e8454L3903L6577L6956K9098J8678Q126p279j9420k7931l6009l7430l3187
$$ y = [63038, 92181, 109216, 114661, 103077, 78284, 45588, 4842, -35951, -69917, -98066, -111685, -110254, -97184, -70040, -33518, 5216, 44964, 78922, 100904, 111869, 107968, 88660, 60638, 23687, -17682, -53447, -84767, -105652, -110779, -103071, -82640, -49613, -12060, 26591, 63996, 90905, 106524, 110286, 97214, 73112, 40543, 566, -37979, -70488, -96553, -108151, -105719, -91875, -63908, -28614, 9194, 47666, 78935, 99055, 108553, 102872, 82912, 54886, 17996, -21277, -55286, -84784, -102793, -105781, -97803, -76389, -43697, -8139, 29748, 64677, 89420, 103960, 105604, 91422, 67830, 35454, -3324, -39463, -71047, -94698, -104603, -101412, -86587, -58454, -24551, 12026, 48982, 78080, 96758, 104884, 97605, 78185, 50254, 14245, -23185, -56372]
1063e6372k7378j6117k024Q789K2181L1870L4087L7181L2690K2663J3212J11j4837
1076H6056k2689l2604l7581l3877l0430k1494p911L761J5640K7436L3293L5645
1088A5245L5007K6866J7361O681q816j8875k7956l5765l5502l1319k6096j3611
1100i6780j233R468K3099L1046L3640L5345L0628K0792J2048j885j5392k3306
1112E7470l2023l5781l2148k8869j9399o204M472J7051K7650L1609L4684L3547
1124E2059K4236J5667N267j0117j9062k7572l4927l3355l0360k3893j1740l4J0210
1137h3621K3437K9955L2540L4617K8275J9469J0348l569j4766k3403l1991l4201
1149a2910l0774k7337j7431m727M985J7747K7067L0777L3947L1114K2914J4703
$$ y = [-56372, -83750, -99867, -101891, -93102, -70921, -39051, -4964, 32217, 64907, 87570, 100782, 100893, 86056, 63367, 30763, -6818, -40695, -71125, -92619, -100530, -96769, -81129, -53693, -20400, 15245, 50252, 77118, 94479, 101160, 92344, 73469, 45513, 9748, -25754, -57073, -83169, -96780, -98013, -88545, -65446, -34400, -760, 34585, 65213, 86005, 98053, 96168, 80776, 57470, 25447, -10334, -42482, -71351, -90750, -96954, -92482, -75431, -47781, -16172, 18512, 52059, 76295, 91962, 97229, 87112, 68050, 40478, 5551, -27804, -58164, -82057, -93797, -93831, -83621, -60184, -30229, 2311, 36928, 65203, 84672, 95020, 91451, 76685, 53282, 21291, -12910, -43684, -71021, -88452, -93179, -88194, -70447, -43380, -12603, 21344, 52458, 75372, 90075]
1161I0075K842j0579j8697k8107l3309l1808k9049k2179r717J98J1736K3193K9252
1174b6149L2143L2617K6285J8199R011n094j5189k3434l1399l2513k9532k5814
1186g0869j5009m054N981J8505K6369L0099L3067K9174K1093J3440J186j0718
1198G8264j9241k8347l1799l0377k7854j9846q363J505J2469K3451K7818L1263
1210H943L1282K4057J6985P278o477j4753k3877l0699l0507k8272k4255j2982
1222h3277l066O997J8866K5656K9488L1356K7199J9875J2117k03j1372j9119k8166
1235B6351l0411k8902k6633j7502p320J883J3617K2840K7159L1014K9112K2500
1247F3708J5938N479p162j5002k3570l0000k8821k7617k2212j1295k615Q051J9417
$$ y = [90075, 92917, 82338, 63641, 35534, 2225, -29583, -58632, -80811, -90528, -90330, -78594, -55401, -26149, 5994, 38611, 64896, 83095, 92106, 87012, 71823, 48389, 16990, -15523, -45055, -70869, -85878, -89932, -83951, -65446, -39077, -8978, 24089, 53263, 74356, 87796, 88982, 78264, 59023, 30676, -1123, -31500, -59354, -79200, -87563, -86058, -73589, -50138, -22320, 8943, 40225, 64282, 81267, 88545, 82068, 67315, 43438, 12739, -17768, -46040, -70295, -83277, -86343, -79346, -60480, -34824, -5336, 26020, 53219, 73094, 85211, 85008, 73636, 54517, 26351, -4060, -32962, -59595, -77097, -84417, -82534, -68917, -46077, -18918, 12096, 41208, 63708, 79646, 85125, 77963, 62961, 39391, 9391, -19430, -47047, -69259, -80554, -83169, -75118, -55701]
1260e5701K4811K8878L0422K4821J8591J0788k147j1261j9265k7324k8998k7970
1272c4355k5097j5689o409L060J4581K1952K6810K9655K7534K0892J5181L353
1284H1468p604j5121k3982k8602k7776k6437k0134r809j785R372J9207K4144K8225
1297A166K9044K3128J7505Q780l194j1475j9453k7194k7516k6757k3463j3964
1309g3393n055M000J5251K1734K5776K9014K5479J9607J3235J891p752j5566k3785
1322C0436k7363k6592k5269j8007q627o53J0087J9185K3165K7791K7400K1365
1334E2918J6614P124m093j1527j9809k6427k6255k5501k1807j2103m859N059J5974
1347e4692K0837K5391K8012K3631J8668J1607M67p980j5659k4016k5651k5650
$$ y = [-55701, -30890, -2012, 28410, 53231, 71822, 82610, 80463, 69202, 49937, 22613, -6385, -34355, -59452, -75141, -81550, -78490, -63909, -41957, -15147, 14508, 42042, 62934, 78115, 81468, 73864, 58743, 34761, 6159, -21617, -48054, -68188, -77997, -79782, -70410, -51203, -27059, 1166, 30210, 53338, 70843, 79623, 76429, 64954, 45501, 18307, -9209, -35966, -59429, -73393, -78448, -74448, -59197, -37463, -11687, 17327, 42806, 62413, 75648, 77539, 69787, 54221, 30436, 3073, -23519, -48788, -66795, -75422, -76075, -65988, -46803, -23638, 4153, 31553, 52918, 69532, 76656, 72563, 61036, 41227, 14800, -11455, -36956, -58763, -70866, -75725, -70666, -54692, -33855, -8464, 19548, 43179, 61847, 73454, 73921, 65941, 50282, 26266, 615, -25035]
1359b5035k4097j6124p733L07J0936J8813K2744K7245K5613J9979J5195N909m740
1372F9012j1820k0332k5005k5569k4817j9566j0757l973O529J5696K0184K5404
1384e014K6555K2069J7476J0083p60q333j6409k3211k4768k4812k2441j4377o876
1397g0818J394J2065J8014K3291K5842K3883J9183J3644M072n026j2573k0462
1409C2509k3892k4450k3447j8053r437k911P154J5728K0119K4640K4866K0624
1421D3450J6820Q132j292q500j6852k2726k3672k3545k1173j2944o096K554J2346
1434e3498J7804K2151K5633K1849J8719J2022K763n437j2537k0319k2906k3570
1446a7326k2716j6147q960j471Q042J5169K0127K4025K3505J9859J5278O615j986
$$ y = [-25035, -49132, -65256, -72989, -72682, -61746, -42933, -20189, 7056, 32669, 52648, 67843, 73752, 69012, 57192, 36860, 11855, -13714, -38531, -58097, -68854, -72827, -66298, -50602, -30418, -5014, 21541, 43610, 61086, 71169, 70409, 62076, 45667, 22456, -2312, -27124, -49565, -63942, -70818, -69424, -57359, -39345, -16054, 9788, 33671, 52854, 66498, 70570, 65544, 52971, 32509, 8617, -15833, -39280, -57333, -66770, -69681, -62527, -46799, -26680, -2040, 22826, 43450, 60270, 68402, 67110, 58610, 41758, 19032, -4640, -28185, -49358, -62302, -68398, -65844, -53498, -35694, -13543, 12090, 33939, 52658, 64680, 67443, 62006, 49469, 29150, 6244, -17326, -40042, -56189, -65149, -66620, -58578, -43409, -23282, 743, 24248, 44107, 59385, 66000, 64014]
1459F4014q968j6791k2601k2466k3242j9108j1551n292L730J2507J7636K2548
1471i584K4073K0579J7064J0960J559n899j2882k0489k2586k2496k1154j4489
1483e5344q092n42Q844J5447J9916K3459K2179J8331J4342N196k910r163j7361
1496C4302k1231k2216k2086j7538j0439m515M820J2929J7190K1886K2939J9758
1508C5799J6066R681N45o445j3627j9867k1477k1867j9812j3368p413P82R737
1521e1266J4557J9910K2610K0989J7746J2744M156k862j0265j7562k0385k1298
1533a0926k1224j6181r777l259N981J2523J7171K1397K1920J8688J5406P529K01
1546E9449o419j4312j9411k0441k1554j8585j2272o420J673R786J4692J9740K2311
$$ y = [64014, 55046, 38255, 15654, -6812, -30054, -49162, -60713, -66005, -62275, -49768, -32132, -9584, 14489, 35068, 52132, 63092, 64651, 58752, 45870, 25381, 2795, -19701, -40855, -55344, -63436, -63978, -55134, -39687, -19771, 3688, 25867, 44198, 58540, 63736, 60826, 51663, 34302, 13071, -9145, -31231, -48769, -59208, -63723, -58903, -45974, -28784, -6898, 16041, 35799, 51865, 61546, 62091, 55646, 42019, 22152, 675, -21192, -41004, -54372, -61785, -61003, -51266, -36709, -16799, 5811, 26800, 44546, 57290, 61446, 58584, 48319, 30757, 10372, -10926, -32150, -48331, -58108, -61367, -55386, -42863, -25692, -4295, 17625, 36313, 51719, 59248, 59449, 53030, 38718, 19307, -1134, -22688, -41273, -53545, -59965, -58292, -48506, -33814, -14074, 8237]
1559H237J9677J7043J1136K923l081j1084j7284j9656k0929k0365j4434q818k779
1572e9414O993J2410J7023K1236K0694J8131J3934O609n25p267j4576j8603j9898
1585c253k0972j7090j1281n454K922R535J4908J9519K0812J9148J5811R949K334
1598E6888l849j1281j6913j8936k0575j8890j3354q683r79O622J2637J7393K0526
1611F06J9588J7143J3125N532j158p767j4476j8362j9425k0478j5612j0268m842
1624e6394L708R892J5023J9332J9948J8016J5438Q240J780m054j1817j6983j8684
1637C445k0080j7625j2411p765j08P602J2121J7474K0107J8516J6411J2127M368
1650E4182j325q499j5108j7185j9594j9043j4279r961l880M572J0064J4787J9270
$$ y = [8237, 27914, 44957, 56093, 59016, 55935, 44851, 27567, 7911, -13018, -33383, -47817, -56635, -59414, -52421, -40011, -22988, -1752, 18942, 37073, 51007, 57616, 57091, 49824, 35248, 16645, -3253, -24225, -41315, -52596, -58050, -55128, -45593, -30685, -11166, 9646, 28794, 44605, 54554, 56888, 53039, 41758, 24845, 5909, -14666, -33556, -46910, -55593, -56572, -49950, -37313, -19920, 606, 20194, 37337, 50462, 55994, 54836, 47069, 32593, 14231, -5194, -25672, -41284, -51552, -56394, -52686, -42794, -27771, -8439, 11509, 29525, 44963, 53203, 54983, 50929, 39112, 22129, 3445, -16635, -34260, -46671, -54436, -54544, -46942, -34821, -17347, 2760, 21276, 37687, 49814, 54182, 52857, 44358, 29250, 12065, -7529, -26572, -40851, -50812, -54692, -50120, -40056, -25269, -5999]
1663e999J8743J7305J4359P776J047m964j2159j6414j8101j9635j6383j1616o977
1676e3018Q66P466J2421J7311J9439J7339J6076J0853L614j984q779j4808j6971
1689I825j8927j7869j3706r047l068N001R912J4980J8810J8227J6428J3462O562
1702E0590P03n504j2497j5873j7718j8863j5179j1295n915J680P870J2269J7472
1715a2260J8230J6631J5419R765L025k324r366j4707j6489j8591j7209j2350q430
1728d8656k063N535R618J5302J7947J7403J6292J2095N226P38o111j2507j5271
1741A5548j7665j8170j4258j0684m827K871P572J2237J7216J7714J6144J4200
1753C7898Q390K728k915r783j4326j6314j7844j6001j2066p372r66N481R970J5358
$$ y = [-5999, 12744, 30049, 44408, 52184, 53231, 48267, 36108, 19694, 1593, -18042, -34425, -46041, -53018, -52152, -44686, -32265, -14954, 4485, 21824, 37900, 48753, 52367, 50383, 41604, 26796, 9825, -9102, -26971, -40677, -49724, -52792, -47791, -37879, -22899, -4089, 14138, 30566, 44028, 50590, 51293, 45789, 33292, 17419, -299, -19162, -34341, -45636, -51551, -49871, -42001, -29732, -12260, 5970, 22601, 38020, 47785, 50810, 48486, 39120, 24413, 7924, -10667, -27876, -40226, -48656, -50719, -45184, -35566, -20264, -2317, 15086, 31378, 43473, 48699, 49437, 43326, 30819, 15548, -2117, -20287, -34545, -45229, -50056, -47185, -39613, -27376, -10160, 7554, 23698, 37898, 46288, 49016, 46101, 36318, 21992, 5678, -12166, -28167, -40233, -47605, -48571, -43090, -33120, -17762]
1767a7762J7296J6586J5466J1385M793l9o903j2287j5081j7277j7045j3528r737
1780d4133m308L134P748J2830J6634J6449J5972J3444P609K114l465j0632j3300
1793B0096j5982j7733j4920j1206p152L69N504J0562J4872J6917J5900J4729J0033
1806D1989M205l87p607j2349j4790j6771j6062j2818q982l127L127Q453J2940
1819b2179J6032J6059J5207J2292P010J497m180j0536j3144j6285j6403j3919
1831b8549j1108n891P60N939J0638J5187J5750J5726J3777Q812L909j253p871
1844C5826j2069j4759j6373j5086j2107q222k438L972Q187J3137J5862J5513J4906
1857B6349J0992N620J257m941j0139j3039j5686j6325j3062j0109n102J527N990
$$ y = [-17762, -466, 16120, 31586, 42971, 47764, 47725, 40822, 28535, 13454, -3823, -20868, -34396, -44133, -48441, -45307, -37559, -24729, -8095, 8354, 24326, 37770, 45379, 47493, 44028, 33396, 20096, 4114, -13619, -28539, -39745, -46897, -46528, -41024, -30462, -15590, 1327, 17227, 31956, 41989, 46194, 45807, 38200, 25851, 11061, -5710, -21772, -34590, -43572, -46699, -43572, -35119, -22179, -6147, 9912, 25119, 37411, 44421, 45918, 41738, 31202, 18058, 1773, -14630, -28549, -39657, -45548, -44788, -38849, -28211, -13024, 2726, 18452, 32229, 41041, 44950, 43697, 35826, 23757, 8998, -7375, -22461, -34568, -42790, -45228, -41256, -33069, -19932, -4070, 11443, 26349, 37341, 42961, 44218, 39277, 29138, 16099, 413, -15912, -28974, -39083, -44185, -42658, -36668]
1870c6668J0746J5062J5079J5144J2821Q125L560k096q079j1681j4748j6213j4265
1883b3213j1340p588r36L740Q453J3185J5051J4799J4275J0249N215J138n775
1896C7253j0484j2709j5635j5092j2469r332m413J923O018J1150J4416J5064J4317
1909B0007J2319P342K822k882p965j1800j4141j5894j3104j0905o877q85M399
1922c7564Q517J3410J4418J4668J3471R347M748J78n861j0333j3076j5228j4009
1935a7314j1874q846l477K015O557J1400J3815J4531J4079J1266O327K503l092
1948C7890q701j1229j4239j5062j2350j0469n983J65M354Q748J3401J3744J4287
1961A4556J2760Q255M096k34o558j0056j2563j4967j3222j1288q360k257K390
$$ y = [-36668, -25922, -10860, 4219, 19363, 32184, 40309, 43869, 41773, 33694, 22013, 7265, -8948, -23213, -34553, -42141, -43077, -39337, -30884, -17699, -2648, 12151, 26426, 36675, 41890, 43028, 37253, 26769, 14060, -1575, -16667, -29136, -38468, -42881, -40958, -34940, -23790, -9374, 5690, 20007, 32326, 39668, 42490, 39608, 31643, 19843, 5702, -10192, -23296, -34201, -41078, -41963, -37564, -29047, -15637, -1219, 13449, 26920, 36267, 41015, 41193, 35332, 24999, 11923, -3305, -17314, -29188, -38034, -41511, -39496, -32939, -21539, -7724, 6807, 20886, 32152, 38479, 40982, 37890, 29189, 17960, 3721, -11341, -23691, -34160, -40143, -39978, -35624, -26876, -13475, 269, 14556, 27316, 35571, 39667, 39433, 32875, 22819, 10256, -4711, -17933, -29221, -37581, -39838, -37448]
1974c7448O585J1467J3444J3901J3854R934N954K330m167q374j1053j4411j4123
1987a2107j2044r581n146M60M426R226J3074J3036J4011J2030P664M047j383o901
2001C0812r390j2969j4512j2653j0543p321j910K613O938J1535J3070J3302J3363
2014B2335R426N049J537m335q629j1021j3899j3172j1796q968m289Q41M783R422
2028b2716J2591J2854J3249J1416P143L252j971o675r725j2671j3835j2152r998
2041b9238o682j079K732P519J1309J2379J2863J2739Q577N038O37m869q180j1370
2055A2375j3504j2328j0965q506l544R05N225R672J2151J2696J2584J0608O135
2068C3504L075k509o802r477j2818j3048j1392r910n357r81K737P952J1232J2176
$$ y = [-37448, -30863, -19396, -5952, 7949, 21803, 31737, 37691, 40021, 35854, 27480, 16427, 2016, -12107, -24151, -33732, -38878, -38418, -33992, -24766, -11692, 1344, 15355, 27385, 35049, 39096, 37713, 30812, 21422, 8453, -6059, -18712, -29255, -36576, -38486, -35873, -28935, -17400, -4330, 8972, 22335, 31761, 36810, 38347, 34012, 25383, 14362, 463, -12709, -24505, -33473, -37762, -36921, -32138, -22716, -10125, 2729, 15978, 27394, 34537, 37789, 35818, 29143, 19418, 6747, -7088, -19240, -29238, -35920, -36999, -34267, -26748, -15439, -3060, 9803, 22542, 31119, 36157, 36794, 31925, 23745, 12375, -1129, -13457, -24422, -32928, -36472, -35567, -30342, -20670, -8519, 4177, 16761, 27369, 33504, 36579, 34070, 27268, 17791, 4973, -8075, -19467, -29377, -34734, -35715, -32978, -25026, -13794, -1618]
2082a618J2759J1469P942M730K39n397q098j1212j3170j1713j0471p849k872J295
2096c3966N405R909J1463J2415J2367R360O042K143k943o670r536j2401j2273
2109h685j0972r494m759m00L407Q085J0616J1753J2596J0707P157M452n68n291
2123B8604q027j1305j2511j1447j0348o652k066J282N978R662J1227J1931J1868
2136A8196Q578N586J600l296o674r761j2222j1873j0575q316l934l45L794P869
2150b1373J0914J1383J2043R896O743L800j370n560q110j1001j1935j0975r466
2163b5011o033j426J706O108R612J0545J1659J1530P610N122J201l702o508j0181
2177A2232j1614j1093j0166p794l474M07L729Q816R700J1329J1601R055O733K976
$$ y = [-1618, 11141, 22610, 30552, 35282, 35521, 30124, 22026, 10814, -2356, -14069, -24540, -32389, -35261, -33966, -28561, -18652, -7189, 5226, 17593, 26953, 32995, 35138, 32195, 25525, 15989, 3588, -8685, -19657, -29151, -33910, -34310, -30903, -22818, -12202, -449, 12147, 22854, 30011, 34463, 33895, 28604, 20577, 9272, -3239, -14686, -25034, -31686, -33752, -32470, -26492, -16830, -5603, 6328, 18196, 26774, 32360, 33960, 30664, 23990, 14229, 2007, -9866, -20441, -28757, -32691, -33036, -29242, -21373, -10459, 924, 12967, 22863, 29606, 33406, 32036, 26476, 18366, 7365, -4570, -15545, -25011, -31044, -32470, -30764, -24656, -15044, -4499, 7160, 18690, 26300, 31422, 32623, 28921, 22413, 12232, 618, -10475, -20641, -28435, -31909, -31502, -27773, -18957, -9257, 2072, 13673, 22728, 29461, 32437]
2191C2437j911n378q294j1096j1328j0155r169n532j257K273O482R461J0437J1775
2205H745J0050P782M393K09l922o555r930j1442j0588r617p109k817J7M544Q831
2220a7409R605J1350J1002Q371N926K471k224n675q179j1112j0566j0158q330
2233b4928m596q95K522O721R346J0235J1478R330O443M711m01m351o413j0253
2247H949j0840r970r574o256k142O69N125Q242R627J0825J0325P765N712J671
2261C0128k579n368q577j1132r903r929p378l928n61K880O610Q917J0344J0786
2275A0310R063O524L733r25m128p299r930j0466r519r039n266k318J529N116Q039
2290a4576R823J0455R699P477N183P01k705n279q981j0139r642r572p059l589
$$ y = [32437, 30526, 25148, 16854, 5758, -5570, -15725, -24894, -30426, -31683, -29410, -22928, -13467, -3030, 8745, 18795, 26577, 30970, 31179, 27257, 20702, 10772, -670, -11258, -20875, -27984, -30801, -30784, -26240, -17409, -7804, 3546, 14548, 22919, 28845, 31316, 29092, 23417, 15238, 4126, -6440, -16598, -24928, -29524, -30419, -27897, -21176, -11830, -1595, 9883, 19213, 25656, 30367, 29966, 25615, 19202, 8949, -1891, -11861, -21435, -27691, -29833, -29164, -24039, -15797, -6170, 4655, 14980, 22745, 28457, 30128, 27549, 22181, 13604, 2472, -7431, -17360, -24738, -28666, -29227, -26347, -19737, -10820, -476, 10310, 19373, 25897, 29630, 28705, 24577, 17278, 7348, -3118, -12637, -21676, -26942, -29260, -27731, -22615, -14576, -4753, 5702, 15401, 22878, 28061, 28762, 26057, 20778, 11797, 1658, -7984, -17556, -24615, -28204]
2304b8204k52L403O987Q804J0032J0557Q152O070L317j498m418p085r554j0136
2318c825r195q656n051j298J396N573P973R361J0337R193O820M557O60k692o011
2333A9142q745r811r716q891o286k724n24L871P148Q282J0302R721P658N602K615
2348B7644j419m419p221r483r603r361p858l894j696J779N945P911R164R924Q866
2363A6279O263M213Q8l401n562q820r718q975q588n876k387J49M511O674Q683
2378f467R861R053P120N452J853j528m809p690r034r300q870p081l814j313K595
2393b3972N663P682R519R135Q061O327L752m28l279o002q715q994r025q016n247
2408b3539k376M25M752O598Q465R778Q839O767M789J435k152m514p689q662r055
$$ y = [-28204, -28456, -25053, -18066, -9262, 770, 11327, 19479, 25549, 28866, 27368, 22950, 15865, 6311, -3825, -13020, -21676, -26727, -28025, -26629, -21056, -13083, -3722, 6615, 15808, 22628, 27185, 27845, 25153, 19142, 10397, 586, -9130, -18021, -24307, -27031, -27555, -23684, -16536, -8254, 2048, 11769, 19427, 25029, 27644, 26225, 21806, 14585, 5102, -4501, -13862, -21720, -25614, -27310, -25531, -19586, -11675, -2511, 7413, 16279, 22542, 26755, 26843, 23442, 17880, 9060, -658, -9633, -18221, -24097, -26484, -26335, -21824, -15150, -6467, 3394, 12447, 19567, 25019, 26872, 25344, 20535, 12845, 3811, -5489, -14359, -21440, -25254, -26567, -23972, -18309, -10627, -1108, 8027, 16088, 22415, 26167, 25739, 22460, 16458, 7743, -1251, -10276, -18292, -23539, -25915, -25490, -20738, -14140, -5675, 4103, 12942, 19709, 24498, 25933, 23781, 19267, 11578, 2916, -6139]
2423f139q500o656l533o75K629N612Q031Q834R122P839N569L187p65l148o341
2438A5066q347q972q463p679m534k137J004M643O665Q164R456Q096O681M403R49
2453B4995k266m909p566q394r020q218n625l159l41L192N836P111R121Q779P320
2468A6856N154K700j045l373o688q170q375q587o890m372j493J398M620O343Q670
2483c252Q755P565O628M025L49k369n066p336q321q384p864n300k905l66L512
2498b0329N842P330Q610Q338P024M802K236j108l807o439q127p841q609o291l919
2513b2288j437K038M661O514Q349Q255P505N943L388Jk339m992p435p937q418
2528h192p258m758k852M73L525N722P289Q590P648O509M718J227p54m222o282
$$ y = [-6139, -14639, -21295, -24828, -25503, -22874, -17262, -9231, -397, 8725, 16564, 22133, 25320, 24555, 21407, 15066, 6719, -2253, -10716, -18395, -22929, -25066, -24062, -19419, -12754, -4590, 4866, 12962, 19643, 24046, 24995, 22729, 17820, 10254, 1860, -7160, -15378, -21003, -24162, -24503, -21311, -15475, -8364, 757, 9536, 16856, 22010, 24710, 23665, 20292, 13604, 5434, -2941, -11528, -18418, -22790, -24283, -22885, -18265, -11922, -3252, 5503, 13068, 19696, 23721, 24070, 21701, 16635, 9299, 978, -7406, -15270, -20570, -23475, -23841, -20329, -14487, -7157, 1453, 9791, 16815, 21617, 23853, 22745, 18938, 12499, 4372, -3469, -12078, -18369, -22288, -23725, -21687, -17026, -10512, -2163, 6092, 13597, 19540, 22928, 22929, 20590, 15598, 8163, 226, -8192, -15450, -20208, -23060, -22587, -19062, -13340, -6051, 2539, 10187, 16696, 21414, 22641, 21887, 17665, 11383]
2543A1383p888p889p851n912m027q38K201N117N863Q642Q233O517N559L040Q9
2558B2239k517n574p233p390p937p178m462k377O84L995N555O961Q424P420O106
2573A6716M361Q16j200m013o847p103p677p517n363l477q88K242N112O251Q294
2588b93P574O316N771K150l59k502n483o941p632p948o262m078k330J505L648
2603a6864N713P132P957O830O125L906N79j462m370o415p209p701p333m569l104
2618b0785l70K863M680O210P801P416O069N050J931k41l053n859o477p446p366
2633i577o037m075j760J750L627N845P114P368O949N599L431O20k062m113o611
2648H068p101p367o499m839k798M4K875M643O563P659O992O092M204J979p58l198
$$ y = [11383, 3495, -4394, -12245, -18157, -22184, -23022, -20821, -15704, -9841, -1199, 7034, 13551, 19110, 22150, 22239, 19722, 14148, 6915, -475, -8412, -15590, -20052, -22429, -21745, -17750, -12195, -5234, 3190, 10610, 16716, 21077, 21893, 20693, 16680, 9833, 2730, -4947, -12464, -17827, -21304, -22192, -19950, -14838, -8587, -293, 7281, 13597, 19368, 21518, 21159, 18657, 13174, 6233, -1399, -9347, -15609, -19687, -22017, -20512, -16864, -11151, -4019, 3938, 10768, 16893, 20799, 21378, 19916, 15546, 9131, 1922, -5779, -13112, -17681, -20785, -21155, -18292, -13612, -7402, 399, 7815, 13884, 18934, 20865, 20624, 17571, 11712, 5235, -2211, -9577, -15614, -19689, -21449, -19699, -16072, -10227, -3113, 4255, 11204, 16803, 20234, 20854, 18792, 14679, 8068, 967, -6400, -12899, -17738, -20536, -20492, -17617, -12974, -6411, 1248, 8240, 14332, 18536, 20515, 19757, 16559]
2664A6559n676o630p022p293n400l514j410J679L819N318P645O795O614N209K739
2679A9432N68j640m941n853p134p130o421m368k345K26L044M840O292P091P107
2694H768N632M095J382j095l260n679o321p147o924m895l268j124J928L755N587
2709h566O882P108O218M660K867J72k014m695o052o487p647n626l809k763J050
2724a8702K778M822O635O882O464N647L240J289q16l731n489o058o813o564m976
2739a5392l130o62K075L919N708O691O245O444M325K454Nk588m705n856o428o904
2755g799n291l986j825J002K994M842O352O538O181N367L095Q10q15l851n428
2770H186o129o980o093m180k878l31K251L644N794O441O427N691M438J741K92
$$ y = [16559, 10883, 4253, -2769, -10062, -15462, -18976, -20386, -18707, -14888, -9570, -1925, 4870, 11484, 16693, 19432, 20000, 18360, 13419, 7566, 432, -6698, -13119, -17487, -19832, -19606, -16562, -11722, -5430, 1661, 8768, 14400, 18495, 19877, 18782, 15522, 9843, 3522, -3625, -10549, -15444, -18712, -19836, -17908, -14153, -8566, -1684, 5424, 11642, 16302, 19169, 19341, 17327, 12632, 6580, 93, -7554, -13180, -16989, -19752, -18702, -15924, -11102, -4467, 2415, 8879, 14526, 17766, 19055, 18239, 14508, 9019, 2961, -3852, -10416, -15392, -18522, -19184, -17109, -13190, -7482, -791, 5454, 11898, 16223, 18677, 18682, 16094, 11389, 5533, -895, -7799, -13090, -17076, -18901, -17899, -14905, -10063, -3711, 2827, 9008, 14375, 17470, 18280, 17465, 13614, 8186, 2057, -4923, -11016, -15196, -18074, -18405, -16154, -12510, -6716, -275, 6152, 11843, 16281, 18022, 18314]
2785A8314k731n319n480o363o512m645l923j672J520K830M914O059O337N995M902
2800A4226L038Q77j583l795n271o024o612n587m314k499M6J921M139N755O349
2815F66O120N504L398K024m18k956m658n380o635n918n068l068j422J743K635
2830a3433M887O278N892N929M510K497Q48j781l798n377o060n881n297m189j935
2845a6910K25K145L988N550O158N894N179L240J587m34k895m904n363o148n917
2860h605m092l037j138J232L222N069N680O240N458L746K484N20j589m228m923
2875F039o226n852n042l659j638K96K272M221N307N555N871M853L105J225p38
2890A5589k917m375n373o166n264m529k872j24J112L315N289N244N661N404L842
$$ y = [18314, 15583, 10264, 4784, -1579, -8091, -12736, -16659, -18331, -16811, -13981, -9067, -3008, 3329, 9324, 14226, 17264, 18141, 16558, 12763, 7492, 1468, -5144, -10731, -15045, -17544, -17498, -15577, -11438, -5683, 666, 6786, 12290, 15688, 17712, 17294, 14338, 9680, 4300, -2335, -8253, -13321, -16389, -17811, -16068, -13433, -8546, -2268, 3624, 9553, 14063, 16560, 17408, 15627, 11829, 6452, 392, -5489, -10786, -14975, -16910, -16685, -14540, -10552, -5002, 1156, 7050, 12229, 15469, 17056, 16622, 13727, 8823, 3460, -2688, -8605, -12697, -15734, -16872, -15640, -12418, -7349, -1669, 4571, 10029, 13775, 16259, 16779, 15190, 10962, 6039, -187, -6039, -11081, -14740, -16378, -16082, -13810, -9589, -4282, 1273, 7144, 11997, 15102, 16327, 15589, 12672, 8297, 2924, -3242, -8506, -13035, -15907, -16031, -14919, -11604, -6315, -1071, 4590, 9994, 13836]
2905A3836J875K05j879m290m460n998n933m252l717j164K74K414M395N299N765
2920B370N209M745K875P82j025l354m081n507n513n450l799k865r7J818L382M621
2936e889N732N120M887L829J647O8k182l724n078n571n198m461l706r53P65K532
2952a2182M253N388N124N140M428K664K69q80l525m012n403n709m284l977k378
2967a5084L08J507L191N063N054N035N080L184J715l66k420l628m722n641n136
2982f860m026l091q69Q72K275M505N073N274M922L818K134P43j721k801m297n337
2998F14n134m405l775j636J23J724L574M806M766N141M375K832J644l47k875l628
3014G799m484n659m665m037k478q55J111K808M000M671N366M668L186K550J95
$$ y = [13836, 15711, 15916, 14037, 9747, 5287, -711, -6644, -10896, -14613, -15777, -15503, -13089, -8694, -3395, 2370, 7579, 12324, 15199, 15981, 14956, 11602, 7521, 2014, -3499, -8949, -12748, -15613, -15710, -13892, -10510, -5889, -157, 4963, 9850, 13679, 15326, 15394, 13212, 9488, 4410, -1161, -6359, -10820, -14526, -15479, -14714, -12182, -7929, -2541, 2583, 7723, 12151, 14815, 15084, 14204, 10679, 6667, 1264, -4445, -8729, -12706, -15084, -14776, -13269, -10078, -5015, 39, 5074, 10154, 13338, 15053, 14687, 12267, 8639, 3917, -1724, -6860, -10886, -13977, -14846, -13974, -11699, -7194, -2121, 3153, 8075, 11893, 14027, 14770, 13049, 10248, 5951, 614, -4520, -8925, -12700, -14336, -14213, -12489, -8915, -4109, 657, 5798, 10173, 13005, 14649, 14302, 11427, 7799, 3315, -2344, -7009, -11046, -13524, -14379, -13268, -10460, -6460, -1789, 3577, 8245, 11431, 13981, 14176]
3029A4176j448l304l958n407m934m126l657j490L63J758L837M564M754N076L937
3044A0141K612J353o80k564l752m729n216m290l748k361o95J260K791M059M690
3059a129N313M117L202K147L15j895l458l856n288m366m426k853j407L43J592
3074a1649M325M006N118M765L439K728Q39q37k627l400m908n100m354l355k118
3089a3128m93J381L079M145M623M661M294K894J771j59j818k974m469m793m265
3104e251l864l182r41P48J953L612M200M746M841L492K147Q55j416k622l606m664
3120A048m351m149l818j538J48J233K884M247M305M292M319K626J652k73j915
3135A0710l228m358m849m048l706k486o38N86K187L684M354M510M190L173K023
$$ y = [14176, 12728, 9424, 5466, 59, -4875, -9001, -12658, -14148, -13785, -12027, -8190, -3626, 1128, 6204, 10141, 12753, 14106, 13426, 10862, 7110, 2381, -2835, -7125, -10873, -13234, -13929, -12669, -9878, -5819, -1129, 4184, 8301, 11503, 13650, 13965, 12070, 8612, 4756, -532, -4898, -9324, -12177, -13584, -13241, -11649, -7324, -3318, 1800, 6565, 10004, 12732, 13571, 12734, 10107, 6707, 1799, -3301, -7655, -11010, -13128, -13621, -12240, -9161, -5016, -393, 4268, 8562, 11456, 13227, 13068, 11250, 8276, 3807, -986, -5251, -9115, -12297, -13238, -12490, -10537, -6925, -2725, 2021, 6862, 10354, 12501, 13356, 11940, 9318, 5712, 1048, -3303, -7452, -11270, -12808, -12660, -11427, -8543, -4296, 9, 4301, 8620, 11246, 12898, 12625, 10710, 7482, 3124, -1725, -5773, -9479, -11965, -12603, -12017, -9830, -6146, -1792, 2718, 6908, 10081, 12104]
3150A2104K97j050k621l423m504m774l725l024j887J69J849K827L952M039M503
3165D732L928K469J282l78k151l052m275m213m280l814j840o72O39K721L640L517
3181a747M771M025K838J788N23j312k873l553m281m274l676l153j096J28J874
3196a0018K792M156L914M324L394K409J121n44k301l126m114m180l946l310k006
3211a1435m39R09K828L257L721M449L989K487J858k7j472k486l760m057m153l519
3227g850k485j095j9J856L228L689M179M002K904K294R63r00k075l045m256l941
3243b551l841k862j710l94J093K316L444M233L735L598K686J655j93j519k665
3258G025l725l876l898l379k380q49LK098K875L812M268L765K694K155N84j078
$$ y = [12104, 12401, 11351, 8730, 5307, 803, -3971, -7696, -10720, -12607, -12438, -10589, -7762, -3810, 229, 4732, 8660, 11129, 12411, 12033, 9882, 6830, 2555, -1658, -5938, -9752, -11592, -12264, -11625, -8904, -5264, -1747, 3024, 7049, 9887, 11675, 12198, 10886, 8013, 4460, 179, -4095, -7771, -10924, -12020, -11892, -10018, -7226, -3070, 844, 5168, 8562, 10971, 12092, 11548, 9247, 6121, 2007, -2173, -6119, -9429, -11435, -11874, -10965, -8137, -4880, -1159, 3290, 7279, 9766, 11624, 11597, 10125, 7639, 3879, -178, -4331, -7850, -10335, -11430, -11449, -9593, -6365, -2676, 1503, 5505, 8409, 10703, 11666, 10766, 8691, 5646, 1390, -2551, -6392, -9254, -10964, -11358, -10265, -7949, -4505, -272, 3463, 7061, 9747, 11402, 11209, 9690, 7025, 3300, -576, -4474, -7853, -10233, -11082, -11079, -8981, -6106, -2294, 1974, 5739, 8433, 10588, 11172, 10094]
3274A0094k005l279l819l993l308k704j756N9R67K597L275L924M024L229K095
3289I400J504k84j881k402l546l977l473l151k371o79L07K119L147L851L546L498
3305E608L029J724M18j230j973l265l742l765l201k791j313K29J324K313L305
3320c330L658L670L142K357J114n21j707k943l580l331l643k921k049m57Q29J975
3336g737L120L573L618L402K446J621J18j090k205k925l980l408l257k207j339
3351a0250L86J328K551L218L571L634K724K124R12o63j919k479l193l807l154
3366e017l095j290j28p9K805K690L364L668L183K286J153J63j284j804l174m016
3382e75l073l009k442p15J11J726K875K827L639L199K659J860N16m92j615k928
$$ y = [10094, 8089, 4810, 991, -3002, -6310, -9014, -10770, -10711, -9744, -7147, -3872, 52, 4076, 7305, 9400, 10904, 10620, 8739, 6337, 2791, -1186, -4659, -7810, -10181, -10860, -10553, -8434, -5287, -1436, 2110, 5608, 8637, 10361, 10779, 9549, 7576, 4311, 569, -3196, -6397, -9188, -10501, -10272, -8948, -6635, -3330, 328, 3998, 7140, 9497, 10611, 10090, 8383, 5440, 1860, -1471, -5114, -8035, -10084, -10541, -9712, -7737, -4617, -1044, 2574, 5976, 8422, 10043, 10161, 9071, 6866, 3941, -39, -3447, -6704, -8911, -10250, -9864, -8536, -5985, -2767, 804, 4438, 7162, 9286, 10198, 9535, 7616, 5137, 1944, -1863, -5017, -8112, -9402, -9530, -9609, -6804, -4114, -750, 2918, 6101, 8387, 9540, 9703, 8419, 6615, 3441, -575, -3648, -6657, -9099, -9814, -9703, -7977, -5102, -2275, 1364, 4563, 7222, 9082, 9598, 9106, 7491, 4563]
3398D563l410l216l484k533j280k41P50K571K761L349L273K939K471J002j90j370
3414G955k175k994l715k953l202j605r42O05J850K663K574L421L337K536J709
3429I064K97r66j421l035l250l198l316k094j309n2J050K085L146L319L168K833
3445F321J821J139l78j202k445l106l447k704k984j482r42N52J830K711K928L534
3461B146K644K370J565K34p73j866k685l195l201k943k094j234N5J359K169K852
3477b597L366L007K331K046R06o12r13l009k927k983l092k370j636m39Q54J802
3493f266K267L106L298K619K473J010K9q62j956k644l134l080k788j877q22j53
3509h780J599K242K727L226L304K103J961M64r20j241k584k853l035k890k178
$$ y = [4563, 1153, -2063, -5547, -8080, -9360, -9601, -8851, -6280, -3519, -170, 3103, 6042, 8513, 9515, 9325, 7955, 5780, 2786, -929, -3882, -7084, -8689, -9631, -9026, -7176, -4513, -1939, 1482, 4819, 7355, 9064, 9361, 8395, 6974, 3939, 689, -2509, -5825, -7919, -9228, -9280, -8230, -6145, -2999, 320, 3488, 6321, 8142, 9281, 8903, 7701, 5256, 2150, -1297, -4001, -6985, -8467, -9409, -8857, -7027, -4316, -1388, 2146, 4790, 7160, 8725, 8959, 8186, 6320, 3635, 440, -2761, -5704, -7798, -9032, -8977, -7618, -5449, -2597, 769, 3776, 6107, 8153, 9059, 8447, 7534, 4525, 1598, -1385, -4477, -6847, -8483, -8922, -8068, -6266, -3999, -893, 2405, 5024, 7497, 8507, 8536, 7674, 5718, 3074, -60, -3140, -5928, -7805, -8627, -8780, -7181, -4939, -2212, 1014, 4318, 6421, 8382, 8846, 7926, 6685, 4101, 1248, -1787, -4677, -6855]
3524f855j504m86J250J842K064L168L204K683J691J506l06r54j898k946k780l134
3540c455k367j924p47M29J190K147K813L232K776K272J863M27r97j007k791k924
3556I37k912k896k052j141k62Q89J674K585K769L384K332J890R88l20j003j927
3572D935k623l077k704k814j290n77K00J551K108K636L353K509K100J461J65k42
3588G691j673k717k664k870k697j984p37l33R88J670K625K603L233K328J525R98
3604G986l69j127j993k747k746l018k026j152r32Q25J530J684L309K472K400K258
3620F354J269J94p62j366k706k892k502k663j558j222r6J578J469K381L124K648
3636C250K388J347P41l83j193k075k570k816k755j747j431k76N09J477K092K581
$$ y = [-6855, -8359, -8845, -7595, -5753, -3689, -521, 2683, 5366, 7057, 8563, 8257, 7303, 5405, 2459, -321, -3455, -5822, -7746, -8493, -8064, -6874, -4727, -1914, 1318, 4094, 6366, 8229, 8656, 7659, 6652, 3861, 937, -1975, -4871, -6923, -8064, -8326, -7437, -5763, -3178, -409, 2975, 5307, 7197, 8185, 7865, 6862, 4935, 2312, -765, -3469, -6283, -7573, -8150, -7950, -6399, -4291, -1655, 1698, 4207, 6307, 7768, 7933, 7691, 6018, 3301, 637, -2233, -4930, -6914, -7651, -7984, -6996, -5326, -2701, -98, 3135, 5463, 6988, 7986, 7617, 6490, 4497, 1750, -996, -4014, -6040, -7192, -8124, -7299, -5769, -4085, -776, 1696, 4096, 6354, 7623, 7817, 7055, 5689, 2983, 91, -2411, -5074, -6632, -7854, -7950, -6372, -4903, -2522, 602, 3250, 5638, 6985, 7726, 7343, 6150, 4075, 1505, -1311, -4066, -5813, -7244, -7520, -7011, -5534, -3442, -861]
3652h61K790K855J673R48K7p87j670k200k631k891k430j535j081K36J444J787
3668d326K470K681K543K086J611M41k61j322k287k561k445k602j957j030m72P54
3684f677J510J828K649K988K099K038P70R1j051j793k230k504k563k184j569r87
3700g585P71Q95J712K749K452K497K162J297J74m06j222k432k228k921k080j766
3716e931j214k5O68J631K369K304K681K072J533R80j3j007k036k518k015k467
3732b988k258j221p04M76J253J915K309K731K137K115Q00L58k99j713j971k481
3748D59k553k125j530j261Q5R76J504J956K682K281K271J430O34k04p26k227k103
3765A549k403k354k110j172l22M17J411J548K512K502K111K082R58k22o56j380
$$ y = [-861, 1929, 4784, 6457, 7405, 7432, 6645, 4975, 2775, 144, -2747, -5177, -6712, -7793, -7557, -6113, -4326, -1856, 825, 3368, 5454, 7065, 7506, 7245, 5923, 3636, 1075, -1370, -3972, -5929, -6959, -7431, -6677, -5167, -3339, -690, 2298, 4397, 6435, 7205, 7296, 6245, 4452, 2222, -282, -2845, -5029, -6598, -7585, -6814, -5919, -4207, -1458, 994, 3491, 5653, 6950, 7124, 6718, 5496, 3064, 836, -2085, -4165, -5931, -7145, -7170, -6502, -4871, -2502, -198, 2483, 4555, 6088, 7068, 7055, 6048, 4012, 1494, -521, -2988, -5246, -6467, -7171, -6695, -5442, -3527, -1218, 1513, 3650, 5765, 6565, 6923, 6624, 4911, 2940, 459, -2094, -4219, -5749, -7010, -6925, -5949, -4445, -2489, 193, 2474, 4745, 6175, 6809, 6605, 5879, 3652, 1549, -854, -3208, -5318, -6490, -6812, -6395, -4984, -3436, -924, 1578, 3689, 5771, 6729, 6507, 5851, 4471]
3781D471j975k179k634j856j545q41j45J037J448K216K267K332K109J467K92R7
3797F561r27j972k610k436j914j832j130l50N80J483J627K280K196K326J736P49
3813F367J27p07j764j792k212k379j872j240q48J40R55J185K708J822K431J916
3829D837J282L55j99j312j936k036k315k013j901q84k16M71J477J876K268J988
3845A742K348J297P86J80p69j593k182k089k142j977j371q20Q31O14J867K337
3861i41K128J964J667J141N16n82j434j505k582k037k103j382p20k62M98J569
$$ y = [4471, 2496, 317, -2317, -4173, -5718, -6559, -6704, -5667, -4219, -2003, 264, 2596, 4705, 6172, 6464, 6561, 5634, 3662, 1052, -1384, -3298, -5130, -6260, -6610, -6030, -4547, -2920, -640, 1556, 3882, 5618, 6367, 6494, 5787, 4023, 2231, 19, -2360, -4232, -5472, -6320, -6180, -5225, -4040, -1332, 490, 2921, 4837, 6119, 6474, 6275, 4963, 3027, 991, -1324, -3337, -5238, -6122, -6338, -5867, -4390, -2514, -246, 1742, 4090, 5387, 6173, 6353, 5584, 3991, 1809, -280, -2422, -4399, -5770, -6590, -5759, -5145, -3278, -941, 1187, 3151, 4818, 5959, 6475, 5893, 4459, 2954, 372, -1665, -3768, -5150, -5870, -6132, -5634, -4065]
$$ [...]
##END NTUPLES=NMR FID
##END=
