##TITLE=1H_Pr Bzl-Dep
 200.13MHz, CDCl3,
 8 sc
 
 6.8.2025
##JCAMPDX= 6.0         $$ Bruker NMR JCAMP-DX V2.0
##DATA TYPE= NMR FID
##DATA CLASS= NTUPLES
##ORIGIN= UXNMR, Bruker Analytische Messtechnik GmbH
##OWNER= pz
$$ XWIN-NMR		Version 3.5
$$ Wed Aug  6 14:28:35 2025 Russian Standard Time (UT+4h)  she@DPX200
##.OBSERVE FREQUENCY= 200.1313
##.OBSERVE NUCLEUS= ^1H
##.DELAY= (6, 6)
##.ACQUISITION MODE= SIMULTANEOUS
##.ACQUISITION SCHEME= undefined
##.AVERAGES= 8
##.DIGITISER RES= 18
##SPECTROMETER/DATA SYSTEM= spect
##.PULSE SEQUENCE= zg30
##.SOLVENT NAME= CDCl3
##.SHIFT REFERENCE= (INTERNAL, CDCl3, 0, 14.3821)
##AUDIT TRAIL= $$ (NUMBER, WHEN, WHO, WHERE, WHAT)
$$ ##TITLE= Audit trail, XWIN-NMR		Version 3.5
$$ ##JCAMPDX= 5.01
$$ ##ORIGIN= Bruker BioSpin GmbH
$$ ##OWNER= she
$$ F:/spectra/data/she/nmr/H-C/1/audita.txt
$$ ##AUDIT TRAIL=  $$ (NUMBER, WHEN, WHO, WHERE, WHAT)
(   1,<2025-08-06 14:27:15.73 +0400>,<she>,<DPX200>,
      <created by zg, POWCHK disabled, PULCHK disabled
       configuration hash MD5:
       00 E9 B6 7A A2 85 ED C7 34 08 36 98 17 FE 4E 26
       data hash MD5: 16K
       21 2D 29 B0 47 8F F8 18 15 D3 B6 6F 8E 71 71 F1>)
$$ ##END=
$$ 
$$ hash MD5
$$ FE 49 CD 07 34 7E FE 81 A1 00 56 73 40 E5 80 C5
##$RELAX= 
##$RELAX= 
##$RELAX= 
##$RELAX= 
##$RELAX= 
##$RELAX= 
$$ Bruker specific parameters
$$ --------------------------
##$DU= <F:/spectra>
##$EXPNO= 1
##$NAME= <H-C>
##$PROCNO= 1
##$TYPE= <nmr>
##$USER= <she>
##$AMP= (0..31)
100 100 100 100 100 100 100 100 100 100 100 100 100 100 100 100 100 100 
100 100 100 100 100 100 100 100 100 100 100 100 100 100 
##$AQSEQ= 0
##$AQ_mod= 1
##$AUNM= <au_zg>
##$AUTOPOS= <>
##$BF1= 200.13
##$BF2= 200.13
##$BF3= 200.13
##$BF4= 200.13
##$BF5= 200.13
##$BF6= 200.13
##$BF7= 200.13
##$BF8= 200.13
##$BYTORDA= 1
##$CFDGTYP= 0
##$CFRGTYP= 5
##$CHEMSTR= <none>
##$CNST= (0..31)
1 1 145 1 1 1 1 1 1 1 1 1 1 1 1 1 1 1 1 1 1 1 1 1 1 1 1 1 1 1 1 1 
##$CPDPRG= <>
##$CPDPRG1= <>
##$CPDPRG2= <>
##$CPDPRG3= <>
##$CPDPRG4= <mlev>
##$CPDPRG5= <mlev>
##$CPDPRG6= <mlev>
##$CPDPRG7= <mlev>
##$CPDPRG8= <mlev>
##$CPDPRGB= <>
##$CPDPRGT= <>
##$D= (0..31)
0 0.7 0 0 0 0 0 0 0 0 0 0.03 0 0 0 0 0 0 0 0 0 0 0 0 0 0 0 0 0 0 0 0 
##$DATE= 1754476035
##$DBL= (0..7)
120 120 120 120 120 120 120 120 
##$DBP= (0..7)
150 150 150 150 150 150 150 150 
##$DBP07= 0
##$DBPNAM0= <>
##$DBPNAM1= <>
##$DBPNAM2= <>
##$DBPNAM3= <>
##$DBPNAM4= <>
##$DBPNAM5= <>
##$DBPNAM6= <>
##$DBPNAM7= <>
##$DBPOAL= (0..7)
0.5 0.5 0.5 0.5 0.5 0.5 0.5 0.5 
##$DBPOFFS= (0..7)
0 0 0 0 0 0 0 0 
##$DE= 6
##$DECBNUC= <off>
##$DECIM= 32
##$DECNUC= <off>
##$DECSTAT= 4
##$DIGMOD= 1
##$DIGTYP= 9
##$DL= (0..7)
0 120 120 120 120 120 120 120 
##$DP= (0..7)
150 150 150 150 150 150 150 150 
##$DP07= 0
##$DPNAME0= <>
##$DPNAME1= <>
##$DPNAME2= <>
##$DPNAME3= <>
##$DPNAME4= <>
##$DPNAME5= <>
##$DPNAME6= <>
##$DPNAME7= <>
##$DPOAL= (0..7)
0.5 0.5 0.5 0.5 0.5 0.5 0.5 0.5 
##$DPOFFS= (0..7)
0 0 0 0 0 0 0 0 
##$DQDMODE= 0
##$DR= 18
##$DS= 0
##$DSLIST= <SSSSSSSSSSSSSSS>
$$ [...]
##$SUBNAM0= <"">
##$SUBNAM1= <"">
##$SUBNAM2= <"">
##$SUBNAM3= <"">
##$SUBNAM4= <"">
##$SUBNAM5= <"">
##$SUBNAM6= <"">
##$SUBNAM7= <"">
##$SUBNAM8= <"">
##$SUBNAM9= <"">
##$SW= 18.0517328524113
##$SWIBOX= (0..15)
0 0 2 0 0 0 0 0 0 0 0 0 0 0 0 0 
##$SW_h= 3612.71676300578
##$TD= 16384
##$TD0= 1
##$TE= 0
##$TE2= 300
##$TE3= 300
##$TEG= 300
##$TL= (0..7)
0 120 120 120 120 120 120 120 
##$TP= (0..7)
150 150 150 150 150 150 150 150 
##$TP07= 0
##$TPNAME0= <>
##$TPNAME1= <>
##$TPNAME2= <>
##$TPNAME3= <>
##$TPNAME4= <>
##$TPNAME5= <>
##$TPNAME6= <>
##$TPNAME7= <>
##$TPOAL= (0..7)
0.5 0.5 0.5 0.5 0.5 0.5 0.5 0.5 
##$TPOFFS= (0..7)
0 0 0 0 0 0 0 0 
##$TUNHIN= 0
##$TUNHOUT= 0
##$TUNXOUT= 0
##$USERA1= <user>
##$USERA2= <user>
##$USERA3= <user>
##$USERA4= <user>
##$USERA5= <user>
##$V9= 5
##$VALIST= <valist>
##$VCLIST= <CCCCCCCCCCCCCCC>
##$VD= 0
##$VDLIST= <DDDDDDDDDDDDDDD>
##$VPLIST= <PPPPPPPPPPPPPPP>
##$VTLIST= <TTTTTTTTTTTTTTT>
##$WBST= 1024
##$WBSW= 4
##$XGAIN= (0..3)
0 0 0 0 
##$XL= 0
##$YL= 0
##$YMAX_a= 15103
##$YMIN_a= -19822
##$ZGOPTNS= <>
##$ZL1= 120
##$ZL2= 120
##$ZL3= 120
##$ZL4= 120
##$ABSF1= 10
##$ABSF2= 0
##$ABSG= 5
##$ABSL= 3
##$ALPHA= 0
##$AQORDER= 0
##$ASSFAC= 0
##$ASSFACI= 0
##$ASSFACX= 0
##$ASSWID= 0
##$AUNMP= <proc_1d>
##$AZFE= 0.1
##$AZFW= 0.1
##$BCFW= 1
##$BC_mod= 2
##$BYTORDP= 1
##$COROFFS= 0
##$CY= -3
##$DATMOD= 1
##$DC= 2
##$DFILT= <>
##$DTYPP= 0
##$F1P= 0
##$F2P= 0
##$FCOR= 0.5
##$FTSIZE= 0
##$FT_mod= 4
##$GAMMA= 1
##$GB= 0.15
##$INTBC= 1
##$INTSCL= 1
##$ISEN= 128
##$LB= 0.25
##$LEV0= 0
##$LPBIN= 0
##$MAXI= 10000
##$MC2= 0
##$MEAN= 0
##$ME_mod= 0
##$MI= 1.114404
##$NCOEF= 0
##$NC_proc= 0
##$NLEV= 6
##$NOISF1= 3.799351
##$NOISF2= 2.8
##$NSP= 1
##$NTH_PI= 0
##$NZP= 0
##$OFFSET= 14.38212
##$PC= 1
##$PHC0= -1106.015
##$PHC1= 7.592303
##$PH_mod= 1
##$PKNL= yes
##$PPARMOD= 0
##$PSCAL= 0
##$PSIGN= 0
##$REVERSE= no
##$SF= 200.129724274929
##$SI= 16384
##$SIGF1= 3
##$SIGF2= 2
##$SINO= 400
##$SIOLD= 16384
##$SREGLST= <1H.CDCl3>
##$SSB= 0
##$STSI= 0
##$STSR= 0
##$SW_p= 3205.1282051282
##$SYMM= 0
##$S_DEV= 0
##$TDeff= 0
##$TDoff= 0
##$TI= <>
##$TILT= no
##$TM1= 0
##$TM2= 0
##$TOPLEV= 0
##$USERP1= <user>
##$USERP2= <user>
##$USERP3= <user>
##$USERP4= <user>
##$USERP5= <user>
##$WDW= 1
##$XDIM= 8192
##$YMAX_p= 0
##$YMIN_p= 0
$$ End of Bruker specific parameters
$$ ---------------------------------
##NTUPLES= NMR FID
##VAR_NAME=  TIME,          FID/REAL,        FID/IMAG
##SYMBOL=    X,             R,               I
##VAR_TYPE=  INDEPENDENT,   DEPENDENT,       DEPENDENT
##VAR_FORM=  AFFN,          ASDF,            ASDF
##VAR_DIM=   8192,          8192,            8192
##UNITS=     SECONDS,       ARBITRARY UNITS, ARBITRARY UNITS
##FACTOR=    0.0002768,     1,               1
##FIRST=     0,             0,               0
##LAST=      2.2672688,     0,               0
##MIN=       0,             -19822,          0
##MAX=       2.2672688,     15103,           0
$$ Real data points
##PAGE= N=1
##DATA TABLE= (X++(R..R)), XYDATA
0 0 0 0 0 0 0 0 0 0 0 0 0 0 0 0 0 0 0 0 0 0 0 0 -8 8 -8 8 -8 8 -8 14 -16 16 -16 23 -24 24 -32 32 -38 40 -48 49 -57
43 -57 64 -70 76 -84 93 -103 113 -125 137 -151 167 -184 205 -225 253 -281 317 -359 412 -476 561
64 561 -676 845 -1110 1604 -2827 13219 12065 -7313 4782 14051 11739 -2789 -6617 -6067 -8127
79 -8127 -8607 -2089 -6172 -13848 -11878 -894 6256 1910 -2578 4281 8774 7614 8330 8377 3825 582
95 582 90 2730 -1278 -8779 -7375 -4663 -8105 -7940 -2884 -657 -3374 -3983 5240 11897 4425 837
111 837 7979 11685 5972 -893 437 3945 -2081 -8257 -4967 -4356 -8099 -7870 -3605 -1010 -4536 -4309
127 -4309 5549 9206 2310 739 6399 10092 6782 244 -103 1005 -2015 -2555 -3020 -7406 -8568 -4978
143 -4978 -1656 -2004 -5094 -1497 5182 4186 2463 5655 7746 5978 2637 2688 4905 727 -4302 -2675
159 -2675 -2743 -6247 -7091 -4510 -2074 -4494 -6224 381 5408 2564 1208 3738 6648 6579 3352 3012 2851
176 2851 -1025 -1986 -633 -3010 -5767 -6414 -4559 -2569 -3936 -2881 1257 1047 480 3913 6715 6421
192 6421 3164 1964 5059 4272 -39 -1396 -2646 -4296 -4243 -3945 -3620 -5285 -6610 -1796 2422 755
208 755 -128 2024 5204 6432 4052 3434 4056 1647 519 865 -1543 -4138 -5226 -4236 -2709 -4662 -5292
225 -5292 -1719 7 176 1623 3071 4699 4599 3696 5205 4461 1562 1028 328 -1480 -2992 -4452 -4128
242 -4128 -4123 -5615 -3788 -1452 -1882 -1073 1151 3432 4617 3267 3475 5357 4102 2496 1753 -139 -1297
259 -1297 -2370 -3348 -3317 -4915 -5639 -3005 -1856 -1978 -890 568 2947 3931 3267 4572 4850 3249 3059
276 3059 2425 682 -796 -2631 -2885 -3015 -5012 -4760 -3239 -3199 -2396 -1120 453 2466 2457 2793 4667 4362
294 4362 3540 3264 1935 1113 -112 -1801 -2035 -3406 -4803 -3611 -3147 -3289 -2422 -1583 501 2019 1840
311 1840 3139 4172 3629 3915 3349 2130 1447 -246 -1182 -1516 -3430 -3977 -3404 -3772 -3162 -2443 -1721 183
329 183 779 1379 3289 3488 3312 3670 2931 2528 1683 -33 -453 -1571 -3170 -2976 -3162 -3594 -2930 -2641 -1376
348 -1376 108 212 1514 2907 2913 3504 3423 2775 2733 1436 312 -37 -1761 -2634 -2543 -3358 -3298 -3046 -2813 -1182
368 -1182 -515 -127 1533 2159 2635 3452 2965 2884 2630 1253 833 -13 -1560 -1810 -2578 -3302 -2868 -2941 -2323 -1165
388 -1165 -1161 -34 1589 1957 2823 2981 2589 3054 2517 1627 1220 -496 -1528 -1583 -2381 -2670 -2994 -3607 -2412
407 -2412 -1338 -827 312 600 1283 2785 3034 3131 3039 1861 1609 1281 102 -504 -1841 -3096 -2706 -2644 -2527
426 -2527 -2162 -2544 -1373 487 1050 1835 2182 2169 3161 3144 2510 2237 760 -322 -452 -1376 -1966 -2719 -3655
445 -3655 -2811 -2011 -2087 -1239 -489 472 1846 1875 2353 3326 2930 2526 1931 884 829 -81 -1643 -2025 -2690 -3024
465 -3024 -2493 -2526 -2052 -1331 -1214 331 1966 2129 2312 2165 2464 3512 2662 1046 313 -528 -798 -1242 -2572
484 -2572 -2803 -2947 -3195 -2012 -1057 -659 -110 48 1427 3222 3005 2343 2131 1906 2326 1451 -273 -812 -1622
503 -1622 -2318 -2124 -2503 -2522 -2252 -2305 -1030 531 721 1142 1568 2245 3303 2651 1715 1844 1309 403 -574 -1652
523 -1652 -1485 -1741 -2962 -2876 -2235 -1625 -713 -650 -76 1225 1568 2123 2893 2452 1971 1410 999 1430 287 -1674
543 -1674 -2104 -2034 -1668 -1631 -2694 -2430 -1151 -450 511 1006 1104 1850 2001 2166 2896 2035 738 183 -195 11
563 11 -736 -2501 -2664 -2048 -1853 -1451 -1543 -998 184 398 1111 2238 2122 1875 1769 1644 1983 988 -515 -662
583 -662 -959 -1469 -1857 -2407 -1971 -1312 -1561 -995 -16 588 1400 1385 1431 2255 2218 1787 1438 487 48 -242 -1131
604 -1131 -1332 -1664 -2453 -2219 -1685 -1014 -395 -767 -248 1296 1868 1978 1825 1448 1903 1657 816 542 -370 -1291
624 -1291 -1417 -1683 -1604 -1722 -2359 -1702 -554 -171 437 654 950 1923 2146 2035 1986 1182 770 670 -152 -650
644 -650 -1265 -2110 -1878 -1834 -1791 -1331 -1328 -754 399 769 1218 1669 1716 2145 1969 1279 1288 719 -147 -557 -1254 -1592
666 -1592 -1668 -2158 -1883 -1376 -1363 -650 24 514 1265 1423 1663 2252 1906 1538 1375 614 205 -310 -1139 -1363 -1777
687 -1777 -2150 -1750 -1658 -1452 -668 -377 256 1036 1261 1846 1981 1590 1803 1544 839 476 -360 -880 -1036 -1746
707 -1746 -1910 -1723 -1884 -1421 -834 -508 273 621 1042 1786 1736 1701 1921 1414 1016 580 -205 -449 -974 -1689 -1628
728 -1628 -1805 -1838 -1331 -1204 -653 78 310 1055 1568 1454 1796 1784 1442 1291 580 0 -157 -983 -1354 -1441 -1865
749 -1865 -1682 -1355 -1248 -618 -225 166 1024 1198 1375 1766 1568 1478 1267 584 334 -159 -949 -1047 -1379 -1757 -1495
770 -1495 -1527 -1229 -645 -487 195 833 896 1376 1647 1474 1572 1118 696 584 -202 -695 -851 -1421 -1510 -1437 -1575 -1072
792 -1072 -787 -590 268 583 841 1382 1417 1533 1575 1000 887 545 -211 -466 -875 -1361 -1328 -1537 -1469 -1050 -1023 -471
814 -471 179 314 876 1259 1311 1596 1390 1094 1070 396 -119 -306 -907 -1153 -1295 -1597 -1328 -1181 -1055 -338 -8
835 -8 252 909 1107 1369 1650 1266 1233 1035 410 210 -272 -906 -1039 -1398 -1505 -1265 -1371 -1072 -421 -266 329
856 329 820 986 1444 1446 1327 1487 1002 503 308 -303 -675 -907 -1422 -1408 -1390 -1512 -943 -621 -373 289 557 977
878 977 1437 1328 1445 1447 888 777 496 -184 -507 -1020 -1352 -1253 -1507 -1433 -975 -948 -480 157 490 991 1126 1137
900 1137 1637 1488 1081 911 362 -23 -293 -937 -1105 -1286 -1702 -1327 -1106 -956 -429 -202 260 903 1053 1324
920 1324 1492 1180 1246 1082 478 233 -282 -740 -874 -1360 -1417 -1135 -1316 -1106 -564 -244 363 629 707 1364 1421
941 1421 1172 1303 1040 707 271 -349 -425 -601 -1291 -1407 -1313 -1244 -868 -744 -428 201 373 778 1265 1237 1285 1194
963 1194 823 893 540 -91 -422 -911 -1020 -894 -1278 -1356 -1017 -764 -223 22 172 819 1019 961 1343 1294 993
984 993 655 167 222 -8 -860 -1117 -1034 -1114 -1055 -1115 -841 -208 -173 131 791 909 1074 1137 986 1152 873 293 188
1007 188 -233 -635 -750 -1104 -1197 -985 -1034 -775 -490 -246 403 633 591 996 1228 1170 1007 584 550 328 -382 -565
1029 -565 -567 -994 -1170 -1262 -943 -436 -627 -489 310 635 784 926 987 1216 1015 600 692 343 -283 -478 -785 -896
1051 -896 -926 -1246 -1058 -693 -632 -137 158 270 775 943 1050 1180 875 831 750 127 -152 -241 -724 -927 -1144 -1128
1073 -1128 -783 -929 -808 -119 100 266 625 880 1240 1110 782 984 834 248 -23 -325 -601 -802 -1178 -1026
1093 -1026 -871 -1093 -728 -283 -84 300 511 762 1177 1026 1005 1091 627 391 215 -199 -452 -865 -1115 -884
1113 -884 -1034 -1121 -625 -451 -206 174 420 868 966 797 1116 1108 630 492 246 -68 -332 -846 -884 -812 -1178 -1037
1135 -1037 -662 -563 -231 -2 327 822 779 861 1171 967 761 615 292 77 -306 -747 -673 -891 -1150 -906 -741
1156 -741 -591 -330 -129 360 634 590 929 1068 857 805 629 388 157 -391 -521 -516 -950 -1029 -859 -808 -581 -437
1178 -437 -167 358 399 493 971 931 843 810 580 514 145 -318 -325 -559 -944 -866 -878 -801 -594 -541 -121 247 248 567 864
1203 864 807 885 780 629 536 86 -137 -189 -591 -824 -784 -854 -766 -666 -505 -44 104 205 671 772 755 828 682
1226 682 744 476 22 7 -208 -616 -682 -771 -796 -705 -737 -427 -66 -86 252 596 658 790 792 733 722 370 130 97 -278
1251 -278 -582 -619 -794 -754 -746 -747 -371 -195 -114 336 504 599 768 738 782 728 327 266 125 -307 -455 -626 -787 -758
1275 -758 -853 -676 -365 -341 -73 298 392 639 718 729 899 628 401 383 88 -226 -377 -633 -701 -757 -859 -602 -482
1298 -482 -442 -57 166 344 645 631 817 893 603 539 447 58 -101 -322 -572 -623 -823 -818 -578 -639 -453 -119 58
1321 58 313 500 599 829 765 626 661 440 159 -1 -299 -440 -566 -834 -711 -660 -681 -418 -230 -51 260 372
1343 372 603 797 666 716 668 404 296 33 -241 -329 -606 -724 -622 -749 -661 -436 -327 -21 174 300 616
1364 616 687 620 705 604 457 320 36 -97 -274 -575 -618 -620 -746 -594 -503 -356 -71 66 272 580 535 642 728
1387 728 540 486 377 108 12 -292 -496 -469 -655 -703 -548 -561 -310 -117 -33 296 446 430 658 656 580 549 242 145
1411 145 53 -260 -430 -490 -661 -614 -572 -546 -288 -178 -10 253 332 472 640 554 593 505 295 227 -17 -224 -265 -486
1435 -486 -626 -546 -587 -492 -326 -238 45 228 237 473 564 576 587 433 334 246 -41 -195 -235 -490 -522 -594 -615 -382 -358
1460 -358 -264 -5 130 314 494 484 601 608 417 381 248 -12 -75 -335 -485 -466 -581 -567 -478 -438 -168 13 39 304
1484 304 457 487 574 509 512 442 165 23 -35 -301 -445 -510 -624 -468 -478 -485 -159 -88 59 288 335 538 632 502 513
1509 513 438 253 163 -98 -306 -308 -513 -578 -487 -535 -415 -271 -204 82 254 306 491 521 569 581 379 245 225 -32
1533 -32 -213 -321 -475 -466 -574 -599 -416 -317 -220 -40 124 325 463 452 561 592 432 386 233 22 -84 -321 -452
1556 -452 -456 -567 -534 -420 -407 -171 -43 97 322 384 456 578 502 433 422 195 60 -44 -260 -331 -413 -598 -475 -440
1580 -440 -425 -200 -98 54 249 261 448 565 469 461 390 227 148 -72 -193 -217 -463 -495 -438 -452 -360 -261 -176 68 171
1605 171 248 450 430 439 474 360 289 157 -62 -150 -239 -410 -396 -451 -462 -341 -270 -141 49 74 267 406 374 463 454 345
1631 345 276 150 -2 -61 -246 -395 -347 -438 -422 -338 -309 -89 11 65 298 361 374 447 401 347 307 85 54 -75 -307
1656 -307 -343 -390 -447 -363 -369 -312 -120 -69 95 299 281 394 413 400 400 245 152 69 -116 -242 -283 -369 -423 -438 -389 -236 -154
1683 -154 -86 124 234 291 389 398 421 372 236 193 115 -127 -225 -281 -401 -400 -434 -401 -233 -225 -106 92 137 298 394 381 444
1710 444 365 269 238 71 -68 -157 -286 -371 -378 -455 -333 -289 -269 -72 66 125 298 321 400 465 355 337 289 91 -20
1735 -20 -114 -272 -305 -409 -429 -326 -345 -240 -84 -29 118 227 328 402 388 353 372 275 107 39 -117 -216 -269 -414 -376
1760 -376 -365 -380 -268 -121 -72 108 214 258 385 334 388 390 246 188 59 -90 -150 -300 -385 -348 -360 -365 -217 -180 -67
1785 -67 62 109 253 347 320 378 330 229 203 75 -5 -112 -280 -318 -308 -386 -359 -261 -216 -56 2 107 239 261 303 373
1811 373 300 281 231 89 26 -84 -235 -215 -328 -375 -285 -283 -207 -86 -22 110 217 214 302 347 294 287 198 113 41 -103 -170
1838 -170 -226 -308 -316 -280 -309 -174 -123 -51 108 166 229 321 296 289 303 166 163 63 -101 -103 -250 -297 -298 -311 -251 -195 -141 -47 58
1867 58 102 241 294 295 304 251 185 151 16 -73 -97 -242 -264 -283 -304 -239 -191 -165 -12 68 82 251 239 290 335 250 219 156 34
1896 34 -23 -124 -211 -245 -255 -296 -251 -258 -138 -10 -16 135 194 216 280 282 262 247 154 53 17 -123 -201 -241 -316 -294 -250 -286 -149
1925 -149 -68 20 99 154 237 303 263 262 248 164 111 -15 -124 -133 -238 -303 -269 -289 -249 -152 -128 -28 101 133 218 251 265 314
1953 314 222 143 120 13 -65 -149 -259 -255 -262 -327 -204 -188 -145 -38 47 112 252 200 262 285 237 226 129 22 -12 -132 -187
1980 -187 -206 -272 -286 -188 -248 -122 -50 -1 119 143 191 262 200 218 224 133 40 -4 -94 -145 -194 -265 -237 -231 -227 -131 -88 -14 134 111
2010 111 224 241 226 239 195 126 121 -5 -98 -109 -204 -227 -218 -246 -198 -109 -126 -31 39 105 194 212 208 237 161 128 102 -21 -51 -117
2040 -117 -189 -208 -188 -211 -210 -112 -99 -9 17 89 181 193 230 245 195 189 93 -13 -1 -122 -174 -172 -217 -224 -153 -165 -86 -7 46 98 146
2071 146 147 207 207 175 147 70 21 -31 -119 -126 -179 -248 -189 -208 -166 -83 -57 -5 98 122 151 210 186 162 132 97 53 -24 -97 -105 -163
2102 -163 -197 -169 -214 -154 -84 -96 37 74 114 180 198 193 192 143 114 48 -32 -67 -76 -206 -175 -178 -202 -133 -132 -93 39 16 93 186 166
2133 166 228 162 147 123 90 -21 -41 -86 -140 -166 -199 -184 -147 -172 -35 4 12 108 129 145 250 168 151 156 58 34 -34 -91 -133
2162 -133 -172 -210 -160 -158 -153 -70 -53 -1 57 102 163 184 172 187 139 72 60 -19 -96 -119 -184 -209 -192 -191 -172 -82 -68 14 74 94 174
2193 174 166 171 207 108 101 43 -8 -52 -109 -164 -180 -168 -193 -100 -112 -55 -6 25 121 118 113 203 162 127 98 90 -10 -49 -104 -139 -118 -167
2225 -167 -162 -112 -102 -64 -6 18 92 110 154 160 151 152 111 81 31 -19 -101 -107 -147 -152 -121 -132 -116 -59 -44 13 47 87 126 157 101 122 88
2258 88 53 28 -16 -61 -78 -137 -151 -148 -152 -103 -36 -62 30 40 69 146 142 133 132 87 65 48 -27 -37 -89 -133 -124 -130 -146 -97 -42 -41 3 41
2292 41 115 151 97 136 137 107 94 42 -29 -8 -87 -106 -127 -151 -123 -88 -79 -42 -14 34 102 98 106 140 132 107 96 34 26 -16 -100 -96 -122 -140
2326 -140 -118 -123 -98 -44 -16 -5 98 72 106 148 113 143 68 44 20 -20 -89 -74 -102 -127 -126 -129 -104 -55 -31 46 43 50 122 105 123 102
2358 102 74 59 34 -34 -48 -63 -133 -120 -131 -121 -76 -84 -32 17 36 74 89 125 112 128 81 87 33 -16 -30 -69 -90 -107 -120 -93 -97
2389 -97 -55 -39 6 46 88 90 128 126 115 89 89 3 -8 -43 -62 -86 -108 -131 -102 -116 -69 -44 -27 28 63 83 116 95 113 126 107 15
2421 15 31 -31 -61 -47 -72 -107 -98 -100 -87 -27 -40 25 40 53 96 72 83 101 46 73 40 -6 -7 -71 -108 -80 -104 -101 -88 -43 -32 2
2453 2 39 80 97 56 86 77 68 58 12 1 -12 -65 -80 -66 -94 -86 -91 -64 -29 1 41 55 82 76 85 97 60 57 11 14 -52 -73 -89 -79 -103
2488 -103 -73 -87 -46 -27 -17 38 59 78 94 84 43 60 47 27 -7 -50 -94 -36 -71 -79 -80 -53 -24 -42 -23 39 51 49 80 58 54 93
2520 93 48 14 18 -19 -17 -58 -66 -89 -89 -77 -44 -30 4 8 25 63 69 67 63 72 48 39 -2 -21 -37 -86 -78 -81 -64 -59 -55 -25 4 22 -6 40 60
2557 60 79 60 52 43 30 7 -5 -23 -35 -57 -69 -80 -26 -43 -45 -21 -11 37 62 74 64 97 60 49 17 22 23 -26 -33 -57 -58 -59 -71 -58
2591 -58 -30 6 -32 6 37 50 50 51 72 52 6 39 18 -19 -38 -66 -65 -56 -75 -81 -15 -33 15 2 28 57 40 54 39 50 27 27 3
2624 3 -38 -17 -31 -53 -41 -31 -41 -74 -33 -16 -5 9 35 46 39 45 29 8 28 7 4 -29 -40 -57 -56 -39 -39 -71 5 6 27 22 33 46
2658 46 23 49 33 46 13 4 -2 -14 -4 -47 -66 -19 -60 -42 -23 -35 -8 16 -9 42 34 14 28 15 23 10 30 10 -10 -26 -54 -27
2690 -27 -23 -21 -13 17 1 28 42 38 20 25 27 -14 30 32 9 -34 -8 -23 -62 -13 -9 -16 -5 -13 -7 8 16 59 26 35 10 46 13 8 19 -29 -13
2727 -13 -22 -19 -24 -13 -10 -22 -28 -9 0 21 44 7 50 -2 23 24 -10 -4 -24 -39 -32 -30 -20 -32 -22 9 1 -13 18 3 10 27 31 23 -4 15 13 2
2765 2 -3 -11 -32 -24 -1 -27 -30 -32 -15 8 22 17 31 33 10 24 22 -21 -6 -16 -14 -18 -41 -23 -38 -11 -16 6 -14 12 27 0 8 6 21 9 -2
2802 -2 -24 19 -21 -41 -17 -24 -13 -26 -10 -18 -6 -16 2 8 21 5 22 -5 22 39 6 7 -37 -8 -13 -30 -33 -9 -22 -35 7 -7 22 21
2836 21 3 30 17 -2 -4 -23 -16 0 -10 -14 -36 -32 3 3 -16 -14 15 6 28 12 2 1 16 -10 3 -1 19 -23 -18 -28 -43 -16 -30 -6 -13 19
2872 19 20 -1 10 2 0 3 9 7 2 -29 9 8 -17 -9 -21 -20 -35 -16 1 -6 -20 -11 9 0 42 24 29 12 -1 -18 -17 -42 4 -28 -15 -4 -27 -20
2910 -20 3 23 0 20 39 47 11 13 9 -17 11 -14 -14 -24 -12 -16 -15 -29 -7 -6 0 18 21 20 5 14 40 28 45 30 -1 -10 -11 -16 -29 -11 -33
2947 -33 -30 -35 -10 -11 0 5 24 24 41 17 11 19 12 11 7 8 -38 -38 -37 -27 -28 -45 -44 -25 13 18 15 4 38 22 13 29 3 20 6 -34 -46 -62 -56 -9
2987 -9 -37 -27 -16 0 11 6 36 49 25 46 40 29 39 9 0 -31 -31 -49 -38 -44 -38 -12 -20 -15 0 3 39 34 42 36 47 18 11 11 -21 -44 -25 -31
3025 -31 -55 -71 -49 -71 -17 -17 3 25 24 39 49 52 81 39 27 2 6 10 -43 -29 -48 -35 -37 -40 -20 4 -22 21 26 26 86 30 52 64 14
3060 14 38 -26 -38 -34 -66 -74 -47 -70 -53 -25 -6 -40 23 13 38 77 84 61 25 55 4 14 -1 13 -19 -71 -30 -49 -9 -42 -16 10
3092 10 -9 10 27 55 32 52 46 30 25 -5 16 -13 -53 -53 -64 -45 -46 -37 -57 -12 26 7 9 34 38 73 53 58 42 -5 33 1 -55 -51 -67
3127 -67 -81 -33 -40 6 2 -22 22 9 45 73 59 41 75 7 -2 33 -17 -68 -37 -65 -51 -58 -64 -22 -8 -4 49 41 64 78 59 59 67 36 7
3162 7 3 -30 -28 -53 -91 -51 -62 -44 -37 -14 -3 18 41 67 68 65 77 55 36 6 -13 -21 -49 -84 -63 -16 -95 -16 -13 -21 4 13 60 81 64
3197 64 57 67 58 56 30 -30 -5 -35 -76 -54 -84 -73 -52 -76 -3 -15 9 32 56 87 102 72 61 59 41 -9 4 -44 -78 -58 -79 -60
3229 -60 -59 -69 -21 -46 8 38 22 90 72 68 70 98 24 11 2 -42 -41 -88 -100 -40 -90 -69 -14 -11 30 16 61 73 50 67 72 53 41 36
3263 36 -20 -10 -46 -70 -60 -93 -70 -61 -45 -40 -18 15 24 50 78 74 78 62 54 13 -18 11 -33 -42 -92 -99 -129 -80 -61 -32 -32 28 41 49 77
3298 77 89 95 75 61 35 21 -27 -46 -50 -90 -108 -65 -65 -46 -49 -22 -18 38 43 58 100 86 88 72 23 32 -22 -46 -34 -95 -82 -57 -64 -53 -55
3333 -55 -27 22 27 86 85 102 58 79 62 41 32 16 2 -72 -69 -68 -82 -60 -25 -44 -11 0 18 70 52 67 113 96 66 69 38 -12 -14 -61
3367 -61 -88 -90 -104 -74 -79 -57 0 -22 24 53 66 43 74 91 71 64 35 -3 -25 -58 -74 -84 -91 -73 -59 -52 -50 -1 1 50 48 82 95 66
3401 66 91 60 52 6 -13 -65 -83 -71 -109 -94 -95 -72 -55 -31 26 42 69 73 109 86 109 49 91 33 -23 -33 -57 -86 -105 -86 -107 -59
3433 -59 -31 -43 20 60 54 77 89 130 91 69 57 12 -23 -9 -54 -89 -89 -117 -61 -73 -95 -54 -11 29 62 47 81 124 72 84 63
3464 63 25 21 -8 -87 -84 -98 -101 -51 -85 -67 -42 -17 32 87 79 106 78 112 92 68 26 12 -15 -60 -44 -96 -106 -82 -89 -79 -54 -40 12
3497 12 55 44 92 111 83 96 84 66 20 -23 -31 -71 -101 -85 -58 -94 -66 -54 -25 -7 31 84 94 63 90 80 67 71 -3 -21 -41
3528 -41 -67 -96 -91 -93 -88 -97 -78 -45 -8 42 70 66 76 112 96 96 71 50 21 15 -37 -56 -57 -101 -103 -95 -54 -41 -17 13 47 49 101 105 109 116 56
3565 56 38 38 -15 -58 -59 -79 -107 -90 -103 -80 -47 -30 20 45 46 101 102 95 73 65 36 13 -56 -37 -36 -112 -124 -114 -88 -76 -71 2 10 24 85
3600 85 80 83 129 104 64 73 29 -9 -30 -65 -79 -103 -126 -111 -86 -62 -17 -6 62 73 93 104 110 91 101 92 13 2 2 -49 -93 -88 -110 -110
3634 -110 -120 -54 -40 11 13 83 90 110 94 99 122 50 47 46 -11 -51 -90 -83 -124 -107 -134 -72 -40 -62 42 36 57 147 84 132 98 65 73
3667 73 46 -20 -43 -72 -113 -64 -124 -92 -92 -69 -33 2 19 81 104 92 121 118 91 89 40 44 -23 -62 -70 -117 -100 -107 -101 -72 -36 -1 19 57
3701 57 72 115 113 76 121 104 39 30 -40 -62 -73 -128 -99 -99 -123 -44 -18 -29 66 54 53 133 93 73 126 90 51 50 -28 -44 -62 -97 -121
3734 -121 -95 -83 -64 -90 -28 34 6 84 87 89 123 109 54 41 46 25 -19 -97 -66 -94 -114 -110 -80 -62 -35 -2 25 61 95 94 109 115 69
3767 69 90 7 -3 -35 -72 -99 -85 -135 -114 -103 -63 -16 18 41 61 91 89 139 76 103 78 68 36 -23 -66 -28 -86 -142 -78 -104 -72
3798 -72 -63 -1 54 45 87 117 120 110 95 49 47 43 -37 -40 -63 -82 -90 -122 -101 -64 -41 -11 29 29 79 98 112 134 98 69 77 36 -24 0 -70
3833 -70 -100 -93 -101 -87 -89 -69 -16 1 44 91 128 119 110 98 111 94 49 4 -2 -57 -61 -124 -132 -96 -86 -77 -14 -20 21 56 90 100 137 121 103
3868 103 81 26 39 -17 -64 -84 -123 -115 -116 -120 -75 -38 -49 58 47 71 110 110 111 117 109 81 35 0 -35 -79 -114 -69 -111 -100 -77 -67 -28
3901 -28 -16 42 66 106 118 130 108 121 90 82 31 -37 -58 -89 -94 -102 -91 -66 -90 -11 1 18 72 58 92 121 113 99 89 54 41 -7
3933 -7 -59 -38 -82 -108 -97 -76 -63 -8 -19 5 37 64 124 124 105 97 71 71 10 -19 -23 -66 -79 -84 -97 -74 -61 -55 -16 52 25 49 125 90
3967 90 138 99 66 64 35 0 -18 -72 -88 -79 -85 -82 -71 -58 -5 26 16 91 80 101 112 95 61 56 34 0 -40 -50 -79 -117 -122 -109 -73
4000 -73 -75 -10 14 10 70 81 93 98 96 104 57 17 12 -24 -46 -75 -84 -81 -107 -91 -43 -25 -5 46 57 91 110 122 112 106 79 31 -4 -17 -53
4035 -53 -88 -103 -120 -93 -83 -62 -45 -45 59 42 96 104 88 113 123 65 49 21 -26 -12 -64 -70 -99 -90 -113 -95 -64 -18 -16 35 71 102
4067 102 129 149 108 93 89 24 -5 5 -53 -66 -93 -151 -101 -134 -76 -52 1 27 83 103 102 139 97 106 91 26 13 -45 -41 -50 -114 -102
4099 -102 -82 -114 -74 -34 -37 16 33 68 117 110 100 103 102 71 -2 -19 -30 -72 -101 -94 -105 -72 -61 -43 -37 -2 40 57 94 76 117 126 68
4132 68 63 27 -36 -4 -70 -66 -99 -106 -100 -90 -60 -20 -5 22 66 95 113 124 91 112 80 18 23 10 -68 -84 -82 -99 -97 -105 -74 -37 -29 62 73
4167 73 72 97 77 112 92 90 54 21 -12 -45 -58 -94 -107 -112 -111 -81 -29 -9 49 38 78 92 101 115 127 67 50 17 -35 -23 -70 -93 -89
4200 -89 -111 -104 -69 -51 -5 -1 66 63 107 88 120 97 110 93 20 4 -52 -41 -78 -102 -145 -73 -69 -66 -27 -6 39 87 90 147 103 76 72 89
4234 89 41 -8 -26 -92 -68 -87 -89 -84 -77 -72 -12 -3 12 63 77 102 93 100 98 48 41 20 -27 -57 -75 -122 -85 -116 -129 -40 -32 -2 6 87 80 126
4270 126 71 135 118 70 54 36 -36 -38 -86 -109 -108 -101 -109 -71 -82 2 6 53 69 85 95 103 93 80 80 27 -14 -24 -51 -97 -76 -117 -60
4303 -60 -54 -98 -39 4 11 55 77 103 130 115 104 89 35 21 -41 -80 -64 -101 -100 -77 -82 -98 -30 -17 51 47 71 91 93 90 97 64 56 57 -24
4338 -24 -44 -77 -88 -100 -102 -118 -37 -51 -17 19 53 88 102 101 118 128 58 32 23 -1 -14 -61 -101 -75 -101 -95 -59 -54 -27 11 3 65 72 102
4372 102 101 121 70 86 11 -12 -34 -50 -86 -103 -102 -80 -85 -42 -30 0 44 53 71 90 106 117 116 44 44 19 -33 -64 -36 -100 -90 -76 -93
4405 -93 -68 -35 -3 46 72 87 97 116 95 75 84 17 11 -42 -40 -82 -72 -100 -95 -111 -50 -25 5 11 29 82 87 101 119 76 50 34 18
4438 18 -65 -18 -75 -95 -83 -92 -89 -39 -31 -36 40 41 68 97 58 101 74 84 70 41 -1 -35 -58 -77 -103 -112 -87 -90 -60 -16 -38 40 54 74
4472 74 117 93 87 94 67 13 11 -38 -56 -26 -101 -74 -92 -70 -38 -13 2 32 76 77 84 98 95 74 45 24 42 -32 -44 -67 -96 -97 -102 -112
4506 -112 -50 -47 -28 26 44 82 93 104 119 92 53 86 39 -9 -45 -81 -59 -82 -82 -74 -89 -56 -28 7 11 65 44 103 80 45 58 54
4538 54 29 18 -1 -67 -76 -68 -105 -89 -60 -60 -38 -3 32 49 52 88 91 73 93 53 35 -10 -8 -50 -82 -94 -78 -72 -117 -64 -37 -13 48 52
4572 52 69 70 89 73 79 54 21 9 -34 -28 -17 -78 -61 -131 -74 -50 -69 -6 29 40 70 65 74 83 86 72 50 -7 -31 -8 -58 -55 -96 -89 -64
4607 -64 -23 -30 -4 15 44 90 59 89 73 84 68 67 16 28 -16 -47 -74 -93 -100 -71 -67 -46 -12 6 44 71 82 103 90 80 58 65 -3
4640 -3 4 -34 -40 -51 -70 -82 -70 -82 -67 -20 1 52 51 67 90 114 100 89 47 22 20 -27 -15 -55 -99 -61 -88 -81 -33 -20 -10 12 35
4673 35 80 93 91 80 75 57 50 8 -13 -46 -57 -77 -83 -95 -39 -43 -53 8 5 50 70 54 105 85 68 89 56 23 20 -30 -72 -51 -103 -92
4707 -92 -71 -73 -50 -37 -3 15 60 89 96 85 78 73 52 16 21 -37 -33 -62 -111 -68 -65 -64 -37 -28 -26 44 34 94 73 113 96 73 30 68 3
4742 3 -16 -31 -43 -92 -72 -137 -82 -45 -57 16 -7 18 51 67 35 103 65 45 55 -9 -22 -15 -45 -60 -84 -83 -69 -39 -30 -12 -7 50 45
4775 45 71 97 66 55 89 37 21 8 -25 -50 -44 -99 -78 -59 -66 -45 14 -1 41 34 55 88 83 88 79 20 10 23 -15 -17 -46 -46 -74 -86
4809 -86 -85 -36 -43 -17 37 35 67 71 88 42 87 51 61 2 -11 -48 -60 -71 -72 -64 -63 -23 -26 22 19 15 61 62 53 59 66 58 46 3 -24 -34 -50 -60
4847 -60 -78 -46 -70 -62 -21 -1 -10 29 43 56 75 70 77 75 28 -15 17 -39 -44 -56 -66 -61 -43 -33 -29 9 -17 18 65 62 101 70 80 43 47
4882 47 23 -20 -51 -68 -69 -61 -84 -57 -66 -33 -9 -8 41 57 78 89 64 76 43 48 33 4 -5 -44 -67 -72 -64 -70 -74 -21 -33 -4 24 40 91
4917 91 49 47 68 63 35 6 15 -22 -23 -71 -48 -90 -74 -77 -69 -48 -2 -6 23 62 58 80 68 54 49 34 30 -1 -32 -17 -69 -68 -78 -49 -73 -32
4953 -32 -14 -6 46 32 43 63 86 87 32 43 44 32 -25 -22 -65 -77 -57 -73 -77 -30 -25 -21 46 49 38 88 58 66 60 49 30 -6 -6 -3 -42 -56
4989 -56 -60 -86 -44 -36 -50 13 8 32 54 63 42 90 52 14 38 30 -15 -51 -63 -20 -98 -63 -44 -59 -33 -24 5 25 31 42 65 43 57 61
5023 61 56 -24 -26 -66 -24 -45 -41 -64 -63 -63 -49 -11 -12 36 68 59 61 53 39 52 26 25 -15 -46 -17 -67 -71 -61 -76 -30 -49 -7 12 18 12 65 66
5060 66 65 20 17 52 12 -12 -34 -23 -92 -71 -63 -40 -47 -42 -23 -10 -12 56 47 41 52 63 14 61 20 13 -12 -60 -58 -45 -83 -56 -45 -74 -13
5095 -13 15 20 56 56 41 86 73 61 42 -1 25 -21 -44 -48 -18 -33 -45 -42 -40 -21 -8 15 30 64 68 75 60 73 53 32 13 10 -14 -21 -59
5130 -59 -56 -58 -69 -26 -20 -9 35 28 21 32 48 76 62 68 20 33 20 -43 -44 -59 -46 -58 -79 -65 -32 4 11 31 31 66 70 50 51 45 36 49 -14
5167 -14 4 -23 -36 -39 -33 -50 -55 -53 -34 15 30 36 63 69 54 46 40 43 27 33 -9 -60 -46 -54 -63 -53 -53 -35 -2 -22 9 27 27 30 61 70 46 36
5205 36 27 14 14 -32 -32 -47 -64 -56 -11 -45 -26 -22 3 28 12 66 35 35 19 41 51 21 -2 -46 -50 -42 -56 -57 -48 -32 -40 -14 -8 19 29 74
5241 74 47 51 45 20 36 10 -7 -36 -30 -46 -26 -18 -75 -25 -43 -3 22 0 40 65 29 66 71 47 43 29 10 17 -56 -31 -48 -66 -69 -37
5275 -37 -45 -12 0 -2 32 51 60 50 50 21 23 5 39 -28 -33 -11 -37 -24 -53 -53 -24 -25 -8 14 24 43 49 6 52 59 29 37 -1 3 -27 -27 -76
5312 -76 -53 -51 -61 -26 -21 -9 7 13 22 63 41 64 44 32 35 25 -1 -19 -47 -46 -31 -88 -35 -4 -25 -29 -5 26 35 39 64 62 37 48 65
5347 65 -1 32 -25 -29 -47 -41 -57 -67 -29 -39 -24 5 13 21 38 42 64 48 28 18 27 -2 -16 -27 -7 -28 -40 -45 -35 -31 -16 -30 13 53
5381 53 32 62 46 66 48 32 17 28 2 -18 -25 -50 -20 -22 -62 -27 -33 -8 7 21 38 40 32 34 47 20 26 14 -1 -4 -35 -29 -51 -39 -34
5416 -34 -42 -18 -14 16 20 39 33 34 38 49 49 16 9 -32 4 -27 -13 -48 -58 -59 -55 -43 -14 19 20 30 25 56 40 22 39 21 10 6 -9 -43 -20
5453 -20 -25 -56 -51 -48 -31 -27 1 7 8 23 41 36 25 27 47 27 23 -2 -9 -35 -29 -33 -56 -42 -32 -19 6 14 2 59 38 52 59 43 25 2 30
5490 30 -33 -36 -3 -57 -43 -47 -41 -30 -19 -37 18 25 33 37 37 72 71 30 45 14 -18 -35 -43 -34 -26 -37 -80 -59 -43 -26 3 1 20 27 41 42 32
5527 32 51 53 31 -2 -47 -37 -23 -19 -28 -7 -20 -46 -21 3 12 26 43 74 59 58 51 45 27 6 10 -13 -29 -12 -31 -84 -48 -29 -27 -35 7
5562 7 26 37 47 48 65 50 30 21 22 8 12 -33 -35 -82 -38 -42 -24 -35 -23 9 -5 24 24 55 65 56 23 19 -2 -10 -11 -8 -11 -43 -41 -43 -38 -13 -17
5601 -17 -17 7 24 33 37 66 52 16 9 26 16 1 -10 -65 -39 -33 -32 -33 -29 -22 0 7 25 28 70 37 66 17 16 18 11 -24 -16 -37 -13 -43 -20 -54
5639 -54 -21 2 -17 27 34 27 36 50 48 31 62 26 -23 -7 -36 -46 -54 -63 -38 -14 -47 -37 -22 28 14 51 44 61 33 8 30 15 23 5
5673 5 10 -28 -33 -42 -22 -52 -24 -11 9 20 3 25 34 26 48 48 41 3 22 -13 -10 -27 -36 -52 -7 -34 -46 -20 -35 25 2 24 70 98 28
5708 28 22 53 22 22 -8 -25 -15 -45 -43 -42 -41 -31 -27 -15 -6 25 8 18 25 63 -16 26 29 20 -10 -6 0 -40 -25 -39 -35 -32 -9 -9 -10 19 9 28
5746 28 25 34 70 29 44 -15 -10 -4 -44 -60 -30 -59 -18 -54 -30 -23 -5 -7 61 15 46 55 55 27 6 45 -15 -16 -20 -27 -40 -43 -37 -23 -27 -5 3 -6
5784 -6 12 21 65 65 20 62 39 30 15 -2 14 -18 -21 -38 -45 -48 -20 -19 9 -4 32 30 47 19 37 55 31 71 31 -25 -25 -29 -28 -48 -30 -22 -15
5821 -15 -31 -17 -6 22 32 16 43 9 64 19 11 41 3 -12 -21 -18 -28 -32 -40 -31 -34 7 13 -14 32 -3 27 38 9 49 14 26 -3 -8 -6
5856 -6 -42 -47 -38 -43 -34 -26 -45 0 -41 9 20 6 52 36 33 42 -12 1 -11 -13 -19 -18 3 -7 -45 -11 12 -8 24 26 23 54 38 45 70 32 9
5893 9 -2 17 -3 -35 -26 -18 -35 -17 -43 4 4 -10 0 8 8 25 40 36 -3 3 9 -7 -12 -19 -18 -8 -5 -40 14 -1 -1 23 6 4 32 60 28 49
5931 49 59 41 24 16 -8 -8 -41 -37 -29 -48 -55 -31 -7 -13 29 37 16 67 16 28 57 14 3 21 8 -9 -26 -24 -47 -44 -44 -54 4 -8 9
5966 9 34 22 39 17 40 38 44 26 26 15 -6 -24 -31 -36 -29 -27 -42 6 14 21 -4 24 22 31 43 20 60 20 -3 13 1 -27 9 -26 -27 -41 -37
6003 -37 -22 -5 -1 12 63 29 26 37 50 33 55 9 26 7 15 -21 -23 -52 -24 -55 -15 2 -11 -5 6 29 26 25 25 40 40 51 23 -6 7
6038 7 -23 -25 -2 -30 -69 -10 -8 -8 26 14 23 12 54 83 10 16 3 5 8 18 -22 -37 -12 -17 -5 -25 -50 -25 25 -7 2 22 45 36 21 46
6074 46 34 23 -1 -11 -48 -28 -48 -17 -42 -16 -14 -20 -10 0 28 10 42 23 64 31 28 31 28 33 -27 9 -28 -27 -24 -23 -22 -14 9 -26 -11 12
6110 12 42 26 44 26 40 8 -12 -7 2 -16 -27 -31 -37 -8 -32 4 -2 -17 18 26 36 40 36 48 57 24 20 41 3 -19 -24 -8 -19 -42 13 -16
6146 -16 -7 13 -22 23 36 22 50 39 14 21 22 9 4 -33 -43 -19 -45 -35 -25 -15 -21 0 30 23 23 38 18 64 30 16 48 21 -16 -1
6180 -1 -19 -31 -34 -30 -28 -56 6 17 -3 23 27 20 26 33 46 23 29 26 -14 -17 -25 -41 -18 -24 -13 -20 -69 -16 -1 6 22 13 21 53 20 0 42 45 -5
6219 -5 -4 23 -27 -44 -16 -23 -31 -36 -17 22 18 0 17 42 59 15 4 7 10 7 -5 4 -24 -4 -33 -14 -36 -36 0 -18 -18 32 38 35 31 28 46 21
6257 21 19 17 4 -17 1 -39 -19 -3 -18 -26 -1 -8 13 -4 24 16 3 25 44 21 30 -11 -30 -9 -5 -33 -13 -30 -6 -34 -5 5 21 10
6291 10 10 41 14 46 29 23 27 11 8 21 -33 -1 -3 -16 5 28 8 33 4 35 18 42 16 38 48 39 12 27 18 8 -1 -35 -14 -5 -26
6326 -26 -39 -8 -8 -4 21 16 -13 28 12 22 51 34 24 34 -11 -6 -20 -46 17 -15 -25 5 -7 -12 8 0 20 25 28 31 51 35 53 -24 -4
6361 -4 11 -29 5 -5 4 -9 -45 -23 -11 18 -3 7 2 21 2 20 27 32 10 -9 -22 -44 -38 -6 -40 -37 -26 0 -2 10 6 14 4 18 41
6396 41 63 0 14 21 6 16 -25 -18 -19 -18 -11 -20 -29 -3 -8 -16 5 11 0 14 29 22 1 -8 15 -8 -33 0 -21 -21 -32 -40 -41 9 -7 -8 11 15 21
6435 21 29 26 31 6 27 -5 -7 18 -10 -16 1 -31 -15 -7 -14 -3 13 11 18 0 6 23 19 2 20 -5 6 -17 3 -23 -12 -70 -21 0 6 6 -1
6472 -1 -4 -13 31 36 39 8 6 21 12 30 -8 -3 15 5 -37 -17 -11 -12 -22 -16 12 3 -12 8 6 40 32 -14 3 -20 -7 2 -16 16 1 -22 -17 -3
6510 -3 3 -18 4 20 12 15 15 28 -5 8 5 16 5 12 -14 -22 -16 -11 -15 11 4 3 7 6 6 8 7 51 34 8 15 2 -2 -13 -20 -25 8 -36 -18 -17 -18 -36
6552 -36 -16 16 7 2 47 0 -4 1 17 0 35 -4 -46 12 -7 -11 -19 22 -29 -8 5 1 11 -3 2 24 20 11 7 3 6 13 -7 -10 9 0 -31 8
6590 8 -13 10 7 -22 -15 15 22 9 17 18 31 -11 -3 -23 11 -10 1 -16 -7 -17 1 -20 -12 -14 -28 42 -26 28 33 7 4 10 -9 -3 -12 -11 2 -7 -17
6629 -17 -16 5 -17 8 3 10 -7 -5 -8 10 17 23 15 19 -2 19 5 16 -21 6 0 -30 6 -27 5 20 3 5 -4 1 -30 10 -5 -40 -4 -9 16
6666 16 -18 -16 -24 13 -38 -40 -6 -8 -9 -1 -44 -4 20 8 4 10 28 11 3 -13 10 -5 -11 0 -4 6 2 15 2 -14 16 5 0 4 38 13 -1
6703 -1 14 -8 -25 -17 -18 -12 -4 -12 -4 20 8 8 -6 -11 -16 33 7 5 -19 -1 25 -35 -8 4 7 -1 13 -9 -12 -12 0 -23 6 -22 3 10 -25 -6
6741 -6 4 13 -2 -16 -8 -8 -21 23 5 -5 7 -18 -20 -2 -16 -40 -5 -20 7 -11 30 26 11 17 10 3 32 -10 17 -4 -16 4 -14 -3 -1
6776 -1 -16 12 5 6 24 16 -2 5 -23 -1 8 17 33 8 -24 -19 -1 7 -3 -15 10 -16 -19 -11 9 13 22 -16 -9 14 -18 -15 -18 11 -2 -9 5 2 -12
6815 -12 -31 -11 0 0 -35 0 -8 13 2 9 6 5 15 20 -13 -14 -10 -2 -2 15 12 1 -4 -14 -2 19 19 -28 -13 -4 17 0 -5 9 31 -18 -5 -14
6853 -14 -13 -20 6 25 3 9 -3 -13 17 25 -7 26 20 27 36 -1 6 -10 -20 -15 -11 -2 -12 -5 -4 -47 -33 -14 -12 -13 3 -50 1 12 7 -13 -45 -3
6891 -3 -3 1 -18 19 -21 8 -10 -5 43 -3 15 11 28 17 14 34 9 0 20 12 11 -6 -20 -8 5 0 -17 -19 -2 1 -21 -18 8 -26 -6 0 -9 13
6929 13 -6 12 2 9 1 -7 -2 23 25 -4 14 -5 8 -29 -18 -6 -7 3 17 2 19 1 48 15 5 20 -11 -7 -24 5 0 8 7 7 -4 1
6965 1 -7 -28 40 19 -8 19 -15 4 2 10 27 16 16 -8 -5 -28 -5 -8 -10 56 7 12 24 -13 22 50 25 -15 -12 3 6 5 -18 13 -21 9
7001 9 -16 15 -12 -19 -16 -9 6 39 -1 -17 -9 16 22 17 20 19 6 -3 -6 -17 4 -13 0 -19 8 -19 20 10 34 16 15 10 22 21 26 -6 -30 -16
7039 -16 20 -2 15 29 -8 -5 25 11 -13 -19 16 29 6 -12 1 -12 -23 10 10 21 -12 -18 27 -9 -5 -3 -6 0 14 -3 5 21 -4 23 37
7074 37 14 0 17 4 17 20 12 -24 -17 -2 -9 9 -28 -6 -14 33 13 -3 8 20 11 5 -1 -10 19 -25 6 -8 -2 1 3 -5 -14 -15 2 11 10 4 -1 10
7114 10 11 5 -15 2 8 3 -1 -10 1 -5 -25 -29 -2 -9 0 13 11 9 -11 26 -4 2 17 35 -16 -9 -27 17 3 -9 -23 9 18 -17 1 35 13 15
7152 15 17 -19 -20 17 3 -3 35 9 4 -8 8 -21 -35 -15 13 -12 6 11 -11 35 11 10 -6 23 11 8 29 -9 -29 1 -18 -35 -11 -35
7186 -35 5 -23 -13 16 10 -17 1 -7 22 28 -3 -13 -3 3 -16 -3 -3 -42 9 -17 -27 -5 -45 -5 6 17 10 15 -6 19 28 -4 -13 0 9
7221 9 12 -23 -21 -8 -37 -19 -21 -17 12 5 4 10 41 25 3 17 -10 23 -7 11 8 -4 -20 -18 -6 -36 -29 -29 13 24 -4 9 24 10 18 20 -7
7258 -7 0 10 30 -18 -27 -14 -8 -23 -4 -9 -20 -14 -13 -31 15 0 -2 21 20 27 14 22 20 11 -13 6 -7 -49 -7 -2 -7 -7 -21 -28 -19 15 24 15 21 27 -9
7299 -9 -7 -7 9 -18 -11 4 -53 -15 -15 1 -15 -1 -4 -2 17 39 6 28 4 40 0 -7 15 -33 -2 -35 -30 14 -22 -14 14 -17 -2 -28 11
7334 11 27 18 33 32 19 37 40 -16 8 -3 -4 8 -22 -6 -37 -43 -1 26 -10 -13 29 15 21 22 19 9 20 -5 23 -14 -4 -20 -25 6 -19
7369 -19 -5 -18 -7 0 12 8 11 22 25 22 44 -7 19 -11 -17 -29 -44 -22 -17 8 -15 -18 -3 0 -22 -12 11 1 35 2 24 -10 3 10 9 -5
7405 -5 -4 -24 -9 -36 5 -16 -24 28 -23 12 37 22 2 8 24 20 11 36 7 -1 -11 -17 -29 -33 -16 -19 3 -7 11 21 38 27 20 1 -2 5 25
7442 25 8 -18 -12 -11 0 -11 -3 -26 -29 -3 -36 10 12 7 19 30 29 -17 18 29 17 17 -15 -25 -32 -23 -11 -43 -36 -5 -22 -5 -33 -5 20 -2
7478 -2 41 28 5 -16 30 9 2 -18 -4 -13 -26 -13 -5 -21 -31 1 6 -7 31 33 52 11 12 50 17 8 -20 -11 -7 -7 -42 -26 -10 -35 -15 2
7514 2 -9 18 14 -5 -7 21 33 24 39 22 8 -27 -24 -25 -15 -19 -12 -5 -5 -17 19 -6 21 34 22 22 31 39 -10 11 11 -13 -10 -33 -18 -27 -45 -5
7552 -5 -12 -24 -22 6 32 34 21 29 -6 -6 23 -2 15 -34 -11 -14 -24 -28 -9 -59 -20 4 7 -3 41 29 24 32 18 3 17 22 -2 31 -29 -10
7588 -10 2 -27 -12 -37 7 -3 -33 4 17 15 27 14 19 21 23 15 2 11 -13 -2 -21 -67 -21 -57 -21 -42 -26 -4 25 20 63 27 28 41
7622 41 49 30 26 -16 9 1 -19 -24 -31 -22 -15 -24 -2 -6 5 -4 10 10 35 45 31 7 6 -23 -48 -4 -10 -49 -20 -47 2 -26 3 -15 13 38 6
7659 6 43 18 31 28 36 17 -1 8 -15 -3 -45 -41 -25 -25 -19 -10 -56 -5 22 1 17 16 45 9 27 17 8 -8 -11 -11 -4 -7 -25 -30 -1 -5 -28 -3
7697 -3 27 11 23 32 23 23 11 35 -23 12 -11 -14 -14 -12 -22 -26 -25 -49 5 18 -20 4 8 -1 28 24 20 6 19 -8 6 4 -28 -22 -25 -41 -47 -4 -23
7736 -23 -3 3 16 23 7 54 36 11 36 26 5 -13 -24 -15 -17 -14 -29 -20 10 1 -31 11 1 -10 3 11 49 41 13 22 -10 -2 -31 -20 -40 -20
7772 -20 -9 -37 -1 -7 -13 -9 -17 20 8 30 27 37 29 17 12 -11 23 -3 -18 -26 -26 -32 -16 -26 -24 -5 17 2 8 27 34 26 30 1 -2 31 3 -14
7810 -14 -5 -23 -25 -55 -38 -18 -8 -19 8 14 35 19 28 14 23 7 -18 -2 8 -35 0 -17 -24 -28 -16 -14 8 -1 -7 12 25 57 47 24 34
7845 34 19 3 8 -10 -16 -9 -2 -32 -41 -55 -12 4 -42 -6 -9 14 21 4 51 44 20 37 8 -17 -10 26 -11 -13 -25 -38 -41 -8 -24 -4 -1 16
7881 16 32 2 17 33 30 13 24 11 6 -23 -21 -34 -38 -47 -30 -25 -34 -12 -9 -14 29 30 35 29 41 4 27 25 -27 -8 -55 -45 -5 -8 -48 -23 -4
7918 -4 4 27 4 20 32 25 37 38 18 -12 5 2 11 -26 -12 -17 -17 -17 -25 -23 -4 6 -8 29 45 -12 43 16 0 12 -20 18 7 -27 -22 -35
7954 -35 -42 -31 -10 -8 -21 -5 -8 7 5 33 28 48 13 29 12 -14 -11 16 -23 -25 -13 -28 -44 -21 -6 37 -19 -20 11 24 -3 40 26 23 21
7989 21 14 15 -22 -16 -28 -39 1 -54 -19 -31 22 33 10 24 43 10 -1 25 27 11 -31 29 4 -8 -31 -23 -17 -16 -9 -17 -8 0 -3 4 31 43 20
8026 20 2 16 8 -15 -7 -13 -26 -29 -35 -31 -32 -34 -12 -1 12 8 17 52 46 51 10 55 43 -1 17 4 2 -12 -13 -27 -7 -31 5 -14 2 7 7 5 34
8065 34 32 8 15 42 16 -2 -17 -25 -25 -24 -17 -33 -24 -36 -29 -3 -9 -4 28 33 27 37 27 23 14 -11 -4 6 -40 -19 -23 -4 -35 -20 -30 -2 -4 23 25
8104 25 19 11 11 53 13 -6 -7 -8 -22 -15 -12 -19 -23 -11 -8 -5 -13 13 -5 18 12 47 16 48 49 48 25 9 4 -5 -2 -39 -37 -34 -30 -27 -17 -14 17 -10 40 -8
8146 -8 24 14 43 -13 -3 -10 8 1 -15 1 -29 -20 -24 -12 5 17 3 5 57 49 -10 14 21 24 4 47 22 -17 -6 -24 -19 -25 -26 0 -48 -20
8182 -20 27 -3 13 36 24 28 12 41 12
8191A2
$$ Imaginary data points
##PAGE= N=2
##DATA TABLE= (X++(I..I)), XYDATA
0 0 0 0 0 0 0 0 0 0 0 0 0 0 0 0 0 0 0 0 0 0 0 0 0 0 0 0 0 0 1 -8 8 -8 8 -8 8 -8 8 -11 16 -16 16 -17 21 -24 24 -25 32
47 32 -33 37 -41 45 -49 56 -59 65 -73 81 -92 103 -116 132 -152 177 -211 260 -333 451 -689 1342
69 1342 -7302 -19822 -782 15103 11575 748 126 6983 7831 5052 7409 1100 -9077 -8590 -866
84 -866 -119 -8488 -14651 -7672 -728 -2419 -815 2597 2293 3354 7086 11256 9212 2881 3521 6830
100 6830 1302 -2818 -1316 -3032 -8357 -10986 -4961 -243 -7210 -10441 -195 6376 2590 -180 4475
115 4475 11138 7719 1790 5075 6338 439 -2388 -1182 -2404 -7527 -9957 -3429 -960 -8363 -8769
130 -8769 -111 5060 3329 208 2993 8229 7424 6031 6108 1865 -298 1549 1131 -2940 -7936 -7153
146 -7153 -2463 -4397 -7675 -3645 41 -244 -358 2480 7035 5900 2533 5276 6782 2420 332 1200
162 1200 365 -4062 -7916 -4154 -1049 -5901 -8164 -3806 215 1213 162 1795 5188 4365 4423 7135
178 7135 5356 1885 956 1209 748 -2861 -5251 -3471 -4553 -6882 -4156 -1375 -1549 -2591 -1241 4068
194 4068 6058 3217 3429 4858 4073 3875 3022 991 -1820 -4551 -2812 -1104 -5127 -7592 -5054 -2015
210 -2015 -605 -1449 -749 2772 3460 3852 6076 5169 3167 2986 3101 2676 -724 -3860 -2519 -2626 -5210
227 -5210 -5219 -4254 -3218 -2492 -2100 715 2671 1835 3351 5324 4683 4011 3213 2704 1958 -1009 -1980 -1426 -4052
246 -4052 -5642 -4459 -3527 -3052 -3658 -2686 1121 2237 1920 3624 4288 4474 4791 3901 3346 1592 -840 -371
264 -371 -1086 -3918 -4781 -4606 -3827 -3177 -3759 -2209 138 368 1847 3721 3748 4090 3977 3824 3777 1517 1
283 1 122 -1810 -3483 -3705 -4115 -3778 -4008 -3938 -1557 -383 -77 1775 2789 3501 4359 3996 4105 3425 1439
302 1439 1402 721 -1763 -2856 -3494 -3637 -3391 -4327 -3637 -1723 -1433 -204 1487 1994 3106 3568 3632 4262 3007
321 3007 1668 1745 294 -1253 -1968 -3200 -3197 -3534 -4201 -2785 -1945 -1855 -215 920 1900 3093 3029 3625 3956
340 3956 2679 2483 1959 178 -658 -1727 -2646 -2674 -3709 -3776 -2636 -2522 -1709 -369 235 1664 2520 2634
358 2634 3573 3245 2562 2776 1614 331 -337 -1619 -2012 -2541 -3697 -3116 -2651 -2675 -1344 -631 95 1611
376 1611 1983 2709 3534 2859 2913 2694 1329 834 -124 -1341 -1688 -2915 -3429 -2576 -2783 -2532 -1653 -1245 283
395 283 1439 1708 2704 2781 2476 3218 2650 1639 802 -716 -1071 -1144 -2486 -2958 -3163 -3282 -1947 -1353 -1063
414 -1063 121 582 1520 3013 3020 2996 2739 1821 1998 1586 122 -875 -2269 -2757 -2073 -2694 -3085 -2637 -2362 -932
434 -932 359 657 1621 2045 2212 3330 3190 2430 1860 566 280 44 -1655 -2443 -2653 -3042 -2543 -2585 -2355
453 -2355 -838 -221 284 1405 1920 2883 3352 2481 2412 2231 1242 874 -229 -1546 -2011 -2875 -2856 -2109 -2588
472 -2588 -2646 -1870 -844 1075 1643 1089 1947 2788 3163 3181 1942 1144 811 -401 -757 -1096 -2386 -3011 -3287
491 -3287 -2706 -1217 -1274 -1615 -440 799 2234 2737 2009 2399 2751 2180 2025 1200 -49 -743 -1804 -2091
509 -2091 -1745 -2608 -3077 -2521 -1811 -485 -139 -216 1305 2295 2243 2420 2254 2473 2359 664 -129 -101 -836 -1474
529 -1474 -2411 -2952 -2234 -2077 -1911 -781 -479 -142 832 1683 2835 2781 1503 1683 2208 1814 1000 -753 -1634
548 -1634 -1170 -1621 -2130 -2267 -2629 -1974 -1230 -659 618 924 615 1530 2376 2817 2526 1028 686 1157 389
567 389 -511 -1483 -2167 -1835 -2108 -2218 -1349 -1255 -1153 -179 687 1689 1925 1330 1983 2483 1874 1353 515 14
587 14 -125 -1294 -1966 -1695 -1938 -1939 -1892 -1798 -569 236 339 996 1318 1736 2343 1994 1712 1504 440 5 -85
608 -85 -734 -1278 -2274 -2608 -1501 -1177 -1448 -1120 -664 505 1449 1340 1809 2006 1611 1832 1724 1078 444 -841
628 -841 -1200 -863 -1547 -2059 -2158 -2192 -1232 -624 -461 249 600 1077 2013 2088 1900 1867 1177 1050 770 -160 -728 -1408
650 -1408 -1890 -1603 -1811 -2060 -1515 -1157 -455 257 442 1255 1901 1703 1953 1941 1545 1350 497 -140 -294 -1252
670 -1252 -1717 -1669 -2038 -1874 -1675 -1462 -454 -9 234 1149 1484 1740 2131 1765 1675 1436 572 336 -264 -1148
690 -1148 -1320 -1746 -2069 -1744 -1720 -1388 -756 -527 285 1122 1218 1713 1851 1780 1975 1412 761 576 -278 -853 -1050
711 -1050 -1705 -1826 -1845 -1903 -1301 -967 -720 235 676 1015 1617 1647 1859 1885 1231 1152 711 -141 -451 -1018 -1559 -1556
733 -1556 -1856 -1777 -1254 -1293 -710 104 378 991 1368 1468 1931 1729 1305 1321 631 61 -160 -935 -1285 -1467 -1856
754 -1856 -1510 -1407 -1414 -644 -222 204 895 1032 1458 1816 1443 1457 1333 644 344 -199 -779 -960 -1475 -1706 -1382
775 -1382 -1593 -1279 -646 -413 220 672 891 1524 1551 1388 1600 1163 754 500 -175 -564 -879 -1475 -1405 -1403 -1584
796 -1584 -1111 -774 -486 190 408 892 1430 1334 1473 1551 1056 888 518 -184 -371 -926 -1331 -1232 -1556 -1496 -1043
817 -1043 -952 -456 90 323 1006 1271 1211 1606 1412 1143 1024 401 27 -276 -987 -1101 -1255 -1697 -1390 -1150 -973
838 -973 -403 -172 263 959 1046 1354 1609 1287 1273 1049 487 270 -378 -922 -922 -1356 -1542 -1306 -1373 -993 -529 -307
860 -307 399 777 888 1425 1488 1358 1429 975 624 381 -363 -601 -886 -1432 -1429 -1430 -1429 -946 -738 -387 311 455 937
883 937 1435 1343 1418 1367 978 904 426 -233 -395 -988 -1337 -1240 -1430 -1367 -1172 -1055 -316 208 329 848 1158 1316
905 1316 1605 1366 1156 995 303 25 -179 -823 -1147 -1356 -1544 -1220 -1180 -1015 -450 -249 249 901 985 1244 1439
926 1439 1278 1301 959 474 370 -262 -849 -904 -1158 -1330 -1357 -1454 -882 -485 -425 193 676 872 1181 1185 1375 1530
948 1530 863 517 402 -82 -423 -847 -1274 -1166 -1299 -1302 -832 -722 -451 42 324 883 1291 1076 1188 1179 980
969 980 1042 370 -291 -385 -660 -907 -1107 -1475 -1155 -886 -945 -356 163 272 552 818 1257 1505 939 747 930
990 930 521 105 -361 -747 -731 -1111 -1386 -952 -885 -871 -480 -193 380 742 684 1056 1278 1044 1079 744 352 266
1012 266 -213 -636 -793 -1087 -1035 -990 -1236 -804 -272 -148 164 432 790 1202 990 949 1204 798 325 113 -147
1033 -147 -243 -841 -1334 -968 -874 -1073 -830 -622 -119 275 276 854 1168 884 1031 1055 816 652 88 -241 -290 -797
1055 -797 -964 -956 -1220 -1018 -713 -611 -200 30 352 899 878 960 1273 1036 783 560 272 132 -377 -935 -783
1076 -783 -907 -1254 -1064 -845 -530 -274 -233 386 892 756 968 1130 1059 981 588 306 220 -396 -715 -657 -1013 -1128
1098 -1128 -1073 -1026 -551 -438 -224 369 532 685 1099 1132 1029 931 624 616 239 -389 -447 -654 -1057 -1067 -1069 -878 -668
1121 -668 -681 -194 369 325 621 965 1038 1106 874 701 764 172 -211 -256 -634 -928 -1019 -1058 -829 -794 -767 -144 104
1144 104 221 638 822 992 1071 848 894 709 159 42 -163 -612 -792 -986 -961 -797 -924 -666 -186 -123 190
1165 190 599 744 952 874 863 1012 622 214 186 -163 -503 -706 -914 -789 -883 -969 -534 -293 -218 161 426 694
1187 694 888 772 922 953 505 418 213 -142 -385 -681 -793 -706 -943 -831 -478 -418 -195 155 345 686 740 734
1209 734 1008 793 490 466 209 -70 -314 -639 -612 -763 -972 -705 -522 -504 -205 58 350 628 549 803 983
1230 983 684 587 514 164 -18 -344 -537 -528 -850 -907 -641 -612 -468 -208 6 350 521 552 904 838 662 684 486
1253 486 227 9 -355 -444 -563 -896 -772 -684 -711 -470 -267 -14 359 364 609 871 730 718 686 472 291 -21
1275 -21 -269 -339 -635 -827 -712 -750 -708 -475 -336 24 226 285 717 778 708 821 700 529 363 -5 -123 -303
1297 -303 -701 -705 -712 -818 -672 -577 -381 -27 80 320 660 654 763 851 668 628 362 93 -17 -351 -622 -621 -774 -809
1321 -809 -652 -650 -322 -125 -39 330 547 543 772 815 707 674 352 214 100 -336 -477 -546 -777 -713 -733 -650 -339 -294
1345 -294 -49 309 408 556 747 681 765 641 384 342 57 -275 -325 -560 -689 -700 -773 -585 -444 -376 -27 220 291
1368 291 559 629 700 793 570 437 420 61 -108 -245 -502 -570 -698 -723 -553 -506 -366 -67 59 237 493 531 665
1391 665 680 550 559 379 68 -38 -233 -435 -522 -694 -645 -537 -585 -349 -72 7 262 360 514 696 608 528 540 318
1415 318 187 5 -266 -340 -504 -671 -578 -518 -523 -285 -207 -18 246 307 497 611 560 613 514 239 218 44 -214 -326
1439 -326 -509 -552 -495 -639 -482 -251 -226 23 160 309 547 500 537 650 488 316 201 -28 -109 -272 -540 -504
1461 -504 -536 -590 -431 -376 -217 18 116 310 488 486 595 567 434 407 228 -30 -119 -327 -426 -468 -650 -578 -432 -383
1485 -383 -218 -97 101 349 371 460 639 580 490 412 208 129 -64 -346 -383 -463 -634 -572 -528 -394 -178 -129 58 331
1509 331 359 510 588 529 587 431 233 184 -80 -230 -304 -540 -564 -508 -583 -437 -277 -161 98 177 282 540 562 512
1533 512 548 450 356 174 -81 -132 -272 -500 -515 -535 -512 -394 -397 -236 55 126 286 420 487 591 516 444 387 200 23
1558 23 -86 -289 -387 -415 -571 -528 -435 -394 -200 -67 34 309 342 451 559 507 475 401 191 120 -11 -259 -335 -423
1582 -423 -512 -446 -493 -379 -166 -148 45 220 295 433 477 467 512 374 192 172 -64 -195 -288 -442 -468 -432 -498 -362
1606 -362 -232 -151 61 164 271 418 429 476 506 336 271 168 -60 -122 -246 -391 -401 -482 -456 -308 -296 -149 54
1629 54 124 269 333 386 511 439 285 307 149 -16 -92 -270 -327 -373 -492 -408 -292 -307 -143 4 96 249 282 401
1653 401 492 370 347 326 98 40 -84 -233 -306 -392 -464 -352 -338 -294 -93 -56 126 238 281 458 430 369 416 299 136
1678 136 69 -98 -175 -296 -418 -392 -330 -401 -289 -160 -49 141 142 288 434 375 378 413 257 186 85 -70 -160 -288
1702 -288 -397 -360 -420 -377 -276 -209 -57 77 118 323 399 348 476 360 297 239 75 -2 -101 -293 -370 -345 -474 -372
1726 -372 -298 -226 -99 11 119 288 317 366 439 402 299 244 112 39 -118 -299 -286 -376 -417 -352 -321 -210 -100 -72 117
1751 117 254 284 377 401 363 373 217 142 80 -107 -196 -248 -367 -378 -393 -367 -230 -187 -81 106 164 241 361 379 355 362
1777 362 215 201 58 -100 -143 -256 -339 -360 -349 -345 -237 -245 -65 56 121 246 316 346 418 322 252 263 90 -69 -73 -242
1803 -242 -273 -296 -405 -274 -257 -232 -61 1 61 225 258 328 374 294 277 202 73 17 -94 -216 -238 -339 -350 -288 -316 -207
1829 -207 -104 -43 104 177 207 311 307 279 297 221 79 67 -117 -154 -223 -322 -260 -296 -296 -184 -114 -46 115 111 211 301 251
1856 251 312 286 165 131 68 -79 -138 -224 -302 -259 -326 -275 -165 -142 -17 52 115 244 273 241 319 276 203 168 55 -40 -128
1883 -128 -238 -240 -250 -319 -235 -175 -164 -37 47 103 237 213 299 321 243 212 155 30 3 -132 -219 -207 -330 -278 -240 -223 -197
1910 -197 -50 -20 170 180 228 325 300 271 261 164 73 3 -135 -200 -211 -322 -280 -249 -246 -121 -86 -10 135 171 230 285 276 301
1938 301 266 124 107 -22 -87 -133 -215 -276 -254 -301 -249 -170 -115 11 65 114 245 285 260 311 254 204 154 17 -41 -119 -225
1965 -225 -245 -231 -300 -225 -238 -155 -1 38 109 226 265 294 295 206 199 164 19 -3 -91 -192 -189 -263 -271 -224 -215 -107 -52 -12 131
1994 131 174 197 250 253 229 209 103 65 34 -110 -157 -211 -261 -241 -234 -193 -111 -82 -16 101 133 195 257 215 262 225 137 94 -35
2023 -35 -73 -101 -186 -212 -198 -246 -175 -121 -100 5 40 107 202 223 223 228 177 134 138 10 -65 -92 -188 -192 -224 -230 -186 -132 -111 1 40
2054 40 110 181 184 240 220 167 183 92 0 -17 -120 -167 -168 -221 -211 -166 -169 -78 -26 26 117 149 155 233 193 171 168 85 27 -8 -83 -123
2086 -123 -167 -216 -192 -166 -173 -95 -51 49 83 141 184 214 195 196 143 92 41 -34 -59 -86 -160 -219 -183 -203 -149 -88 -75 5 83 102
2116 102 184 178 187 208 152 95 70 -7 -39 -137 -161 -179 -204 -206 -154 -119 -61 16 25 124 158 150 211 193 147 114 54 -17 -49 -126 -166 -155
2148 -155 -213 -174 -166 -173 -72 -1 30 117 162 130 225 159 159 153 59 42 -9 -86 -120 -134 -225 -188 -167 -123 -79 -39 58 90 73 200 204
2179 204 170 175 132 107 75 -27 -101 -105 -183 -162 -174 -176 -138 -88 -66 33 70 103 150 164 191 205 148 124 76 -24 -33 -75 -158 -163 -163 -147
2211 -147 -112 -115 -45 16 5 76 154 124 186 156 145 132 47 7 6 -73 -101 -172 -162 -141 -130 -141 -90 -3 19 98 109 136 171 144 153
2242 153 102 26 45 -17 -77 -103 -142 -146 -116 -154 -113 -39 -34 17 85 84 158 142 133 167 112 60 78 -27 -49 -48 -150 -105 -152 -145 -83 -80
2274 -80 -68 38 75 72 157 112 151 153 86 117 61 -37 -29 -81 -136 -124 -157 -117 -91 -95 -47 25 39 77 116 123 141 117 92 72 28 34 -47
2307 -47 -77 -104 -136 -130 -128 -98 -97 -25 -10 45 90 86 132 158 104 92 98 32 4 -32 -57 -101 -151 -144 -98 -128 -76 -38 -4 18 59 74 136
2340 136 141 135 93 73 52 61 -43 -46 -62 -121 -99 -116 -102 -93 -65 -32 31 58 98 137 89 120 137 89 42 14 -28 -57 -72 -133 -94 -141
2372 -141 -121 -89 -63 1 15 31 108 102 87 113 108 81 70 27 -54 -36 -91 -98 -99 -144 -104 -79 -50 -22 -7 35 93 73 112 150 89 99
2404 99 64 60 -14 -26 -80 -76 -118 -126 -100 -109 -98 -28 -25 39 63 45 95 118 111 112 61 73 26 -29 -44 -61 -91 -99 -100 -102 -24 -61 -52 3 47 52
2440 52 92 86 107 135 69 47 56 -27 -10 -56 -86 -91 -111 -86 -45 -61 -22 13 8 54 82 66 138 82 62 83 24 -22 -20 -37 -49 -65 -82
2473 -82 -75 -79 -46 -11 -6 -7 54 62 90 74 81 107 60 35 -26 -28 -34 -76 -87 -64 -46 -76 -52 -31 -18 51 62 63 86 56 69 45 44 -4 12
2508 12 -44 -58 -28 -75 -59 -63 -74 -47 -42 1 26 33 78 90 72 90 99 24 65 -11 -5 -25 -69 -80 -70 -55 -77 -46 -49 3 24 37 23
2541 23 41 49 53 56 38 59 15 -33 -21 -66 -70 -61 -75 -69 -62 -44 -12 2 62 33 86 82 62 75 54 47 28 0 -18 -43 -45 -62 -90 -76 -70 -17
2577 -17 -18 7 20 25 43 84 69 29 37 31 25 -17 -35 -21 -85 -50 -57 -63 -62 -52 0 -26 23 22 57 62 86 84 61 26 34 -11 -14 -24 -43 -68 -25
2614 -25 -71 -52 -31 -31 14 3 27 48 73 50 55 26 22 53 -14 3 -35 -30 -64 -41 -50 -48 -25 -11 -16 7 16 55 30 50 70 39 41 10 -4
2649 -4 7 -9 -23 -32 -40 -62 -41 -8 14 -7 7 -12 23 23 48 70 58 21 32 -5 5 -18 -44 -37 -51 -32 -66 -31 -35 -16 31 11 47
2682 47 1 33 37 33 39 26 16 0 -11 -21 -15 -34 -32 -40 -23 7 4 4 10 30 23 6 32 22 13 24 43 6 -26 -2 -22 -24 -14 -25 -5 12
2718 12 0 4 5 20 49 29 32 30 24 13 -4 -2 0 -15 -41 18 -11 -41 -14 -32 -18 8 10 35 17 30 37 33 29 30 28 -4 -11 -35 -25 -10 -31
2755 -31 -33 -7 -24 -9 28 -8 14 36 8 9 21 19 36 -4 17 -18 0 -2 -40 -56 -15 5 -45 15 20 11 11 24 46 18 23 29 26 -22 -13 -17
2791 -17 -37 -10 -45 -36 -7 -11 -12 -7 1 28 3 6 28 26 2 40 27 25 -8 -37 -20 -29 -12 -9 7 -37 6 20 13 10 30 17 7 23 29 35 -12
2828 -12 -16 -26 -20 -4 -33 -27 -26 -15 -26 -21 0 21 19 10 22 14 39 12 -4 -6 -9 -30 -29 -33 -30 -17 -15 -4 -12 6 2 21 51 6 56 15 21 16 24 -1
2868 -1 30 -48 -36 -13 -10 11 -26 20 6 9 34 49 17 17 29 28 2 11 17 -1 -2 -23 6 -50 -30 -6 7 -26 -14 -27 1 -2 20 26 26 18
2904 18 8 25 0 -2 -8 -20 -32 -20 -16 -32 -28 -12 -15 39 39 23 26 30 19 2 21 -19 3 -14 -25 -31 -20 -70 -21 -6 11 -2 15 23 5
2939 5 26 24 39 30 28 2 8 11 -14 -23 -54 -55 -49 -18 -43 -10 -5 7 28 7 20 57 47 7 25 -6 -3 -47 -26 -9 -49 -12 -27 -33 -16 -4
2975 -4 13 14 -13 8 34 29 30 19 -3 24 26 2 -18 -2 -37 -43 -48 -26 -35 -26 5 10 39 40 30 27 44 38 32 21 10 2 -6 -38 -12 -53 -42 -36 -2
3014 -2 -31 -9 36 15 12 41 74 41 46 65 20 6 9 6 -47 -29 -39 -44 -20 -38 -9 -7 -13 -1 35 45 43 61 42 37 42 24 -2 -8 -35 -31 -56
3051 -56 -59 -49 -37 -30 5 9 16 43 44 47 46 60 51 42 -1 10 -7 6 -24 -38 -26 -56 -48 -58 -15 -17 27 38 62 42 46 43 35 43 39 3 5 -28 -57
3090 -57 -47 -58 -49 -50 -51 -42 -22 -13 24 50 21 76 52 44 13 26 26 -15 -25 -48 -65 -67 -84 -36 -26 -14 0 51 37 39 70 53 55 24 28 16
3126 16 11 -7 -10 -29 -48 -49 -66 -53 -61 -46 -20 -3 37 44 42 71 51 45 70 51 26 -14 -37 -17 -52 -79 -57 -61 -53 -19 -7 -3 47 16 50
3161 50 54 74 71 47 24 1 18 -8 -24 -40 -64 -42 -63 -57 -34 -15 -11 29 47 93 80 81 88 84 29 48 25 -26 -11 -49 -39 -82 -60 -69
3195 -69 -24 -6 20 13 24 95 36 69 69 56 23 23 15 14 -53 -23 -61 -76 -57 -68 -70 -13 9 5 70 34 59 72 49 55 44 7 0 -6 -54
3230 -54 -43 -48 -79 -79 -54 -59 -20 10 10 39 67 65 71 63 83 65 36 38 -12 -29 -21 -78 -65 -68 -75 -39 -45 -28 -8 50 44 77 65 81 86 90 68 42
3268 42 0 -17 -36 -28 -62 -77 -116 -60 -46 -48 32 15 62 103 91 70 78 79 50 22 5 -4 -26 -57 -69 -98 -65 -61 -59 -22 -16 0 58 48
3302 48 82 102 65 66 74 29 -28 -14 -27 -71 -98 -68 -60 -73 -61 -46 5 16 31 29 51 85 89 86 68 43 31 -30 3 -16 -76 -61 -49
3335 -49 -92 -52 -54 -30 4 17 20 57 78 70 85 74 58 20 -19 -43 -37 -60 -60 -85 -53 -50 -51 -14 12 33 57 80 82 65 82 33 47 15
3369 15 -27 -8 -53 -63 -72 -112 -72 -75 -64 -37 -15 36 63 46 112 110 83 63 59 24 18 10 -59 -57 -90 -90 -70 -64 -68 -25 -3 19 59 78 87 133
3405 133 102 127 55 56 17 11 -34 -83 -63 -67 -76 -82 -53 -50 -10 34 72 56 90 74 99 117 64 50 43 -18 -23 -56 -84 -79 -86 -86 -76 -74 -41 10
3441 10 65 73 85 55 121 106 28 105 29 3 -11 -22 -70 -75 -107 -111 -86 -42 -17 2 35 60 83 83 133 102 115 87 42 31 -12 -64
3473 -64 -75 -119 -126 -113 -67 -51 -55 -13 10 62 58 110 116 99 116 80 92 66 -2 -21 -35 -98 -77 -110 -122 -81 -67 -19 18 34 48 85
3505 85 89 105 91 57 58 54 -57 -33 -103 -77 -68 -125 -94 -86 -71 -41 25 1 71 82 85 107 100 71 71 32 9 -25 -67 -88 -91 -124 -94 -72
3539 -72 -85 -26 -8 22 86 83 84 120 73 96 66 21 45 -35 -68 -96 -96 -74 -98 -98 -74 -52 -17 41 35 55 104 80 89 110 58 38 32 -9
3573 -9 -51 -80 -110 -82 -98 -119 -68 -48 -25 2 74 61 84 80 109 76 98 57 -5 -25 -31 -51 -83 -64 -120 -112 -45 -68 -42 16 28 61
3605 61 87 93 81 114 80 95 35 0 -1 -81 -77 -102 -108 -98 -72 -71 -11 5 30 74 76 98 105 111 117 68 31 22 -36 -90 -74 -110 -78 -109 -116 -81
3641 -81 -51 -12 6 50 61 113 110 101 126 103 67 35 -29 -57 -62 -92 -113 -119 -103 -78 -71 -17 25 30 86 102 108 121 103 78 59 21 -26 -30
3675 -30 -67 -107 -95 -116 -86 -80 -97 -34 4 19 67 81 110 140 88 82 89 21 10 -13 -62 -70 -98 -125 -106 -84 -91 -46 -18 37 87 67 104
3708 104 94 110 114 64 59 47 -34 -60 -61 -129 -96 -107 -100 -77 -28 -31 16 49 61 119 95 101 112 63 71 22 -16 -49 -81 -73 -90 -87 -103 -43
3742 -43 -68 -21 17 19 79 107 135 107 93 89 48 43 -13 -9 -85 -61 -105 -133 -83 -57 -70 -15 -15 14 81 66 106 144 96 92 62 15 -25
3775 -25 -22 -74 -76 -96 -131 -100 -103 -58 -44 -13 38 38 101 96 122 97 102 73 47 24 15 -45 -76 -76 -101 -123 -109 -45 -51 3 40 59 56 117 105
3810 105 111 101 59 60 23 -23 -31 -64 -109 -81 -82 -107 -74 -84 -25 42 40 83 96 105 115 116 72 97 47 -34 -38 -79 -106 -95 -112 -117 -99 -108 -7
3845 -7 -9 18 69 89 134 144 104 113 92 29 12 -33 -80 -72 -94 -121 -120 -110 -85 -36 -29 29 116 82 113 104 110 135 68 55 45 -37 -40 -71 -89
3880 -89 -99 -127 -119 -81 -66 -45 28 74 95 114 98 114 128 70 92 -6 -35 -20 -75 -90 -90 -113 -121 -81 -85 -17 -9 45 68 88 89 137 125
3913 125 112 104 27 33 -14 -89 -73 -93 -103 -81 -98 -63 -26 30 62 77 110 130 118 101 114 76 52 39 -22 -61 -75 -82 -123 -96 -110
3944 -110 -86 -40 -55 12 72 78 121 96 122 105 80 73 27 -42 -72 -89 -86 -92 -116 -96 -75 -47 -18 16 33 79 121 95 117 105 63 88
3976 88 14 -30 -34 -65 -83 -95 -104 -112 -87 -84 -24 0 -4 99 81 91 111 102 91 108 15 -16 -29 -61 -107 -108 -121 -75 -86 -66 -16 -23 33 80
4010 80 67 80 122 108 106 98 30 35 -15 -85 -72 -117 -94 -90 -106 -50 -34 -12 38 61 88 94 104 91 99 71 45 21 -21 -44 -91 -119 -124 -124
4044 -124 -103 -56 -47 -7 20 45 83 126 115 124 99 58 72 21 3 -26 -59 -96 -109 -113 -93 -86 -81 -9 32 4 89 95 126 122 92 68 76 57
4078 57 13 -3 -43 -67 -75 -117 -110 -90 -63 -28 -27 25 71 79 122 112 105 124 55 58 36 -33 -44 -77 -91 -81 -90 -105 -68 -34 -33 37 52 93
4112 93 101 115 116 116 70 60 17 -10 -35 -21 -117 -102 -113 -108 -68 -65 -15 3 30 49 109 81 116 130 88 93 26 -8 5 -56 -47 -105 -97 -57
4146 -57 -79 -68 -45 3 40 80 77 96 115 87 95 56 32 -13 -1 -66 -83 -77 -93 -64 -100 -44 -19 -27 20 57 94 118 102 89 84 70 30
4179 30 42 -27 -48 -86 -90 -70 -73 -97 -93 -34 -11 41 28 56 132 110 74 112 75 31 15 -15 -46 -76 -115 -94 -104 -82 -93 -62 -4 20
4211 20 45 88 90 108 145 136 91 68 38 -27 -36 -48 -81 -83 -102 -90 -79 -70 -8 8 39 59 89 81 102 86 105 65 17 16 -23 -78 -56 -110
4245 -110 -104 -112 -120 -46 -27 -33 24 75 85 124 120 116 92 74 41 35 -12 -42 -95 -93 -97 -92 -66 -59 -59 -47 23 57 66 107 94 113 89 74 44 7
4281 7 -16 -39 -79 -117 -99 -119 -100 -89 -72 0 21 34 106 81 96 93 103 76 77 27 -17 -13 -85 -84 -90 -100 -85 -92 -66 15 -24 4 63 95
4315 95 83 119 89 88 64 50 12 -42 -72 -75 -86 -124 -78 -102 -65 -63 -10 5 68 71 106 100 104 105 61 70 34 -17 -33 -52 -94 -102 -89 -104 -59
4350 -59 -58 -30 7 50 78 73 98 97 92 72 33 14 -28 -63 -86 -83 -93 -120 -74 -69 -73 -30 3 12 55 89 76 66 84 91 51 29 24 -39 -76
4385 -76 -77 -91 -109 -57 -79 -65 -40 -13 35 62 75 120 89 89 83 75 25 -10 -60 -65 -61 -70 -80 -69 -113 -62 -49 3 39 35 73 90 71 84
4419 84 93 68 45 16 -49 -43 -56 -99 -73 -100 -81 -32 -36 -21 47 84 72 88 99 137 102 67 43 7 -8 -64 -67 -128 -95 -99 -82 -87 -48
4452 -48 -18 19 41 45 76 95 135 76 98 41 17 -5 -39 -54 -83 -72 -101 -62 -106 -61 -6 0 29 94 70 103 132 103 110 68 33 22
4484 22 -7 -61 -72 -114 -90 -85 -78 -34 -38 -49 34 65 78 105 107 108 76 78 47 24 -24 -59 -49 -98 -102 -102 -107 -58 -49 -13 43 42 71 102 111 101
4520 101 95 70 65 8 -17 -32 -47 -80 -62 -98 -95 -79 -56 -22 3 28 35 94 99 102 56 76 63 -4 -1 -41 -54 -58 -81 -97 -92 -75 -58 -1
4554 -1 -9 -4 65 77 88 95 72 77 51 41 -7 -5 -47 -72 -81 -99 -80 -68 -43 -36 -19 35 46 73 87 85 53 57 52 11 28 -14 -26 -72 -84 -92
4590 -92 -87 -95 -26 -48 -31 26 13 80 70 92 84 111 69 51 36 -20 -50 -82 -89 -69 -79 -69 -59 -55 -14 -9 31 69 41 100 114 94 63
4623 63 40 -5 25 -19 -68 -65 -85 -74 -60 -72 -50 -20 -21 39 73 74 81 84 67 85 40 24 -13 -48 -66 -63 -91 -68 -58 -72 -36 -21 -7
4656 -7 41 61 86 77 96 103 92 36 42 17 -39 -49 -37 -82 -82 -91 -51 -39 -24 -21 25 65 67 99 99 107 61 84 39 19 -27 -32 -75 -60 -70 -92
4692 -92 -81 -46 -36 -2 14 57 49 73 74 106 79 74 46 40 -25 -36 -58 -76 -63 -106 -94 -78 -40 -35 -6 19 53 98 92 66 95 79 53
4725 53 45 19 -23 -16 -57 -61 -77 -88 -22 -37 -41 24 24 43 81 96 47 97 53 51 53 1 -13 -36 -59 -43 -74 -74 -76 -74 -41 17 20 8 54 71
4761 71 68 82 64 71 77 -8 9 -4 -35 -60 -66 -91 -80 -54 -20 -33 10 17 67 40 80 91 68 99 41 -3 15 -18 -25 -49 -76 -36 -78
4794 -78 -48 -36 -32 7 23 29 43 73 76 77 73 28 37 9 -24 -38 -72 -66 -49 -66 -55 -28 -34 3 11 38 57 56 54 84 84 28 55 3 0 -35 -56
4831 -56 -92 -83 -70 -55 -38 -31 -20 40 42 63 73 79 60 47 58 52 23 -13 -53 -66 -63 -83 -75 -54 -68 -31 2 -8 41 68 68 77 70 49 53 34
4867 34 -6 9 -21 -40 -76 -75 -62 -52 -65 -68 -16 20 39 57 54 77 90 98 66 49 -6 -5 -41 -47 -93 -85 -61 -62 -35 -35 -16 14 54 27 56
4902 56 66 52 85 84 36 33 -25 -15 -25 -63 -85 -54 -71 -60 -58 -44 10 13 35 63 63 80 84 55 29 42 27 -6 -40 -44 -53 -52 -68 -79 -41
4937 -41 -47 13 11 15 80 61 56 107 63 66 45 9 25 -11 -62 -57 -70 -41 -83 -52 -26 -27 -1 41 32 66 62 70 77 76 46 35 -2 -21 -27 -51 -58
4974 -58 -83 -29 -56 -44 -23 0 37 37 44 31 67 78 62 57 17 30 -13 -17 -41 -46 -48 -58 -80 -54 -26 -22 21 35 41 43 68 70 41 18 34
5009 34 -16 -19 -13 -59 -51 -46 -54 -46 -68 6 12 7 24 32 46 64 32 57 35 19 4 -3 -21 -48 -33 -39 -70 -29 -25 -22 -30 -2 23 47 40 60 83 63
5047 63 59 24 18 -11 -32 -32 -52 -51 -50 -69 -40 -38 -16 40 36 45 46 65 52 75 64 55 27 14 -18 -30 -53 -68 -50 -43 -19 -30 -21 1 39 31 59
5084 59 79 53 58 69 37 21 0 -13 -29 -18 -64 -80 -72 -51 -42 -10 -18 19 35 53 27 36 44 65 30 24 21 -24 -48 -20 -67 -68 -46 -31 -36
5119 -36 -32 16 13 42 39 54 52 53 64 36 44 18 -5 -42 -21 -37 -45 -45 -42 -20 -10 12 -3 11 42 47 45 60 82 48 8 30 22 -24 -32 -49 -39
5156 -39 -64 -44 -38 -50 0 10 16 46 39 38 86 62 54 37 14 -9 -18 -43 -63 -52 -80 -56 -45 -44 -14 -24 -21 36 38 61 58 43 79 78 32 27
5192 27 28 -13 -51 -43 -40 -30 -48 -24 -15 -14 18 17 36 57 54 39 51 45 5 25 -26 -32 -30 -43 -35 -50 -41 -65 -5 -39 8 8 30 32 29 54 50 46 14
5231 14 28 0 -19 -28 -60 -38 -28 -58 -32 -31 -9 -4 9 33 16 23 57 29 44 8 -9 -24 5 -46 -13 -38 -73 -54 -43 -24 -3 -9 15
5264 15 38 -8 43 72 58 28 31 39 -19 -21 -33 -55 -63 -52 -28 -40 -36 16 -1 19 33 37 53 50 45 67 31 18 15 -1 -21 -30 -51 -78 -66
5299 -66 -44 -38 -17 -28 -5 49 20 44 47 50 56 69 48 20 7 33 -80 -45 -36 -68 -37 -40 -4 -27 22 1 52 30 68 100 49 42 15
5332 15 14 -6 -32 -25 -21 -55 -37 -76 -70 -39 -47 -17 30 60 51 44 69 46 59 39 25 24 6 -2 -26 -48 -33 -56 -50 -22 -5 -3 35 34 26 63 75
5369 75 55 71 46 30 23 -15 -1 -16 -45 -63 -40 -44 -33 -10 -16 20 11 34 47 28 32 42 54 0 26 -20 14 -8 -55 -19 -42 -57 11
5402 11 -30 -53 11 1 7 61 4 37 28 48 45 -16 3 4 -32 -50 -59 -38 -66 -29 -45 -31 -9 -41 18 21 32 75 28 30 38 -10 10 8 -12
5437 -12 -57 -51 -50 -34 -39 3 17 4 28 66 8 36 60 50 61 33 8 -9 -23 -12 -54 -31 -39 -54 -26 -49 -18 -7 22 19 26 21 37 45
5471 45 53 19 31 -13 -8 1 -16 -36 -25 -23 -15 -41 6 4 -19 49 50 28 26 56 57 32 27 28 15 -14 -27 -51 -45 -41 -55 -17 -30 -12 29 18 11
5508 11 11 53 11 51 38 16 -4 -5 -26 -34 -25 -57 -60 -50 -32 -12 -44 1 40 46 34 38 49 35 46 17 38 16 -28 -33 -34 -10 -39 -55 -43
5543 -43 -51 -17 -2 25 34 47 29 35 62 51 42 10 -7 16 -30 -25 -85 -19 -39 -30 -10 -18 -14 18 13 27 26 60 47 29 52 64 39 1 17
5578 17 -40 -5 -62 -47 -23 -28 -17 20 12 19 15 28 82 18 23 52 51 1 3 -34 -45 -32 -47 -70 -42 -16 -61 -13 -14 16 23 27 44 41 45 53 6
5615 6 13 7 7 -17 -29 -53 -53 -35 -46 -35 5 18 41 3 60 32 70 39 34 16 36 -11 -49 -5 -27 -32 -36 -41 -46 0 -36 18 9 11 23 14 34
5652 34 61 45 51 6 4 8 -26 -45 -42 -33 -43 -41 -13 -16 -17 0 25 41 70 68 50 20 30 11 -5 15 -34 -32 -23 -26 -6 -39 -26 -19 15 26 25
5689 25 50 54 68 42 50 30 0 19 0 -21 -31 -25 -18 -4 -36 -38 0 -27 11 29 33 29 50 56 22 4 29 8 15 3 -43 -28 -56 -40 -17
5724 -17 -16 -16 13 -24 35 27 28 27 34 43 41 36 -1 -1 -17 -10 -24 -32 -32 -24 -42 -20 -1 -2 -18 46 48 26 40 64 30 44 31 -18 9 -36 -25 -47
5762 -47 -32 -36 -47 -26 -13 -12 -13 -2 56 54 15 15 35 44 18 22 -28 -13 -5 -28 -26 -35 -73 -27 -26 4 16 31 30 21 61 40 51 35 42 9 54
5799 54 15 -4 -11 -58 -50 -39 -7 -40 -33 3 15 21 43 44 58 33 36 21 -4 -11 -13 -8 -27 -17 -43 -2 -39 -16 -8 -2 0 24 58 37 39 32 47
5836 47 32 12 -2 -14 -22 -45 -25 -33 -36 -44 -30 -18 -23 30 35 31 -15 20 39 45 19 28 21 -19 -5 -43 -47 -39 -64 -28 -32 -27 -20 -1 44 38 46 48 41 36
5876 36 15 2 48 15 36 7 -16 -14 -48 -19 -25 -30 -21 -6 5 30 43 37 22 56 49 29 -2 -9 -7 -3 -25 -25 -5 -22 -24 -45 23 16 -6 35
5912 35 31 28 54 69 48 34 17 3 -18 -44 -21 -37 -11 -42 -11 -26 -15 5 -16 46 25 33 40 41 26 16 14 -7 -29 -29 -14 -42 -24 -23
5946 -23 -34 -1 -27 -16 8 24 18 16 25 35 30 37 66 20 9 -7 -13 -52 -26 -22 -31 -1 -9 -7 25 39 16 68 24 13 51 17 37 16 -13
5981 -13 4 -12 -49 -39 -44 -37 -43 -10 3 2 1 26 17 44 57 48 39 21 25 1 -12 8 9 0 -37 -2 -29 -31 -16 -6 -6 2 41 7 52 37 38 47
6019 47 11 26 -11 -18 -1 -21 -43 -25 -47 -22 -12 6 8 26 40 33 43 60 68 34 40 43 9 4 13 -28 -19 -11 -27 -14 -4 9 11 4 23 28 27
6056 27 23 41 11 18 16 15 16 -69 -14 -37 -10 -13 5 -42 4 -14 25 36 28 41 63 58 33 32 8 6 -3 -35 -5 -37 -7 -7 -4 -6 21 -8 26
6093 26 35 32 28 43 27 23 38 23 24 0 5 -48 -39 -25 -3 -42 -3 -34 -11 18 20 18 39 8 12 50 16 17 -11 -6 16 -2 0 -19 -14 -11 -7 -27
6131 -27 -11 -40 20 10 31 40 18 40 47 17 37 16 15 -4 -50 -38 -40 -19 -13 -8 -7 -3 8 -18 48 32 16 23 31 27 7 21 1 -8 -21 -27 -26
6168 -26 -6 -20 -23 -10 -11 -12 12 6 46 42 43 7 35 -7 2 -3 -13 -49 -42 -31 -38 -35 -17 -11 1 15 -21 0 9 46 40 27 16 9 29 -13 10 -19
6206 -19 -32 -17 -24 -41 -17 5 27 -12 -2 26 39 -1 36 42 37 38 10 14 -23 -9 -31 -20 -36 -19 -38 -24 -7 4 10 31 -1 11 17 18
6240 18 29 3 28 3 -4 18 -17 -17 -18 18 -24 -16 -24 -16 19 40 33 42 18 7 12 11 27 9 -12 -11 -40 -30 -29 -20 -37 -5 -10 0 -14 5 10 6
6278 6 22 29 27 -3 10 -13 -25 -6 -9 -45 1 -27 0 -14 -28 13 -19 33 30 23 29 43 38 61 -8 0 -9 -19 -16 -26 -35 11 -24 -23 -7 -19 6
6315 6 18 34 28 26 37 23 -6 34 14 23 9 -8 -2 -24 -46 -13 -14 1 2 27 4 11 5 44 31 22 10 16 21 20 -24 -18 -1 -16 -24 -34 -46 -3
6353 -3 -9 6 25 17 8 20 26 14 34 14 -7 1 -7 -12 -28 -31 -17 -27 -8 -14 29 5 -5 13 41 38 47 41 34 30 9 -5 0 44 -39 -5 -23 -17 -1
6392 -1 -11 -37 -39 0 -5 6 24 27 29 44 0 21 23 -9 -19 -20 -15 -27 -4 -17 -18 -3 4 8 1 0 13 39 41 27 37 8 33 16 14 7 -33 -17
6430 -17 -36 -42 10 -12 -5 19 -14 -5 20 14 24 41 2 11 -3 -4 18 -3 -17 -23 -20 -27 -26 -10 -26 0 12 -18 0 36 23 14 23 39 3 13
6466 13 -4 8 -3 -6 -8 -15 -13 -18 -22 4 -22 -14 15 19 28 9 22 26 34 19 19 1 -9 -44 2 28 4 -21 -9 -2 23 10 2 9 47 36 23 3
6504 3 26 13 14 8 -16 7 5 -24 15 6 15 -4 -22 2 18 29 18 15 28 17 7 42 3 7 4 40 -9 7 -20 -12 -5 -25 -4 -19 30 20
6540 20 23 -4 30 37 0 11 -1 21 1 -21 -22 -23 -16 -40 14 0 -14 -2 46 4 50 14 -7 33 38 1 10 0 -20 3 -11 -7 -13 -32 -24
6575 -24 -6 -5 -23 17 12 -5 9 21 24 12 -11 10 3 10 -8 -4 10 -25 -10 -27 2 -9 18 -10 22 26 19 15 13 21 33 4 -2 21 -11 9
6611 9 -6 13 9 -2 -21 -2 7 12 -1 17 21 30 -2 -38 11 8 42 23 22 0 7 17 -26 -5 11 33 -2 14 8 -4 -15 19 15 17 14 13 3
6648 3 4 19 -13 -11 -13 -2 10 24 5 -5 10 28 -11 12 6 23 -1 21 14 45 6 -27 -9 -5 -9 -9 2 4 8 -21 3 6 18 -1 11 3 48
6685 48 0 6 33 -12 1 -9 41 -8 -16 11 -2 -3 -7 -30 34 -12 9 4 14 -14 39 10 4 28 12 -24 -15 27 15 15 -18 -4 4 -1 -1 -10
6721 -10 11 2 18 22 3 18 36 25 -7 6 -28 -2 -12 -16 -13 -6 3 -5 -2 7 -6 13 -12 10 34 23 7 -4 15 12 -13 3 1 13 -1 20
6757 20 -1 15 10 -7 -2 -2 30 15 -3 18 20 20 -5 -4 2 9 19 22 39 -11 3 1 -9 15 -6 11 37 20 24 -16 11 -9 -18 21 11 17 1
6794 1 -2 4 -7 9 -2 -6 -7 23 10 33 12 8 22 16 -6 14 3 -3 16 -9 22 -7 6 -6 -2 -9 1 -17 -17 -7 1 -10 -3 8 18 21 1
6831 1 27 18 26 11 -19 28 3 -14 -5 -2 0 2 11 24 -13 15 25 6 -8 -11 -4 4 33 7 15 -3 3 37 -5 -6 0 -8 0 -3 13 -22 -8 -7 -3 8
6871 8 -16 -24 30 -8 -7 15 -5 0 -29 0 3 9 10 -17 13 12 -6 9 -7 -15 7 9 -8 5 34 27 3 -6 -7 -5 -52 -12 -20 5 4 -13 1 -6 3
6910 3 -24 -12 41 -7 15 5 -4 24 31 8 14 -20 -6 29 -2 -3 0 -3 20 3 -22 4 -5 -8 -5 18 -4 5 35 -10 2 12 -2 6 6 -10 8
6947 8 22 3 -11 11 -24 4 6 20 30 -13 6 9 1 -17 27 28 -21 -9 -9 -7 1 -13 17 35 -38 -10 37 21 -1 7 -8 19 1 -7 -2 16
6983 16 -15 5 -20 1 7 -12 -17 -35 13 -5 8 5 -19 10 39 -31 12 1 26 13 -9 -12 -17 16 -5 17 -2 3 20 30 27 -3 8 -25
7017 -25 30 7 27 12 9 19 1 -9 -7 13 -25 -23 -19 2 -19 9 39 16 -5 22 16 0 37 22 -23 5 -36 -10 2 -12 12 6 0 7
7051 7 -5 25 2 32 23 46 25 31 16 32 30 28 29 11 -28 3 11 -19 -6 2 24 19 27 7 27 5 16 7 4 2 16 -25 3 8 25 -3 -4 -16
7089 -16 -13 -3 17 8 4 14 22 16 21 14 43 43 15 12 -7 16 -19 8 -33 4 -6 1 2 39 5 6 -9 9 -5 18 46 27 40 -1 20 -16
7125 -16 15 -9 -4 17 15 -1 11 -16 10 25 47 3 -7 18 31 27 1 32 20 8 -4 -10 -15 14 -20 -6 3 -18 13 46 15 25 21 1
7159 1 -1 25 -15 1 7 13 8 0 1 -40 -12 -8 -25 6 -19 9 20 -5 18 -13 23 -2 -1 9 29 31 6 5 7 21 -41 -8 23 -4 24 23 26
7196 26 32 23 7 15 32 18 25 -4 8 11 4 -18 4 -14 -23 1 -21 -15 -2 9 34 12 17 24 25 23 41 -7 3 -18 7 -15 -7 14 -42 -7 -15
7233 -15 -6 -12 16 15 40 34 39 15 12 17 26 3 -12 -27 -15 15 -16 -22 -17 -8 -13 16 -36 -1 14 21 9 21 -1 -18 14 -4 1 -9 0 -17 -19 -28 -36
7272 -36 -4 -12 -10 -5 2 -24 -10 20 28 25 -4 38 19 14 9 10 -31 -46 -25 -25 -47 -22 -17 9 -12 -19 2 12 40 19 42 36 35 14 23 -25 -7 -9
7310 -9 -26 -36 -28 11 -9 -22 14 29 20 4 30 38 44 0 28 -6 -1 -4 -4 7 -15 -30 -23 -9 -31 -1 -7 3 26 5 -1 20 23 23 10 17 -3
7347 -3 8 7 1 -23 -26 9 -9 -10 -13 7 27 21 11 24 25 11 32 9 14 -24 0 17 -5 -5 11 -6 -28 3 -4 23 10 17 22 12 19 16 39 21
7385 21 3 -1 -1 -5 -20 10 1 -14 -17 -25 -6 17 25 -1 23 38 25 25 18 26 17 -10 -6 0 -9 -13 -2 -37 1 -16 -35 10 -7 22 24 16 43 23 14
7424 14 34 39 21 18 28 -18 15 -15 3 -17 9 -9 0 -6 7 2 6 44 27 67 9 8 16 -4 -14 2 -25 -34 0 -13 -13 -44 -27 -15 17
7459 17 8 -6 32 14 13 29 3 -10 10 -13 -7 -25 -26 -14 -14 -27 -36 4 3 -2 -10 -2 28 -16 11 8 30 33 5 -11 -16 -29 -5 6 -9 -37 -20
7496 -20 -28 -1 -14 -6 21 -14 29 45 42 33 38 5 15 -23 9 -10 -5 3 -3 -8 3 -16 -1 19 29 3 2 9 19 27 31 1 37 -18 -9 2 -32
7533 -32 -38 -25 -12 -10 -20 3 7 -5 -3 12 21 15 -5 12 22 10 -7 -10 -5 -15 -18 -23 -43 -23 19 3 10 -6 14 8 45 27 28 24 25 26 28 -5 -2
7572 -2 10 -12 -41 -4 -1 -10 -13 -13 8 -4 33 36 43 38 14 1 49 1 3 -16 1 -12 -9 1 -7 -20 5 1 16 23 39 54 40 19 49 42 24
7609 24 34 13 24 -28 -4 -29 -32 -16 -5 -1 -15 4 -8 1 -6 7 63 45 -10 15 10 -8 -2 -17 -11 -32 -8 -17 -21 -5 -14 40 -4 33 4
7644 4 17 10 24 9 16 19 -4 7 -8 -23 -3 -18 -21 -14 -4 -7 -19 -3 39 28 9 36 33 28 21 11 -7 -5 -16 -17 -13 -10 -3 -15 -33 -19 -8 15
7682 15 8 46 32 40 26 25 34 6 3 -6 -14 -16 -10 5 -11 4 8 6 -35 -6 15 -1 37 26 17 6 3 26 4 -4 -19 6 -20 -32 -11 -31 -39 -9
7720 -9 -5 -11 2 15 23 38 51 41 -3 17 28 11 14 -26 -14 -20 -16 -22 2 -35 -11 -11 24 17 35 4 45 26 35 27 11 -1 5 4 -10 -32 -42
7757 -42 -2 -23 -19 -48 -18 25 15 2 25 44 8 32 27 11 8 -1 23 -18 -20 -14 -20 -27 14 -15 -20 16 -6 -13 11 27 21 18 23 35 3 8 -30
7794 -30 -16 -11 -47 -42 -21 -39 -26 -13 -3 -12 9 41 7 59 14 -6 39 10 -24 19 -3 -8 -30 -33 19 3 -29 -18 -10 40 27 10 55
7827 55 39 23 38 37 -13 -3 -4 -10 -35 -25 -15 -18 -33 -37 1 -1 3 -10 10 20 19 15 20 2 45 29 -15 -5 0 1 -31 -39 5 0 -4 -12 -3 34 43
7866 43 33 40 39 42 25 39 18 10 4 -7 13 -27 -8 -7 -23 -25 3 8 0 5 21 2 23 19 9 16 22 -10 6 -2 -7 -7 -18 -15 -17 -32 -27 -3 6 25
7906 25 9 37 35 40 51 -5 35 30 12 11 -34 -34 -20 -4 -12 -24 -22 -4 25 -2 14 39 22 39 36 56 57 25 10 -13 -18 -12 -20 -27 -16 -20 -14 3
7944 3 0 17 10 56 11 50 2 37 9 12 8 20 -8 -46 -21 -21 -14 -26 -45 -37 -7 -17 18 27 39 14 34 36 -6 11 2 19 -1 -3 15 -38
7980 -38 -16 -31 -25 -8 -22 11 37 44 27 33 50 22 24 2 0 -5 -6 -37 13 -23 -30 -16 -25 -22 -24 5 21 22 14 24 39 42 10 20 6 -2 11 5
8018 5 -23 -35 -17 -6 -1 -32 -1 -28 12 28 44 19 10 -4 4 36 -20 18 5 -3 -31 11 -23 -45 22 -33 -9 12 10 12 5 19 20 28 59
8053 59 37 13 -13 -7 -20 -8 -62 -55 -4 -6 -14 -24 -3 1 12 18 8 38 30 -5 33 9 5 -20 -10 -14 -30 -26 -11 -30 -34 -34 3 -18 -13 31 13
8090 13 13 24 28 2 23 -18 -29 -12 -32 -36 10 -19 -51 -28 -49 -7 1 24 27 18 45 23 54 27 21 49 2 14 -39 -38 -28 -27 -8 -48 14
8125 14 9 -6 3 38 29 29 36 25 18 12 36 -3 -13 -5 -12 -20 -6 -37 -2 16 3 -43 -5 0 8 11 31 36 4 35 10 12 -10 -25 -31 -11 -15 -36 -28
8164 -28 -23 -15 -17 32 -15 38 21 2 15 9 -7 39 -5 9 -1 2 -49 -31 -30 -32 -25 -29 -8 25 0 12 28
8191B8
##END NTUPLES=NMR FID
##END=
