##TITLE=1H_Pr Bzl-Dep-D
 200.13MHz, DMSO,
 8 sc
 
 6.8.2025
##JCAMPDX= 6.0         $$ Bruker NMR JCAMP-DX V2.0
##DATA TYPE= NMR FID
##DATA CLASS= NTUPLES
##ORIGIN= UXNMR, Bruker Analytische Messtechnik GmbH
##OWNER= pz
$$ XWIN-NMR		Version 3.5
$$ Wed Aug  6 15:38:28 2025 Russian Standard Time (UT+4h)  she@DPX200
##.OBSERVE FREQUENCY= 200.1313
##.OBSERVE NUCLEUS= ^1H
##.DELAY= (6, 6)
##.ACQUISITION MODE= SIMULTANEOUS
##.ACQUISITION SCHEME= undefined
##.AVERAGES= 8
##.DIGITISER RES= 18
##SPECTROMETER/DATA SYSTEM= spect
##.PULSE SEQUENCE= zg30
##.SOLVENT NAME= DMSO
##.SHIFT REFERENCE= (INTERNAL, DMSO, 0, 14.3821)
##AUDIT TRAIL= $$ (NUMBER, WHEN, WHO, WHERE, WHAT)
$$ ##TITLE= Audit trail, XWIN-NMR		Version 3.5
$$ ##JCAMPDX= 5.01
$$ ##ORIGIN= Bruker BioSpin GmbH
$$ ##OWNER= she
$$ F:/spectra/data/she/nmr/H-C/1/audita.txt
$$ ##AUDIT TRAIL=  $$ (NUMBER, WHEN, WHO, WHERE, WHAT)
(   1,<2025-08-06 15:37:16.90 +0400>,<she>,<DPX200>,
      <created by zg, POWCHK disabled, PULCHK disabled
       configuration hash MD5:
       00 E9 B6 7A A2 85 ED C7 34 08 36 98 17 FE 4E 26
       data hash MD5: 16K
       32 00 E4 6C 99 6E 99 E7 FB 35 6E 22 1A 31 DA 55>)
$$ ##END=
$$ 
$$ hash MD5
$$ C4 83 0D A8 31 37 E8 2F 93 9A 03 E6 B2 3A B8 8A
##$RELAX= 
##$RELAX= 
##$RELAX= 
##$RELAX= 
##$RELAX= 
##$RELAX= 
$$ Bruker specific parameters
$$ --------------------------
##$DU= <F:/spectra>
##$EXPNO= 1
##$NAME= <H-C>
##$PROCNO= 1
##$TYPE= <nmr>
##$USER= <she>
##$AMP= (0..31)
100 100 100 100 100 100 100 100 100 100 100 100 100 100 100 100 100 100 
100 100 100 100 100 100 100 100 100 100 100 100 100 100 
##$AQSEQ= 0
##$AQ_mod= 1
##$AUNM= <au_zg>
##$AUTOPOS= <>
##$BF1= 200.13
##$BF2= 200.13
##$BF3= 200.13
##$BF4= 200.13
##$BF5= 200.13
##$BF6= 200.13
##$BF7= 200.13
##$BF8= 200.13
##$BYTORDA= 1
##$CFDGTYP= 0
##$CFRGTYP= 5
##$CHEMSTR= <none>
##$CNST= (0..31)
1 1 145 1 1 1 1 1 1 1 1 1 1 1 1 1 1 1 1 1 1 1 1 1 1 1 1 1 1 1 1 1 
##$CPDPRG= <>
##$CPDPRG1= <>
##$CPDPRG2= <>
##$CPDPRG3= <>
##$CPDPRG4= <mlev>
##$CPDPRG5= <mlev>
##$CPDPRG6= <mlev>
##$CPDPRG7= <mlev>
##$CPDPRG8= <mlev>
##$CPDPRGB= <>
##$CPDPRGT= <>
##$D= (0..31)
0 0.7 0 0 0 0 0 0 0 0 0 0.03 0 0 0 0 0 0 0 0 0 0 0 0 0 0 0 0 0 0 0 0 
##$DATE= 1754480236
##$DBL= (0..7)
120 120 120 120 120 120 120 120 
##$DBP= (0..7)
150 150 150 150 150 150 150 150 
##$DBP07= 0
##$DBPNAM0= <>
##$DBPNAM1= <>
##$DBPNAM2= <>
##$DBPNAM3= <>
##$DBPNAM4= <>
##$DBPNAM5= <>
##$DBPNAM6= <>
##$DBPNAM7= <>
##$DBPOAL= (0..7)
0.5 0.5 0.5 0.5 0.5 0.5 0.5 0.5 
##$DBPOFFS= (0..7)
0 0 0 0 0 0 0 0 
##$DE= 6
##$DECBNUC= <off>
##$DECIM= 32
##$DECNUC= <off>
##$DECSTAT= 4
##$DIGMOD= 1
##$DIGTYP= 9
##$DL= (0..7)
0 120 120 120 120 120 120 120 
##$DP= (0..7)
150 150 150 150 150 150 150 150 
##$DP07= 0
##$DPNAME0= <>
##$DPNAME1= <>
##$DPNAME2= <>
##$DPNAME3= <>
##$DPNAME4= <>
##$DPNAME5= <>
##$DPNAME6= <>
##$DPNAME7= <>
##$DPOAL= (0..7)
0.5 0.5 0.5 0.5 0.5 0.5 0.5 0.5 
##$DPOFFS= (0..7)
0 0 0 0 0 0 0 0 
##$DQDMODE= 0
##$DR= 18
##$DS= 0
##$DSLIST= <SSSSSSSSSSSSSSS>
$$ [...]
##$SUBNAM0= <"">
##$SUBNAM1= <"">
##$SUBNAM2= <"">
##$SUBNAM3= <"">
##$SUBNAM4= <"">
##$SUBNAM5= <"">
##$SUBNAM6= <"">
##$SUBNAM7= <"">
##$SUBNAM8= <"">
##$SUBNAM9= <"">
##$SW= 18.0517328524113
##$SWIBOX= (0..15)
0 0 2 0 0 0 0 0 0 0 0 0 0 0 0 0 
##$SW_h= 3612.71676300578
##$TD= 16384
##$TD0= 1
##$TE= 0
##$TE2= 300
##$TE3= 300
##$TEG= 300
##$TL= (0..7)
0 120 120 120 120 120 120 120 
##$TP= (0..7)
150 150 150 150 150 150 150 150 
##$TP07= 0
##$TPNAME0= <>
##$TPNAME1= <>
##$TPNAME2= <>
##$TPNAME3= <>
##$TPNAME4= <>
##$TPNAME5= <>
##$TPNAME6= <>
##$TPNAME7= <>
##$TPOAL= (0..7)
0.5 0.5 0.5 0.5 0.5 0.5 0.5 0.5 
##$TPOFFS= (0..7)
0 0 0 0 0 0 0 0 
##$TUNHIN= 0
##$TUNHOUT= 0
##$TUNXOUT= 0
##$USERA1= <user>
##$USERA2= <user>
##$USERA3= <user>
##$USERA4= <user>
##$USERA5= <user>
##$V9= 5
##$VALIST= <valist>
##$VCLIST= <CCCCCCCCCCCCCCC>
##$VD= 0
##$VDLIST= <DDDDDDDDDDDDDDD>
##$VPLIST= <PPPPPPPPPPPPPPP>
##$VTLIST= <TTTTTTTTTTTTTTT>
##$WBST= 1024
##$WBSW= 4
##$XGAIN= (0..3)
0 0 0 0 
##$XL= 0
##$YL= 0
##$YMAX_a= 661806
##$YMIN_a= -767769
##$ZGOPTNS= <>
##$ZL1= 120
##$ZL2= 120
##$ZL3= 120
##$ZL4= 120
##$ABSF1= 10
##$ABSF2= 0
##$ABSG= 5
##$ABSL= 3
##$ALPHA= 0
##$AQORDER= 0
##$ASSFAC= 0
##$ASSFACI= 0
##$ASSFACX= 0
##$ASSWID= 0
##$AUNMP= <proc_1d>
##$AZFE= 0.1
##$AZFW= 0.1
##$BCFW= 1
##$BC_mod= 2
##$BYTORDP= 1
##$COROFFS= 0
##$CY= -3
##$DATMOD= 1
##$DC= 2
##$DFILT= <>
##$DTYPP= 0
##$F1P= 0
##$F2P= 0
##$FCOR= 0.5
##$FTSIZE= 0
##$FT_mod= 4
##$GAMMA= 1
##$GB= 0.15
##$INTBC= 1
##$INTSCL= 1
##$ISEN= 128
##$LB= 0.25
##$LEV0= 0
##$LPBIN= 0
##$MAXI= 10000
##$MC2= 0
##$MEAN= 0
##$ME_mod= 0
##$MI= 1.114404
##$NCOEF= 0
##$NC_proc= 0
##$NLEV= 6
##$NOISF1= 3.799351
##$NOISF2= 2.8
##$NSP= 1
##$NTH_PI= 0
##$NZP= 0
##$OFFSET= 14.38212
##$PC= 1
##$PHC0= -1198.545
##$PHC1= 9.1923
##$PH_mod= 1
##$PKNL= yes
##$PPARMOD= 0
##$PSCAL= 0
##$PSIGN= 0
##$REVERSE= no
##$SF= 200.129724274929
##$SI= 16384
##$SIGF1= 3
##$SIGF2= 2
##$SINO= 400
##$SIOLD= 16384
##$SREGLST= <1H.CDCl3>
##$SSB= 0
##$STSI= 0
##$STSR= 0
##$SW_p= 3205.1282051282
##$SYMM= 0
##$S_DEV= 0
##$TDeff= 0
##$TDoff= 0
##$TI= <>
##$TILT= no
##$TM1= 0
##$TM2= 0
##$TOPLEV= 0
##$USERP1= <user>
##$USERP2= <user>
##$USERP3= <user>
##$USERP4= <user>
##$USERP5= <user>
##$WDW= 1
##$XDIM= 8192
##$YMAX_p= 0
##$YMIN_p= 0
$$ End of Bruker specific parameters
$$ ---------------------------------
##NTUPLES= NMR FID
##VAR_NAME=  TIME,          FID/REAL,        FID/IMAG
##SYMBOL=    X,             R,               I
##VAR_TYPE=  INDEPENDENT,   DEPENDENT,       DEPENDENT
##VAR_FORM=  AFFN,          ASDF,            ASDF
##VAR_DIM=   8192,          8192,            8192
##UNITS=     SECONDS,       ARBITRARY UNITS, ARBITRARY UNITS
##FACTOR=    0.0002768,     1,               1
##FIRST=     0,             0,               0
##LAST=      2.2672688,     0,               0
##MIN=       0,             -767769,         0
##MAX=       2.2672688,     661806,          0
$$ Real data points
##PAGE= N=1
##DATA TABLE= (X++(R..R)), XYDATA
$$ [...]
1828B02m7m21L05p4j86L80j89K72n44N09k67n6J47K07k84j20J34Q5n1p8N9j85
1850b02K74n2J00k66j90N70k82j6L2L0M9k64J16j9R4j33k6J71j67K0J80k14K36
1873D1J67m38L35M1LQ1l78R7K01m45Q4RJ24k35J70O9K17j77O7j97K28l00M43p8
1897A29l42K14J47q6p1j64J78K3J55k97K5J70l77M3j04M94j83L1K33j41N9k02
1919f6J16m9K6k98K05n4P8R2p7k21J22J25j62J57J91q0k60M49N8l07kJ30K22j21
1943B74k64p1p7R0n4N4R2k07p6K51q4K57N4j10k97K17r3J40j16J63r6o6k32J44
1967a07pJ30L9mj62o4Q7J52r6K10k39n6q4J16J91k2K38j65L3k72N1M1j20K40j37
1992gP5j2l46K86k75J96k60L49K27k19j09J42k96M06J29k50J50J30l83L65n61
$$ y = [202, 155, -266, 39, -35, -221, 159, -30, 242, -302, 207, -60, -116, 31, 238, -46, -166, -32, 53, 2, -76, -17, -202, 72, 20, 120, -146, -336, 234, -48, -64, -32, -2, 47, -217, -101, -120, -26, -159, -185, -14, -181, -161, 19, -195, 41, 208, -230, 105, 146, 149, 230, -148, -51, 150, -295, -211, -202, -78, -313, -143, -74, 143, -34, 33, -164, 64, -236, 207, 129, -213, 1, 148, 62, -9, -173, 5, 28, 183, -114, -89, 81, -296, -253, -357, 137, -46, -15, 218, 77, 136, -66, 50, 1, 27, -271, -66, -120, -42, 50, -27, -248, -126, -1, -163, -6, 185, 105, -155, 294, 352, 45, 43, 173, 395, 274, 10, -61, -138, -48, -102, -48, 44, -163, -239, 12, -72, 185, 239, 129, -168, 49, -44, 96, -20, 143, 47, -19, -251, -107, -114, 16, 55, 51, -111, -175, -88, 64, -32, 178, -61, -117, -201, -85, 106, 84, 322, 157, 190, -82, -31, 10, -110, 130, -7, 68, 56, -290, -4, -279, -83, -343, 6, 233, 14, -95, 47, -249, 157, 286, 36, 186, 316, -67, 298, -263]
2013b63M13p7k07p5l4J95k24K14J06r7j27J2L38j38J52J1q6J98l41O7J61j10k77
2036a89J00K16j70J53j70R7j51J1J40j98M97l29k28R8J85J8j31J19j3k7J44j76
2058dJ08j8j51J23j75k26J36J87N5j08K4K75j11p3l2m8J00j84M30k14J16j50r2
2081c2k77J45K96q0L5k81J18J50O9l16K67N3p0L3j6R0j09j01N5J9j12J01M4L6
2105A17k27M9K6k35R2%M3K85j21L32m24K62r7k0M1o0j85J98k1j02M0J07j15O5
2129E0j67j15J22j32J68J09j26J71k3J7j87P7P2J65j39j2j67K23m21J27Q0j20
2151b28K72pk78L14K72j72k28K55m24J90J20p4ro1R4k18mK22J18l34K05m7J68
2174A46k89K47l73M44m00L24R5j56l2p8J83k08J62P2L4Qp9l29J02K4p1K39N0k02
$$ y = [-263, 150, 73, -134, -209, -243, -48, -272, -58, 48, -49, -176, -164, 174, 36, 188, 199, 113, 311, -30, 37, 198, 88, -189, -89, 127, -43, 110, -60, 37, -114, -103, 37, -161, 336, 7, -221, -123, 62, 80, -51, 68, 55, 28, 172, -4, 104, 86, -65, 58, -117, -343, -207, -20, 35, -73, -49, 226, 115, 42, 10, -38, 62, -122, 308, 94, 210, 60, -32, -309, -164, 132, 52, 87, -194, -76, 74, 143, -173, 94, 147, 77, 110, 94, 184, 75, -26, 29, 48, -64, 37, 81, 117, -110, -61, -35, -270, -178, -178, -135, 150, 29, 361, -63, 199, 102, 82, 123, 63, -122, 76, 55, -47, -7, 100, -15, 50, -117, -232, -110, -242, -74, 35, -91, 80, 57, 74, -113, -36, 36, 201, 62, 50, -117, 106, -315, -188, -108, -228, 44, 37, -241, 73, 345, 173, -55, 200, -224, -34, 86, 12, 3, -58, 36, -182, -186, 36, 154, -180, 25, -22, 146, -143, 104, -269, 175, -225, 99, 194, 38, 6, -72, 111, -97, 65, 137, 171, 179, 100, -229, -127, -103, -174, 65, 115, -87]
2198h7k89L10J5Q0o4m0J69j32j28L18Mj47J52j70l2r3L50K0l40Q9j63L61j81j91
2222a89L22l4k86M06j66L1j58K56j72R2p6J30j80lP5j63j94K24M1j2J7k28K25
2245d2n5J95O7l23L03O3J52l56R0O2mN2j88Q9J8J82m56K66l44K60j0j00J0j3M29
2270C47l20L4j55Q6j33R6J15j42m2L26m70K66j77K16j54R1q4R0j93J25N8n7kJ43
2294F4j39j37M09J85j16l75J11L13l31J51j5j97L08k08O9J11j37Kj54J05k11M6
2316a46M7O6J99M9k90k3K28L9j05k43K46k80J88r2N6L02k28q9K26r5n6N5J88O5
2340C07n32K47o3J88p6O2J84m54J04J4j09J53Ko6J20O9n07J32K36j46L46j63J52
2363B00k36k38K73j31J47J74j45N5n6r1K76m47L46o1j16R0L2o9J55k18J25j13
$$ y = [-87, -376, -66, -51, 29, -35, -75, 94, -38, -166, 152, 156, 9, 161, -9, -41, -134, 216, 236, -104, -15, -178, 183, 2, -189, 133, 99, -187, 219, 53, 84, -74, 182, 10, 102, 26, 156, -24, -27, 48, -115, -309, -85, -44, -56, -39, -267, -42, -97, 98, 165, -158, 145, 208, 360, 4, 94, 156, 152, 204, 16, 105, 123, 305, -151, 115, -229, 31, 21, -79, -69, -82, 347, 27, 61, -94, -8, -141, -45, 70, -72, -114, 212, -258, 8, -169, 47, -107, -16, -100, -10, -203, -78, -20, -77, -79, 64, -75, -212, 197, 382, 266, -109, 2, 315, -16, 135, 120, -77, 231, 23, 92, 203, 66, 68, -86, 19, -192, -146, -99, -33, 166, 215, -75, -98, 130, 169, 64, -179, 67, -213, -25, -117, -61, 241, 13, -76, 150, 55, -1, 54, 242, 307, -225, 22, -41, 147, 71, 133, 317, -137, -33, -19, -128, 25, 27, -39, 81, 150, -357, -225, 11, -135, 211, 48, 200, -36, -274, -1, -132, 15, 189, 44, 99, 43, -48, 228, -219, 127, 66, -50, 40, 72, 3, 158, -60, 65, -48]
2385d8L9K39m54K89j11J40j86J83p4Kj46K60j87kK77n45Q9J53K24j90n8J97j13
2408b2k7j21P7L08o2N5k72L44o1r3K70l40j52J9j30q2M32j36O1k1k16J78K6r3
2432e8Q8K23j94k94j91K71J83p4N1j0Q7k92L49j89m4J47P5J49l23P0l3J29k03
2455h3J25j2mQ3m47L69j75J03J2j0P8K77k91l11K46K46j16j16j4J97p0j92L26
2478B21j79nl4o0J36j51J39k36j68M17r3l8K82l83J06k3P9j25k60L74M9J2Q5k35
2502i0o0L28j09p3l4Ok58L43j18KR9Q4k19J67R6l29K19K64p6l74L49p8j63o3K41
2527A54J22k31k4J9j38J8j9J03R7j37J90k20M95l81m2k4J63k76K37J77j76K16
2549C23j97j2n05J90K00j71J05O6k20M18l24k36K08K68J80j68K16m55r7O1k36
$$ y = [-48, -9, 230, -224, 65, -46, 94, -92, 91, 17, 19, -127, 133, -54, -56, 221, -324, -235, -82, 142, -48, -106, 91, -22, -49, -170, -93, 215, 153, 208, -64, 280, 219, 126, 396, 56, -96, -77, -207, -289, 143, 7, 68, 47, -169, 9, 35, -58, 30, 253, 59, -235, -426, -155, 28, -46, 5, -5, 82, -210, 139, -50, -94, 53, 128, 277, -46, 24, -9, 120, -83, 42, 30, 26, 109, -338, 31, -144, -41, -29, -39, 39, 316, 25, -286, -40, 206, 90, -26, -40, 157, 87, -105, 221, 42, 37, 3, -57, 79, -72, 67, -169, -337, 80, -13, -51, 231, -152, -46, -69, 10, -115, -375, -1, 48, 60, 145, -90, -150, 178, 69, -4, -38, -32, -290, 53, -65, -63, 36, 120, -99, 68, 164, -165, 54, 318, 242, -132, 217, 139, -24, -87, 154, 276, 45, 21, 40, -98, -80, -99, 4, 101, -36, 154, -66, 429, 48, 6, -18, 145, -131, 106, 283, 107, 323, 126, 114, -391, -201, -1, -172, -67, -1, -221, 197, -127, -363, -155, 113, 293, 125, 341, -114, -211, -150, -386]
2570c86L04J11J74n45M63k35J28j29n3J30j50j28K50J12k80M19j33k18J85J41
2590A60j42K62k78J0k33LR7K32K35j75Q1m03K76k45J06J6N6M2j14J72j11QJ83
2613B38k92r7J22j23J73k7j13J31k9K2O5l17J76M1j47j68J66K46k71L07L49m58
2635fJ71j65M8M7m6j7K65k05j71P0J54p6k19J59l4j24j27K21j17P7J86j59J07
2658C9R8k78J30K6j2K51k75QK10k90P8J37K0j51l5R1m10L25m1P7N9k28J44J10
2682H3j53%K81j84K73l95M5r2J07K12j69okj70q8L62r6j94L76k7k37O0Q3KJ20
2707A91l00lk3j31M73j92p5K9k1p4M6J29o5p1j84K05P1k7K69N7k10j51nK10o5
2732H3j31L8J25k69J3K41j35o1L1n5M9R4m6O5p6K56m95L96o9l17j4m2M27j18M63
$$ y = [-386, -82, 29, 203, -342, 121, -114, 14, -115, -168, -38, -188, -316, -66, 46, -234, 185, 52, -166, 19, 160, 18, 280, 2, 12, -221, -218, -121, 111, 346, 171, 252, -151, 125, -120, -14, 2, 58, 100, -14, 158, 47, 55, 238, -54, -151, -29, -152, 21, -6, -119, 12, -17, 5, 70, -247, -71, -30, -177, -345, -179, 67, -204, 103, 452, -6, 165, 0, 48, 95, 49, 32, 297, 92, -79, -9, 145, 69, -150, 9, -25, -149, -276, -55, -172, -95, 91, -68, 39, 137, -141, -11, 15, 3, 254, -21, -13, 197, -93, -15, 122, 142, -9, -44, 47, -363, -38, -79, -2, 57, -171, -27, 83, -70, -70, 211, 27, 300, -95, -50, -142, -35, 177, 8, 2, 0, -170, -258, 104, 8, -186, 190, 163, -74, -14, 69, 71, 191, -109, -112, -135, -266, 207, 15, -60, -31, -52, -126, -80, 49, -16, -87, -271, -66, 5, -22, 247, 304, 94, -57, -62, 148, 83, -48, -10, 115, -154, -141, 100, -35, -96, -65, -120, -71, 23, -23, 42, -34, 222, -273, 123, 54, -263, -277, -319, 108, -10, 453]
2757D53o53J13k7L60m34p7N01k60m9J9L28o4o4j22o0Q7Q9k35M04n22K62Q3o2j05
2781c5K34k14J67j03j50P5L43k61pK69k80j6j65R4J29o2K1N1k97L65j89q3J40
2804B6l2J29K56m30n6j06K80J24j0j79J26j00R8r1o9J06k07k7R0J38L2J4r6j67
2828a51K24j53m0L46j08l34K52k86L78j40M0p9MO4j80P1K17j98J11k46N0M24o29
2851c63N36j3k42N4k8K19l05J85R3K8n3r9j81L91k7l37Q5Q8j11j64M3J11J44j95
2875a41O7J83r7J26k79nP6J41J65j73j63Q3J96m2j73J9Q6L6N4j18r2J7J9L41n74
2900b48J74q3N1j11J63J13m6N5l00K22p2J85L2l1j27m5K72j19l20N03r7l35K71
2923A07k80L0M10l30J43r8K14l00J39q7l2j03J32nK31n3m4j78Q6P0k86L75j32
$$ y = [453, -200, -87, -114, 246, -188, -265, 236, -24, -73, -54, 274, 210, 146, 24, -36, 51, 140, -95, 309, -213, 49, 132, 70, -35, 199, -15, 152, 49, -101, -26, 317, 56, 49, 318, 38, 22, -143, -49, 80, 18, 39, 90, -207, 158, -31, -114, 26, -6, 123, 379, -51, -107, -213, 67, 191, 181, 2, 128, 28, 126, 35, -34, 72, -135, -162, -72, 66, 98, 112, 16, -151, 73, -80, -120, 226, 118, -216, 36, -250, 128, -12, 28, -51, -47, 17, -163, -92, 125, -73, 38, -208, -158, 266, -363, 173, 160, -82, -28, -56, 163, -142, 43, 136, 164, 111, 12, -169, 222, 195, -142, -57, 31, -80, -244, -201, -90, 54, -141, -74, 109, 12, 138, -141, -146, -70, 71, 236, 63, -100, -17, 179, 137, -36, -17, 69, 105, 159, 41, -51, -34, -15, 326, -248, -74, -157, -106, -217, -54, 59, 13, 68, -232, -10, -82, 103, 135, 104, -23, -68, 204, 85, -235, 268, 171, -164, 107, -173, -143, 267, -63, 80, -18, 196, -104, 35, -52, -84, -187, -55, -60, 171, 118, 74, -104, -18, 52, -234, 141, 9]
2946IJ17J15j71P5k47Q1J20j25L8j88L89N5j50n0l70L47r5j88M39j42J99q1j09
2969F8l1k12L01Q4j13p6j56R3P4k90N01l12J59l4P3NJ08j77j46J32m3q7JQ1J78
2994A81M5l12j35J73J45j14J2K57j87O1K8m13l3J11p3J77J23j26N2k21K80J7m9
3017aK30k77O1j73L51P4m90K77j93M6P6M1j04Q0n5L74l67J74K9j39J70l2q2R3
3041A63k72j6K15J81k01M5k34J56j92j13K99p9P3j49J94j23k15K96ol32M26j08
3063HK14j99k7J80k28j24J54j60J20K21m1j87J82J4j94O1K0j3J42j15p2k3j54
3086b21L05j28m5L06j0J03k13k76K52k58K02OM4j28J04j81J18L7rj57r3J17O1
3109f4j3K79o6l15L15o3jj26J70k15Q7mp6j31K43M2j35Q8J01k51RL9J38MQ2L4
$$ y = [9, 126, 241, 70, 145, -102, -21, 99, -26, 12, -176, 213, 268, 118, 68, -302, 45, -50, -238, 201, 59, 258, 177, 68, 37, -175, 126, 210, 97, 21, -135, -42, 32, -258, 243, -69, 90, 56, 129, 134, 242, 65, -81, 51, 8, -79, -78, 3, 181, 226, -86, -221, -48, 97, -17, -5, 252, 65, 126, 154, -259, -292, -181, -254, -77, 46, -80, -28, -249, 31, 48, -1, 229, -48, 13, -160, 191, 265, -225, 52, -141, -95, -19, 22, -82, -2, -57, 317, -50, 124, 153, 14, 184, 152, 70, 163, -109, -125, 90, 271, 70, 115, -119, 37, -155, -268, 31, -48, 25, -124, 70, -53, -268, 28, 22, -310, 116, 8, 222, 23, -4, 176, -52, -176, -22, -182, -62, 159, 118, -69, 113, 127, -67, -6, 14, 1, 143, 28, -44, -67, -221, 84, -44, -89, 217, 207, 310, 97, -179, 73, -185, 17, 23, 67, -61, 43, -138, -20, 17, 8, -149, -242, -125, -64, -77, 202, 136, -179, 136, 73, 72, -54, 116, -99, -12, -16, -92, -223, 20, 62, -73, 15, 116, -135, -126, -87, 51, 55, 137, 171]
3135A71l30M34j12k53j21J88r7L06J01j56j65K84l07J10k61L17Jp1kN6j25j30
3157a62J05J9q1oM25k43K35l39k10l9L32r7K5Q2Q9l49K66K1j03p7J66J88l69P5
3181d7k72K54J53J0k11K45j69O6Nkq4J41P0j31O6k29J97J20J25j31j93M15l57
3204D1O6j66J5J0R8n5q7J85j12K9k72K27P8n7R1J10j16o3Q4k41L05k38k30N98
3228C00m17p7J41O5n0N5k39K11k34L20J89k89K00Q8r7r5J22j64q1R5J56j02m85
3251c88L71q4K64m84K4K80K07j88P7j67K84k35r9J61N3j09p3K44kk5j19m7j06
3274a61j68K69K09k55J30l50M78k83k0L00k19J49j96K6J24j59J03L25j91j09j28
3295a26L01m07K74R7R2m08K04j77K82k19K93k91j43N69j86k78j55J34J12J43k55
$$ y = [171, -159, 275, 163, -90, -211, -23, -120, 186, 287, 131, -34, 250, -57, 53, -208, 109, 110, 39, 37, 93, -32, -162, -57, -38, -119, -125, 300, 57, 292, -47, -257, -296, 36, -61, -36, 46, 135, -214, 52, 73, -30, -107, 59, 247, -122, -47, -319, -65, 88, 98, -113, 132, -37, 29, 34, 32, -52, 89, 159, 28, 94, -135, 62, 182, 307, 176, -17, 398, 41, 107, -59, -44, -34, 64, 9, -78, 107, -5, 24, -248, -21, 57, 0, 91, 201, 85, 22, 106, -135, 170, -68, -298, 300, -117, -194, -53, 12, -38, 17, -222, -11, -245, 75, 264, -25, 175, 263, 166, 71, 193, 29, -52, 43, 199, 97, -388, -17, -101, 163, -321, -297, -17, 190, 2, 79, -88, 196, -39, -138, 23, 76, -33, -106, 138, 136, 111, -8, -55, -161, -329, -60, 149, -106, 24, -326, 152, -131, -151, 149, -70, 79, -117, -91, 33, -126, -23, 302, 111, 2, -126, 175, -232, 42, 139, 231, -177, 27, -150, 132, -87, 206, -85, -228, 341, 155, -123, -278, -144, -32, 111, -144]
3316a44j41K03M1O2k33O8J97N6L2j73J91l82K07M0M8k60K56j35K4k37J65K52l51
3339b14L35m46M96o1o9k7j60J90J71l02Nj07J31J27l41k2M77j9j93K9k44L88j15
3362B9j9p4Mj82K58o6j23K12j5R3k56J33J16n7m7p8k7P4J37p5R9k73M6K30k70
3387a31J46O8J03k25J22j83K69l16J61J56J1k59L16k15k49L12ko8J21oj61k33
3409b63L93l3q4oJ40k40o9L28J0k8N8n2l20L77k80j3nJ09j24J76L2K0k45K72j70
3434a7k37O1K50N2j61nM30k49j31O5m6J77o3k2j42j9p0p2L19j11p3no9J7o0K15
3460C4K37k39k7p5m8R4L9J4K13k30j00O1P5K11k14n9O6j6j81J53n0j32J40K17
3484A83n2j75J26m9Om7%k44J99J6P2J0P9Mj06j07K49J67k88J3K5N3P6l90KK93
$$ y = [-144, -285, -82, -41, 21, -212, -144, 53, 109, 141, -32, 159, -223, -16, 24, 72, -188, 68, -67, -43, -280, -115, 137, -214, 121, -325, 171, 110, 41, 14, -146, 44, 215, -87, -82, -189, -58, 69, -272, -294, 183, 164, -29, 0, -244, 144, 29, 10, -64, -60, -242, 16, -50, -173, 39, 24, 117, -139, -6, 110, 53, 6, -72, -99, -25, 112, 37, 136, -137, -91, 139, -131, 15, 83, 186, -39, 83, -100, 169, -147, 14, 170, 181, -78, 238, 23, -226, 86, 84, 16, 137, 131, -30, -263, 130, 97, 13, 7, 147, -93, -162, 166, 176, 148, 206, 154, -166, 211, -69, -82, -87, 22, -102, 74, 106, 126, -119, 153, -17, -254, -193, 57, 109, -52, -57, 373, 124, -7, 58, 12, 189, 126, 104, -38, -57, -127, -199, 120, 9, -64, -69, -138, -121, -181, 34, 271, 32, 5, -70, -118, -24, 15, 29, 242, 12, -88, -27, 48, 259, 45, -14, 52, 36, -145, 8, -42, -174, -34, 183, 131, -44, 82, 33, 39, -8, -8, -252, -53, -37, 35, 45, 124, 128, 22, -85, 164, 331, 43, 56, 81, 134, 210, -180, -178, 115]
3510A15j29j6J10k04K83l05J55k98M3J25Q8J20J04l6k12m1J29j85K58p6j42mJ53
3533C5Q3j40J2O1O9j84J27j01M0J2k9j98K09j19J68o1n3L34l12O1j41K30k90L26
3557A39k84P2K43m80L20j88J79KL5N6p3k46M50k04J25j53N9m1P6m78M09n2k00
3580b34K53N6j06j3J68J74m14m5O9k1K17j51N2L1j44K54k65K44j09m7jN1Q0p1
3604B8J59r8q3j9J5Ql9J10oj94J3j24J32O4k38K32j67K07j61l3K76k35MJ98L7
3629H6o6P3j38Q9j58J50k41j7M64j56l45K47j45J34R3p8k45K10J31j95K08j77
3651g6l7O4J4K16l28J73O8j57n4L44l56L08p1o8l9L01j94n1oj13RJ98q1k0j18
3676g4k43K90L81m65j37J90j57M11k59L55j69m9j32l0j6j2k07J35L37k9r9n1J90
$$ y = [115, -14, -30, 80, -124, 159, -146, 9, -289, -246, -121, -33, 87, 191, 155, -57, -98, 31, -154, 104, 28, -114, -118, 35, 118, -22, -10, 51, 120, -64, 63, -38, 2, 14, -15, -213, -4, -123, 45, -16, -69, 265, -47, 14, -127, 103, -187, 139, -145, -73, 170, -310, 10, -178, 1, 3, 38, 94, 21, -225, 225, 21, 146, -7, 52, 11, 87, -391, 18, -34, -234, 19, 75, -31, -44, 124, 298, -116, -161, -92, -113, 104, -47, 5, 36, -108, 146, -119, 125, 16, -31, -32, 19, 99, 28, 187, 89, 6, -13, 2, 10, -29, 81, 75, -119, -106, -230, -98, -34, -272, -40, -207, 0, -161, -194, 82, -153, -149, 49, 86, 20, 93, -45, 44, -114, 36, -205, -222, 242, 86, -259, -12, -157, -23, 70, -8, -253, -43, 88, -107, 101, -76, -113, -49, -35, 181, -147, 26, 94, -63, -117, 227, -129, 179, 108, 40, 1, 302, 108, 57, 51, -62, -53, 145, 64, 44, -74, -317, -27, 354, -111, -248, -58, -215, 196, -63, 292, 123, 74, -58, -88, -104, -116, -323, -188, 149, 120, 21, -30, 160]
3699A60j85l2M5o4m7J06j13K06k01p4P3j77M34j91o8L4K13Pp5j14k7J43J82j85
3723E0L3k85J10j34L26Rq4J35j28j2J79l21K43j73K77J6j94k33K66l00J71l17
3745c66L39o9J84m3j34K32j44J15j17Q4k68J58j48L03j64J24j38K29k54J49k39
3766a67K82o8k13M34l40k22J42J37R6k3R8J12l31O7J54j04O4M7l31K06J15p4j21
3789d0m5L2K87l95L08j65J33o7j21N7m1p4J39j84K96j81j76O7J35Q3K50k13J8
3812A03j48k05K74J9r9j12L91k32J13j45J71j85pM8j10J54j64J42J80j28j66J88
3834H2j40J66R3k60k38L57k71K56K14l02L37j03k81l1M44m08J82p0p4P4J08L8
3856A73m7k32K23k8k75K00q2r4O1P9J88j38R9j65J81J65k71l18L73pj05p6L14
$$ y = [160, -25, -57, -12, -76, -123, -17, -130, 76, -125, -199, -126, -303, 131, -60, -128, -94, 119, 126, 51, -63, -90, 53, 235, 50, 83, -202, -92, -226, 100, 109, 25, 160, 32, 20, 199, -122, 121, -52, 225, 241, 47, -186, 80, -220, -49, -366, -27, -96, 88, 45, -89, 143, -1, 114, -3, 81, -187, -29, -177, 126, -38, 86, -52, 177, -77, 72, -167, 115, 47, -166, 268, -72, -294, -152, -15, 81, 58, 156, 268, -63, 4, 158, 54, 118, 165, -166, 40, 155, 81, -40, -85, -53, 234, -161, 147, -18, 115, 48, -73, -16, -57, -131, 8, -176, 120, -61, -237, -170, -35, 48, 298, 85, 103, -45, -250, 24, 43, -56, -168, 223, -9, 104, -41, 130, -55, -62, -14, -124, 30, -134, 8, 188, 60, -106, 82, -58, 108, 201, -59, -297, 60, -211, 45, 259, -43, 294, 191, -90, -121, 323, -85, 97, 27, -47, 27, 135, 173, 126, -106, 117, 89, -186, 14, -68, -162, -101, -22, 166, 28, 127, -38, 143, 308, 37, -281, 92, 85, -20, -96, 218]
3879B18l37J65l16K65L1j93L23r8q6j64J47J27r5N2N8n7k17nJ08J10O9J02j43
3902F4j9M7j73J6K41p5LK1o7j00Q8N2j71N5M71l42p5l32L04O4R9j02p5J10l77
3927b73K56M1jK4K54l98K20l78K20O8J32r7k92J12K4j99K15J03j9j10P3lR6j55
3951h7j08L72j13K7j27L87k49K40k41j01J46j02j26J06K73l02mK23m84M36n8m6
3973F2j4j07N9r7K02j82p5K76J08k86K01J4O4r5n5J0j52L6l1K58l10N5J57j69
3997g1N2j66J23M5K63k16k46L98J32m12M41m42J06oK06m07J83J18l07N0L07k34
4019h3n5L12R9q4j38k33J02j04K40l18K18K99m00K23p1J63M2j09K84l29j66n2
4041a60L82k37j26J35k92M09j26K96k76p2K31j39P0l1l59N67k33k5j78K77M2j93
$$ y = [218, -119, 46, -270, -5, 26, -167, 156, 58, -28, -192, -45, 82, -13, 39, 97, 40, -177, -182, -74, 36, 105, 207, 64, 45, 92, -81, -65, 176, 101, 104, 125, 58, -42, 46, 98, -73, -18, 453, 111, 36, -296, 8, 72, 171, 69, -6, 104, -273, -17, 24, 23, 47, 301, -97, 123, -255, -35, 33, 165, 68, -224, -112, -88, -287, -72, 31, 12, -98, -25, -28, 68, -87, -195, 177, 64, 91, -36, 351, 102, 342, 101, 0, 146, 44, -82, 24, 297, -5, -9, 214, -270, 166, 108, 62, 48, -59, 0, -97, 105, -77, -152, 124, 232, -54, 147, 161, 225, 130, 75, 85, -67, -31, -62, 196, -114, -59, 98, -71, -19, -185, -62, -17, 246, 30, -216, 182, 314, -98, 343, -99, 7, 1, 207, -200, -17, 101, -206, -156, 151, -83, -138, 174, 273, 189, 51, -182, -80, -184, 56, -262, -44, 255, -145, 78, 7, 170, 212, 103, 387, 58, -108, -160, 222, -15, -141, -6, -298, 111, -15, 281, 5, -67, 164, 25, 95, 64, -295, 272, 39, 14, -164, 113, 155, -38]
4063c8O5mK4k44L30j54J08j50n4Q4J57k2k49L19j41J58o0j69J44n3j8r0l2K07
4087A18o4j56Q9k15k44L41J77K30l86Q7J99O7j01jj59J61n3j60J10OJ43j34J46
4110B01k10L5R9j07R1qk55J03jM2m6q9J90k3j12J56QL04m51k09M09l75l9K70m3
4135f0J85j82j21K39P0k26J59j64J58q2J83L9j94q3J91l33L80j37LL6l7q2J41
4158H3k8L1J6j16K19k95Q4J0j47Q7j66n5K28k7n5R0J18N8k09J05J5m7k03K27J60
4183A83l59m0L12L8m17L57p7J85r8m9K72n09L12j74m0j41J09K81j29p6K12n8m8
4206D6m13K98k5p0lL09k7j00q0J72l08K63P9j8j94N2K14m27K13k04J55J2K70l07
4230i3K10k59L76L0P9k96l3j50J25J29j63R0m1j07J34P3J79k42o3J85j99O3k08
$$ y = [-38, 27, 23, 47, -197, 133, -21, 87, -63, -117, -33, 124, 102, -147, 172, 31, 189, 129, -40, 104, 51, 33, -57, -89, 118, 54, -102, -13, -228, -472, -131, 46, 276, -110, -23, 176, 243, 142, 141, -18, 143, 90, -70, 40, 46, 189, 55, 201, -9, 26, 125, 18, 109, 101, -154, -51, -52, -10, -56, -145, 45, 22, -90, 66, 74, 378, -73, -282, 127, -248, -287, -17, -60, 125, -57, -178, 61, 131, -95, 64, -100, 58, -24, 159, 198, 4, -79, 112, -221, 159, 22, 25, 61, 24, -58, 83, 55, 86, 102, -14, 205, -90, -6, 4, -143, -56, -222, -277, -49, -76, -131, -41, 77, 135, -74, 31, 46, -1, -204, 23, 183, -176, -216, 96, 134, -283, 74, -3, 182, 84, 35, 307, -202, 110, -64, -104, -245, -136, 145, 16, -60, 152, 94, 46, -367, -69, -94, -164, -167, 142, 115, 15, -65, 107, -201, 62, 141, 123, -71, -19, 195, -232, -19, -223, -68, -56, 214, -93, 117, -142, 234, 264, 343, 47, 14, -136, -11, 118, -45, 45, 4, -103, 31, 104, 283, 41, -22, 163, -36, 27, -181]
4253a81K01j98J37K84r7j16j29rnk1K69j86k0J57j54L48k40l36L60p0j42K21j98
4276a25K41J22j34j82NJ10j36j34L56M5k22j17K60m03K66k3L73j57k42k2K89k43
4298g3K24J3k10k40L95m4K8k62K32P0l55J58k81M81j45N0k28K98n6n0K21j34k19
4321a27K57k5j70MJ18l94K98J56k29k02M27O1j55O3J01o2k6K98j11q4l14j31L27
4344H0k2k4j17K89k43Lj74J25o1J89j26m9L29k6j59L1j83J77J91M4j72l5J09k33
4368e7J49J34J00l32m7kJ72k46j04O08m00R1L21n31P3K41j78k78L5J18Q7L30l86
4391a02J11P5l40J87l2l5R5K05o2k20j8K4J71n0k01K6K47k56L8q2Q3K64J62l17
4415b7rl8K49m8l19K51K9o5n5j74n6J58k1J0K42j14j44K21l50K54n8K63n7j20
$$ y = [-181, 20, -178, -41, 243, 146, 30, -99, -108, -113, -134, 135, -51, -71, 86, -68, 280, 40, -296, 64, -6, -148, 73, -125, 116, 238, 104, -78, -73, 37, -99, -233, 123, 168, -54, -171, 89, -314, -48, -71, 302, 145, -97, -119, 170, -73, 151, 164, -46, -286, 109, 65, 93, -169, 63, 133, -222, -64, -345, 136, -9, 41, -187, 111, 55, 5, 226, 92, -127, 130, 105, -65, -61, 57, -337, -39, 117, -112, -314, 113, 174, 19, 82, 183, 121, 95, 393, 282, 198, -116, -247, 80, 58, 34, -83, 206, -37, -34, -208, -83, -144, 45, -81, -130, 199, 173, 14, 45, -138, 39, 230, 274, 102, 67, 176, -57, 92, 226, 326, -6, -53, -55, 117, -129, -233, 375, -25, 66, 387, -144, -71, 170, -8, -286, -251, -133, -46, 284, -102, 9, 84, -256, -69, -101, -136, -41, 164, 102, -118, -136, -112, 59, 9, -192, -166, 81, -175, -137, -219, -136, 128, 290, -27, -36, -74, 175, 127, -192, 59, 88, 23, -32, -206, -262, -104, -125, -115, 127, 13, -131, 90, -260, -6, -64, 199, 142, 22]
4439B2J20j67KJ14k49M15k34J33o2r9Ln2K41m29K91k04Q9K83l33l9R6Jq8P4J94
4464A22j72K42k15j00j0M0K3J30K31k10j30N9J88j96rMQ9j05M0j55J01J45j10
4487BO8J38m26L61m36M46o5p5J4j0r7j3q6J51M2K6J34l8k57J28Q5j60J90N4k09
4512c3k1J83l32K74k56N7r8N9J88R8k50K65k81J54j35K69j1R2k83N3R5r3N4N2
4536A00k00K78r4L2L7o9k54L62L7k22r4J01K91m29n4PJ66q2k2k0M40k96R9j27
4560a3m2J46L7L6k79o6K61k40K4O0j13k5O93o6m13k14j25K37L5J34j32K21j78
4583b2p7R8k23K21j98K48j83L8Q8R8J03k17q7j95O35k93M7j14L1L7%l04L45j52
4607g6m0J29k6J33J08m77L19J6m9J23j81P2j92J66J4K9j73j30L34p2m3K82l31
$$ y = [22, 142, -25, -23, 91, -158, 257, 23, 156, 94, -5, -2, -54, 187, -242, 49, -155, -66, 217, -116, -155, -59, -58, -146, -72, 122, -50, 192, -23, -123, -133, -93, -70, 60, 291, 81, -49, 10, 198, 2, -7, -3, 86, -19, 21, -134, -33, 112, 2, 70, 208, -218, 143, -293, 153, 88, 13, 27, 17, -80, -93, -179, -28, 14, 40, 174, 136, -121, 7, 92, -68, 122, 176, -33, -54, 129, -203, 71, -185, -128, -226, -167, 21, 119, -131, 134, -147, 7, -128, 141, 130, 222, -61, -8, 87, -6, 48, 100, -100, 178, 84, 116, 153, 84, -170, 192, 229, 7, -87, 14, 305, -124, -178, -171, -5, -87, -109, -129, 311, 15, 114, -13, -55, 91, 128, 164, -115, -181, 80, -160, -136, -76, -189, -214, 479, 413, 0, -214, -339, -102, -67, 67, -65, 156, -22, -99, -1, -224, -3, -201, 47, -136, -98, -10, 88, 191, -26, -113, -308, 327, 34, 81, -33, -2, 35, 35, -269, 76, -76, -116, 13, -13, 120, 228, -249, 70, 86, 37, 160, -21, 51, -141, 25, 39, 68, -105, -235, 99, 27, -16, 266, -65]
4630f5j08lK05j01PK23k2l8j94J09L4j57R2J29k8J46l45O6j47Rj47J87J14R6j31
4655f9J1O5k16L55q9j05o7J65J9K8O5k88L43k45q2L0J61o7k35J40J48j00O6q5
4679e2J64m3K3o3J05O1n1j84j8J37R8o7nR9n57K91k1QL64l59K17N8l3j17K33k57
4705C1K5q0o2qM44k25j53N3o4O6J06j39K64j69j90J9K13r9M6Rk43qL05L5k61n6
4731a41J57O9j31K8P7o6J72m66L22j09N5p2J99l07N1K38M0o2Rj58k3L05m36M05
4755A56l12K85rj44m4K03M1k02j25j58K52J09k7j85Q5J31k48L28k89M01k74j99
4777b25K53N9M9O6Q6m80J48j81M50m76MN27l47J87q3k5Q1q9M7r8J30l6k67K50
4801C0P4j46o7N5Q6j85K71k65K13L9J46l73M5K18q0J27l01J53J47j44L7J53k88
$$ y = [-65, -173, -176, 29, -72, -65, 158, 136, 98, -96, 13, 47, -110, -18, 111, 83, 229, -116, -50, -197, -188, -335, -148, -34, 62, -69, -58, 7, -209, 146, 57, -48, -115, 50, 69, 97, 162, -126, 217, -28, -110, -80, 81, 14, -221, -81, 67, -33, 33, -52, 112, 69, 92, 29, 134, 195, 144, -40, -58, 79, 177, 110, 105, 204, -353, -62, -83, -75, 289, -70, 147, 205, 172, 55, 288, 31, 56, -24, -86, -94, 350, 125, -28, 25, -39, 27, 133, -6, 258, 89, -101, -82, 131, 32, 78, 87, -156, -164, 141, 176, -85, -141, 16, 85, -46, -18, 59, -7, 165, -301, 21, -88, -33, -105, 94, -213, -162, 76, 116, 54, 63, -95, -118, 187, -249, 156, -156, 129, 120, -24, -68, 135, 176, -26, -151, -309, -57, 52, 25, -160, -75, 56, -192, 136, -153, 248, -26, -225, 28, 87, 136, 202, 288, -192, -44, -225, 225, -251, -247, 280, -67, 120, 37, 12, 93, 4, 51, -47, 83, 47, -220, 30, 104, -42, -109, -54, 32, -153, 118, -147, 66, 105, 251, -122, -77, 141, 61, 188, -113, 40, 187, 43, 80, 233, -55]
4824e5j54M5J66l7O2L01l00j06J31j60K88m4j03k68L20O8k19r5J83L6J09Q3j42
4847A09k46K32O2j26j26J84j14j32L70l16J91O4r7q6j3n2R1j23R2R9j0k40J77
4870a0n4J7J74J08n9l36N0K16j28q5J04K71k69K76k55Q9m7k13J98%q1pQ5J8LO3
4896A28n9j59M8J76q4j18K53j98J65k33J84p9O8K8j23J53j67Q4j44J13J51k12
4918b5n3J18P8j02j36j20L04M4k36K22Q2j61q6p8K91l16L12l5j91j22R6M3jJ83
4942A11l4l46M81n2j18J22j93K7N7l06K93j53J09p7K35j12J52j09j43N1j07K26
4964A14m3l39J54j19K10p3J70k54K00k28J35J39m04K03J95J06o6j01r5J29j66
4985a33J39j57K17l69J49J91m2N7j88K38r2k88J75K05p6j21kK13n3KN6l66L92
$$ y = [-55, -209, -164, 2, -35, 27, 328, 28, -78, 53, -107, 181, 137, 34, -234, 86, 154, -65, -160, 23, 59, 168, 251, 109, -137, 95, 157, 31, -95, 89, -25, -157, 213, -103, 88, 152, 55, -31, -44, -96, -5, -128, -36, 63, 53, -187, -10, -64, -47, 127, 235, 176, -160, -110, 106, -22, -107, -3, 268, -1, 275, 20, 109, 62, -151, 47, 47, -34, -41, 44, 62, 65, 128, 69, -90, -42, 134, 50, -68, 185, -13, 152, -81, 103, 24, 92, 120, -3, 150, -17, 67, -77, 36, 187, -25, -78, 40, 118, 16, -120, -240, 64, 108, -128, 94, 176, 15, -71, -149, 142, -174, 138, 103, -88, -210, -114, -71, -72, 111, 77, -269, 212, 160, 42, 164, -29, -2, 55, -251, 42, -111, -2, -79, 156, 44, 196, 87, -56, -5, -112, 114, 71, -268, -114, -233, -23, -96, 74, -180, 20, -208, -73, 66, -338, -135, 60, 166, 100, -1, -96, 33, -133, 6, -151, 66, -303, -154, 37, -5, 52, -136, 102, 10, -278, -103, 102, 26, -95, -97, 116, 63, 65, 121, -245, 147]
5008A47k50N7n3L82j22k41L04k17K50l02O0K38l41l8J82j6O7n4o3O3J0k01J72
5031C4m3P0j07OJ65k8l5J0q6Q0m6Q1k3M1j2j43k61Q5J65L22j73l02P0m3p7k2L65
5058I3K4j96N5J26k34J49O2j37J08mj95N13j38q1k42R0j16K09J9j26J23m27Q9
5081b36J56L5NJ03j25K56k14Q1k16N07j91j99k1j00L94l84K13j63K32o5K13n21
5103b40K02l3Q3j73L17L6k55j0LP5L4k7K35m61K82j81K15p1j38l6N3L00k45M5
5127A0k46K88j35j72L37j44J99N4j18J66o2n7k03J02j36J25j56J76Jk18J19J61
5149I1j22j05J27l0J66j61n7L4j35J68J97j94k8K64l36J28J87j06k60q9L15j87
5171a33K44o5j10J5k18J9L30j57J48j37P7k88L27k9j5M8j60O3J05l7j13J15j07
$$ y = [147, -103, -46, -99, 283, 161, -80, 224, 7, 257, -45, 15, 253, -88, -126, 56, 40, 107, 53, -10, 53, 63, -138, 34, -9, 61, -46, -40, 125, 97, 62, 72, -14, 66, 20, 101, 78, 119, 107, -36, -297, -212, -47, 275, 102, -200, -130, -173, -250, -272, 93, 117, -79, -24, 102, -132, 17, 79, -58, 50, 46, -149, 364, 226, 145, -97, -7, -123, 86, 105, -21, 102, -325, -236, -80, -45, -40, 63, -62, 194, -20, 61, -155, 352, 161, -38, -59, -159, 235, -149, 64, -99, 133, 68, 281, -240, -38, -71, 12, -161, 156, 192, -63, -73, -70, 5, 39, 12, 247, -214, 68, -113, 102, 31, -107, -143, -90, 210, -35, 10, -236, 52, -83, -255, 82, -62, 137, 191, 73, 239, 177, 120, -83, 19, -117, 8, -148, 28, 29, -189, -70, 91, -31, -136, -9, -39, 127, -34, -91, -57, -192, -24, 173, -21, -49, 215, -121, 7, 194, 88, -172, -261, 54, -133, 111, 46, -64, -49, -267, -248, 82, -75, 73, -64, 13, -275, 52, 23, 8, 56, -104, -41, 64, 27, -86, 29, -78]
5194g8J66Q9L2k09l4j15J77n2j6L67k33k60K59K6j53J63J34l71J93mk8j33J14
5217C4O5O4k19J6L14j49l55L02n9J09k0j3k20k2q9N6K61P4j42O3k46K33J70l78
5241a51J33L39l97k0L80n42J45O4L9j45Q2O7j03K18j35j81K56L18m78J96m0M5
5263I0K57l85K7l9K19k96M7J03q2L65k46j8r8k4k8L11l22J71k08M05k37k72K59
5286aK28k86L6k1j1J0j01J53l05L80J56k34L39k97J15k00j45M03o0k51J54j8k7
5309A7K03j03m30L56n9K44j18j31j03j30M5J30J16j41K39j32jM2L3l1k15L51M
5332A86k59J04O9k6k96L45r1J8J96k41n1pL84k67P0j02J25k99K12o6l17L17R8
5355A02q1j86M4M8l2K90k39J11j25l3N0J5j82J9K69j54J42j08J02j01J01j37j02
$$ y = [-78, 88, 177, 209, 0, -34, -149, 28, -24, -40, 327, 94, -166, 93, 119, -34, 129, 263, -108, 85, 81, 53, -80, 34, 99, 163, -56, -40, 274, 125, -230, 72, 13, 122, 102, 89, -131, -153, -242, -186, 75, 149, 7, 70, -176, 57, 227, -151, -18, 321, -76, -96, 284, -258, -113, -49, -10, -155, -73, -6, -109, 109, -26, -207, 49, 367, -111, 85, 45, 90, 347, -38, -11, -50, 169, -127, -80, 23, -59, 306, 60, 42, -56, -80, -108, 203, -119, 52, -156, 249, 12, -260, -1, 227, -59, -23, -44, -55, -45, -146, 7, -298, 82, 238, 4, 343, 46, 161, -39, -184, 219, 159, -92, 62, 44, 17, 220, 117, -313, 43, -16, 228, 110, -21, -124, -254, -209, -79, 37, -104, 135, 3, 2, 44, 77, 46, -169, 182, 186, -73, 31, 100, 74, -222, 123, 32, 50, 246, 5, -46, -53, 331, 64, 134, 32, 157, -142, 70, 4, -313, 4, 102, 21, -165, -121, -73, -105, 185, -54, 57, -68, -101, -51, -36, -218, -199, 70, -84, 58, -50, 52, -49, 52, -85, -187]
5378a87L82k26P4%K64j47m9J32r8j95J0j72o3L59k41L2K45k98L80l21l7L59k70
5401f7j99L09J8K1k7R2k59Q1K55j20N3j59R3K2m27M05j27N7m9n8LL1K51k4p2j36
5427c3m55J30M17J24l8j69J77j86K39j51j96j51L51O3p7n6L17m05K31r7r6K4j05
5450a42K9R6k21K12J24Q5k96J43j09J02KK15j14M3P7k05l9J36k72K67o5M5j4k50
5474a51K90o6J14l08k83N28k4j99J20m3K8J25j2n8j43j22K74K7j51K9P4J54l68
5497a65J52K72p7k62rL23j43n1j30nJ96J7M7k02j47J13j27K22j83K80m31M59j93
5520d4j01N7l1K91l52L36j89mK1R6j27n2K70P9k04K1J44j51j71J5J32o1q7J28
5544A6j01J9q1K38k71J17j73M50r0l19J21OJ35j3Nj39r6J31M23o49o3M78m38J86
$$ y = [-187, 195, -31, 43, 43, 307, 160, 111, 243, 145, -50, -40, -212, -275, 84, -157, -125, 120, -178, 202, -119, -156, 203, -67, -266, 43, 61, 82, 55, 147, -112, -31, 224, 104, 157, -2, 91, 113, -314, 91, -36, 21, -28, -86, -83, -52, 199, 175, 103, -33, -488, -358, 59, 183, 145, -24, 153, -33, 206, 55, -141, -292, 59, 122, 45, -11, 306, -99, 132, 35, -61, -37, -142, -113, -17, -238, -26, 98, 183, -113, 30, -79, 23, 25, 240, 126, 169, 246, 41, 2, 138, -134, 133, 68, 113, 99, -151, 139, 73, 187, -121, -404, 124, 100, -99, 21, -22, 6, 131, 119, 61, -82, -204, 70, 97, -54, -25, 49, 203, -165, -13, 259, 182, -80, -89, 234, 91, 40, -90, -95, 101, 118, 165, -37, -184, -71, -198, 24, -159, 121, -310, 149, -44, -145, -88, -119, 172, -180, 156, -33, -37, -16, 80, -47, -99, 171, 250, 46, 67, 211, 60, -111, -96, 36, -25, -112, 16, -85, -66, -147, 91, -180, -63, -236, 214, 124, -195, -74, -68, 67, 54, 59, -80, -176, -45, 378, -271, -334, 144, -294, -108]
5568a08K38q3nj3r1J11j04J98L1k30O1J06K66k60k92J26N3J5j4k01K89l22J87
5591d2%j62M43l32J00K73l41M3J96J53k02m5j23N3j45K56k2j90k19J13NJ81k04
5614b11J02j6J48J80j16j18o2k2L6P1j37J19m6R4p7J50k65K26j51M0k09J12J54
5637Bk19P7P3j4K2K28m0j1k67M84n1k38R8j34j27K91l34M0O5J4o9J30j24J68j63
5662i9j11M00k14J9Q7L6j75J61l38N82l46K52j55l9m5k89N84k14j2k37L14o3k33
5685a35J38j87K03J39m42J94NJ93l86K50l2P0l4r0K88l88L13o7k58M34j73j93
5707a58L30J01m79J67J08j94L43j90L2j12J73q7j21J36j12o5L36k00R4k03L44
5728B43m92K11q4M9J09j71J19j12pJ31P4k03K3K88j79M1p4M0j99J10Q3l7j1K01
$$ y = [-108, 130, 47, 42, 29, -62, 49, -55, 143, 174, -56, 5, 111, 377, 117, -175, -49, 4, 19, 5, -196, 93, -229, -42, -42, -204, 239, -93, 7, 280, -61, -18, 178, 331, 129, 84, -39, 14, -131, 125, 103, -87, -306, -193, -188, -7, -211, -109, -125, 23, 203, 87, -31, -93, -115, -79, -8, -145, -26, -72, 22, -55, 95, -170, 56, -95, -55, -264, -152, 2, -217, -140, -67, -81, -59, 169, 129, 118, -149, 335, 284, 46, 144, 10, -117, 174, -160, -120, -55, -41, -110, 20, -104, 64, -99, -210, 190, -24, -5, 82, 118, -57, 104, -234, 348, 2, 254, 99, 60, 15, -274, 310, 96, 84, -153, 161, 98, -135, 3, -184, 19, 158, -284, -90, -85, 108, -278, -28, -60, 10, -24, -114, 174, -214, 99, 32, -226, 208, 35, -158, 172, 273, -206, -39, 69, -125, 218, 28, 60, -52, 121, 34, -87, 49, -63, -128, 208, 8, 102, -101, 243, -249, -38, -122, -73, 36, -135, -16, -128, -135, -4, 70, -133, -110, 178, -1, 40, -34, 6, -193, -83, 0, -37, -48, 153]
5752A53m7j09QpR4j91qJ07J06p7K7JJ67k76j63J26N1K35j05k14J30J8k44L10j38
5777d6L17k44j42K96j84L4j61J03k98N08j27m6q6J16k6j8j30K86l89N71M4j33
5799B45l41J4K36k33L9j45M63k41J18j70k65K35J28J10n8l48L07k82J36n6n2K13
5821E3l43K89K30q1j82r8n8L16m18M13j28J10l57J01O9k4o8K01l28M51q8k96K48
5844A2o5Q3J36j93J57r5J71j7m31K72K29Q2j52q8k94K17J61O0l53J35j98J2J81
5867B2M0m9j13j6J08r1J05J47m5p8J25l00N7M3oJ74n5O3p3k3j96k7K33j09j32
5892a96L56j09q5J66l31J38K24m25K92J18k93j10K87m9j30J10L37q6k84L83j82
5913A31l45M7L7jK9k44L52q9K19j92q4j88N26k45m8J88l30J05K83j36K37l20j1
$$ y = [153, 106, -3, 5, -2, 92, -99, -107, 0, 106, 29, 56, 57, 224, -52, -215, -89, -38, 197, 92, -122, 8, 26, -218, 92, -46, 271, 27, -115, 181, -3, 31, -130, -27, -325, 183, 56, 10, -76, 40, 14, -4, -134, 152, -237, 334, 378, 245, -96, -82, 154, -79, -40, -185, 278, 37, 155, -15, -280, -45, 83, 193, 135, -213, 94, -188, -52, -108, -160, 53, -290, -1, 229, 148, -34, -132, -190, 126, -292, 121, -7, 103, -254, -153, -84, -108, -176, 25, -303, 148, 60, -236, 12, -53, 30, 166, -27, 130, 35, 206, 189, -242, 30, 259, 341, 189, 101, -193, 24, 185, 245, -108, 27, -171, -159, 22, 62, 13, -100, -116, -8, -99, 6, 153, 108, 30, 155, -145, -88, -45, -51, 123, 68, 131, 58, 35, -161, -188, 45, -64, -196, 160, 51, -34, 132, -199, -61, 163, -262, 30, 148, -145, -255, 32, -17, -147, -37, 300, 214, -70, 313, 131, -214, -167, -130, -131, -102, -346, 6, -83, 136, -56, -140, -328, 198, -47, -95, 93, -237, -132, 151, 15, 252, -68, -79]
5936g9J36L1q0n8R3k04K88k9k12J99o8n1j13q3J40J55J9j63L20r1J07n03M32l48
5960a62K21N3j56k7K24j87R5m5k75N37p0l50L99l09M0j38Q1J44M0j85O9J8k04
5983a87K88j72o2K88k68L99m56k1L6M53l41j3o0J0J52j17J6J18kj43m6N5J07l03
6007b69M48P5j02j47o5L0J56j65k72K86J34j47J18q8k33k12N98k59L6r5r8N5M06
6030A90q6m1p9j01p2K95j18%l1J4j23L37m71K55K63J22l20J84k25P7j08pj31K00
6054B4m8r9L09k89K57j40N0P2j0k7R8j95R9j7m9k56M25l62R6J64k37MK97k99Q8
6079d5p9OJ77j27o6N8j8K56j74J60l18J32J27Q5k91L27k82J57l7J30k59J1J83
6102A13k09L2P6M7nj06j35J72K4L38l12l3K65j06l39M9K00l7n6L42l76L0m3j08
$$ y = [-79, 57, 88, 8, -50, 43, -161, 127, 98, -114, 85, 17, -34, -147, -230, -90, 65, 84, -79, 241, 150, 257, -246, 186, -162, 59, 112, -44, -71, 153, -34, 61, 16, -259, 278, 208, -142, 257, -52, -12, -150, -69, 75, 115, -70, -1, 17, -187, 101, -71, -133, 155, -113, 286, -170, -191, -155, 298, -43, -56, -116, -106, 46, -71, -55, 63, 61, -82, -128, -73, 34, -269, 179, 254, 152, 5, -60, -30, 126, -39, -311, -25, 109, -38, 80, -8, -241, -453, 145, -114, -78, -173, -271, -216, 190, 104, 63, -16, -117, -189, 106, -12, -12, -43, -29, -152, 185, -286, -31, 232, 354, 34, 218, -7, 70, -38, -45, -176, 24, -24, -123, 186, -103, 154, 14, 64, 136, 126, 99, 197, 2, 101, 84, 35, -221, 204, -158, -62, 102, -135, -131, 166, -133, -45, -124, -118, 59, -68, -134, -76, -94, 162, -12, 148, -170, -38, 89, 174, -117, 210, -72, 85, 48, 178, -81, -70, 113, -96, -64, 12, 59, 54, -52, -187, -15, 9, 347, 35, 2, 267, 161, -178, -129, 71, 34, -22, 320, -56, -26, -69, -177]
6126a77J43J79k25M6J64j78j07M04k99L71k22j58Q3J77j48J30j16k24j86N97k95
6147d1J00q0K68L0m29j05K61k67J07j77M36k60P3o6k8J19r1K86q0j60k6J79k7
6170B2qk61K52p0J16k45K23k65L19k16K0j0K60k52k07N9L83J9k31J83k67R7lJ7
6194f5J32j14O4m5j07J91q9M8n9M15l92J71O8m10N0K88k39l06K79NQ4q8J57l5
6218Cj21J46q4Lj3j56L17P2k0k78M12j26p2N3k64M18j71l27J78R4k55J42K00l40
6242a89J29N26m69OJ27j04J71k85Q2J16J03j76K37m05p9M76l72j19N0M71k30r5
6264b9l9k41M75k37K3k0R0r0j0j9J69J96l35m5M5K09j16j8k27J74J54j03m6K5
6288a5Oj53K21j08K51k77K81k79M96k73q1O4j95J10r1J94j83L7j87K56p7j54K36
$$ y = [-177, -34, 145, -80, -34, 130, -48, -155, 249, -50, 321, 99, -59, 24, 201, 53, 183, 67, -157, -343, 254, -41, 59, -21, 247, 277, -152, -257, 4, -263, -156, -333, 103, -157, -84, -150, -178, -59, -150, 136, 56, -104, -130, 49, 22, 14, -247, 5, -65, 51, -194, 29, -236, 83, -133, -113, -123, 137, -115, -322, -263, 120, 139, -92, 91, -176, -79, -82, -65, 67, -47, 17, -28, -135, 56, -33, 15, -44, 371, -21, 150, 218, -192, -142, 146, -93, -399, -120, -115, -31, -119, 38, 3, -118, 28, -56, -53, -66, -222, 95, 167, 147, -131, 281, 155, 83, 136, -128, 290, 119, -208, -30, 64, -191, -49, 151, -189, -60, 466, -3, 3, 130, 26, 197, -88, -6, 110, 213, 37, 274, -131, -210, 266, -106, -225, -175, 296, 66, -29, -68, -309, 166, -71, -48, -68, 22, -68, -78, -97, 72, 268, -67, -112, -67, 142, 26, 8, -219, -45, 109, 6, -40, -15, -9, -162, 59, -49, 202, -75, 206, -73, 423, 150, 69, 133, -62, 48, -43, 151, -32, 5, -182, 74, -3, -157, 79]
6311G9n4k1k20J58J41k64K80l56L53k13L15k99J56k93J89K15j84j46m7p9L38J21
6333A69n0k9M3o4j58j58J00J39j91L55j28m6J78k45J68J8m1l17K35j15J24Nk02
6356b10J23N6J9r2J68J2j5q9j5M1J74k72J87J70j96R0j49N1r0p9R1m4K10qL33
6381D66k52l31n5L21P4K9l69n9Q4J42j2j84L69M7l42p0K96l48J95pj59L73l50
6404a42K06J32k84J49R9k58kp2J58rj4K16k81K55J06l68l3J01J57Q4k03R0j13
6427b6o1k6j2J91k64J95k3RQ6j2j46k5R7Q0j68K71k57J43J2k31j33K55Q7O6j25
6452a7K06n5o9j61p0K16j35L5K04K8l95L59l58J57J80l6q0Q7k09J37J62j48k33
6475a95j03L48L28j40l56L5J06O2j87M15l21J57j46k76J87j03J01R2K5j50R6J02
$$ y = [79, 25, 4, -216, -58, 83, -181, 99, -257, 96, -117, 198, -101, 55, -238, -49, 166, -18, -164, -211, -290, 48, 169, 119, 90, 133, 69, -89, -247, -147, -8, -199, 156, 28, -18, 160, -85, 83, 101, 60, -257, -22, -137, -13, -8, -210, -87, -31, -12, -104, 64, 76, 61, -28, -43, -2, 172, -100, 87, 257, 61, 151, 2, 53, -37, -116, -25, -69, 141, 133, 466, 214, -117, -172, 149, 223, 252, -117, -176, -92, 50, 38, -146, 223, 270, -72, -142, 154, -194, 1, -6, -165, 208, -142, 64, 196, -88, 61, 160, -98, -100, -172, -14, -23, -37, 179, -102, 153, 259, -109, -142, -41, 116, 200, -3, 87, -26, -87, -113, -125, 66, -198, -3, -26, -17, 69, 57, -89, -114, -17, 63, -105, 166, -91, 52, 64, -167, -300, -45, 42, 108, -17, 189, 134, 65, -96, -166, 50, -85, -50, 154, 182, -213, 146, -212, -55, 125, 89, 9, 96, -113, 24, 186, 38, -195, -298, 50, 378, 238, -118, -83, 23, 85, -102, 313, -8, 149, 3, -273, -86, -189, -88, 4, 29, -121, -25, 77]
6497G7m3l8o5j12Q4L82l16J93l05J45K09l05K29k56J55rk01J72k06J38n1k9N00
6520C48m28J6OJ61K4j78K68m19K22m86M92j75L5L37j86p1oQ0J50j51k22j5l6J11
6544a23M8M4n2K65r6oK37j84r1k48J66J9l6J15k83R2J71R5K2K7m4l01J52j63J48
6569b6oJ68n29M13p3j34N18j1l49N6J02m5q1k17J6J7K5M86m04K14K16l8l28Q3
6593G3J78o0l92M5J4K42j32LK08l15K12l3J8j59J94k26M68k91k42J17k6J45R2
6616A33Pl49K74P4p1j02m9J64p9K82n07k18M94M4k14J64j78J69j3p7P7n3J18J3
6640A03K3k03j46K7K01j21J18M0n5N4k57K17j47K56j70LJ47n1p9P5k55K20j86
6663a86L73k80k8K30l04J65J06MK35l46j04QK07p5K24j48l78K09K28k24K40n14
$$ y = [77, 34, -4, -69, -181, -97, 285, -31, 162, -143, 2, 211, -94, 135, -121, 34, 25, -176, -4, -210, -72, -123, -152, 348, -80, -64, -58, 103, 127, -51, 217, -202, 20, -466, 26, -149, -114, 223, 37, -34, -40, 40, 190, 39, -183, -198, -234, -123, -75, -31, -83, 182, 86, 80, 317, 133, 42, -206, -40, -21, -57, 58, -225, -133, 38, 133, 155, 182, 138, -163, -11, -174, -26, -32, 136, -393, 20, -53, -187, 331, 320, -29, 27, 129, 84, 3, -214, -198, -181, -156, 330, -74, 140, 356, 318, -10, 73, 251, 191, -201, -156, -142, 100, -32, -29, 179, -136, 76, 43, 61, -98, 96, -130, 338, 47, -195, -78, -104, 41, 133, 140, -209, 65, 139, 68, -34, -83, 81, 2, 284, -223, -441, 53, 97, -117, 47, -131, 38, 25, -52, 25, -28, 90, 103, 126, -77, -223, -196, 5, -116, 2, 42, -13, 41, -216, 1, -146, 110, -60, -57, 90, 39, -40, 35, -220, 0, -186, 187, -93, -121, 109, -195, -30, 76, 80, 315, -31, -135, -127, 80, 5, 229, 81, -297, -88, 140, -84, 156, -358]
6685c58M12q4J85jk2P2j19j45J60l7l67L71r6j1J36N8j53j33K20k2m1r9K07L4
6709A67k72M7n3n3O6p9J40J69j20q7j5L09k61J9j82J82j8q6L76l91K8J30j00K29
6733A45k25Q4J48p0J26n76J39K32J87j63j3P2J1P8p1K18k21j12P9R3j93p6J61
6756E3N4O6N9k20q7M4O8p2k8n9J2q0K31pj19j42L89k48rJ74j10K50l08n9Q7P1
6782A0j37J9K09j78J58K97m43n7J73j71P9J04o5n7rJ21j60o8O4K05K0j62J77r5
6806C4J14j48Q0o2M3o9J61k73j48L44N1r3J59j81J92j89J42n0k6l47J76J64M9
6829A23k18L4J06p3J79j26j53j1K72n71L56M3J84j80J9L0l3R1k93J92R4q9J9l2
6853c7J73k6J80l21J74k27J04k49J93J30J29j97K0j79m8J73K57j78K0%o6J14j48
$$ y = [-358, 54, -30, 155, 154, 132, 204, 85, -60, 100, 63, -304, 67, -29, -40, 96, 154, 1, -132, 88, 66, 25, -74, 133, 167, -105, -58, -111, -164, -98, -177, -37, 132, 12, -75, -90, 219, -42, -23, -205, -23, -41, -127, 249, -142, -114, 16, -84, 145, -80, 4, 152, 82, 208, -368, -229, 3, 190, 27, 14, 86, 97, 175, 104, 322, 101, -11, 68, 161, -32, -108, 53, 107, 173, 232, 12, -75, -31, 37, -35, -63, -122, -110, -190, 41, 34, -85, -227, 162, -86, -95, 79, -31, 219, -89, -148, -61, 10, -127, -108, 101, -77, 81, 378, -65, -122, 51, -120, -41, 63, -2, -59, -68, 53, -107, -175, -111, 94, 114, -48, 129, 34, 148, 0, 80, 18, 61, -8, 153, -120, -268, 76, 127, 34, 193, 12, 204, 15, 157, 107, 81, -266, -90, 74, 123, -95, -61, 45, -28, 151, 25, -128, -139, 133, -438, -82, -39, 145, -35, -16, 14, -19, 72, -221, -29, 65, -24, -5, -37, 136, 110, 290, -31, 143, -84, 20, -229, -36, 94, 223, 26, 46, -133, -181, -8, 249, 71, 91, 91, 25, 139, -9]
6876iO8l0n2q5J47m2J14l0k85L35j32M7q2P5O4j02j1J71J2o03L53N6J94j61J64
6901A76k58J61q6K9J76j79k47Q8K58j10j83j26L28J48Q4k62j90L16p6N8l42L43
6923A06J9l5k80J7K85l61P1R6M54n46K65j39K1L6K73j71k38j8R0J05n0j9J54n
6947A30k77q6K15J87j25rN3pl5P5j3k07j27J61J3p3M32j11k49N4R9q5l63L14J4
6972b0j10K25m5NJ07j9k21K79k93J88q4Q9l0Q3m23L23j87J67K34p7l16J11q7J79
6996G8j07K5J71l63K72j04j29J31Rq9k7J58p2M2k7m7J5j03M91l18j73J52j35J83
7020C3j69M9L1K28n6k45K03p2Lp8R4K97l21K09l56M0P7k55N80n08R3J92J02j33
7044C8j67k24L00J76qk8l0j8j87K31j76j21J01j43L21k9q4j2J71m1K9O7m51L11
$$ y = [-9, 59, 29, -23, -108, 39, -3, 111, 81, -204, 131, -1, 46, -36, 39, 103, 1, -10, 161, 173, -430, -77, -21, 173, 12, 176, -82, 79, -7, 22, 198, 19, -228, -140, 118, 8, -175, -301, 27, 175, 259, -3, -193, 123, 47, 105, -237, 106, 125, 90, -190, -173, 112, -249, -178, -82, 372, -174, 91, -48, -27, 9, 282, 111, -127, -145, -55, 50, 0, -19, 135, 130, -147, -233, -18, 169, 44, 35, 88, 81, 46, 121, 108, -99, -226, -65, -52, -125, 307, 196, -53, 1, 100, 15, -348, -34, -20, -130, 95, 50, 55, 162, 143, -78, 201, -92, 96, 12, 101, 71, 154, -269, 54, -133, 34, 268, 191, -125, -14, -101, 78, -29, -4, 167, -196, 76, -28, -157, -26, -17, -106, -133, 25, -47, -5, -32, -79, -64, -167, 324, 6, -167, -15, -150, 33, -136, -87, -56, 172, 116, -129, 74, 2, 5, -73, 21, 318, -3, 206, -150, -110, -33, -288, 292, -216, -123, 69, 171, 38, -129, -353, -53, 123, 115, 87, 57, 39, -148, 83, -93, -214, -113, -256, 65, 36, -48, -60, 111, 70, 99, 166, -285, 26]
7068B6K62r9L3l03l3K57M3K5k33M5m7j40L19L3j80j1J81k10K28l54J91m9k25J03
7092a38K62q8nl29K51J24O5k36L29n80K82j30O5J40K72k85j22K39l13M53k80L9
7114A5p7K62m1j70l7l6J69r9J36r8q3j13N0J91k78K59K25J04m89m7L20m31K15
7137e3J92n70J03K91K20k74R7m35O32n38M53r0j08J18j27L18nm06L77K5l93NK52
7160H4j26j97M96n05O9J56m8J40l67L01l6N0j84K31rN4J03l83J4L08k00J78j31
7183bJ72l20r3K90N2nJ21j91J18r9j00J2K11j03l50L74J52j79j11L09k57k51K45
7206ej13P1j9M9J66m8p3q6R1k2r3L95q2j49o1J52j58qQ0l27J67K58nj56j50P9
7232d7J29m1K82j90q8L7l9k40J53K71j61n9l2Q1L8O8j02j91R8m5J51l49K24N5
$$ y = [26, 288, 189, 222, -81, -114, 143, 186, 211, -22, 23, -24, -164, 155, 188, 8, -3, 178, -32, 196, -158, 33, -16, -241, -138, 124, 36, 31, -298, -47, 77, 142, -94, 235, -345, -63, -193, -128, 12, 284, -1, -123, 116, -197, 256, -24, 15, -62, 200, 159, -11, -48, -84, 85, -14, 122, 24, -59, -172, -122, 69, -209, 50, 275, 379, -110, -157, 163, -268, -53, 139, -431, -328, -37, 183, -91, 6, -429, 203, -335, 118, 28, -80, 38, -89, 229, 224, -182, 195, 220, -173, -168, 84, -42, -239, 257, -248, -179, -23, -71, 69, -298, 3, -33, 17, -167, 64, 55, 109, 212, -171, -157, 151, -49, 129, -2, 170, -150, -243, 47, 99, 94, 215, 24, 142, 43, -57, -45, 166, 63, -287, 87, 239, 60, -51, 258, 1, -250, -5, -118, -47, -66, -17, 149, 101, 28, -58, 33, 11, -82, 313, 231, 82, 21, 173, 15, 7, 87, -240, -73, 185, 180, 24, -126, -47, 82, 41, 323, 133, 45, 82, 43, -197, -44, 227, 66, 7, -25, 56, 94, 162, 60, -131, -33, -78, 73, -276, -52, 3]
7256Co0pN4J28l39K95k74K05j08j44K09J48N6M7j74MO2m1M0Q9r6M6j24M8j82J40
7282B5j47J78k15p7L42j87j13J24j19K23j1r2r8L54k63N2j31Q3J70J15l88J61
7304a4l8M7o7N3j44L62j29k9k80L39j43K32n32j6K98J71j10k58K26r0J1O8P5o4
7328c2J74k94NO9K20j68K35l44L76j93j35J23K20j99k00P7p1K41k87L31j02J12
7350A58j49o3Q5j21L39m39J0J41j05K31J61l56j65L26P4R8j34j52o6j60M79k44
7372e2o7K11k69J53k78M56RL0J5m55J72n8o8J64l0M38m43l49N22l09L45l95J80
7395g8j60J61L4l7K74k61L8K18l30K02k4mm8p8KK77l86O4K78N0j57r6R0O3p7j10
7421i5lJ39J93j80O1j48K66r0j04j34J89M6O1l79O3k5K95l17L11J43n05L72m89
$$ y = [3, -57, -64, -10, 118, -221, 74, -200, 5, -103, -247, -38, 110, 166, 213, 39, 43, 105, 64, 104, 193, 97, 143, 19, 67, -115, 25, -122, 56, -159, -236, 106, -81, -194, -70, -189, 34, 23, -69, -167, 187, -76, -24, -155, -72, 98, 213, -175, -14, -52, -5, -72, -19, -163, 199, 70, 41, -239, 100, -43, 189, -343, -359, -61, 110, 0, -258, -32, -122, -111, -43, 32, -32, 142, -152, -147, -78, 142, -26, 209, -135, 241, 48, -87, 36, 256, 57, -143, -66, -137, 104, -183, 148, 46, 158, 9, -54, 31, -90, 249, -190, -180, -39, -144, 87, 248, -108, -273, 53, 127, 225, 91, -61, -127, -287, 192, -52, -119, 92, -177, -24, -302, 154, 163, 193, 208, -247, -75, -133, -201, -37, -67, 371, -72, -421, 101, -208, 137, -258, -78, -238, -77, -43, -80, 194, -67, -29, 189, -141, 61, 37, 33, -15, -93, -91, 186, -200, -136, 142, 192, 35, -61, 29, 92, 15, -95, -98, 41, 234, 54, 115, -33, 233, 143, 39, -95, 94, 140, 201, -178, -115, -140, 155, -162, 149, 292, -213, 159, -330]
7444c30M76J8l30O25o24K22j88J71l5m73M20m7l9L40j05j11k02K00n2J46j21j60
7466a99J16J79l8K42k60J91j98P3q5L2J82m21P5R5j54K34l25J74M4L86m78M5K18
7489A28k62N4q2j7J94j17J48Q9o6Pj77ol1J65k23L06l70L86n5KJ90k47N9Q2o0
7514I7m8k13L69k98J65j57J02o1J11R1n5K21l46M1j42lJ39K68r3l45J63j90O7
7537a17J46J49P1p8l64J05J53L90j19n50J39J14n5Q7l69J50L69k67j87Q0k2J06
7559f9J43j60J00nl0O8k04J01j34K92k69K59K9j72J93j40m0J09p3RR5k30N9K1
7583d8N0L90n49K18l7J3N5k39J27K75m45K74P7o9j60n0K19j07n7J91j5j44J87
7606A56LP1j23mj80M1j19R5OP5J25j28j74J31J97l0l59j17J35L15J0N1j95q6K13
$$ y = [-330, 146, 164, -166, 459, -165, 57, -131, 40, 5, -468, -48, -95, -134, 206, 101, -10, -212, -12, -64, 82, -39, -199, -83, 96, 58, 300, 40, 231, 33, 106, 21, 53, 235, -186, -111, -16, -170, 64, -261, -87, -43, 343, -135, -90, 128, -134, -80, -162, -179, 15, -102, 46, 135, 69, 76, -101, -107, -138, 27, -196, 110, -260, 126, 71, 73, 263, 16, 75, 157, 97, 49, -164, 205, -93, 72, -85, 17, -44, 67, 158, 103, 324, -22, 19, -123, -126, 13, 281, 188, -157, 6, -184, -117, 29, 178, 249, 171, -193, -88, 65, 455, 336, -214, -75, 39, -16, 71, -298, -148, 221, -46, -233, -153, -175, -69, 74, -86, 14, 9, -21, 47, -157, -56, -190, 102, -167, 92, 121, -51, 142, 2, -38, 71, -2, 7, 102, -128, -69, -48, 2, 392, -157, 61, 24, 37, 92, -147, -20, 255, -190, 84, 161, 92, -68, -118, 101, -6, -63, 128, 113, -31, 156, 159, 230, 107, 103, -77, -36, -155, -60, -54, 21, 146, 18, -156, -25, 172, 142, -217, -334, -199, 116, 126, 177, -18, -104, 109]
7631A09j99N2K78j44k30M31k74M0NJ9m45M21j74J65O9r9kj59q1L76j88k06K35
7654aN4o5L18m02j20J41p5L23n43N91k82J3M57o01j8L51k95J06m1K01j29K33l41
7677a25K03J10k85j3P9p0K3J36O9j11K3k7J62J5k13J54j69J29P9o1j14O1R3k96
7701a48J9J62j87K14mK0M4r6M7j41k8L6m1P0%J56l13M78k64M6l04K8L73l35P3
7726i5J21K36l29K64l87J31P6M6Q9k34K37j14j0M8j16j67J67J54j41L8j45p4J72
7749c3p7J20Q3j01K8L16m8m03J7K84k64j62M87n6j36j4O5k75J69j54K56k02j3
7772a13M5o9K82j17j08j89M74k00J32k72K76J15m01j0K15j02j30J96n0R9j37l7
7794a01j00k13K30K46r3Q3n2j7m51O42j34l03L47k29L20j55J3O8k04Q2mK29j93
$$ y = [109, -90, -38, 240, 96, -134, 297, 23, 63, 68, 87, -358, 63, -111, 54, 123, 24, 22, -137, -218, 158, -30, -236, -1, 53, -12, 306, -96, -216, -75, -150, 173, -370, 221, -61, -48, 409, -192, -210, 141, -154, -48, -89, 112, -17, 216, -125, 78, 188, -97, -110, -31, -101, -78, 58, 127, 16, 39, 12, 174, 189, -24, 130, -39, 90, 169, 108, -6, 55, 148, -148, -129, 33, -154, 60, 56, 76, 120, 24, 71, -70, -98, -62, -103, -33, -33, 123, -190, 288, 24, 70, -234, -206, 167, -168, -95, 26, 262, -67, 197, -190, -59, 17, 63, 152, -82, 155, 41, 31, 79, -37, -204, -37, 117, -24, 14, -131, -205, -33, -110, 10, 93, -8, 20, 336, 288, -115, -98, 186, -78, -240, 247, 191, 55, 41, 106, -169, 0, -154, 102, -100, -113, -68, -137, 145, 28, -80, -269, 205, 5, 137, -135, 141, 256, -145, -155, 60, -42, -172, 24, -26, 73, -64, -101, -201, -414, -184, 62, -31, 52, 0, -17, -468, 174, 40, -263, 84, -145, 175, 20, 33, 101, -103, -21, -25, 204, 11]
7817A1J57J6j31p8M0j0J15k45O0J3K75j92k54M01j64r9L22k91m6llL22k71J45
7841I0l17J48r6O7j10L99o6k18J44O7k6K07l42K83j79q8O8o4M17m85J9o9J72j82
7865a61L5K22q0j92j5J53j63K37m7m7Jo2K55p1k24J45P3l15L39mj53M4qj73M39
7890B28j72k54NK57Q0J53k10p5p7k39K22j3o9k8N10l27n1l2LN0Q0j37L24o8k34
7915g4J87k91J80J06l9j76J26OJ44k45J90m5l9k4k32L14q2j32l6K62J3mk09M2
7939e8L72j01j96R2JJ73l45J4j2Rr5L53k94o3J46kJ10J15l49L68r8q6ro3K8J43
7965A53k61O9L2k5J6L03k07kk15p0K95l32L43j53p3K23l31L90j94L4np5%j0L25
7990B30j58n7Q5k90L13j13j68M32k69K26M4l03L00m6l47J14J87k1j18O5l20M7
$$ y = [11, 168, 184, 53, -25, 15, 5, 120, -125, -65, -52, 223, 31, -223, 178, 14, -85, 237, -54, -100, -103, -106, 216, -55, 90, -227, -79, -175, -108, -218, 181, 115, -103, 41, 108, 82, 289, -53, 230, 51, -37, 31, -33, 384, -101, -82, -151, 21, -161, -126, 96, 16, -176, -191, -38, -201, 36, -11, -58, -57, -119, 136, 65, -159, -14, 59, -256, 83, 79, -74, -30, -38, -211, 228, 56, -198, -193, 64, 144, 297, 87, 12, -65, -304, -82, -95, -164, -192, 318, -9, -60, -92, -89, -39, 41, -96, 228, 160, -74, 113, -178, 2, 108, 69, -107, 19, 25, 169, -76, 114, 69, 30, 6, -226, 88, 6, -126, -162, 100, 113, 109, -100, -58, 314, 213, 17, 109, 110, 283, -62, -48, -60, -51, -146, 207, -87, -150, -4, -6, 104, 219, -130, 238, 140, 54, 45, -18, 10, 153, -108, -39, -7, -32, -16, 287, 80, 78, -137, -207, 88, -244, 99, -54, -127, 96, -235, 155, -39, -5, -10, -85, -85, -95, 230, 72, 15, 100, -190, 123, 10, -158, 274, 5, 231, 275, -28, 272, 226, -121, -7, 180, 159, 41, 106, -214, -167]
8012a67O9J87j13J49j57J32k52Q9j54K70j67J33l3j20J69k30J97l48N67j91pN3
8034G6j06j14K75l52L90j60O5K21m59L58k81j9K71k50J33J9N9j73j48j2K58N7
8056A08j19J95q9r7O0k08J17J01j6o1j31R4Q7J02P8k78O7l10K03R9j31L11k86
8079a04J56k76K84K58n90L94J65l07J78j09j08J8j31J98l1j39J88J0m07K64R4
8100EK7l86M12j30J4O0J81k95K56j44j32J33O8j10K66np4k11P4r1P8j29M1LL7
8125e2j29rK62l4J69r0R0l02N0K61o6k29j87J69L00k76M7q3J88j43K80q2k06K99
8149B27k74J79l43Q2K79k06Q5m8K36k94R4N4k75n3j7M35l5m80M11j01k6J50p4
8172FK4r5lqJ28k9O3L4P0k11K33m11K23J10j58J79l6j10R2
$$ y = [-167, -98, 89, -24, 125, -32, 100, -152, -63, -217, 53, -114, 19, -14, -134, 35, -195, 2, -346, 221, 30, 23, 76, -30, -144, 131, -221, 169, 9, 74, 295, -164, 194, -87, -106, 165, -85, 48, 67, 126, -47, -195, -207, 51, 108, -11, 184, 95, -2, 58, -150, -33, 68, 52, -9, -140, -46, 41, 143, 221, -57, 10, -300, -97, 2, -129, 182, -104, 52, -224, 60, 318, -272, 122, 287, -20, 158, 49, -59, -41, -172, 26, -5, -144, 44, 54, -353, -89, 5, 32, -354, 58, -72, -58, 2, 183, -112, 144, 0, -132, 1, 69, -41, 225, 220, 146, -65, 9, -82, -4, -133, -92, -89, -52, -181, -190, 72, 38, 207, 117, 207, -95, -45, 216, 150, -79, -266, -97, 203, -73, -26, -109, 79, -64, 216, 134, -72, 227, -47, 132, -211, -129, 150, -56, 29, -19, 217, -77, 17, 71, -204, -257, -274, 161, 126, -354, 57, -44, -70, 80, 6, 30, -65, -68, -76, 52, 23, 86, 120, 190, -21, 212, -199, 24, 134, -24, 155, 119, 9, 101]
8191A01
$$ Imaginary data points
##PAGE= N=2
##DATA TABLE= (X++(I..I)), XYDATA
0@%%%%%%%qJ6j6K2l0L2m0N6p2Q8j10J34j60J92k32K80l29L85m50N25o11P05q10
30d33R29j062J209j370J549j748J968k207K467k754L069l415L790m199M650n141
46b698N677o261O900p602Q373r225J0165j1210J2378j3688J5171j6866J8824k1114
60a1176K3835k7136L1238l6489M3492n3356O8386r4378J51795n06163K22463P60448
72E72959o02601m51335J43819O05502j11248j80170M6671J00892k588L7306J20151
83B79358j90640k41223J36498J82780k4659l71958J4336J76894j1669m3046k6368
94a19697O6555m6726M7675J71291n0449j19898J2950K60311m3165k26981L3885
105a4249J36191L4624k28066j3095J57221p7636r2811K831J04056o8010o0371
$$ y = [0, 0, 0, 0, 0, 0, 0, 0, -8, 8, -8, 14, -16, 16, -24, 32, -40, 48, -62, 72, -88, 104, -128, 152, -177, 208, -242, 283, -328, 377, -433, 496, -566, 643, -727, 822, -926, 1042, -1165, 1302, -1452, 1617, -1798, 1992, -2207, 2443, -2698, 2979, -3282, 3618, -3984, 4389, -4836, 5329, -5881, 6497, -7191, 7980, -8886, 9938, -11176, 12659, -14477, 16761, -19728, 23764, -29592, 38794, -55584, 96211, -409952, -187489, 572959, -29642, -480977, -337158, 268344, 157096, -23074, 23597, 124489, 121901, 159207, 279358, 88718, -152505, -16007, 166773, 142114, -229844, -215508, -38614, -50283, -93329, -119697, -53142, -99868, -52193, 119098, 68649, -51249, -38299, 222012, 178847, -48134, -14249, 121942, 156566, -71500, -84595, 72626, -5010, -97821, -94990, 9066, -58944, -119315]
116a19315J12927K0746p7514m5092K07408K9597k25156K3389J97264R7647k49735
127b7834j19583K46267R3770j67114j67989J19133J02342p9576o3066j2086M8511
138b7225m8465M5640O3008r7694j6714N6990J11419k6254r5595M6094N2022K4395
150H7621l4414M23m3106m5706Q3481J2224o6989j25460M1280J51390o8029j09137
162a16422k274J17398L9411p0205J1045L8717K9886j9226M1436J6781p7181J3892
174B3258K9030J7533o9594o1557O4113r507m6143j5901L4041j466m4460M2831
186c7822M6939O948n6092K9920R6164k9252l1404p017M1263J1267n8350J718k620
199A1662j6463k2637L990k158l5821J4879M875J6133r288J952N1651k1628M011
$$ y = [-119315, -6388, 14358, -63156, -108248, 99160, 128757, -96399, -73010, 124254, 221901, -27834, -147417, 98850, 192620, 25506, -142483, -23350, 78992, -584, -63650, -75736, -27225, -75690, -30050, 32958, -64736, -81450, -24460, 86959, 60705, -34890, 11204, 63226, 87621, 53207, 53630, 10524, -35182, 48299, 60523, -6466, -131926, -90646, 60744, -7285, -116422, -118696, -1298, 38113, -32092, -21047, 17670, 47556, 28330, 69766, 86547, 9366, 23258, 52288, 69821, 227, -61330, 2783, -6724, -52867, -68768, -34727, -36193, -80653, -37822, 9117, 16065, -40027, -10107, 86057, 56805, 25401, 18384, 59647, 70914, 12564, 14282, 11662, -4801, -27438, -23448, -25606, -61427, -46548, -41673, -25540, -34828, -32876, 18775, -2853, 1158]
212A158L3506J7803j2334l3494L5785K1809l0348m9076J2911L2833m4630k2293
224c6370o474J9840K80l3677K9898P369j603J1244J1859J3962n961J8658O716
237C5741k391j1902Q431K0731m5608j1819J2852K127j6598m4094K0640K2640j5455
250b4705j7650Q012K7071j41O402LJ4098R595l499K4454j8184q974J1260m320
264B3422m736k5918p02M217j2821j2995K495R492j7611Q622J2298P255L389j1544
278a5137L1592J2361j1556J632L529J1928r650r911o303k315p102r568L190k0501
292b7811L02J0339m661J982r739J8290J7194p897L109J1573J3108l625j226k99
306B0639K012k354j4944N806j1457j0901L387r262M00q631P20J0167j597K23P137
$$ y = [1158, 34664, 52467, 40133, 6639, 42424, 64233, 33885, -15191, -2280, 30553, -14077, -36370, -42844, -23004, -22724, -56401, -26503, -19134, -20737, -9493, 2366, 16328, 10367, 29025, 35741, 33350, 21448, 29879, 50610, 5002, -6817, 6035, 8162, -8436, -52530, -31890, -9250, -24705, -42355, -34343, -7272, -7413, -1011, -1008, 13090, 22685, 19186, 43640, 25456, 16482, 27742, 23422, 18686, -7232, -7934, -3717, -16538, -29533, -27038, -17546, -35157, -26535, -14237, -6982, -3593, -15137, 16455, 28816, 17260, 18892, 22421, 34349, 24699, 14788, 8485, 6170, -932, -10500, -7310, -27811, -27509, -17170, -21831, -19849, -29588, -11298, 5896, -2001, 1108, 12681, 25789, 22164, 20938, 20639, 22651, 20297, 5353, 11159, -298, -11199, -7812, -17074, -16674, -25305, -24585, -14418, -16015, -15792, -8655]
321h655J2726m88O509N366J370O537q491O694j958j3636K430n635m248q699o184
336a6362K049j476m437j535J0104j270M454Q805K80R963j891N694P872q352J413
351A5311J0j745n964n831m263l098k616q565L649l774l025J0181j881M516J796
366e299L687J1923o60p40L349M818j042k267l437m605J870r042k048l041q997
381a5531M695k491q99J277K53O123L181J453L704O889l5J687M660k806K413n289
397I284k889K414q534l367k811l381n36k194q40J073J671K75O283K242L89P050
413F129k29M727K164k791K760l752j856N54m506n650k839l99j500r03o050J433
429a2708N454p76L929m97K027P655J530K364o12n12L474J604n383m915j36j404
$$ y = [-8655, 4071, 3583, 10092, 15458, 16828, 23365, 14874, 21568, 19610, 5974, 8404, 2769, -1479, -10178, -16362, -14313, -15789, -20226, -21761, -11657, -12927, -8473, 332, 612, 10575, 8684, 14378, 22250, 13898, 15311, 15321, 13576, 7612, 1781, -2482, -5580, -8196, -16761, -13112, -16886, -19911, -9730, -11611, -7095, -5299, -1612, 10311, 9651, 8911, 12260, 17078, 16036, 13769, 10332, 5727, 7597, -1445, -3493, -6534, -15531, -10836, -13327, -14226, -12949, -12696, -6573, -3392, -1939, 1765, 8654, 8619, 10306, 14966, 12160, 14573, 9284, 6395, 8809, 275, -3092, -5903, -9284, -9820, -12014, -12854, -11781, -10110, -9835, -3552, -1310, -921, 6129, 5900, 10627, 12791, 10000, 12760, 9008, 7152, 7706, 3200, -2450, -5289, -5688, -7188, -8091, -14141, -12708, -7254, -8030, -4101, -4598, -2571, 5084, 6614, 8978, 8366, 7854, 11328, 12932, 7549, 2634, 2498, 1094]
445A094K67p002m876L682k349M25k66r37M491K230K298L114J549J514K930J749
461I913j202N65l553L2M63n875r61l903j295R74l370j510J177J499J338K007J230
478b471L134L194j104M380J773j582M33k500J712l81n642k348n54j852j094j631
494f533k327R27N47J540M407k077Q54M473K939K938k998q42L967J316k623l607
510B901k090j52Q46m639k778k99j486K930p20j083K198P71L212K938k72O01K152
527E030J611J187j463l384J344J08l473j885l111O04L64l648M25J352j44L79J547
544c157J984K352J51M83L817J42k52M26j749P76j965k349j36k480j868P1n32j173
562e459J31n86K080K504r61J422J273K382K855j658j95J103M19m39j514k953p72
$$ y = [1094, 1361, -5641, -10517, -6835, -9184, -8759, -9025, -9962, -5471, -3241, -943, 2171, 3720, 5234, 8164, 9913, 8711, 9276, 5723, 5755, 6218, 343, -618, -4521, -5816, -4842, -8212, -9722, -8545, -7046, -5708, -3701, -2471, 663, 3857, 2753, 7133, 8906, 7324, 7757, 5257, 6969, 6588, 946, -1402, -1956, -3808, -4902, -6533, -8860, -7933, -7386, -5846, -1439, -3516, -2662, 1811, 4750, 7688, 4690, 3848, 7815, 9131, 6508, 2901, 811, 659, 1505, -3134, -5912, -6211, -7697, -4767, -5487, -6570, -4372, -3601, -389, 2549, 2277, 2878, 5030, 6641, 7828, 6365, 2981, 4325, 4433, 960, -925, -4036, -3432, -3068, -6716, -6291, -4939, -5083, -4704, -3157, -1173, 1179, 1330, 1813, 5630, 5772, 5520, 5946, 4197, 4973, 3008, 659, 523, -1957, -3825, -3754, -4286, -5459, -5328, -5914, -3834, -1330, -2291, -869, 404, 2786, 5641, 3983, 3788, 4891, 5310, 4871, 3357, 404, -368]
579c68M65k069j134j674j028J893K07j00L86k84L726K992j044J1J313K029R12
596F233k346j415R37j077j661r13k238k93p30j032J063o54m49J816J154J045J318
613G58L23J364J537q00R07J28r56L58j685j006l25j864j024o63j171Q48m45q00
631d516J605J410K56J431J52J387J788l90N06oo32K66n14j692p72j657l95L99
649a374k046j229J102K63O83N36j76K271R79K87J153o4O85P49m20q36k32j668
667F63J82o60k029k78j051n7O55q83L00J078O22J331O53L24J240J141l38L94p60
686B527L06J48k010l73m26j400l7q91r75M41j61j42J218j1P98J286J29J425N70
705B422m37J256n85n52O67j159r05l83j254m61j11j270L7K34m59R27L76N69J339
$$ y = [-368, 97, -1972, -3106, -4780, -5808, -3915, -3708, -3808, -3422, -3706, 20, 3012, 1968, 1979, 3292, 5321, 6233, 3887, 2472, 3409, 2332, 671, -242, -2480, -2773, -3503, -4535, -3472, -4126, -4575, -2759, -1605, -560, 758, 1081, 2445, 3982, 3182, 4089, 4217, 3261, 3619, 1934, 928, 603, -1261, -2285, -2948, -4119, -3271, -3716, -4516, -2911, -1501, -1245, 186, 338, 1725, 3513, 3123, 3629, 3623, 2991, 3257, 2743, 1051, 279, -1378, -1773, -1374, -3420, -4649, -3547, -3284, -2601, -2065, -2241, 30, 1009, 1296, 2449, 2385, 3070, 3819, 3399, 2563, 2331, 663, 845, 185, -1844, -2122, -3173, -3230, -2575, -3458, -3158, -2080, -1458, -127, 526, 850, 2090, 3231, 2893, 3287, 2527, 2833, 2981, 971, 598, 172, -1228, -1265, -2156, -3131, -2690, -2851, -2993, -1775, -1786, -988, 298, 427, 1852, 2422, 1985, 3241, 2656, 2104, 2771, 1612, 707, 324, -930, -1391, -1502, -2772, -2735, -2501, -2960, -2033, -1657, -1088, 251]
724B51k68J235R58k48J090l55o25K64q32j049j44p63q86K13j374L0nm1O39J88
744a722N48J080J66P45J188j94J28P87o26j64m79o25k1j171o64j71r12j27K16
763b018k93J66P45K04J152O66l62J472oJ65O53p92K91l51r12k55p02p34r2p96
783a799k09J02l61J54J107k61N96Q28N69M84M50j48R41n21k11k2p13m91m48q48
803h01j73k77r61L75O1j03N59M5N53Q66J15P58M18j55M82J42m52J48m14p94j07
824B85p02n87j47o22k6L8r7N97Q4O04Q15j70M43J018k12K65L58p42M5k19o25m9
846C54l40p45k10k88l00J69k37K98M78LP12M03K60N81K09r0J90j81O0k42p54k
868C28n07p03K21k44q93N90l97M74L54K34L60M05L11M55K51m07O17j14k14np61
$$ y = [251, -17, 1218, 2176, 1928, 3018, 2663, 2038, 2302, 1470, 421, 277, -486, -1372, -1159, -2533, -2503, -2508, -2549, -1910, -1722, -1174, -94, 72, 817, 2005, 1811, 1939, 2726, 2100, 1936, 1457, 832, 811, -360, -1024, -1195, -2107, -2234, -2018, -2311, -2145, -1400, -1196, -44, 622, 260, 1732, 1726, 1891, 2544, 1752, 2043, 1692, 780, 525, -177, -911, -1003, -1799, -2008, -1906, -2267, -2113, -1006, -1267, -671, 157, 726, 1210, 1660, 1512, 2453, 1932, 1721, 1699, 986, 495, 47, -801, -974, -1251, -2212, -1837, -1776, -1879, -1320, -1275, -722, 144, 259, 1017, 1435, 1280, 1762, 1904, 1452, 1600, 1186, 392, 285, -417, -1004, -1151, -1773, -1799, -1761, -1858, -1261, -1177, -573, 242, 72, 515, 1533, 1321, 1586, 1944, 1202, 1247, 1028, 403, 354, 14, -731, -941, -1229, -1529, -1360, -1597, -1299, -821, -818, -106, 297, 557, 1138, 1347, 1257, 1447, 1266, 1326, 1084, 330, 328, -179, -882, -661, -905, -1798, -1208, -1605, -1131, -777, -543, -183, 222, 533, 988, 1239, 832, 1449, 1335, 1121, 1116, 355]
889C55m7m66l85k64M8n64K24k9l38M97J41M66M44K83O01k28J57N33j16q9k49o20
911C54k09mo89j71j11n25N30P3n03M69J77L37N11k6M93L33k72L98k6l17R6m17
933E01n62J67l79m59J50l13k2r3l2K88M33k23N26L24j79O15J03J83J95n71L21
954I73l82l18k29L6n59K29o21j31J33k44M58j6P2M44M15J66K16l3J98L94l62j00
976G39k8l75j94l43n42M15m12j41kQRN73k65K01Q49p53P43J12k59O27j05j8k24
999F15j76k24k32k46j42o6l94L33j63j28P66o7NL48j68L02P05l69k4J19j96k20
1021C78j55j98j09n4k73o6q9k94L26m2K53Q6jL45p1M04J84rLR5j10q3k4l64k52
1046a20o1l01K19m39K8R6j4Q2O2J24L62L18j38N89j66l09N29j77l65mO3k38k40
$$ y = [355, 308, -158, -543, -807, -759, -1323, -1099, -1128, -1466, -969, -828, -362, 82, 365, 966, 738, 895, 1428, 1312, 1223, 974, 354, 145, 141, -548, -719, -830, -1355, -825, -752, -1255, -786, -609, -272, 239, 213, 706, 1039, 767, 1165, 1139, 822, 918, 501, -61, 106, -273, -732, -582, -895, -917, -1010, -1042, -754, -321, -544, -18, 306, 127, 742, 845, 1028, 1223, 652, 973, 591, 273, 44, 80, -479, -250, -871, -1002, -869, -1113, -655, -671, -599, -155, 260, 426, 642, 609, 807, 1201, 839, 739, 711, 336, 142, -201, -743, -328, -740, -881, -883, -875, -866, -293, -558, -357, 492, -261, 482, 594, 335, 962, 857, 839, 615, 439, 215, -17, -263, -405, -471, -865, -532, -695, -823, -57, -124, -119, 229, 61, 363, 1068, 699, 675, 794, 598, 378, 223, 25, -84, -138, -411, -477, -566, -860, -534, -576, -323, -237, -238, 107, 36, 440, 624, 615, 618, 713, 603, 520, 496, 132, -120, -181, -482, -263, -702, -674, -578, -592, -510, -448, -324, 38, 356, 218, 807, 641, 332, 861, 684, 319, 315, 378, 140, -100]
1069a00l97P0p4k56M1K56r2P13k45Q6K54j6J67k0K94M0k59r9R0n79J9K10l16j21
1093c34M4l09J51J25j01K63L9J26N4J41J55K10j25J53L3o06J19J76j96J19n70
1114c33R3j83j48J48J1J14K79q5n6K97j11L39P6m3k29K80k6k18L7m25m3Q6j09
1137b49ml02j18M67j28j7K3J53K16QK06K92j53J12l36L73J8l57j15k80J00m21
1159e12L84l65k57N20J12j18J8M4K90m5k3K86J32N7J34l62k06K15n59K57q3l03
1181c84J25J1k63R6J89o5M3K57o4P0J57J7J19J07K11m38JL17j96k02r4k08j2J9
1205a87q4l7J33k07j22J74K85J39K06QL1PM5j3r4J36m76P3k95Q6K69k72k56n2
1229e03J79Q3J64Q9K29l38N4R3K32K65k14L2o6j20j91o3K32k58n6o0j96L2OJ2
$$ y = [-100, -497, -427, -501, -757, -716, -460, -552, 161, -84, 2, 256, 240, 407, 387, 681, 721, 462, 363, 453, -126, -107, 103, -213, -334, -290, -599, -448, -323, -424, -161, -122, 4, 58, 199, 354, 564, 439, 592, 625, 19, 138, 314, 118, 237, -333, -240, -423, -571, -423, -412, -298, -19, -104, -160, 137, 26, 365, 441, 398, 169, 449, 423, 205, 242, -183, -226, -140, -249, -253, -555, -673, -206, -334, -351, -328, -175, 41, 49, 255, 547, 394, 506, 170, 543, 561, 204, 89, -191, -91, -512, -128, -493, -750, -230, -118, -236, -218, -174, 116, 71, 48, 334, 466, 523, 657, 295, 89, 304, -255, 2, -81, -384, -259, -248, -511, -415, -226, -291, -248, 9, -55, 15, 172, 189, 308, 415, 626, 188, 189, 506, 310, 108, 14, -194, -206, -187, -271, -308, -175, -382, -504, -330, -45, 94, 300, 308, 339, 346, 391, 378, 284, 420, -56, 17, -278, -192, 77, -195, -451, -503, -324, -241, -77, 12, 241, -97, -43, 50, 282, 547, 333, 365, 299, 179, -12, -75, 157, -101, -157, -217, -413, -381, -375, -363]
1253c63L2N26k11K37j79k2J61o3K31r6K4M8o2k26j49j32q7J28j66j9K50P4j55
1276b19R8l9J49o7R9K02n6J0J41n7p6J34l81j46R1r1r2L28k19o4J77j61M5L60
1300A66j28q1N6J91J67J9j10K7L9m71mj60J06l8j29N5P1j08J42J22J66J46k73
1323b9M96l35j70K45J01K04k45k75j19J97r4n9j82K70L1n88J79K35J10k31L87
1344A28j7J54J3j52J6L5R1j04J99k94J42k69k14J27j79J03Q5j77K66k10P9M29
1366B51k11n5J51Jk1K35r3M0nM2k24l39J2J4k72K68l2J02pP3K07l17J03J65J0
1391I8p1K5K74J25k63Q0l06K63l5k33J29l35J48k29J16k26J24K30J27O0oq0P1
1414H6J81Q0O6l94K21m4j04j94Q5J9k59J32r6J79M0k21K95j84L26k29J51K37j1
$$ y = [-363, -331, 195, -16, 221, 42, 20, 181, 118, 349, 253, 277, 325, 263, 37, -112, -244, -331, -203, -369, -388, -138, -64, -219, -121, -160, -11, -78, 21, 223, 167, 177, 318, 261, 185, 319, -62, -208, -117, -208, -300, 28, -191, -255, -78, -239, -194, 166, 38, -43, 13, 204, 371, 390, 280, 307, 346, -125, -129, -289, -183, -221, -350, -295, -224, -332, -190, -68, 98, 244, -29, 467, 132, -38, 207, 308, 512, 267, -8, -127, 70, -24, -83, -265, 5, 36, -552, -373, -138, -28, -259, 128, 111, 265, 278, 126, 142, 177, 268, 164, 363, 69, 211, -58, -272, -145, -324, -221, -136, -313, -47, -257, -178, 251, 40, -15, 136, 137, 116, 351, 258, 298, 293, 335, 111, -228, -216, -202, -474, -206, -238, -136, -143, -70, 137, -180, -77, 88, 98, 27, 52, 326, 451, 188, 268, -38, 225, 190, -43, 86, -249, -101, -330, -214, -440, -316, -86, 41, 101, 95, 15, 86, 267, 347, 413, 19, 240, 196, 92, -102, -17, 2, -257, -125, -221, -42, -2, -223, 72, -112, 214, -15, 136, 373, 362]
1437C62o8j43R7l8j0p5j04k60J69j26J3j21K22o7M5j03j6K68J22K4k12L39P%j73
1462A52r7J39j77o1M7m9J01m89J49j20Q6K64P8j19J12j06M41J43m84OJ56j06m
1485F2L1Nrnk98l5P6j69M9J94j28K71o5N8J13j01o4M12m05l3K11L19m55p2K59
1510B21m10QJ57p8J1m3pJ11J11k16K73J58m2k23K71k64L63l46K94r9l40K38k0
1533A28k74p1K33k79O8k20R1R3L03J18j34N9Q9j78J22P4j8J18j01J33l71r6J84
1556G1m48J74JM6o1%K14l2K1J88j78k1Q5P5J53k3l16K72j40j04j2Nj90O8l1L6
1582a47J29m37L36R2P7J4j22K75Pl17L20P8k43J19k35RK6L4L1j44Q2j24Q0j29
1606a89L96J15l57l7R8j37K04J2j6J41J95n71J67m3J10L02m81R2j0j41L30n65
$$ y = [362, 294, 151, 248, 210, 200, 125, 21, -239, -70, -196, -183, -304, -82, -149, -104, -207, -223, 45, 167, 191, -21, 318, 325, 325, 152, 55, 194, 17, -44, 3, -46, 55, -434, -285, -405, -319, -55, 23, -96, 16, -90, 351, 494, 10, 16, 172, 66, 62, 93, 98, 89, 84, -214, -249, -173, -342, -293, -99, -227, 44, -21, 37, 150, 49, -15, 397, -8, -41, 170, 489, 34, -38, 221, -189, -181, -24, -102, -91, -134, -141, -30, 81, -135, 138, 296, 254, 31, 302, 38, 401, 55, 349, 250, -90, 148, 128, -146, -217, 16, -263, -195, -415, -324, -231, 72, 190, 56, 115, 204, 26, 148, 222, 204, 322, 221, 354, -17, -113, 71, -377, -203, -202, -156, -217, -217, -3, -35, -14, 174, -4, -25, 60, 135, 288, 265, -51, 221, 81, -23, -35, -30, -220, -152, -183, -147, -18, -455, -119, -27, 50, 64, -58, 217, 224, -93, 227, 305, 62, 181, -54, -45, -19, 15, 46, -98, -16, -140, -60, -189, 207, 322, -35, -72, 26, -111, 93, 105, 89, 230, 425, -146, 21, -22, 88, 390, -91, 1, -9, -150, 180, -385]
1628c85L48k5p6J1P9R4r3J13J32m7M1j05r6qr7J67j07j14l2k07K96R4j27J44j46
1653a46P8J46J26k10K03k69K26L45l29j62J02L7j13r5j8o9J30L4NL2ol46L70l0
1677D1j04K01j22J4J77k38J5L78o2k55j62k80J77K25p6p8o5L92m36K80j8N6k58
1700a98L53Q5m7j24R5j51K7n3P9k28J2J27J06j09k31M68l21J2J7Q0q5K64k66L9
1724d9K67m8K17k69kk00J67k85J68J34l20J77m6j80K04M4Qj84J06K34lj51L37
1747C26P0l83L13k79J20l56K75J36k7k02j02J15j25q5L85l46P8K42R6j85j63J21
1769B4J87l53J46J22N2l11L7K4l4oq2j41K57RK28j78K40j49j61K77O6j27M7J1
1793A85p0L1l15L82m48K37j44K40p3k33R0J9J17j31L02m46K20K3J10q7R2J02j95
$$ y = [-385, -37, -62, -138, -127, -48, 46, -47, 66, 198, 151, 192, 87, -9, -17, -114, 53, -54, -168, -200, -407, -111, -17, -144, 0, -146, -68, 78, 204, -6, 197, -72, 154, 499, 170, 8, 110, 147, 34, -61, -79, -148, -18, 16, 21, 53, 47, -299, 71, 41, -63, 138, 16, 30, 207, -31, -16, 362, 300, 45, -117, -397, -220, 5, -71, -149, -214, 178, -258, 22, 4, 60, -198, 155, 240, 193, 69, 164, 13, 40, -13, 66, -162, -150, -23, 83, -26, -257, 211, -110, -98, -81, -1, -86, 178, -88, -49, 218, 170, 387, 118, 116, -84, 83, -202, -34, 100, -220, -43, -89, -269, -65, -21, -13, -197, -91, 143, 140, -11, 326, 396, 13, 326, 47, 167, -189, 86, 222, 195, -7, -109, 6, -119, -204, 181, -165, -87, 155, 251, 66, -97, 24, 211, -142, 4, 126, 178, -133, -96, -72, -106, -112, -194, -335, -78, -69, 159, -19, 221, 72, -89, 188, 254, 127, 174, 185, 115, 146, -169, 213, -235, 2, -142, 98, 25, -208, -118, -99, 18, -113, 189, -257, -37, -14, 96, 9, 101, 203, 8]
1816HK76l80R8m8L5j00K48n33K14Q5j13O7O1J81N4k74R7k6K84j1k78L0K56J6m03
1841a56M8m0mJ44rM9l5j01O9J55m0j26j04L72l08K96j96R5K52m95K02k67K57R
1865F7O4j26p8m5j39J14J26J99k14l19L65J73j13p1j10J39K2J31K86l91j1o6j6
1888a3k03K13O6k52K85p2r0K37q6q6R8Mm1j03M9p7m0M55n79P4J74q6k9O9J14j27
1914d6j12p1L71k07K91l93O70o19L45k72J68N6k45O8N0j3r5J22j61k2L7J17k84
1937b45L24k65J67J8J28k22J70L2J46l45K53j74P6J54l60K25j52L71k34jk60J0
1959a84p1M85n10L54J75k79k1k6K76k48N1P6k59J50J43k70L46j71Mk03P4J38J31
1982A61l7j24r0J65j84L98l01m1R8j41N13n58L0p1M14j91l54L11j69pL4n9J57
$$ y = [8, 284, -96, 2, -46, -11, -111, 137, -396, -182, -97, -210, -143, -82, 99, 153, -121, -24, -50, 234, 223, -55, -25, 231, 247, -156, -108, -148, -152, -8, -17, 32, -3, -104, -35, 120, 80, -46, -150, 222, -86, 210, 14, 109, 361, -134, 68, -199, 58, 67, 131, 5, -73, -118, -257, -143, -17, 182, -32, -351, 14, 187, 74, 3, -107, 32, 54, 185, 471, 80, 69, 3, -13, -216, -3, 63, -189, 96, 24, -66, 171, 85, -1, 97, 101, 60, -43, 6, -71, -111, 344, -235, -161, 13, -73, -102, -33, 81, -46, -158, -229, 142, -65, 226, -167, 503, -116, 229, -43, 125, 181, -64, 4, 54, 41, -54, 68, -93, -115, -78, 39, -245, 79, -186, -19, -1, 127, -95, 75, 107, 253, -92, 161, -13, 63, 217, -143, 82, -70, 301, 67, 66, -194, -184, -255, 230, -280, 74, 249, -30, -51, -77, 199, -49, 2, 78, -181, -31, 112, -158, 188, 17, 21, -182, -108, 30, 161, 124, 0, -90, 75, -109, 289, -12, -53, 45, -96, 417, -141, -111, -182, 232, 41, -313, -2, -171, -178, -144, -203, -46]
2005d6Q1J90q7l91R2Q7N2j5j36K10K37k69O1k55o3k2P7O4Q6J01o9j11K16m3j83
2030a36K60J16J67m39J47l10QK87N6O7j94J30r5o2J71l76K58L2o6k7k62L84k8
2053H8q7k06J67N7j08j96K79J37k00l2l7K55j13k81K49k00K49r3L7Q2l73L56j52
2076a22P5K15o7r4L9M6p1j35K71j20K78k47j82L9J6J96l97J74K8Oj07J10J58p9
2100C0J18N8j17q5Q6j73K34n28K91n6N3J67j69R4P0nj62K37k15L98l13k4L09n27
2124b29K17N1n5m58O90k34K21j13l47K35m5k68K85K9K5j19K1O0p3J29p1K43q7
2147A07j06j6j63N49m54L79m75P7J16p8J54k39k18N09j60m3J16O1n4L2j58J05
2169D1J81l77L18j29K12k40J32k03K2L6j07Kj68N1K44K35m27j32K63L43n25M57
$$ y = [-46, 35, 225, 138, -253, -161, -74, -22, -37, -173, 37, 274, 5, 66, -189, -252, -274, -197, -133, -47, 54, -15, -126, 90, 47, -136, 124, 240, 407, -32, 115, -195, -187, 100, 156, 223, 29, 159, 64, 2, 173, -203, 55, 87, 21, -6, -268, 116, 88, 1, -205, -38, 19, -89, -285, -6, 131, -69, -101, -138, 117, 4, -277, -28, -228, 21, -72, -35, 47, -326, 30, -122, -47, 168, 101, 7, 46, 92, 21, -114, 157, 37, 315, 68, -114, -75, -59, 137, -260, -86, -58, -52, -159, -49, 109, 30, 148, 206, 89, 4, 90, -83, 151, -377, -86, -142, -89, 78, -91, 3, 73, 68, -94, 143, -72, 326, 13, -11, 298, -229, -12, 39, -16, -474, 216, -18, 203, 90, -257, -22, -67, -335, -50, -21, 4, -115, -94, -34, -107, 22, -49, 194, 107, 1, -15, -178, 371, -83, 296, -179, -102, 14, -64, 90, -149, -367, 142, -18, -61, 55, 116, 62, 94, -64, 41, 222, -155, 163, 34, 246, 6, 138, -65, -43, -7, -114, -112, -280, -229, 15, 250, -177, -309, -46, 297, -228, 229]
2191B29l63L56j72k10K29k80J56N1q1L9j44k8P8Q1q8Q7P5q4J58k81L05mJ12O4
2215B85k54l7m9J32m1J74j92o3j72L77J1k59K17j25M6l27K21O0L20m06L69n4m
2238B29l7k75j9o5K12Nj04K46j83p7M2O1k17J31O8N9r7N3k49m4L36J35j73O8q4
2263B1j16K46k50J19p4J76K4l70J95R5J52l57M9K2L77k20j18R6q4j46J60n2K31
2286A76k55J48j09l68N38k87M04k95q5K55k95L67k58L54o1k07l4M1J5J36p0N6
2308A66j75R3j59L4j68J65j89L12J92l48j18L15Jp3p5O9j35K20l1r1QQ1j20K88
2332B62k62j26L03j03j33J29l2j7r9r9K39Q5l7n0J50N7k96k19M82k86J9k1m5K09
2356A10m11M36l30N7j1j5K20Pp9n9J8R6m8K18j62P2j61K78k42P0K53k3l41r1J14
$$ y = [229, -134, 222, 50, -160, 69, -211, -55, -4, -85, -46, -190, -218, -140, -59, -147, -60, 15, -69, 89, -192, 113, 109, 221, 285, 31, -6, -55, 77, 36, 210, 18, -45, -217, 160, 171, -88, 129, 4, 50, -277, -56, 4, 324, -82, 287, 233, 229, 192, -83, -102, -167, 45, 50, -54, 192, 9, -68, -26, 35, -182, -51, 17, 76, -21, 32, -217, -261, 75, 210, 37, 105, 21, -95, 151, -99, 20, -54, 122, 146, -224, -29, 66, 218, -139, -90, -68, 309, 89, -29, 67, -17, -163, -3, -55, 176, -79, 69, -40, -408, 130, -157, 247, -48, -133, 122, -173, 194, -64, 290, 229, 22, -12, 29, 44, 180, 110, 166, -9, 84, -75, -41, -209, -44, -233, 79, 271, -77, -195, 120, 121, 48, -27, 42, -93, 127, 96, 5, 13, 94, -26, 262, 0, -126, 177, 74, -59, 70, 38, 21, -78, -177, 62, 147, 110, 60, 210, 267, -29, -248, 234, -52, -33, -54, -99, 110, -301, 135, -195, -138, -149, -164, 56, 63, -16, -75, -57, 39, -9, 209, 47, 119, -42, 236, -6, 64, 317, 294, -47, -138, -24]
2381b4k54L41k31RJ43j16NP6r7K31k42K71J34j36k26J35P4k3r8j4J98K2m62J36
2405a48J43n9O4j13O2J23O4J09j97J30k46M32j55k79n3O3r7J88j22K9J25j75o3
2428a75N6q8J96N9l1j35K44j75J32J88Rk30q0K57l99J23L0m8J93m26L04q7Q0Q
2452EJ05m03J82L67j26j01n0K9k0k7J10o8K9r5N5n2j01M32m67L22k25K12l90K52
2476b5K17O8l43R1p0J88J4oj20m3P2j04q9L53m58L45J80l64p6K64R0j07j02K1
2500dl2j94M39l28j61J91L45l55J32j23J21j69J31L8M1K0m1k30J27o4P2j49J87
2523fj08K18j10L04j41j13J48M7j39m0K92k70j75Q1p4J76J56k04R3k11l9Q3O3
2546C1RM5l76L70j08L0o6K1M81n68o1k6L37j76J36p7K81j78n5J83P0m61K0J69
$$ y = [-24, -278, 63, -168, -159, -16, -132, -127, -51, -148, 83, -159, 112, 246, 110, -116, 19, 93, 70, -28, -42, 156, 178, -284, -148, -5, -64, 0, -113, -51, 72, 136, 245, 48, 178, -68, 364, 209, -70, -123, -60, -157, 31, -91, -62, 63, -112, -175, -119, -207, -11, 48, 17, -118, 126, -49, 83, 271, 280, 50, -30, 227, -172, -49, -19, -67, 126, -300, 4, -83, -3, 5, 110, -293, -111, 256, 130, 29, -21, 8, -12, -39, 71, 3, 32, -63, -8, -60, -161, 271, -196, 126, -99, 113, -277, -25, 192, 260, -83, 8, -62, 126, 140, 134, 14, -29, 43, -61, -150, 203, -255, 90, 270, -94, -170, 94, 184, 77, -25, -4, -36, -230, 209, -119, -280, -89, 256, -99, 33, -90, 31, -138, -7, 31, 72, 92, 51, -179, -52, -116, -44, -193, -6, -114, 104, -6, 298, 157, 44, 192, 239, 100, 60, 352, 82, -93, -12, -86, 90, 246, 42, 135, -76, -115, -32, 31, 40, 85, -291, 79, -29, 1, -65, -44, 437, -131, -192, -218, 119, -57, 79, 2, 283, 105, 50, 233, 303, -158, -138, 31]
2570C1j27lmL39j28m6o1K94l25J04N7J9j05k35K03j3j41J9M1MK11l04P9J63J06
2595A78nn03N63p7k70J55m66L53O7l4p6j11L02k6p3j38J07K23l72L24Qk77L09
2618A61j00j93L8K43j65P9O3j74J69n63L39O1R4K90k69k85K66J96l8l21M5J74
2640A10q3k2r1j76M99l32l0K51J80m27J27M5k70J13K3j57J84j90J99k07K08j03
2662a49l4K30k09N04l26j38K80k61K29j36J81j75nJ77m4j74j45r8M0L59o2J1k37
2685a82J83J93k17J98r3p1j47j35P3J24J91j54M49k35j07j25j9L52k59O6r1lJ2
2708Cq9O0N9J72m20M40k47j54J98K0J09k04j3P7k7k54L17q5L24l71K28j36j80
2731a73J61N1jk14J20N17o44O7J23J46M8j75O8n5j50j25K55j71l6L70k46L4L58
$$ y = [31, -96, -99, -103, 236, 108, 62, 1, 295, -30, 74, 131, 150, 45, -190, 13, 0, -141, -122, -81, -77, 134, -170, -91, 72, 178, 173, -330, 233, 156, -114, 41, -425, -72, -5, -39, -115, -226, 76, 50, -23, -161, -54, 169, -203, 121, 129, -148, 161, 61, -132, -94, 149, -16, 63, 126, -48, 121, -442, -103, -42, 52, 342, 73, -212, 54, 250, 212, -109, -64, 110, 27, 5, -86, -262, 237, -95, -125, 126, 306, -121, 6, 51, -219, -106, -83, -240, -56, -246, -47, -254, -46, -149, -183, 47, -162, 342, 16, -122, 158, -103, 126, -10, 171, -4, -9, 168, 124, -50, -195, -293, -253, 106, 44, 55, -182, 1, 194, -23, 175, 82, 11, -136, -271, -198, -74, 117, -37, 412, 177, 70, -55, -74, 278, 19, 85, -6, -9, 3, -86, -26, 33, 205, -215, 225, -22, -176, 22, 42, 151, -53, -66, 11, -16, -270, 47, -38, 286, -85, 143, 7, -173, -12, 39, 38, -176, -56, 461, -183, -116, 7, 153, 201, 26, 94, 39, -111, -236, 19, -152, -188, 182, -64, -30, 328]
2754C28l45q2K14N3N9K7j47j4j80p7J9J42J0j14K33n9r2op0K78j79p0J17J0j49
2779i4L00n8j87j01K35j42K4m4J35k62M7K5p2L25k17J00k12J37J27j85l1J62p
2802EK68k03j7M3j96P1pK15m85K43M4n1j43K79l38J89L8J59M9j77J80N6k96J55
2826H1l4k59J41R9n2j22K15N3J91k62N5M7O4l9k16L43j08q4j47K23M1l40L14k97
2850i3r4P1J58l3lj16j2L5J94j00Q2N8r3j34NP5J35j34j45K58j18Rr8J57m8K71
2876B87l02j17K59k30J61K7O6j77J44o6q5N1k48K44Lj94J68j13%L27j07j55j18
2899a75K16j54J3L00l77p5L59p2J45m09K60q1J76j77k3n6R0j81LP1K16j33n0l8
2923a52J86R4p0k17N1J79l08J81p3K50l51J41O7N2o7M22n11L8J29j96K59k1O9
$$ y = [328, -17, -99, 115, 168, 227, 254, 107, 93, -87, -164, -145, -3, 7, -107, 126, 67, -25, -31, -101, 177, -2, -72, 45, 55, -94, 206, 148, -39, -140, 95, -47, -23, -67, 68, -194, -147, -122, -194, 131, -86, 14, -198, -61, 66, -119, -150, 12, 5, 273, 70, 53, 96, -100, -29, -36, 179, -306, -63, -19, -70, -213, 66, -272, -83, -45, 114, 163, -14, 166, 222, -74, 81, 47, -212, -71, 28, -24, -146, 69, 122, 313, 51, 106, 153, 217, 178, -38, 305, 197, 113, -34, 189, 230, -110, 204, -93, -187, -116, 42, 9, 6, -110, -122, -87, 107, 7, 89, 147, 54, -80, -75, 0, 135, 1, -144, 114, -4, 5, -93, 64, 16, 287, -15, -132, 127, -103, 58, 85, 151, -26, 118, 52, -33, 18, -230, 14, 17, -177, -9, -122, -122, 205, 98, -57, -175, 41, -113, -100, 200, -177, -252, 107, 35, 180, -229, 31, -50, 126, -51, -74, -130, -40, -221, -218, -147, 69, -64, -114, -152, 34, 128, 58, -159, -108, 71, -237, -56, -129, 121, -230, -89, -22, 30, -37, 385, -126, -88, 41, -155, 104, 83, 152]
2946A52j44j23L3J63m7j34M0K44k83K19j85J04J8K9j72K39k17j38P3J47j59J23
2968a8R4l68K04N1j5K9J03l06P53l53k97J75k10J69k14K55k67Q9mK95q6k42K03
2991D0m2J53m8j93J64J25n9O9Ql12J73j05n1N4L1K1l8j24P6l9K54k80M7L2K53
3016B09m85L09K4o6N0K13k33K49l70n6K07No0M2k02J75J20q7M8p0K39n34L52l9
3040D0K16n47L91j94J19j27J55J27M2P3k3j87o6J62k36K17j24l8l0P4k40J62J04
3063G0k8p2J19k74l4L18q7L18k93O3q8J02p7j60J77n7KJ23q2j7l74J66m9J89L7
3088hn2L0J21Q5k21J16j96J9J65K14l99r8N1N2L41q6j12j2j70L9K95j29j31j73
3112b59O96n58K05M7l86M03K04m50J61J84m37K71j00j28kK49r2N5j73j40J51K85
$$ y = [152, 8, -115, -82, 81, 34, -100, -60, 184, -99, 120, -65, 39, 57, 86, -86, 153, -64, -202, -129, 18, -141, -18, 76, -292, -88, -37, -52, -23, 80, -226, 527, 174, -123, 52, -158, 11, -203, 52, -215, -126, -130, 165, 79, -163, 40, -2, 151, 103, -90, 74, 199, 140, 209, 217, -95, 78, -27, -78, -24, 7, 28, -10, -134, -58, -97, 157, -123, -76, -44, 209, -276, 33, 57, -9, 41, 254, 21, 270, -100, -156, 51, 56, -4, 38, -164, 11, 131, 44, 92, 22, 261, -273, 79, 40, 256, -291, 100, -94, 25, -102, 53, 180, 222, 295, 272, 85, 19, 181, -55, 162, 38, 0, -30, 44, -196, -34, 70, 42, -30, 89, -185, -219, 99, 12, 330, 37, 100, 12, 114, 37, -123, 54, -3, -1, 122, 40, 23, -351, -185, -234, -45, -8, -60, -30, 91, 176, -45, 71, -125, -106, 59, 273, -126, -224, -173, -121, 220, 134, 22, 10, -160, -121, 174, 45, -86, -259, 437, -121, 84, 131, -255, 148, 352, -98, 63, 247, -190, 81, -19, -147, -149, 100, 8, 63, -110, -250, -99, 186]
3134A86j52j53oR5QL4mL78l59K01j95n4n1J31l4l3q4j79J27J44N6O9j72nJ43k21
3160a30K32j57J38MM1j05K61n17K40K12n26K04L7J23m51M92j29M8k43l4L11n3
3182bJ65k02J1kJ02l4j89K59l31K95J29k11Oj19R1P8p9N1q4J11k60L80J04R8k89
3207G8k05L54j78N4no2j35J53K01j39k58L17j17R9j57k3R6PK1j10j59J68O2n1
3231A1J0lj33K20q8J3p1J41R6j07R4j41j99J64K31l06l7K33ok06l7rK00k15J14
3256c1k28L26M0j52l3j5L08p9j04m7PM6M9j07K28j34k38M23l46J10k38O7J92k73
3280b29M5k4J80m5o4L23k14J38k3n9j08L88l68n4M3p1K63j72K45j23j18K4J40
3303A17k14l37M49N3j84Q6P9j69K1K06J50j59j25j24K06L2L49n66J48rJ9l0k16
$$ y = [186, 34, -119, -125, -30, -22, 12, 8, 386, 27, 228, 33, -21, -72, 59, 25, -8, -92, -271, -144, 0, 56, 125, -47, -52, 91, -130, 102, -55, 83, 87, 128, 23, 284, -233, 7, 219, -307, -103, -66, 57, -394, 98, -31, 17, -226, -260, 51, -2, 163, -39, -28, -30, 72, 38, -151, 108, -223, 72, 201, -10, -4, -123, -32, 46, -33, 18, -66, 45, -215, 165, 269, 367, 78, -127, 227, 49, 103, 98, 36, -99, 54, 255, 116, -142, 175, 58, 157, 0, -23, 73, 80, 101, -9, -168, 0, 62, 11, 21, 18, -115, 105, 17, 30, -41, 100, 196, 89, 183, 42, -157, 7, 238, -68, -105, 128, 122, -84, -121, -130, 70, -145, -31, -259, 67, 107, -45, -78, -93, 215, 136, 32, -15, -8, 38, 87, -20, 208, 74, -164, 259, -87, 23, -215, -148, 44, -229, -184, -208, -28, -73, -137, 186, -28, 110, 87, 28, -80, 308, -60, -114, -71, -142, 121, -51, 194, 71, -47, -23, 117, -97, -434, 15, 68, -116, -30, 49, -120, -99, 107, 257, 98, -27, -151, 55, 87, 436, -130, 18, 9, 28, -2, -218]
3326b18L37l5j9j75J71k15J37J49r8l59K92k7OP1j12J81J2l3J4M5k81K37q4p0
3350g4n7K54k27J90J79k44P6J71P1r4l88J63k42J19J15J44j38K7K06m29L24k13
3372f7p6N43l33J15j69k48L08k23J97k8J67k18J30j56K99l80M42n22L61N6m42
3393b44K63M2K29k16o9O7l24K86J1L9k66J62R8M1m1L6q7N1M2o7j04J70j83j2K42
3418A66j93k05K94j7k8j55lM6mj14K78m2O3J84m04J31m3j02K8j37K35J00j96j78
3442b96L09J57j91R4k26K48k8k82J60n2o9J77q5J96j46O9MM3k3j62K44l15J62
3465a2K52k62N9r7p1J65o7K42j10o1j57K22l79L52q3k72J82l0J24j5n5J38j35
3488g0Q9j2m6q2L21k01R6Q0m14L29l40L91j79p7j1J27jp2K1Q9L2r9J13k22J86
$$ y = [-218, 119, 84, 65, -110, 61, -154, -17, 132, 34, -325, -33, -60, -54, 17, -95, 86, 98, 65, 79, 124, -157, 80, -4, -74, -131, 123, -104, 86, 265, 21, 97, 268, 339, 245, -143, 20, -222, -103, 12, 156, 18, 45, 251, -178, 146, -67, -143, 400, 67, 182, 13, -235, 73, -150, 47, 19, 186, -32, 98, -58, 241, -139, 303, -219, 142, 198, -244, 19, 61, 290, 74, 5, 72, -252, 34, 45, 84, -182, -20, 78, 119, 78, 114, 27, 78, 120, 53, -51, 119, -64, -76, 166, -27, -232, 62, 45, 17, -138, -141, -95, -99, -213, 65, 23, 86, 270, -134, -3, -46, -148, -120, -257, -22, 78, -118, -296, 13, 170, -21, 73, -153, 95, 67, -215, -55, -107, -176, 1, -84, 112, -34, 35, 39, 82, 59, -103, 141, -174, -12, 240, -22, 37, -60, -131, 34, -33, 209, 99, 38, -119, 103, -276, 76, -7, -279, -97, -127, -3, -18, -73, 65, -70, 19, 7, -39, -121, 200, -1, 95, 175, -239, 90, -250, 141, -38, -115, -126, 1, 0, -72, -51, 38, 70, -29, 84, -138, 48]
3513D8k03J25L51l22L0K5J0j93J16l8L15k18j10J19j97J07M0M8j09J60l51J32
3535a15l3J43n5j34J75K10J79n17L25j19j4o0J01j42m3K07o3Jm6r7R5K5J17m50
3559c10J25K42m0k84N25l31j14k6l0N87m58M16j64l52Q6qN4l6L12l19j17L64m
3582A18j3j93J62p4P4j69K75m64M6L82o1j09L6K58j08p1O6r5ol6k70K1J62j28
3606a97R6J72k34J35j07M4J39L3l58K79j25J13k06J53J72r1J13m51J80O6J47L5
3628A08j05k23L12j41J6K45n1l28K72k31J75j12n2o8K50J25k16rk53O3J59K79
3650B15j92k20M82l17q6p4J43q5l1J03K87m38R3P2K16J00j22L6l25K13j40J88
3672A18j51k2J23k27K09q5O7J45j87J30k80J15J06K49l76Q9l6J86K5l52K17M7
$$ y = [48, -155, -30, 321, -1, 29, 54, 64, -129, -13, -51, 264, 46, -64, 55, -142, -35, 5, 53, -56, 104, -247, -115, -148, -5, -60, -194, -19, 191, 370, -147, 178, 59, 45, -15, 86, -56, -99, 108, 45, 46, 0, -97, -2, 23, 140, -310, -185, 57, 17, -267, 258, -73, -187, -213, -243, 344, -114, 302, 138, -214, -128, -136, -82, -118, 194, -125, -242, 122, 118, 105, -88, 74, 0, 74, -95, 180, -284, -238, 144, 83, -26, 10, 268, 160, 89, 155, 60, 54, 18, -252, -231, -69, -197, -101, 71, -163, -28, -135, -91, 48, 81, -277, 2, -123, -10, -216, -63, 109, 18, 131, -320, -140, -74, 73, 108, 3, -220, 92, -49, -33, 212, 161, -167, 105, -126, 49, -63, -115, -183, 67, 192, -24, -33, -286, -223, -64, 215, 23, -197, 285, -32, -118, -192, -49, -134, -165, -62, 225, -213, -120, -48, 168, 268, 146, 182, -143, 70, -70, 118, -33, -55, 68, -159, 50, -35, 32, 177, -10, 120, -160, -45, 61, 310, -66, 23, -13, 173, 198, -154, 63, 110]
3694A10j02j01J1K60L6r8k12K55Pm24J56N0n2O0J75j44K67k67j18K06j81j8K02
3717G8J49k64LL31p1j09q3O5m03L17Q9k02J35K18m83J87j23NQ6O5j5o9K45J06
3741B57K5k14q7J82m07K19j30k29L93K6l9o6K69j90j53j20N16m34l0L1K97Q8l93
3764a89L19m5k3k72J97K51j23j55O2J97k36L3j99J48l6k42J90J17q4j95K04K21
3786A40k12K51m65J96n5R2m9Q3J79j68j23j26M06mk46qK22l14L15k36K60M9l39
3809a52L29l71L33k14J43Q0k58L56j02j53j9L13j62K2j52k09J33J25p0q5Q1J2
3831b0K19j49j2j95q6L37J63l39j77L40Q6k36J4J78j21J98k21k8m1K91k52mO8
3854A3J81J59m61R5l9J52R2l97M8J6L21j49r7K62j01j4j34J21Q1j12j27q3K41
$$ y = [110, 8, -93, -82, 178, 214, 116, -96, 159, 166, -258, -102, -52, -104, -44, 131, -13, 254, -13, -131, 75, -106, -124, 78, 227, -37, -34, 297, 226, 117, 34, 99, -304, 13, 102, -100, 35, 253, -230, -43, -166, -161, -75, -10, -25, -94, 151, 257, 282, 68, -19, 163, -244, -25, -155, -384, 9, 35, -4, -70, 199, 9, -144, -264, 252, -182, -212, -181, 116, 204, -189, 130, 85, 62, -210, -13, 238, 115, -40, 22, 219, -17, 16, -183, -35, -71, -313, -123, -6, -90, -285, -81, 140, -72, 179, -286, -90, -145, -53, -102, -19, 160, -8, -131, -257, 149, 145, -101, -109, 113, -201, 114, -122, 138, 187, -152, 177, -194, 139, -75, 68, 148, -110, 246, 144, -9, -28, 285, 123, 145, -7, -216, -83, 42, -28, -113, -32, -20, 199, 50, 38, -157, -243, 94, 257, -82, -259, 81, 167, -69, -55, 123, 2, 200, -21, -49, -90, 201, -51, -55, 13, 194, 353, -108, -13, -52, 100, 192, -205, -157, -141, 180, 31, -66, 196, 95, 81, -53, 68, 149, 37, -90, -173, 68]
3877F8k12K38r8r0P3Nk44K66k0J59l85J26K42l19J60J96k21K9L77k74j61L4P6
3900B5k8J30K8k57K24k02K90jm01jK91j05M9j49K38J6l79L39j21m6K30j40K06
3923B36l13m1j45K47k6nJ86m4j76q0J54k37K82p8K13j55J33K19l58j39K18J31
3945B22k16J64k53N39l77n8R1j8k76K51j94K10N6n6j43QK94j65l96M39p4J15R7
3968B60k90p3o0K35j70O7L6k0J5J04k47Q9J72l4j10L28k75J81k68J52n2j99L44
3991A85k35J32k52P9J27J34j80omMJ48O6l73L47j16l7OkJ84k84o2J43j06l3J93
4016E8o0J81j29j89L14k39J24k16J27m0K89k12K2k13J24J1j76j80L42j8J36kl2
4039B2J4j72R0J22j60K49k82O8J09j53J74L3J14J7Kl86L59j61k29J45K38M9j14
$$ y = [68, -144, 94, -4, -94, -21, -16, -260, 6, -14, 145, -240, -114, 128, -191, -31, 165, -56, -27, 350, 76, -85, -51, 25, -3, 127, 155, -102, 122, -80, 210, 209, -192, -193, 98, -7, 42, -107, 131, 147, -232, 107, -14, -60, 170, 30, 236, -77, -118, -263, -16, -42, -47, 139, 95, -81, -161, -7, -244, 38, -40, 173, 18, 151, 370, 12, -127, 91, 222, 6, 170, -83, 456, 79, 21, 112, 94, -182, 69, -125, 85, 141, 85, -58, -50, 244, 79, -317, 122, 48, 163, 260, -30, -103, -163, 72, -98, -31, 5, -15, 0, 104, -143, -54, 118, 84, -26, 302, 27, 208, -60, 92, 40, -159, 185, -50, 82, -170, -91, 36, 170, -10, -16, -20, -16, 132, 198, -175, 172, 56, 19, 25, 23, 207, -77, -139, 4, -102, -135, 58, -2, 179, 50, -139, 175, -64, 60, -156, -29, -69, 220, 8, 30, -183, -59, -48, -224, -404, -62, -80, 56, 54, 22, 36, -136, -46, 76, -84, 165, -117, -49, 60, -93, 81, 114, 228, 245, 247, -139, 220, 59, -170, -25, 213, 262, 148]
4062A48q0o8K29K0n45L03P1j08j48j90N01k41J21O0j71K79j24L4k94K67r8n9J14
4085B1m2j4P9j81J04L7o3r0K63l17J77k1K23K6Lj68o4oJ02j57K7K57k82n0K05
4110F9l35m2R0L38l48J92M4j79L00k14J76k60r5J33J90M5q3k81K18o0J8k66L75
4133B5P2k4P9R3l79L04q6k76J60l9j6J82j11m4L4k39J76K66k73J16N4L6k16P7
4157b9O1m6M2m5r6K3k3J37k44L28j48l1K68j80l9kK14J5R6k54l6l0j83J38r2L05
4183A49j70M6k73K59j02M3j58L69j54j69M0J52k9K1J36N6k24k8J53m3p0J01J50
4206B55j99j08Q9j50J45J15j20r6J0J84l8n2J16o1N4k47R2j30R3O3O5k00K70n2
4230I8K9o4j13M5q7R5k20J79o7J52m7j3j01M1J27l96L99l40L69j24p4Q6L1p5K0
$$ y = [148, 68, 0, 229, 249, -296, 7, 78, -30, -178, -368, 133, -108, 13, 73, -98, 181, 57, 91, -203, 64, -34, -93, 21, -21, -35, 44, -137, -33, 4, -59, -149, 114, -203, -26, -47, 176, 202, 205, 37, -27, -33, 69, -88, -61, 196, -86, -136, 69, -266, -308, -218, 120, -228, -36, 8, -171, 129, -85, 91, -169, -264, -131, 59, 104, 21, -260, -42, -102, -84, -350, 25, 97, 73, 152, 245, -134, 170, 84, -192, -32, -71, -87, 95, -16, -60, -26, -265, -89, 177, -96, 20, 74, 110, -106, -29, 32, -14, 28, -17, -113, -90, -113, 24, -220, 108, -40, -71, 197, 17, -22, -24, 190, 205, 301, 47, 11, -19, -202, -64, -156, 149, -21, 25, -248, 11, -91, -48, -206, 163, 9, -160, -120, 32, 3, 24, 160, 216, -8, -36, 117, 74, 4, 105, 255, 56, -52, 37, -113, 32, 147, 27, -69, -59, 125, 87, 35, 151, 90, 144, -103, -11, -141, -48, 15, 80, -120, 150, 98, 127, 63, -50, -5, -92, 3, -217, -38, -105, 47, 0, -13, -114, -73, 54, -342, 57, -283, 86, -38, -112, -26, 5, -70, -50]
4255e0L46l74J8K1J04j54K33m3k52L75j8k30P5r2l3M6k0J15j36jL26k46k5N6J08
4280A49j07N9l90J36p5K00J43J0n0k89L02k27K18j8j54m0J20r6L8m9J43r4L3J67
4304A29j26L21j34l82N84l67J93o2J48k55O1k27J20j38K72J08k82K69j12j69J08
4325E9j0J17j87l6L56m58M28j7m3Q9l02O4j34J49J00k96M34j82l55kK48M4o6j5
4349a5r2J93k15J31J34J3j36J36r6J92k49J04j13J78r1j51p3J63J72j71r9%l3
4372a18o8J00p2M9J43Noj42J09r0j0K32n0m77J74J70o1qM1j1J97k01K93l25L4
4397i2K46j46L8j14j55M36j82k26K35J27j06k78L90j35r6j70J66L89l29J32J5
4418A45l26M31j24j48k18K51J48M1N1j56j7p9j09J48O4j45L4Q9r4M1r2J03m6K81
$$ y = [-50, 296, -78, -60, -39, 65, -89, 144, 101, -151, 224, 206, -24, 51, -41, -74, -28, -48, 67, -69, -70, 256, 10, -15, 41, 149, 42, 101, -289, -153, -228, -28, 115, 125, 75, -214, 88, -139, 79, 61, -93, -133, -13, -109, -71, -120, 23, -71, -38, 129, 3, 324, 190, -192, 392, 25, 218, 156, 304, 49, 110, -117, 3, -135, 137, 245, -37, 232, 120, -49, 59, 49, 166, -21, -57, 299, -159, 269, 252, 209, 298, -4, 60, -74, 75, 175, -121, 313, 131, -224, -226, 22, 66, 0, -15, -107, 86, -129, 2, 136, 149, 13, 149, 53, 245, -4, 100, -13, 165, 74, -77, -150, 13, 185, 14, -85, -85, -118, -186, -86, -158, -109, 34, 39, 33, -109, 0, -90, -100, 132, 82, -395, -221, -51, -112, -120, -79, -90, 107, -94, 199, -126, -92, 154, 8, 46, -68, -223, 213, 31, -195, 40, 167, 61, -217, 173, 38, -58, -228, -62, 327, -2, 130, 145, -181, 250, 126, -22, -240, 11, 159, 200, 251, 95, 78, -1, -110, 38, 102, -43, -9, 80, -14, 27, -65, 38, -8, 273]
4442B73l15Q4Rj91J42r8L8J75n9k5l14J74K5J22m0J12q4L5n6O3p0lP2l30M30l79
4468b10K52JJ50j45m7m4J22l18j0M49k2k05k5JK24j39j86L57j20L5n9j78K70k71
4492a18J90kk0j3j33L90k56q8N8J03j87J04j58J23j61j59N09l8j41k1L1L54m58
4515i1K18j44J15jPj11K8m7j7QJ60L5j09K8j23j51J62K24l0k96j8K15j01Q9M3
4540I3Q5k71J88n1j7O3k76NK99n2k35K92k84J10J24K11k62j23J10j3j36M03m04
4563a41J31Ok94J78J8p5O3Q3rj4Q8o8L9l07K35Q5NN2k4l4J40k14O3j26M08n41
4589b53L39m4j30J46P4k48L78k73j1Pj52J10L36l08j97L31k9J59m08L7K57j68
4611d7%j6J3K26j23o7pk26L94q5K06q6l61M39k00j25lP5jk13L28n7j4j10N17j03
$$ y = [273, -42, 42, 51, -140, 2, -96, -58, 117, 58, 33, -281, -107, -82, 40, 0, 112, 28, 63, 7, 70, 0, -3, 69, -261, 169, -210, 42, 43, 193, 48, 1, -43, 79, -239, -249, 200, 178, -27, -52, -51, 173, 34, -152, 205, 85, 120, 61, -117, 153, -118, 72, 70, 50, 37, -96, 294, 38, -50, 8, 111, -76, 28, -130, -7, -168, -327, 182, 144, 3, -18, 13, 367, -91, 127, -17, 98, 97, 104, -7, 21, -26, -43, -35, 125, 160, 51, 79, -44, -195, -33, 191, 161, -135, -153, 62, -39, 50, 93, 178, -93, 95, 44, 27, 90, -186, -181, 118, 66, -169, 123, -161, -51, 73, 284, 22, -101, 9, -4, -140, 263, -141, -10, -4, -298, -120, -102, -177, -114, -31, -40, -54, 34, -34, 5, -302, -67, 18, 23, 75, 51, 17, 157, -57, 6, -120, 288, -253, 86, 42, -88, 58, 132, -116, 262, -11, -22, -15, -167, -57, 279, -29, -226, 105, 76, 235, -173, -136, 121, -47, -47, -63, -50, 176, 53, -14, -21, -247, 147, 62, 268, 182, -179, 260, 60, -65, -68, 7, 6, -207, 121, 64, 50, -60, 457, 354]
4637C54m02j18P5l8L72r9k76J51j78K49j67P2J32j85K44j05l2j35L0J47k00J66
4659E7l73K83O7O1q0M7m50M06j29N1J54k7j07n7K1jk5J16j80K05J65lj14j02L7
4684B2L6J25n8K5q4m9j00N4Q3j50K97j11Q3k52N9Q5j77K8J15o8J4lP1j03p9J13
4710b4Q6J58j94K2m8J51j28k00J70l0j21J06Jk03N79j96j81J82k94K26r2l8L9
4733b9r8K75R2k23j02J79j42r3J63k6J13l62L15m7j28K27O5l93P6jm6M83j72K4
4757A50j04j65J90k31M34m09J98j05Rj01J08k27J49K5p3j1l2K46j74K07l57K09
4779f4J72k07K48l7n3R1k16J08m7O0q2J26j94K00K16m95L3K24j12q8p6L67J90
4802C64l01k31J83k7p1J66j26J16K11l5O6m33k7K48m50L84j06J32j82R7j12J96
$$ y = [354, -48, -166, -91, -129, 243, 144, -132, 19, -159, 90, -77, -5, 127, -58, 186, 81, 49, -86, -56, 91, -109, 57, -316, -33, 34, 95, 15, 62, -388, 18, -111, -60, 94, 67, -40, -97, -76, -77, -102, 14, -166, 39, 204, 201, 87, -15, 22, 58, 183, 125, 150, 66, 17, -83, -29, 54, -96, 201, 90, 173, -79, -20, 65, -112, -84, 31, -37, -23, -26, 45, -58, -137, -24, 62, 220, 26, 48, 0, 151, 23, -177, -7, -37, -158, -52, -51, -254, 325, 129, -52, 130, -164, 62, -30, -68, -29, -127, 148, 240, 17, -85, 94, -48, -141, 22, -4, 109, -253, 62, 15, -113, 114, 179, -214, -138, -139, -185, 298, 126, 150, 46, -119, 71, -160, 274, -135, 63, -42, -33, -134, -26, -253, -104, -79, -152, -163, -195, 51, -123, 84, -273, -64, 108, -99, 149, 112, 59, 150, -66, 42, -5, 55, -27, 99, -95, 105, 321, -174, -141, 83, -29, -117, -193, 174, 364, 63, -168, 15, -12, -83, 83, -43, 73, 284, 249, 315, -118, -145, 103, -347, 37, -69, 63, -119, -22, -134, 62]
4824F2R1k10o3K75l69J80J2l8J16k50L43m79L19n0K39l0p5o3k30N28K4n26J78
4847a6J52j52K53j92n8o2K63l64N6j04M29l17J79k30K28r7K01l07J35j30m4J93
4869A6R0J47o48M33K2j00J08j29k4J53r3j74k4K80p2N8M6j3ok35J97R6j00L33
4893C61l28j63J95q0n4J50k29L08k51J60N6j19P7k02J51m7k04J69J6j60K27j50
4915a17Q8P7k40K97k10L86j19j1k05J95q4N5n1L8J36l88J62J11P2m3l14K0J52
4938GJ76j52M1j96L98j46L5o2j14Q8j45J25j74Q1M40l89n4K3K95l13l9j8L8M0
4962a5o3J42j6J7l50M71j9r2L2P6k5l98J25NJ01p7o0m1J67OK01j21j76L22k09
4987Cmoo7J79j77r0L49j61J53m9K00n01J32N9k10J53K32l46k63L45K30j38k06
$$ y = [62, 153, -57, -120, 155, -214, -34, -22, -60, 56, -194, 149, -330, -11, -61, 178, 148, 73, 10, -220, 308, 332, -194, -16, 136, -16, 237, 45, -13, -75, 188, -176, -120, -224, 205, -112, 67, -163, 65, -32, 169, -138, -3, -133, -177, 16, 106, 253, -395, 38, 60, -40, 68, -61, -85, 68, -25, -199, -223, 57, -15, 43, 89, 76, 70, -165, 32, 128, 28, 361, 33, -130, 65, -15, -69, 81, -148, 160, -91, 69, 125, 6, 83, -119, 32, -15, -219, -50, -34, -194, 33, -117, -29, 48, -192, 105, -105, 281, 162, 151, -54, 141, 57, 112, 61, 99, 235, -153, 9, 120, 192, 149, -165, -145, 7, 183, 31, 72, -124, 274, 128, 163, 101, -13, 75, -70, 55, -119, -38, 402, 13, -41, -18, 277, -36, -75, -93, -55, -15, -78, 64, 48, 65, -285, 186, 167, 75, 107, 183, 158, -240, -115, -110, -9, -86, -146, -187, -20, -14, 187, 66, -110, 212, 3, -1, -7, -74, 105, -72, -162, 187, 26, 179, 130, 330, -171, -39, 20, -190, -37, 195, -151, -414, -69, 161, 23, -183]
5010a83J67P0k9j4j51M53p8l4k04l40M98k16J87R4l17J07J50l09J22J3J73j24
5032C5On3j22K6N08m57J68rq4p6J21n2L8j23PQ8n5J41j46K0j13L30j53Qj39L92
5058C06l48K13j20j34R2Q2l88K74L0Q8j0j68J14J47n00N20o1l1J20j20j5j09Q
5081a0o8J73p7k0r1J2J08N7k18J71J5p8Q5N9l36M4N5Mn1K23l9k9RP7m5k13J34
5108d9K12j23j21O8K1r6K31k97J19l5M9J02j31K9j07J92l8j12L7l72M84n9JQ9
5132I4j93N9J40K7j06m9o2L21m14M00p3r9k04J51R6QJ7K5j96J48j16l36L77j65
5156a50P5R4M0q8l2p3K37r7k07J94l5M9j87M46l33k46L62j39J40j8J2j28l3M6
5180g1J72j39J71Jj30k7N4L42n18J90L6J36l54J43j72K08q9K5j6L19k60J16k22
$$ y = [-183, -16, 54, 25, 11, -140, 313, 235, 201, -3, -343, 155, -61, 126, 220, -97, 10, 160, -149, -27, -14, 159, 35, 41, -12, -134, -108, 400, -57, 111, 102, 18, -58, 63, 11, 49, -74, -67, 21, -34, 107, -39, -19, -132, 198, 45, 53, -86, 306, -42, 171, 51, -83, 9, 91, -297, -23, 7, 95, 85, -83, 31, 178, -322, 198, 137, 106, 226, 106, 91, -18, -10, -78, 95, 18, -2, -93, -81, 27, 84, -134, 37, 52, -26, 59, 118, -218, -174, -119, -115, -166, 57, 18, -11, -2, 75, 30, -183, -49, 163, 40, -81, -13, 8, -88, 143, -154, -35, -70, -21, 81, -50, -21, -128, 64, 26, -86, -49, -421, 63, 4, 5, 94, -99, -40, 100, 127, 21, -28, -90, 231, -183, 217, 144, 45, -159, -8, 88, 96, 113, 138, -58, 90, -26, -362, 15, -150, -75, 19, 59, -29, -61, -134, 103, 6, -201, -7, -42, 7, -180, 266, -67, -313, 49, -90, 50, 32, 44, -84, -117, -71, 101, -38, 133, 134, 4, -23, 31, 373, -145, 45, 81, 217, -137, 6, -166, 42, -47, -22, -38, 281, 21, 137, -85]
5203h5Nj30M01j41j88O0J6k0l14L36L96l23j17J89m8M6j14N6J91k2j85N0j55k4
5227a20K64m5j35J40o9j56M0K15o3Q6k02k45M34k95j5L62n7J7k08J93k24q7QK49
5251H7r7j03J45R5rq1J12k33k1J34J31j05N9N6j70L7r0K31j57K20k71j7J60Rj96
5276g4j13L2K20j97J74j61J33K72j78j18L1rq1K02k42K36k55Q0j57L35J17j45
5298A02l16N5M77j40l68l1N00n33J26n7J38l6J88J15m76J34M6K42J01m18J10j24
5320a65J10Q3j68L18k80P1M8o7J56q8m4o0K2l5K13l62p3L03K01k5l6K6o7j80R3
5345fK0R0J57k88R1Q8j33n2J20r1K1Oj11L02j38R0k0j81j10N0J63o0k28L38j53
5370c5L8r6K20R1j58P6k76O1J92k30R9l0J35n6l1j11K50n3j76j01J09J33l45M79
$$ y = [-85, -80, -210, 191, 50, -138, -78, -62, -82, -396, -60, 336, 13, -104, 85, 37, 83, -31, 25, 216, 194, 9, 59, -96, -120, 144, 99, -36, 104, 35, -121, -81, 134, 71, 157, -45, -290, 144, -151, -166, 196, 139, 156, -52, 141, -83, -170, -162, 87, -10, -113, 32, 127, 118, 37, 149, -84, -105, 29, 160, 55, 114, 170, 0, 37, -53, 178, 21, 241, -30, -47, 113, 122, -74, -187, -155, 65, -132, 42, -119, 14, 286, 108, -10, 21, 12, -69, 133, -109, 127, -128, -48, -205, 130, 247, 102, -214, -159, 318, 178, -190, -221, 279, -254, -128, -185, -47, -83, 105, 220, -256, -122, -76, 166, 267, -151, -41, -165, -55, 28, -140, 178, -102, -31, 17, -50, 106, 18, -26, -86, -64, -99, 114, -248, -321, -18, 183, 158, 122, 148, 81, -99, -6, 14, 104, 261, -27, 64, 152, 19, -33, 87, -4, 17, 23, -88, 214, 76, 166, 146, -35, -145, -95, 68, 8, -220, 118, -35, 3, -93, 127, 218, 60, 136, -140, -79, 113, -117, -18, -48, 87, 31, 0, -111, 139, 86, -90, -191, -82, 51, -294, 185]
5394A85j41j09K65k46l5J66l08K63o2J68k04p7J24N0k7j3J12j78K30j83O6k2M
5417B8kj14K08J26k57p9L00l22J21K6J49L4M7k79J52r0j38R6j42L47k05m1m4N2
5441b7j77K67Q2k68k6J91m9j5j44K26L3k71Q6K30%k73J17J12nk51O8N6L11k38
5465C5j83P2J7j44J18J03l9O6L3J6J00k10k21K20o7k03J47J15J8L8J84o9l19K21
5489D8J03k92L70P3m86K35J14J6k39J10K5m8j21q0j40L5L65j07l0K7M3J86l36
5512a29K08o7r0KpQ0j00l7l0OJ91j51N25o09J30P7j88M98m12RL35k81o8K5J39
5537E6o8N9n8n7M7J54O1j59j01K9k01K58N6R9k16M9l4p5K2J62M4j6k30N2N1k48
5563b64J06j2K14k26J47J6q8Q1P8M3J6K0k99L8M58j33k24j57K33k14J34J10l09
$$ y = [185, 44, -65, 200, -46, -81, 85, -223, 40, -22, 146, -58, -135, -11, 39, 12, -1, 111, -67, 163, -20, 46, 24, 28, 26, -88, 120, 246, -11, -90, 210, -112, 9, 35, 184, 218, 265, -14, 138, 48, -90, 6, -136, 211, 6, -35, -79, -27, -204, 63, 145, -123, -149, 42, -7, -22, -166, 60, 93, -178, -92, 138, 138, -135, -18, 94, 89, -162, -94, -38, 273, 35, -148, -76, -59, -203, -85, 18, -21, 45, 78, 94, 194, -16, -237, -17, -84, -287, -140, -25, -7, 31, 215, 146, -173, 48, 151, -141, 229, 302, -184, 51, 165, 181, -58, 52, 77, 29, -92, -172, -312, -277, 88, -19, -49, -22, 21, 207, -129, 79, 12, -78, -76, -83, -3, -103, -140, -170, -164, 27, -124, 401, -208, -78, -1, -189, 309, -103, -94, 241, -40, -108, -83, 56, -12, 47, -11, -68, -21, 133, 194, 35, -66, -37, -238, 20, 76, 175, -41, 8, -26, -101, -79, 83, 127, 111, -119, -67, -16, -264, -158, -170, 44, -182, -35, -19, -107, -26, 52, 95, 111, 131, -168, -130, 328, 195, -29, -186, 47, -167, -33, 77, -232]
5586b32J00J1K49j9k79L19m5m68O52k68P1O5j94K46j25j43L1J63J21k90P5l45
5608c05K62Ro9J26l90N01M0k20J93j39J51j1j47K70k53k1o6J08l6k8N4J08p1K93
5632C59l72j5j0R5Q4l81J90j39J10K7K79k88p4P8J69k06J9K17j01R8j82N4K94
5655C05l73J12L5o9N5m16L34J40j68J14k64J78j9R1K14l15J26j4k4j35K04N0k76
5678a15L8Jlj4J15j76PO4K69p9k13J63mj92R6Km9M02j64k16j1J89J1j11M3k33
5704a80L18k25J73N0o4k24J02j47l4M12k65P9J59k32o5J35K01m16M74k45L1p0
5726c3K46l36M60l27L0N7l0j51k7L81k82j0J67r2k49J71J18j32j1pK07j84q4n2
5750a70Q4M9R8K0l0k2p9j40J37J11k31Q1K49l78L34m4j33l0m8J04M4J81o01M07
$$ y = [-232, -132, -121, 128, 109, -170, 149, 104, -364, 288, 20, 91, 156, -38, 208, 83, -60, -29, 134, 255, -35, 40, -305, -43, -34, -103, 23, -367, 134, 174, -46, 147, 8, 159, 148, 1, 271, 18, -3, -69, 39, 3, -25, 29, 137, 66, 359, -13, -28, -38, 57, 141, -240, -50, -189, -79, -52, 227, -61, -135, -57, 112, -94, -75, 142, 41, 139, -43, 11, 305, -68, 44, 79, 10, 65, -351, -17, 123, -45, 69, -195, -17, -36, 55, 269, -46, 80, 66, 42, -93, 111, 161, -115, -77, -76, -79, -93, 22, -154, -147, -83, 186, 107, -106, 57, 53, -139, -43, -41, -90, 312, 148, -68, -79, 110, 121, 10, 53, -180, 138, -87, 86, 136, 72, -152, -50, -197, -231, 181, -84, -5, 154, -78, -143, -8, 193, -223, 251, 6, 37, -33, 213, -123, 337, 10, 40, 97, 67, -84, -111, 270, -12, -22, 145, 53, -196, -25, 93, -39, -50, -57, 150, -34, -118, -170, -86, -37, 61, 81, 51, 29, -50, -190, -53, 58, -173, -92, 157, -221, 113, 69, -64, -94, -142, -38, 6, 187, -414, -7]
5774gm3K8K6j50k1L06%k5j91J73k24j00O7L57l13K93k21J01m2K0o8m1m0Q2L13
5799B80n43K3J58J97J69k90J55j10j10J25L2l05N3J43m2jJ95m00K39J25R0j59
5821B4J79k78Q8j18K69j37k8k25O1R1M6J1P7l9j97K4L75k17J21l49K58k55K52
5844C3J57j45Kj42k41K68J42j33J62k10j04J01nj09J67j40K24NJ30k41K21k36
5866i4O9K7k01L96j31k52K77j43J6J57p5o9L9q7k6K14O5k14J23j28j41N95p07
5889b90J08K29Q8p2O6l37J78j99K17J14k57l1K68k11J68m4j01j74L29K68l26n8
5911f7J10j13J6m3O9Or5Q4j12P8k35J9P6J37J19N9K47l27K06m36J40k8J1nK99
5936B15Kp6j2Jl07K77k12M01l87o0K74o3J9l4p6j44K08J07k96N2K00k47J79k3
$$ y = [-7, -50, -22, 4, -146, -167, 139, 139, 114, -77, 96, -128, -228, -161, 196, -117, 176, -45, 56, 14, 34, -34, -75, -115, -33, 280, -263, -240, -82, 115, 284, -6, 149, 39, -71, 54, 86, -219, -166, -23, -65, -66, 129, -271, -32, 93, 183, 24, 203, -75, 13, -105, 164, 27, -1, -226, -165, -74, -28, -17, 60, 21, -176, -152, 223, 6, 127, -222, 36, -219, 33, 190, 45, 47, -95, -336, -68, 74, -59, 103, -107, -211, -110, -115, -224, -57, -197, 27, 32, 162, -79, 142, -94, -25, 2, -199, 197, 66, -186, 91, -52, -36, 121, 46, -23, 16, -71, -97, 117, 182, -32, 91, -37, -178, 417, -290, -182, 47, 135, 63, 129, -208, -30, -229, -12, 102, -155, -186, 82, -129, 39, -5, -106, -280, 49, 317, -9, -67, 43, -70, -54, -97, -28, -22, -117, -33, -145, -67, -302, -283, -207, -70, 49, 108, 355, 28, 234, -202, -62, -90, -79, -84, 215, 217, 141, 129, 130, -177, 100, -112, 289, -98, -158, 116, 53, 72, 38, -38, -182, 26, 133, -163, -111, 89, -158, 21, -2]
5960bp9J59j50K54o9L3q3J18l10J96M2j75L23k99L54k07j68k26K06K6J84M5l22
5983a50p6L09J8k1j34QQ9j10O9RP5j42k14M90n44L20J14r0p1l7j2Q3k49PK69R0
6009A00k08J14J79l48M76k20j39NK31j60R7l22J64K5K2j37J53k06Q3o6Q0K4k40
6032b93M62P5l99K25o1r0J92j43N4K06n5j72J57k88K44J37l43J10k55K83J31j12
6054F5j16J36K38m40Q0J73M9n36J51K48l6L9J09n1k05J40L36k13j37J05M2L0n16
6077c09O7J27kj86L26L8k73L37o1l0J16k9j45K37m36L55l22J45M35n07j20L33
6099I6J28m58P6K56o9k61K09q6o4J9p0q2K79L15k82O5m3o5j64K74k2j18K92j56
6123F9j46j54J85R6Oo6j5k6J21j31K71j30P7l34J54L2p7l0L45k34j00J66k07m6
$$ y = [-2, -81, 78, -72, 182, 113, 146, 63, 181, -129, 67, 109, -66, 257, -42, 312, 105, -63, -289, -83, -57, 127, 172, -150, -226, 83, 101, 80, -54, -46, 43, -67, 2, 11, 86, -56, -270, 220, -324, -4, 110, 20, -51, -88, -100, -17, -266, -259, 10, 100, -108, 6, 185, -163, 313, 93, -46, -41, 190, 30, 127, -195, -31, -6, 16, -121, 32, -174, -91, -157, -77, -53, -293, 169, 244, -155, 70, 9, -81, 111, -32, 22, 228, 173, 1, 158, -130, 114, 251, -92, 18, -237, 46, 177, 65, -51, 85, 323, -117, -37, 136, 185, -351, -200, 48, 12, 51, 160, 109, -96, 44, 380, 167, 30, 135, 177, 207, -309, -242, -115, -117, -303, 23, 61, -212, 125, 64, 34, 150, 121, -24, 213, -223, 132, -190, -45, 390, -117, -237, 96, 224, -234, -158, 98, 29, -232, -23, -109, -173, -154, -224, -306, -27, 288, 6, 71, 28, -37, -201, 73, 51, -67, 225, 69, -77, -231, -46, 50, 56, -10, -25, -51, 70, -61, 210, 80, 157, -177, -23, 9, -68, -98, 247, 13, -87, 79, -128, -174]
6147a74K06Qj09J05k43M00k71Q6L0J57k4J27l25N4M7J00r0J43oM4n2j61J32k80
6171i6L33n8k33j35J86K8p1K05l32J82Mp3r9Q6o7J33J56NL6Pk60P1j41J98n0K12
6197B27l99K46k23R1J58j54J99l00K15j86q7K39l01l5J87L60k88J09r1nm6J97
6219A13k84J30j8R8k1k00j4Q8J74j9Q6k18K07r9K85l36N7l5p2J54k65K11n0R0
6243F2j1j33Kk5J95k7j22J94k76j3L09m23N08j96K2J27K44k49j19j79l2K84K8
$$ y = [-174, 32, 40, -69, 36, -207, 193, -78, 8, 38, 195, 171, 298, -27, 27, 74, 174, 84, 227, 221, 265, 213, 52, 184, -96, 237, 179, -54, -189, -3, 25, -46, 159, -173, 9, 13, -60, -159, -73, -140, -7, 149, 154, 190, 197, -63, 8, -133, 65, 15, 227, -172, 74, -149, -58, 100, -54, 145, -155, 60, -126, -213, 26, -275, -310, -123, 237, -51, 58, -33, -38, -84, 113, -171, -41, -59, 39, 18, -182, -196, -108, 66, 47, 133, -85, 122, 23, 308, -28, 29, -6, -78, 76, -189, 22, -28, 62, 51, -82, -80, -105, 90, 63, -59, 135, -141, -154, 155, -268, 240, 44, 66, 193, 437, 188, 69, -110, -142, 142, 170]
$$ [...]
8191d0
##END NTUPLES=NMR FID
##END=
