##TITLE=1H_Pr But
 DMSO
 8 sc, 
 17.3.2023
##JCAMPDX= 6.0         $$ Bruker NMR JCAMP-DX V2.0
##DATA TYPE= NMR FID
##DATA CLASS= NTUPLES
##ORIGIN= UXNMR, Bruker Analytische Messtechnik GmbH
##OWNER= root
$$ XWIN-NMR		Version 3.5
$$ Fri Mar 17 15:40:03 2023 Russian Standard Time (UT+4h)  she@DPX200
##.OBSERVE FREQUENCY= 200.13135
##.OBSERVE NUCLEUS= ^1H
##.DELAY= (6, 6)
##.ACQUISITION MODE= SIMULTANEOUS
##.ACQUISITION SCHEME= undefined
##.AVERAGES= 8
##.DIGITISER RES= 18
##SPECTROMETER/DATA SYSTEM= spect
##.PULSE SEQUENCE= zg30
##.SOLVENT NAME= Acetone
##.SHIFT REFERENCE= (INTERNAL, Acetone, 0, 15.7039)
##AUDIT TRAIL= $$ (NUMBER, WHEN, WHO, WHERE, WHAT)
$$ ##TITLE= Audit trail, XWIN-NMR		Version 3.5
$$ ##JCAMPDX= 5.01
$$ ##ORIGIN= Bruker BioSpin GmbH
$$ ##OWNER= she
$$ F:/spectra/data/she/nmr/H-F/1/audita.txt
$$ ##AUDIT TRAIL=  $$ (NUMBER, WHEN, WHO, WHERE, WHAT)
(   1,<2023-03-17 15:00:37.40 +0400>,<she>,<DPX200>,
      <created by zg, POWCHK disabled, PULCHK disabled
       configuration hash MD5:
       00 E9 B6 7A A2 85 ED C7 34 08 36 98 17 FE 4E 26
       data hash MD5: 16K
       B9 54 DD 75 B5 21 D3 1D CA 12 6A 80 16 F1 52 DF>)
$$ ##END=
$$ 
$$ hash MD5
$$ C0 25 FB 72 2C 59 75 70 80 DD FC FA 97 42 8C 75
##$RELAX= 
##$RELAX= 
##$RELAX= 
##$RELAX= 
##$RELAX= 
##$RELAX= 
$$ Bruker specific parameters
$$ --------------------------
##$DU= <F:/spectra>
##$EXPNO= 1
##$NAME= <H-F>
##$PROCNO= 1
##$TYPE= <nmr>
##$USER= <she>
##$AMP= (0..31)
100 100 100 100 100 100 100 100 100 100 100 100 100 100 100 100 100 100 
100 100 100 100 100 100 100 100 100 100 100 100 100 100 
##$AQSEQ= 0
##$AQ_mod= 1
##$AUNM= <au_zg>
##$AUTOPOS= <>
##$BF1= 200.13
##$BF2= 200.13
##$BF3= 200.13
##$BF4= 200.13
##$BF5= 200.13
##$BF6= 200.13
##$BF7= 200.13
##$BF8= 200.13
##$BYTORDA= 1
##$CFDGTYP= 0
##$CFRGTYP= 5
##$CHEMSTR= <none>
##$CNST= (0..31)
1 1 145 1 1 1 1 1 1 1 1 1 1 1 1 1 1 1 1 1 1 1 1 1 1 1 1 1 1 1 1 1 
##$CPDPRG= <>
##$CPDPRG1= <>
##$CPDPRG2= <>
##$CPDPRG3= <>
##$CPDPRG4= <mlev>
##$CPDPRG5= <mlev>
##$CPDPRG6= <mlev>
##$CPDPRG7= <mlev>
##$CPDPRG8= <mlev>
##$CPDPRGB= <>
##$CPDPRGT= <>
##$D= (0..31)
0 1.2 0 0 0 0 0 0 0 0.06 0 0.03 0 0 0 0 0.0002 0 0 0 0 0 0 0 0 0 0 0 0 
0 0 0 
##$DATE= 1679050836
##$DBL= (0..7)
120 120 120 120 120 120 120 120 
##$DBP= (0..7)
150 150 150 150 150 150 150 150 
##$DBP07= 0
##$DBPNAM0= <>
##$DBPNAM1= <>
##$DBPNAM2= <>
##$DBPNAM3= <>
##$DBPNAM4= <>
##$DBPNAM5= <>
##$DBPNAM6= <>
##$DBPNAM7= <>
##$DBPOAL= (0..7)
0.5 0.5 0.5 0.5 0.5 0.5 0.5 0.5 
##$DBPOFFS= (0..7)
0 0 0 0 0 0 0 0 
##$DE= 6
##$DECBNUC= <off>
##$DECIM= 32
##$DECNUC= <off>
##$DECSTAT= 4
##$DIGMOD= 1
##$DIGTYP= 9
##$DL= (0..7)
0 120 120 120 120 120 120 120 
##$DP= (0..7)
150 150 150 150 150 150 150 150 
##$DP07= 0
##$DPNAME0= <>
##$DPNAME1= <>
##$DPNAME2= <>
##$DPNAME3= <>
##$DPNAME4= <>
##$DPNAME5= <>
##$DPNAME6= <>
##$DPNAME7= <>
##$DPOAL= (0..7)
0.5 0.5 0.5 0.5 0.5 0.5 0.5 0.5 
##$DPOFFS= (0..7)
0 0 0 0 0 0 0 0 
##$DQDMODE= 0
##$DR= 18
##$DS= 0
##$DSLIST= <SSSSSSSSSSSSSSS>
$$ [...]
##$SUBNAM2= <"">
##$SUBNAM3= <"">
##$SUBNAM4= <"">
##$SUBNAM5= <"">
##$SUBNAM6= <"">
##$SUBNAM7= <"">
##$SUBNAM8= <"">
##$SUBNAM9= <"">
##$SW= 18.05172834244
##$SWIBOX= (0..15)
0 0 2 0 0 0 0 0 0 0 0 0 0 0 0 0 
##$SW_h= 3612.71676300578
##$TD= 16384
##$TD0= 1
##$TE= 0
##$TE2= 300
##$TE3= 300
##$TEG= 300
##$TL= (0..7)
0 120 120 120 120 120 120 120 
##$TP= (0..7)
150 150 150 150 150 150 150 150 
##$TP07= 0
##$TPNAME0= <>
##$TPNAME1= <>
##$TPNAME2= <>
##$TPNAME3= <>
##$TPNAME4= <>
##$TPNAME5= <>
##$TPNAME6= <>
##$TPNAME7= <>
##$TPOAL= (0..7)
0.5 0.5 0.5 0.5 0.5 0.5 0.5 0.5 
##$TPOFFS= (0..7)
0 0 0 0 0 0 0 0 
##$TUNHIN= 0
##$TUNHOUT= 0
##$TUNXOUT= 0
##$USERA1= <user>
##$USERA2= <user>
##$USERA3= <user>
##$USERA4= <user>
##$USERA5= <user>
##$V9= 5
##$VALIST= <valist>
##$VCLIST= <CCCCCCCCCCCCCCC>
##$VD= 0
##$VDLIST= <DDDDDDDDDDDDDDD>
##$VPLIST= <PPPPPPPPPPPPPPP>
##$VTLIST= <TTTTTTTTTTTTTTT>
##$WBST= 1024
##$WBSW= 4
##$XGAIN= (0..3)
0 0 0 0 
##$XL= 0
##$YL= 0
##$YMAX_a= 69659
##$YMIN_a= -79835
##$ZGOPTNS= <>
##$ZL1= 120
##$ZL2= 120
##$ZL3= 120
##$ZL4= 120
##$ABSF1= 10
##$ABSF2= 0
##$ABSG= 5
##$ABSL= 3
##$ALPHA= 0
##$AQORDER= 0
##$ASSFAC= 0
##$ASSFACI= 0
##$ASSFACX= 0
##$ASSWID= 0
##$AUNMP= <proc_1d>
##$AZFE= 0.1
##$AZFW= 0.1
##$BCFW= 1
##$BC_mod= 2
##$BYTORDP= 1
##$COROFFS= 0
##$CY= 11.3945322036743
##$DATMOD= 1
##$DC= 2
##$DFILT= <>
##$DTYPP= 0
##$F1P= 2.36226072786647
##$F2P= -0.459571619588291
##$FCOR= 0.5
##$FTSIZE= 0
##$FT_mod= 4
##$GAMMA= 1
##$GB= 0.15
##$INTBC= 1
##$INTSCL= 1
##$ISEN= 128
##$LB= 0.24
##$LEV0= 0
##$LPBIN= 0
##$MAXI= 10000
##$MC2= 0
##$MEAN= 0
##$ME_mod= 0
##$MI= 1.114404
##$NCOEF= 0
##$NC_proc= 0
##$NLEV= 6
##$NOISF1= 3.799351
##$NOISF2= 2.8
##$NSP= 1
##$NTH_PI= 0
##$NZP= 0
##$OFFSET= 15.70392
##$PC= 1
##$PHC0= -19105.1
##$PHC1= 10.40075
##$PH_mod= 1
##$PKNL= yes
##$PPARMOD= 0
##$PSCAL= 0
##$PSIGN= 0
##$REVERSE= no
##$SF= 200.130013532006
##$SI= 16384
##$SIGF1= 3
##$SIGF2= 2
##$SINO= 400
##$SIOLD= 16384
##$SREGLST= <1H.CDCl3>
##$SSB= 0
##$STSI= 0
##$STSR= 0
##$SW_p= 3612.71676300578
##$SYMM= 0
##$S_DEV= 0
##$TDeff= 0
##$TDoff= 0
##$TI= <>
##$TILT= no
##$TM1= 0
##$TM2= 0
##$TOPLEV= 0
##$USERP1= <user>
##$USERP2= <user>
##$USERP3= <user>
##$USERP4= <user>
##$USERP5= <user>
##$WDW= 1
##$XDIM= 8192
##$YMAX_p= 0
##$YMIN_p= 0
$$ End of Bruker specific parameters
$$ ---------------------------------
##NTUPLES= NMR FID
##VAR_NAME=  TIME,          FID/REAL,        FID/IMAG
##SYMBOL=    X,             R,               I
##VAR_TYPE=  INDEPENDENT,   DEPENDENT,       DEPENDENT
##VAR_FORM=  AFFN,          ASDF,            ASDF
##VAR_DIM=   8192,          8192,            8192
##UNITS=     SECONDS,       ARBITRARY UNITS, ARBITRARY UNITS
##FACTOR=    0.0002768,     1,               1
##FIRST=     0,             0,               0
##LAST=      2.2672688,     0,               0
##MIN=       0,             -79835,          0
##MAX=       2.2672688,     69659,           0
$$ Real data points
##PAGE= N=1
##DATA TABLE= (X++(R..R)), XYDATA
$$ [...]
$$ plain form
1841 -294 457 -116 206 -99 -407 472 -58 137 320 -290 257 314 -518 245 -304 -210 172 -431 178 424 -415
1862 -415 139 -62 -199 288 -262 248 342 -116 183 -159 -280 382 -354 -33 331 -538 171 -265 -106 500
1882 500 132 76 99 94 315 -263 -369 325 48 -225 18 -244 350 -22 -339 266 -66 -161 257 -372 274 38
1904 38 -372 394 49 15 270 -439 184 183 -114 274 -271 -239 546 -227 149 366 -326 135 -156 91 347 -555
1926 -555 -167 124 -110 310 -84 -99 450 -372 -174 96 -214 94 192 -338 275 -25 -124 117 -359 171 -152
1947 -152 -309 106 -56 74 3 -536 311 169 -166 78 -353 -288 414 -416 -56 126 -289 33 -90 -33 257
1968 257 -215 -56 41 -252 103 -170 -225 153 -309 -114 91 -282 245 100 -195 532 -377 -137 269 -337 305
1989 305 59 -122 647 -101 -437 94 -213 225 340 -373 428 -85 -59 391 -130 176 213 -263 349 -184 -210
$$ packed form
1841b94P51n73L22l05l08Q79n30J95J83o10N47N7q32P63n49R4L82o03O09K46q39
1862d15N54k01j37M87n50N10R4m58K99l42j21O62p36L21L64q69P09m36J59O06
1882E00l68n6K3nK21n78j06O94k77k73K43k62N94l72l17O05l32r5M18o29O46k36
1904C8m10P66l45l4K55p09O23jk97L88n45L2P85p73L76K17o92M61k91K47K56r02
1926e55L88K91k34M20l94j5N49q22J98K70l10L08R8n30O13l00r9K41m76N30l23
1947a52j57M15j62J30p1n39Q47j42l35K44m31O5P02q30L60J82m15L22j23N7K90
1968B57m72J59R7k93L55k73n5L78m62J95K05l73N27j45k95P27r09K40M06o06O42
1989C05k46j81P69p48l36N31l07M38J15p13Q01n13K6M50n21L06L7m76O12n33k6
$$ plain form
2010 -210 319 -397 -22 25 -130 145 -198 -365 516 -160 63 188 -250 87 -218 -151 310 -218 79 126 -120
2031 -120 242 -71 -238 108 -227 25 178 -447 335 120 -394 118 -73 -74 351 -322 259 200 -241 265 -104
2052 -104 -266 570 -118 -71 121 -345 34 -47 -462 275 -297 45 195 -296 152 281 -147 520 -240 -31 268
2073 268 -298 396 -201 -512 90 -61 -96 100 -339 153 123 -216 114 -78 -37 300 -151 299 195 -125 42
2094 42 -109 -28 352 -382 -239 245 -418 202 -350 -71 390 -143 58 297 -71 380 -110 -5 310 -204 -34
2115 -34 195 -102 221 -126 -332 388 -274 -69 318 -513 163 -69 -320 320 -211 5 207 -264 192 -97
2135 -97 -242 138 -248 41 322 -322 81 107 -124 381 -211 -58 130 -514 249 -52 -518 220 -223 -104 221
2156 221 -304 27 116 -269 81 -213 -187 206 -189 32 49 -308 92 -181 -290 282 -204 130 7 -226 232
$$ packed form
2010b10N29p16L75M7j55K75l43j67Q81o76K23J25m38L37l05O7M61n28K97M7k46
2031a20L62l13j67L46l35K52J53o25P82k15n14N12j91jM25o73N81n9m41N06l69
2052a04j62Q36o88M7J92m66L79q1m15P37n72L42J50m91M48J29m28O67p60K09K99
2073B68n66O94n97l11O02j51l5J96m39M92l0l39L30j92M1L37m51M50j04l20J67
2094D2j51Q1L80p34J43M84o63O20n52K79M61n33K01K39l68M51m90J05L15n14J70
2115c4K29k97L23l47k06P20o62K05L87q31O76k32k51O40n31K16K02m71M56k89
2135i7j45L80l86K89K81o44M03K6k31N05n92J53J88o44P63l01m66P38m43J19L25
2156B21n25L31Q9l85L50k94K6L93l95K21J7l57M00k73j09N72m86L34j23k33M58
$$ plain form
2177 232 200 -155 146 -520 154 283 -418 50 325 -100 513 -317 -301 417 -370 -124 193 26 229 -475 -46
2198 -46 222 -253 145 25 -273 204 -81 -23 124 -167 229 -41 -72 148 -95 -294 250 -321 -127 161 -141
2219 -141 49 -178 -156 277 -275 76 155 -80 -80 -83 -364 129 -478 -14 260 -304 127 335 -70 371 -356 38
2241 38 210 -454 149 13 -328 394 -291 -275 401 -98 138 177 -349 364 -101 -87 216 -156 242 147 -200 141
2263 141 116 -343 295 -273 -115 285 -449 284 179 -164 235 173 -21 326 -111 330 -231 -245 157 -105 -4
2284 -4 330 -248 -111 -126 -199 442 61 89 202 -347 16 173 -142 603 -336 168 81 -400 -154 279 -558 169
2306 169 35 -204 217 -324 -90 81 -273 -8 -34 -157 70 -214 -9 -119 -252 287 231 -315 394 -385 -285
2327 -285 99 1 10 231 -176 218 -109 94 339 -168 68 -109 -171 -8 -82 -67 423 -387 135 -87 -366 458
$$ packed form
2177B32l2l55L01o66O74J29p01M68K75m25O13q30J6P18p87K46L17j67K03p04M29
2198d6K68m75L98j20k98M77k85N8J47k91L96k70l1K20k43j99N44n71J94K88l02
2219a41J90k27K2M33n52L51P9k35%lk81M93o07M64K74n64M31K08m05M41p27L94
2241C8J72o64O03j36l41P22o85J6O76m99K36L9n26P13m65J4L03l72L98r5l47L41
2263A41k5m59O38n68J58M00p34P33j05l43L99o2j94L47m37M41n61j4M02k62J01
2284dL34n78J37j5p3O41l81K8J13n49L63J57l15P45r39N04q7m81K46M33q37P27
2306A69j34k39M21n41K34J71l54K65k6j23K27k84K05j10j33N39n6n46P09p79J00
2327b85L84r8RK21m07L94l27K03K45n07K36j77o2J63p4J5M90q10N22k22k79Q24
$$ plain form
2349 458 -296 -10 394 -224 -26 5 -101 296 -48 -51 212 -16 -60 102 -136 369 8 -115 235 -215 -139 302
2371 302 -81 312 -23 -15 226 -385 139 -183 -519 116 296 -224 133 36 -56 246 -297 309 -140 125 221 61
2393 61 -45 45 -120 9 -209 -243 -29 31 -177 208 32 -190 -62 -452 381 -285 -129 104 -184 147 354
2414 354 -249 34 238 -39 -16 -173 -80 242 -283 -197 29 -51 67 -144 184 337 -345 180 22 -192 247
2435 247 10 -38 225 -201 152 75 -33 200 87 -248 66 -204 -69 -18 -43 73 -74 -107 147 -256 29 265
2457 265 -250 540 -80 27 147 -212 340 282 -353 -68 -93 -84 367 7 -24 33 71 -60 -24 -250 179 -23 -63
2480 -63 73 -137 80 116 -339 -39 55 -46 157 -401 27 102 -198 142 39 -287 210 -247 198 219 -202 133
2502 133 -84 -190 326 2 112 273 -294 71 -233 -240 82 -554 -23 -79 -313 256 -262 202 286 158 -15
$$ packed form
2349D58p54K86M04o18J98L1j06L97l44lK63k28m4J62k38N05l61j23L50m50P6M41
2371C02l83L93l35QK41o11N24l22l36O35J80n20L57r7r2L02n43O06m49K65R6j60
2393F1j06R0j65J29k18l4K14O0k08L85j76k22J28l90Q33o66J56K33k88L31K07
2414C54o03K83K04k77K3j57R3L22n25Q6K26q0J18k11L28J53o82N25j58k14M39
2435B47k37m8K63m26L53p7j08K33j13l35L14k70J35N1k5J16j47l3K54m03K85K36
2457B65n15P90o20J07J20l59N52n8o35K85k5RM51l60l1N7L8j31L6k26M29k02m0
2480f3J36k10K17L6m55L00R4j01K03n58M28P5l00L40j03l26M97m57M45K1m21L35
2502A33k17j06N16l24J10J61n67L65l04pL22o36N31n6k34N69n18M64Q4j28j73
$$ plain form
2523 -15 112 -219 73 89 -388 246 111 58 224 -242 27 227 -166 366 -178 41 186 -130 -50 143 -637
2544 -637 266 115 -58 211 -313 166 31 -216 270 5 31 71 -336 -141 24 -3 100 39 -94 393 -62
2565 -62 -149 220 -5 332 -439 12 43 -186 78 217 -226 353 -194 -296 175 -103 -182 105 -219 -155 105 -164
2587 -164 27 20 -36 374 10 279 -113 -169 402 -53 -278 94 30 -415 131 -272 33 -76 -74 189 -244 145
2609 145 264 -97 238 -194 -280 -22 -155 182 280 -31 343 204 -201 197 -265 67 330 -303 264 160 53
2630 53 -5 59 -395 78 82 314 77 -119 108 15 3 67 -132 116 241 -159 174 -26 180 309 17 102 422
2653 422 -87 275 14 18 138 -193 -58 191 -183 86 -13 -283 266 -29 -21 86 -271 165 43 -82 -107 -122
2675 -122 143 -30 -326 142 -132 -134 -88 71 -22 102 -69 18 56 -368 202 -72 30 187 -26 117 133 -129
$$ packed form
2523a5J27l31K92J6m77O34j35n3J66m66K69K00l93N32n44K19J45l16Q0J93p80
2544f37R03j51j73K69n24M79j35k47M86k65K6M0m07J95J65k7J03o1j33M87m55
2565f2q7L69k25L37p71M51L1k29K64J39m43N79n47j02M71k78p9K87l24O4K60k69
2587a64J91pn6M10l64K69l92n6N71m55k25L72o4m45N46m03L05j09KK63m33L89
2609A45J19l61L35m32q6K58j33L37R8l11L74j39m05L98m62L32K63o33N67j04j07
2630E3n8O4m54M73MK32k37j96K27r3j2O4j99K48J25m00L33k00K06J29k92Q5L20
2653D22n09L62k61MJ20l31J35K49l74K69r9k70N49k95QJ07l57M36j22j25k5j5
2675a22K65j73k96M68k74kM6J59r3J24j71Q7L8m24N70k74J02J57k13J43J6k62
$$ plain form
2697 -129 281 32 152 143 -124 -207 -41 -41 10 41 -127 241 -304 301 75 -186 98 107 -105 174 -245 -30 130
2720 130 -169 1 115 -168 199 -177 75 238 -288 193 -251 -348 107 -42 54 75 -325 35 143 -152 351
2741 351 263 -267 227 -195 66 -83 -231 247 -171 -205 20 -149 -25 -94 151 152 210 -112 260 3 79 62 -15
2764 -15 175 -37 77 128 -184 105 150 -119 206 283 -165 -41 159 -18 250 -1 213 4 -117 240 -27
2785 -27 -146 125 -336 -20 161 -100 95 -353 -44 240 -107 -128 -208 -482 185 -7 -19 258 -19 -103 184 -553
2807 -553 383 -183 -272 259 -284 67 319 -327 94 71 47 504 -184 16 232 -62 211 -51 3 -5 -40 -112 221
2830 221 -128 189 3 -265 139 -1 -162 112 -92 158 -135 -159 103 -78 17 135 78 -107 -125 3 5 -76
2852 -76 -184 -5 -265 -614 300 -61 121 -102 -79 89 -481 148 285 -80 -63 -67 132 111 -44 205 -27 -5
$$ packed form
2697a29M10k49J20rk67q3J66%N1L1j68L68n45O05k26k61K84Rk12K79m19K15J60
2720A30k99J70J14k83L67l76K52J63n26M81m44r7M55j49R6K1m00L60J08k95N03
2741C51q8n30M94m22K61j49j48M78m18l4K25j69J24o9K45JN8l22L72k57P6j7p7
2764a5J90k12J14N1l12K89M5k69L25P7m48J24K00j77K68k51K14k09j21L57k67
2785b7j19K71m61L16J81k61J95m48L09K84l47k1q0k74O67j92j2K77k77q4K87p37
2807e53R36n66q9N31n43L51K52o46M21k3k4M57o88K00K16k94K73k62N4ql5p2L33
2830B21l49L17j86k68M04j40j61K74k04K50k93k4K62j81R5J18n7j85j8J28Kq1
2852g6j08J79k60l49R14l61J82k23K3J68n70O29J37l65J7mJ99k1j55K49k32K2
$$ plain form
2874 -5 122 67 -305 93 59 -75 121 -380 76 -91 21 28 -310 7 276 -110 -70 8 -184 -124 -133 102 50 50 87
2899 87 101 -169 105 -102 -127 147 -238 -83 169 -297 203 -319 83 131 -109 -123 -35 -260 286 -79 -297 -55
2921 -55 -85 -109 14 -72 -300 273 -106 117 93 9 179 -135 -62 192 38 128 -212 182 143 -19 -186 -26 -273
2944 -273 67 -160 -167 311 -157 -63 -34 -76 -59 111 -20 427 -291 -138 -18 -83 -6 -52 -144 123 161 44 132 -157
2968 -157 210 -131 42 -68 -185 -183 -1 -5 162 167 -63 159 -8 -32 86 -244 201 -52 -53 27 -63 -42 10 138
2992 138 24 196 -41 89 -10 -68 32 -98 -264 197 -218 18 -40 -157 27 -161 -61 211 -303 -45 -101
3013 -101 -106 182 -59 82 -201 -148 147 17 -220 363 -372 -36 6 -69 -84 83 -194 426 -178 -12 50 -119
3035 -119 159 -142 -111 137 137 -200 87 -207 110 -64 -141 -95 74 -329 -41 -303 14 311 19 -108 26 137
$$ packed form
2874eJ27n5l72L98l4j34J96n01M56j67J12Pl38L17K69l86M0P8j92O0rK35n2%L7
2899H7J4k70K74k07k5K74l85J55K52m66N00n22M02M8k40j4Q8k25N46l65k18K42
2921e5l0k4J23q6k28N73l79K23k4q4J70l14P3K54j54R0l40L94l9j62j67J60k47
2944b73L40k27pM78m68R4K9m2J7J70j31M47p18J53J20o5P7m6r2K67L8j17Q8k89
2968a57L67l41J73j10j17KJ82mJ67Nk30K22j67k4J18l30M45k53jQ0r0K1N2J28
2992A38j14J72k37J30r9n8J00j30j66M61m15K36n8j17J84j88J00K72n14K58n6
3013a01nK88k41J41k83N3K95j30k37N83p35L36M2p5j5J67k77O20o04J66O2j69
3035a19K78l01L1K48%l37K87k94L17j74p7M6J69m03K88k62L17K97k92j27J34J11
$$ plain form
3057 137 264 28 227 -52 89 -134 -267 -207 141 -219 19 -172 -403 14 -77 12 108 67 -150 -274 -245 145
3079 145 -92 -201 73 -122 44 188 154 177 19 67 145 -25 -174 121 -240 41 -8 -19 49 -34 -216 90 -208
3102 -208 -129 -129 -145 156 -15 152 300 -174 14 243 -30 -44 -285 17 115 -129 -87 25 -124 149 26 -281
3124 -281 322 57 116 148 -213 86 187 -38 171 207 50 269 -52 -360 -123 174 317 21 -76 96 -363
3145 -363 170 -17 -62 165 -8 -14 209 -128 87 64 -41 139 48 -160 281 -4 -80 4 -347 -159 -88 -150 275
3168 275 -94 -146 166 50 -116 76 -114 -127 -40 -187 72 -257 204 93 -161 271 -153 35 70 -353 -207
3189 -207 29 -81 -61 -167 28 76 -112 127 175 -227 262 128 -106 128 -201 -2 147 -307 137 -67 35
3210 35 -170 -188 132 12 -118 103 86 -270 -74 41 21 192 -168 45 27 -49 363 -220 -2 81 10 44 27
$$ packed form
3057A37J27k36J99k79J41k23j33O0L48l60K38j91k31M17r1Q9R6m1k17j24K9L90
3079A45k37j09K74j95J66J44l4K3j58M8P8j70j49K95l61K81m9j1O8q3j82L06k98
3102b08P9%j6L01j71J67J48m74J88K29k73j4k41L02R8k44M2J12j49K73j23l07
3124b81O03k65N9L2l61K99J01k25K09L6j57K19l21l08K37K97J43k96r7J72m59
3145c63N33j87m5K27j73oK23l37K15k3j05J80r1k08M41k85p6Q4l51J88P1o2M25
3168B75l69n2L12j16j66J92j90j3Q7j47K59l29M61j11k54M32m24J88L5m23J46
3189b07K36j10K0j06J95M8j88K39M8m02M89j34k34K34l29J99J49m54M44k04J02
3210C5k05j8L20j20j30K21j7l56J96J15k0J71l60K13j8p6M12n83K18Q3p1L4j7
$$ plain form
3233 27 -48 86 14 -32 -8 156 2 -80 -405 57 -58 -155 94 -44 44 395 -104 -139 182 -165 -145 62 67 -24
3257 -24 -126 -127 -108 -34 304 2 -30 146 168 -4 17 -302 72 -86 -118 -67 -289 278 27 44 -86 -282 -254 125
3281 125 -24 4 -118 -328 -93 -105 -12 214 -105 -227 65 -177 176 -42 56 50 7 293 -1 -165 296 149
3303 149 -187 132 -218 -44 125 -114 169 -6 -143 102 -108 -15 122 -135 196 55 -202 -78 -199 118
3323 118 9 -159 -99 112 -72 229 -329 21 -74 -104 -10 60 -190 49 -91 -24 457 -31 -23 132 265 195 -148
3346 -148 -156 200 -115 49 -42 -397 176 -22 -188 333 119 -109 28 -29 143 -71 47 92 149 153 138 -290 -129
3369 -129 -198 -122 42 144 156 -34 -148 -53 44 50 137 23 -147 42 176 -135 16 -224 403 77 19 -164 -28
3392 -28 -142 136 -174 53 9 3 219 -128 -118 264 -2 -165 0 -47 36 209 80 12 -108 88 -121 -36 195
$$ packed form
3233B7p5J34p2m6K4J64j54q2l25M62j15r7K49j38Q8L51m99l5L21l47K0K07Nr1
3257b4j02jJ9P4L38l02l2J76K2j72K1l19L74j58l2N1k22N67k51J7j30j96K8L79
3281A25j49K8j22k10K35j2R3K26l19j22K92k42L53k18R8om3K86k94j64M61j47
3303A49l36L19l50J74J69k39K83j75j37K45k10R3J37k57L31j41k57J24j21L17
3323A18j09j68O0K11j84L01n58L50r5l0R4P0k50K39j40O7M81m88QJ55J33p0l43
3346a48qL56l15J64r1l55N73j98j66N21k14k28J37n7J72k14J18M5N7Mj5m28J61
3369a29o9P6J64J02J2j90j14R5R7OQ7j14j70J89J34l11J51k40O27l26n8j83J36
3392b8j14K78l10K27m4oK16l47J0L82k66j63J65m7Q3J73j29o8j20J96k09Q5K31
$$ plain form
3415 195 -255 -90 78 -158 31 -118 -349 140 -304 -143 -76 -68 -43 -52 3 129 -326 29 54 -21 225 -35 -86
3438 -86 20 -47 143 55 -183 -64 193 -130 -77 8 -71 334 -160 -256 275 -145 -254 -18 -76 123 161 48 -40
3461 -40 -164 187 182 -102 185 -197 0 -114 -176 4 15 -262 111 -191 82 -171 -243 272 -48 17 325 83
3483 83 48 258 -149 155 -101 -92 255 20 70 133 -165 224 1 -154 273 -56 -71 10 -15 222 -59 -174 43
3506 43 55 -36 -28 -229 90 186 -287 93 -55 135 -106 46 91 -68 19 74 -6 188 382 -18 17 314 -190 -146
3530 -146 76 -380 77 -269 -39 -2 -251 83 164 -27 69 -158 44 412 -158 -103 -3 -406 50 -349 12
3551 12 348 -87 91 93 243 -13 39 -74 113 95 -111 209 -27 101 86 -224 304 -136 77 228 -37 -47
3573 -47 -208 146 283 -338 119 138 -199 35 135 -350 151 135 260 130 -52 70 -7 -169 87 8 -198 -6
$$ packed form
3415A95m50J65J68k36J89j49k31M89m44J61O7QK5rN5J26m55L55K5p5K46k60n1
3438h6J06o7J90q8k38J19K57l23N3Q5p9M05m94r6N31m20j09K36n8J99L8j13q8
3461d0j24L51nk84K87l82J97j14o2J80J1k77L73l02K73k53p2N15l20O5L08k42
3483H3l5K10m07L04k56RL47k35N0O3k98L89k23j55M27l29j5Q1k5K37k81j15K17
3506D3J2r1Qk01L19R6m73L80j48J90k41J52M5j59Q7N5q0J94J94m00L5K97n04M4
3530a46K22m56M57l46K30L7k49L34Q1j91R6k27K02L68n70N5J00m03M56l99L61
3551A2L36m35J78KJ50k56N2j13J87j8k06L20k36J28j5l10N28m40K13J51k65j0
3573d7j61L54J37o21M57J9l37K34J00m85N01j6J25j30j82J22p7j62K56p9k06J92
$$ plain form
3595 -6 -95 56 -120 42 210 -12 -58 357 -125 256 74 -68 -4 199 -89 247 -61 -19 -111 -266 323 -195
3617 -195 -169 86 241 40 -91 -318 17 -305 -122 74 -160 -84 176 -209 203 214 -74 265 209 70 -45
3638 -45 51 -30 180 -211 70 -123 -169 73 23 40 34 -29 17 23 24 190 -171 -2 -2 -98 50 -170 -71 -70 -273 103 98
3665 98 61 98 19 -197 -97 -117 97 49 -283 91 94 6 389 -258 45 131 -167 -17 -1 39 80 -188 166 -147
3689 -147 -153 -11 -116 36 487 114 132 287 -284 201 -223 -224 -30 -167 -162 15 -91 171 64 -84 116 -37
3711 -37 -126 435 -215 -112 -274 -9 -51 -94 75 44 -103 -177 -65 -245 420 -262 14 232 304 -6 391 -109
3733 -109 26 59 35 -84 -65 72 -37 -95 164 316 14 327 -64 -259 -89 13 18 113 -194 -142 -223 181 -42
3756 -42 -218 -21 34 -9 -121 -222 -129 175 132 79 179 -48 37 -153 134 180 -81 -18 309 92 -142 7 -405
$$ packed form
3595fq9J51j76J62J68k22m6M15m82L81j82j42O4K03k88L36l08M2r2j55N89n18
3617a95K6K55J55k01j31k27L35l22J83J96k34P6K60l85M12J1k88L39n6j39j15
3638d5R6q1K10l91K81j93m6K42n0J7oo3M6OJJ66l61J69%r6J48k20R9Jk03L76n
3665I8l7L7p9k16J00k0K14m8l32L74Lq8L83o47L03Q6k98J50J6M0M1k68L54l13
3689a47oJ42j05J52M51l73J8J55n71M85m24jJ94j37NJ77j06K62j07j48K00j53
3711c7q9N61o50J03j62K65m2m3J69l1j47p4J12j80O65o82K76K18P2l10L97n00
3733a09J35L3k4j19J9J37j09n8K59J52l02L13l91j95J70J02NR5l07N2q1M04k23
3756d2j76J97N5m3j12j01R3L04m3n3J00k27Q5j90K87M6k61O3L27k17k34J49m12
$$ plain form
3779 -405 168 309 29 237 -308 -17 -7 -213 114 -149 -108 203 99 -59 -164 -197 -80 38 -65 -29 -172
3800 -172 150 120 20 47 -131 -47 -7 152 -169 -35 -179 124 -271 -113 196 71 57 80 -128 25 -196 -175
3822 -175 334 -124 37 54 -127 -30 -4 -245 47 -138 -104 17 22 164 -15 148 70 -120 7 201 65 377
3844 377 52 -337 -206 5 -257 64 -279 104 -64 -74 -50 -147 246 -61 -160 -60 95 98 24 -88 97 305
3866 305 -33 -91 137 -92 -160 -210 -149 118 19 12 21 -251 226 100 43 271 -231 146 73 -100 108 -67 -147 317
3890 317 91 41 50 -96 201 127 18 74 31 -36 179 -51 51 166 -223 -15 231 55 158 -24 281 -408
3912 -408 -3 161 -85 159 -69 -94 23 -76 -183 -77 77 -71 231 -160 -180 -181 125 96 147 15 110 104 195 105
3936 105 -75 -165 247 107 99 23 -83 94 30 -70 31 -128 178 92 -117 236 -107 -62 156 -94 -115 -52 217
$$ packed form
3779d05N73J41k80K08n45K91J0k06L27k63M1L11j04j58j05l3J17J18j03L6j43
3800a72L22l0j00K7j78Q4M0J59l21J34j44L03l95J58L09j25j4K3k08J53k21K1
3822a75N09m58J61J7j81R7K6k41K92j85L4J21NJ42j79J63p8j90J27J94j36L12
3844C77l25l89J31K11k62L21l43L83j68j0K4r7L93l07r9J00J55Lp4j12J85K08
3866C05l38n8K28k29o8n0O1K67r9pRk72M77j26n7K28n02L77p3j73K08j75q0M64
3890C17k26n0Rj46K97p4j09N6m3o7K15k30J02J15l89K08K46j76J03j82L05o89
3912d08M05J64k46K44k28k5J17r9j07J06J54j48L02l91k0jL06k9N1j32R5oR1r0
3936A05j80r0M12j40qp6j06J77o4j00J01j59L06q6k09L53l43M5K18k50k1O3K69
$$ plain form
3959 217 339 -147 -33 353 -106 27 -141 -69 -135 0 18 114 -73 163 298 -188 -1 183 71 104 -91 -76
3981 -76 28 33 -19 -52 -99 -116 -178 -167 109 -148 158 -58 96 160 207 -8 265 182 74 179 51 97 24 27 125 63
4007 63 122 71 1 -18 90 -127 69 -132 -113 53 32 87 14 54 218 -53 128 -74 60 -28 -45 -74 91 -6 305
4032 305 -11 -115 146 43 -17 222 -174 -139 60 -124 -177 -210 44 63 -35 -79 -238 -326 234 -230 -80 210 -127
4055 -127 97 217 -79 92 -94 -203 240 -180 -83 -136 -71 291 254 -202 -32 -151 -52 169 -231 -192 111 -217
4077 -217 19 -22 139 227 54 109 300 -151 67 143 -100 76 -320 360 86 -123 273 50 -118 309 -26
4098 -26 -148 222 -203 269 -49 16 -112 108 165 66 19 245 -101 -164 157 18 63 102 255 81 -12 116 -147
4121 -147 -421 -55 119 42 -105 59 -158 -57 60 81 -121 69 -166 -195 -106 159 144 -283 82 -31 198 -112
$$ packed form
3959B17J22m86J14L86m59J33j68P2o6J35J8R6j87K36J35m86J87J84j12L3j95J5
3981g6J04Nn2l3m7j7o2J1K76k57L06k16J54O4M7k15K73q3j08J05j28M6p3LR8o2
4007F3N9n1p0j9J08k17J96k01J9J66k1N5p3M0J64k71J81k02J34q8j7k9J65r7L11
4032C05l16j04K61j03o0K39l96L5J99j84n3l3K54J9r8m4j59q8N60m64J50K90l37
4055a27K24J20k96J71j86j09M43m20R7n3O5L62l7m56J70j19R9K21m00L9L03l28
4077b17K36m1J61Q8j73N5J91m51K18P6k43J76l96O80k74k09L96k23j68M27l35
4098b6j22L70m25M72l18O5j28K20N7r9m7K26l46o3L21j39M5L9J53j74r3J28k63
4121a47k74L66J74p7j47J64k17J01J17K1k02J90k35k9Q9K65j5m27L65j13K29l10
$$ plain form
4143 -112 140 194 -33 14 -28 -67 -93 -163 -243 -102 -203 366 -196 -211 278 104 52 227 149 173 173 -394 -215 91
4167 91 -308 95 -57 -184 117 187 89 270 88 -53 375 69 -191 -105 69 -85 -213 41 -27 -26 -84 -109 -89
4190 -89 222 -140 182 1 -58 78 -161 -41 -7 -145 -196 -29 -214 206 -220 -133 66 -271 -38 151 -34 -60
4212 -60 38 -21 122 314 96 -332 -145 204 140 -50 -71 166 103 -201 49 -186 156 -254 -10 -229 -96 134
4234 134 -122 8 83 70 -17 -176 -208 104 -173 -59 142 -83 274 -110 54 112 -107 60 234 10 -59 15
4256 15 -316 83 114 -57 6 -274 46 -274 -187 -28 13 -38 69 -26 143 51 -34 219 138 -47 -225 117 70 40
4280 40 -130 -20 8 215 136 -28 55 60 -38 153 -62 -154 233 10 81 -39 113 -19 -79 -275 101 -45 21 232
4304 232 -52 401 -110 -119 111 -52 115 -14 -311 -165 -5 -224 4 166 -38 -17 -1 53 -43 67 391 22
$$ packed form
4143a12K52N4k27M7m2l9k6p0q0J41j01N69n62j5M89j74n2J75p8K4%n67J79L06
4167I1l99M03j52j27L01P0r8J81j82j41M28l06k60Q6J74j54j28K54o8Jn8k5K0
4190h9L11l62L22j81n9J36k39J20L4j38n1J67j85M20m26Q7J99l37K33J89j85k6
4212f0R8n9J43J92k18m28J87L49o4j90k1K37o3l04K50k35L42m10K44k19J33K30
4234A34k56J30P5j3q7j59l2L12k77J14K01k25L57l84J64N8k19J67J74k24o9P4
4256A5l31L99L1j71O3k80L20l20Q7J59M1n1J07r5J69r2q5K53q1j85j78L42m7l0
4280D0j70J10K8K07p9j64Q3Nr8J91k15r2L87k23P1j20J52j32o0j96L76j46O6K11
4304B32k84M53n11rK30j63J67j29k97J46J60k19K28J62k04K1J6N4r6J10L24l69
$$ plain form
4326 22 -15 165 -52 96 -206 -33 -35 -26 118 -57 -39 42 -243 -52 -62 27 -29 168 -143 -57 -33 -192 -4 122
4350 122 92 -27 -35 -78 -38 -185 108 118 81 -90 -32 -217 1 152 169 -70 7 126 -157 -57 -4 67 41 207
4374 207 -100 -61 114 153 206 -144 -34 -336 24 -5 -121 -145 68 -239 50 -239 194 166 -162 -92 -28 4 -43
4397 -43 159 8 -111 -51 37 209 -222 -257 -17 -65 77 -265 -24 267 97 165 49 -45 61 -191 -103 196 -127
4420 -127 -300 -49 -118 33 256 -60 77 13 -184 -107 81 50 160 243 -6 -48 148 83 -440 15 -20 -176 209
4443 209 41 -82 -121 -90 -24 33 -170 -40 -2 -90 142 -32 -106 113 -187 59 -123 -20 -96 -13 252 -92 -25
4466 -25 113 -271 -298 104 -281 -149 148 -232 -213 -142 -171 245 159 -163 62 -53 -112 -4 -109 -33 204 56 50
4489 50 104 62 -68 -296 -57 -96 -86 51 24 49 128 135 131 -481 220 -171 23 -14 86 59 258 21 -133 -47 -234
$$ packed form
4326B2l7J80k17J48l02J73kRJ44j75J8Q1k85J91j0Q9n6J97l11Q6K4j59J88J26
4350A22l0j19qm3M0j47K93J0l7j71N8j85K18J51J7k39P7J19k83J00N3P1k6J66
4374B07l07L9J75L9N3l50J10l02L60k9j16k4K13l07K89k89M33k8l28P0O4L2m7
4397d3K02j51j19O0Q8J72m31l5K40m8J42l42K41K91j70O8j16r4J06k52Q8K99l23
4420a27j73K51o9J51K23l16J37o4j97P7J88l1J10Q3k49m2J96o5n23M55l5j56L85
4443B09j68j23l9L1O6N7k03J30L8q8K32j74p4K19l00K46j82J03p6Q3K65l44O7
4466b5J38l84k7M02l85J32K97l80J9P1k9M16q6l22K25j15n9J08j05P6K37j48o
4489E0N4m2j30k28K39l9J0J37k7K5P9Pmo12P01l91J94l7J00k7J99k37j54Q6j87
$$ plain form
4514 -234 108 38 100 -153 -88 -2 217 -122 20 -106 -26 95 7 -97 -59 106 148 -175 98 -25 158 46 -220
4537 -220 -94 287 21 -88 463 38 97 153 -147 100 234 17 53 57 -25 127 416 -83 149 185 -211 -99
4559 -99 -18 -109 -77 54 -166 11 40 -4 -35 57 147 -194 -57 -55 10 -168 85 0 160 106 -35 -18 141 50 -84
4584 -84 203 -19 -120 19 -141 15 -131 51 82 10 -108 174 7 -158 -5 -124 435 195 215 131 -90 -213
4606 -213 354 -116 -90 185 28 201 -22 32 -10 10 189 -43 -127 65 -341 -93 177 2 221 57 -64 103
4628 103 211 36 233 -111 -49 -89 -33 185 -236 -150 16 -60 -87 -138 -212 74 178 -183 -73 4 182 13 15 282
4652 282 20 -288 -128 -142 118 5 -104 117 18 67 97 159 -27 3 375 -226 -184 219 241 -181 -113 -69 -91 -48
4676 -48 199 67 213 12 -220 40 157 -341 -205 -171 202 -34 -200 191 -66 -146 167 -145 70 -197 -181
$$ packed form
4514b34L42p0O2k53O5Q6K19l39J42j26Q0J21q8j04L8J65M2l23K73j23J83j12k66
4537b20J26L81k66j09N51m25N9N6l00K47J34k17L6Mq2J52K89m99K32L6l96J12
4559i9Q1r1L2J31k20J77K9m4l1R2R0l41J37KO5j78K53q5J60n4j41J7J59r1j34
4584h4K87k22j01J39j60J56j46J82L1p2j18K82j67j65J53j19N59k40K0q4k21j23
4606b13N67m70K6K75j57J73k23N4m2K0J79k32q4J92m06K48K70j75K19j64j21J67
4628A03J08j75J97l44O2m0N6K18m21Q6J66p6k7n1p4K86J04l61J10P7J78j69KK67
4652B82k62l08J60j4K60j13j09K21r9M9L0O2j86L0L72o01M2M03K2m22O8M4k2M3
4676d8K47j32J46k01k32K60J17m98J36L4L73k36j66L91k57q0L13l12K15k67J6
$$ plain form
4697 -181 -318 -110 160 70 -84 -276 543 125 -109 327 5 -138 4 -447 120 72 -232 -146 -133 61 -315
4718 -315 107 45 -195 -19 98 -196 -33 171 -198 87 -66 -216 246 45 129 -155 75 91 -209 -28 -82
4739 -82 3 245 214 38 -4 -190 -221 75 -74 111 -4 -97 149 -29 101 -43 -91 -23 0 -6 -153 147 223 -126
4763 -126 -26 -45 -112 153 -58 -12 -120 -31 65 183 212 -129 138 7 109 -33 -94 -130 42 213 21 -233 20
4786 20 -16 -216 183 165 -252 100 -107 -329 -140 -29 -16 -9 -116 108 -106 -45 79 -322 65 -56 -153 -9 37
4809 37 -236 212 134 244 5 340 112 45 43 -23 -2 203 -163 -122 142 115 -2 169 7 49 378 -108 -51 96
4833 96 -208 -38 -435 -133 108 -76 -44 -36 -44 210 -137 -2 -19 34 196 -97 -19 148 -108 136 72 -45 143
4856 143 -256 -177 6 112 -203 22 1 -107 -56 33 123 137 -20 324 -248 14 117 -48 167 153 -134 -110 -256
$$ packed form
4697a81j37K08K70r0j54j92Q19m18k34M36l22j43J42m51N67m8l04Q6J3J94l76
4718c15M22o2k40J76J17k94J63K04l69K85j53j50M62k01Q4k84K30J6l00J81n4
4739h2Q5K42l1j76m2j86l1K96j49J85j15r3K46j78J30j44m8O8K3oj47L00P6l49
4763a26J00j9o7K65k11M6j08Q9R6J18K9l41K67j31J02j42o1l6J72J71j92k54K53
4786B0l6k00L99j8m17L52k07k22J89J11J3Pj07K24k14O1J24m01L87j21r7J44M6
4809C7k73M48p8J10k39L35k28o7ko6K1K05l66M1K64k7j17J71j62M2L29m86N7J47
4833I6l04J70l97L02K41j84L2QqK54l47J35j7N3J62k93P8J67k56K44o4j17J88
4856A43l99P9J83J06l15K25k1j08N1Q9R0J4j57L44n72K62J03j65K15j4k87K4j46
$$ plain form
4879 -256 14 133 130 41 26 47 94 57 43 -191 4 -125 -155 124 -93 121 -112 111 -132 -91 235 64 161 -61
4903 -61 -4 20 -229 26 126 -25 -285 -57 -207 24 -44 157 -17 -79 124 -18 -102 112 -135 73 38 -97
4925 -97 -115 -48 -39 237 -70 16 -107 -231 87 297 -123 -161 -185 -51 12 -169 -120 -88 -211 -165 168 -248 -152 157
4949 157 -34 -227 -89 -36 5 14 -93 23 -145 -225 -180 -109 269 186 87 265 107 -21 -1 62 -59 118 -144 -100
4973 -100 13 -110 249 -148 -66 25 300 39 -40 3 151 -160 61 -74 128 -15 -136 23 51 103 105 -48 93
4996 93 -41 17 84 33 -1 -179 -34 99 -91 -27 220 68 -2 66 14 27 -140 -90 116 -346 60 -87 -4 254
5020 254 63 -176 -27 -181 178 229 74 0 209 -45 -116 -54 74 103 -184 153 -37 20 -172 -108 -85 78 -98
5043 -98 -192 139 49 75 286 -288 -116 -219 -109 -130 -9 -48 89 75 5 207 -45 -107 18 18 -61 63 -164 130
$$ packed form
4879b56K70J19lq9j5K1M7l7j4k34J95j29l0K79k17K14k33K23k43M1L26j71R7k22
4903f1N7K4k49K55J00j51k60K28j50K31o8K01j74o2K03j42q4K14k47K08l5j35
4925i7j8O7RK76l07Q6j23j24L18K10m20l8k4J34O3j81M9L2j23M6L33m16R6L09
4949A57j91j93J38N3M1Rj07J16j68q0M5P1L78q3r9J78j58j28K0O3j21J77k62M4
4973a00J13j23L59l97Q2R1K75k61p9M3J48l11K21j35K02j43j21J59K8N2Kj53J41
4996I3j34N8O7n1l4j78J45J33j90O4K47j52p0O8n2J3j67N0K06m62M06j47Q3K58
5020B54j91k39J49j54L59N1j55p4K09k54p1O2J28K9k87L37j90N7j92O4K3J63j76
5043i8r4L31r0K6K11n74J72j03J10k1J21l9J37j4p0K02k52o2J25%p9J24k27K94
$$ plain form
5067 130 -152 118 -188 0 -83 161 90 139 -101 -268 -160 122 106 128 -77 -33 87 -101 -187 -188 -93 22 112 -140
5091 -140 -222 104 -131 295 277 92 -67 258 155 103 45 -7 -61 -78 147 -73 -178 1 59 85 -10 105 62 -107
5115 -107 43 -65 -39 160 147 29 154 -7 -216 147 -20 23 -7 11 37 179 105 91 89 -148 -2 -385 264
5138 264 -250 -16 -108 -81 4 -270 -98 36 62 66 260 19 -152 -107 -180 -154 150 -145 -283 8 -91 129 219 150
5162 150 -151 -343 44 318 -164 -223 40 8 -79 -175 -5 -19 65 52 -39 151 120 91 -184 -54 92 62 -57 42
5186 42 37 133 101 -20 -94 -157 11 -20 228 -163 -344 141 -398 -33 75 -60 -173 -199 4 178 -102 -73 -160 172
5210 172 42 -172 -87 -15 95 -77 119 79 -237 -161 -10 11 -139 93 -134 22 -111 -22 163 -244 49 103
5232 103 -266 8 -108 -81 -143 60 -24 257 -192 352 7 -191 -117 85 -21 -234 -61 -78 -92 -33 98 -40
$$ packed form
5067A30k82K70l06J88q3K44p1M9k40j67J08K82j6K2k05M4J20j88q6jR5J15R0k52
5091a40q2L26k35M26j8j85j59L25j03n2n8n2n4j7K25k20j05J79N8K6r5J15m3j69
5115a07J50j08K6J99j3j18J25j61k09L63j67M3l0J8K6J42p4j4kk37J46l83O49
5138B64n14K34r2K7Q5k74J72J34K6MJ94k41j71M5p3K6L04k95j38K91r9K20R0o9
5162A50l01j92L87K74m82n9K63l2q7r6J70j4Q4j3r1J90l1k9k75J30J46l0j19R9
5186D2nR6l2j21p4o3J68l1K48l91j81M85n39L65J08j35j13k6K03J74k80K9q7L32
5210A72j30k14Q5P2J10j72J96m0l16P6J51K1j50K32k27J56j33Q9J85m07K93N4
5232A03l69K74j16K7o2K03q4K81m49N44l45j98P4K02j06k13J73j7j4N9J31j38
$$ plain form
5254 -40 245 111 -53 -137 65 -135 52 201 -82 35 132 -92 75 37 -433 0 209 -44 -87 74 -27 -117
5276 -117 200 31 -182 10 -25 -236 -5 -271 32 189 -170 -148 -61 -264 162 -6 -43 174 -183 -69 16 -119
5298 -119 -12 -304 -50 -178 128 -11 37 66 166 -228 71 159 153 152 -157 231 312 157 49 50 117 3 -79 116
5322 116 -148 -103 -63 36 269 197 9 45 55 17 -72 109 64 149 -13 -151 18 -26 -139 -21 -17 2 -110 96 -308
5347 -308 -20 -41 -46 -31 -206 25 134 50 240 10 10 -311 102 79 -80 -172 -183 34 -204 -177 186 92 42 -129
5371 -129 -118 135 -11 -153 69 -11 93 -121 15 62 -80 -147 -133 -21 165 -136 -23 -98 138 50 -219 -45
5393 -45 126 -95 -223 -111 30 -97 70 -17 -237 -16 -337 -68 -389 24 -186 -105 87 53 -59 -119 -60 279
5415 279 59 11 181 -98 90 -148 -292 188 -98 -122 72 80 -19 189 -146 -266 109 -18 -8 33 -296 217
$$ packed form
5254d0K85j34j64q4K02k00J87J49k83J17R7k24J67l8m70M33K09k53m3J61j01r0
5276a17L17j69k13J92l5k11K31k66L03J57l59K2Q7k03M26j68l7K17l57J14Q5j35
5298a19J07k92K54j28L06j39M8K9J00l94K99Q8ojl09L88Q1j55j08JO7j14q2J95
5322A16k64M5M0R9K33p2j88L6J0l8q9J81m5Q5j62j38J69m4j13J18MJ9j12K06m04
5347c08K88k1nJ5j75K31J09q4J90k30%l21M13k3j59r2j1K17k38K7L63r4n0j71
5371a29J1K53j46j42K22q0J04k14J36M7j42o7J4J12J86l01J13p5K36q8k69J74
5393d5J71k21j28J12J41j27J67q7k20K21l21K69l21M13k10Q1J92l4j12o0N9L39
5415B79k20m8J70k79J88k38j44M80k86k4J94Qr9K08l35j20L75j27J0M1l29N13
$$ plain form
5437 217 -256 37 -93 369 -168 -401 36 -22 -60 -80 -143 27 205 1 130 -45 -67 -222 119 -178 59 -89
5459 -89 -169 -105 111 -166 -158 285 71 -166 18 -86 152 -43 -15 -227 -231 -11 -41 -102 -141 116 -165 20 -64 -169
5483 -169 -133 -109 -128 173 118 -154 460 -9 -41 -115 -161 -105 162 -8 110 -66 -153 106 173 119 -65 15 13 -115 -153
5508 -153 72 -36 -35 -19 11 -57 -228 167 162 -120 -72 -105 -141 -300 -138 -101 -158 -39 -118 131 148 60 -87 184 264
5533 264 -178 191 65 63 157 77 -199 18 -84 -6 -204 22 -122 102 -35 -113 -200 39 102 -109 127 123 -207
5556 -207 -93 -245 -102 -63 -152 -24 -155 -46 36 141 -40 287 -268 -218 39 24 183 -49 22 157 69 137 38
5579 38 -125 -168 386 -25 324 -270 194 246 7 66 138 73 89 195 47 -128 -223 269 -158 316 41 -65 97
5602 97 175 -135 57 23 37 83 60 -140 -94 -97 64 -154 -42 -89 80 -8 -61 167 77 -243 -168 256 -166 -147 149
$$ packed form
5437B17m73K93j30M62n37k33M37n8l8k0o3J70J78k04J29j75k2j55L41k97K37j48
5459h9q0O4K16k77QM43k14k37J84j04K38j95K8k12mK20l0o1l9K57k81J85q4j05
5483a69L6K4j9L01n5k72O14m69l2p4m6N6K67j70J18j76q7K59O7n4j84Q0kj28l8
5508a53K25j08JJ6L0o8j71L95nk82M8l3l6j59J62L7n7J19p9K49J7q8j47K71Q0
5533B64m42L69j26kR4q0k76K17j02P8j98K26j44K24j37p8q7K39O3k11K36ml30
5556b07J14j52J43L9q9J28j31J09Q2J05j81L27n55N0K57j5J59k32P1J35q8O8r9
5579C8j63m3N54m11L49n94M64N2k39N9P2o5J6J06j48j75r5M92m27M74k75j06J62
5602I7P8l10J92l4J4M6k3k00M6lJ61k18J12m7J69q8n3K28r0l20P5M24m22J9K96
$$ plain form
5627 149 123 -309 96 -42 86 36 -267 106 -389 -95 -43 -88 -160 -101 200 -68 135 46 53 -80 -90 121 -126
5650 -126 -55 255 131 37 -89 -160 58 131 -6 -78 -187 3 41 -53 21 -53 -104 -131 -181 182 -76 280 -74 -308
5674 -308 83 -111 -157 -188 -271 -86 -68 -42 118 32 5 -43 212 -55 50 -27 225 71 -100 -31 -124 20 -91 -103
5698 -103 -187 -44 -363 66 105 -183 205 283 154 28 -67 99 135 -10 -83 -98 -234 -62 228 -2 -140 211
5720 211 50 20 -223 313 -76 236 146 99 69 -62 -31 -155 -38 -120 -143 -60 39 -50 2 30 -152 -263 10 -81
5744 -81 -130 -212 -14 -23 63 -7 -37 -61 27 -140 -49 -169 -42 81 41 83 -66 23 95 59 -68 -123 -13 -167 110 -24
5770 -24 6 92 227 195 -13 210 -26 162 -86 -170 67 -6 143 -237 84 153 -159 -67 -50 49 -137 -67 172 -15
5794 -15 71 -206 169 -160 -12 -234 120 -6 -54 -69 -36 43 -78 -156 -141 -9 -97 -50 66 139 -70 110 -174 38
$$ packed form
5627A49k6m32M05j38J28n0l03L73m95K94N2m5p2N9L01k68K03q9Pj33j0K11k47
5650a26P1L10j24r4j26p1K18P3j37p2j09J90L8r4P4p4n1k7n0L63k58L56l54k34
5674c08L91j94m6l1q3J85J8K6J60q6k7m8K55k67J05p7K52j54j71O9r3J44j11j2
5698a03q4J43l19M29L9k88L88P8j29j26r5J66L6j45p3j5j36J72K90k30j38L51
5720B11j61l0k43N36l89L12r0m7l0j31L1j24J17q2k3Q3R9q9N2K8j82j11K73r1
5744h1m9q2J98rQ6p0l0k4Q8j67R1j20J27J23m0M2j49Q9P2l6j27n5J10j54K77j34
5770b4L0Q6J35l2k08K23k36J88k48q4K37p3J49l80L21O9l12R2J7R9j86P0K39j87
5794a5Q6k77L75l29J48k22L54j26m8j5L3P9j21p8J5J32q8M7J16P3k09J80k84K12
$$ plain form
5818 38 -93 43 42 103 14 -69 -84 178 -175 88 -20 -105 -99 51 -96 285 137 -124 33 -262 -6 -189 -153 40
5842 40 -197 61 98 -175 54 67 -53 198 47 90 -109 -90 14 -99 12 56 -53 -47 -159 42 29 -180 -242
5865 -242 -16 -194 -95 -60 -289 268 -52 77 89 8 77 11 23 173 119 97 225 50 133 -205 108 -55 -183
5888 -183 53 -51 122 -81 10 52 101 -19 25 47 -66 97 137 -98 -114 -252 170 -247 -124 145 35 57 54
5911 54 90 -161 -177 -32 -156 171 122 114 -71 -84 25 -133 110 241 88 95 308 -197 113 -74 -53 55 137 179
5935 179 -61 -175 16 -5 -43 333 15 37 245 -80 2 212 150 -147 148 32 39 125 -114 -44 -26 -175 -199 40
5959 40 75 74 -23 111 -54 202 77 -110 42 31 134 -163 106 113 42 235 72 312 72 156 -56 -26 5 -153
5983 -153 -174 -65 -11 191 25 146 -39 86 26 -34 -84 19 147 -83 139 -101 86 -335 -173 -313 -195 30
$$ packed form
5818C8j31J36jO1q9q3j5K62l53K63j08q5OJ50j47L81j48k61J57k95K56j83L6J93
5842D0k37K58L7k73K29J3j20K51j51M3j99J9J04j13J11M4j09Oj12K01j3k09o2
5865b42K26j78R9L5k29N57l20J29J2q1O9o6J2J50n4k2J28j75Q3l38L13j63j28
5888a83K36j04J73k03R1M2M9j20M4K2j13J63M0k35j6j38M22m17J23K69j10K2l
5911E4L6k51j6J45j24L27m9qj85j3J09j58K43J31j53PK13n05L10j87K1J08Q2M2
5935A79k40j14J91k1l8L76l18K2K08l25Q2K10o2k97K95j16PQ6k39P0J8j49k4K39
5959D0L5jr7J34j65K56j25j87J52j1J03k97K69Pp1J93j63K40k40Q4k12L0L1j58
5983a53k1J09N4K02j66J21j85J25o0o0n0J03J28k30K22k40J87m21J62j40J18K25
$$ plain form
6005 30 190 134 179 126 172 180 97 -114 -121 -39 -112 31 73 -280 -184 21 -191 -84 49 -67 -50 -67 5 2 -193 43
6031 43 36 17 239 -3 -93 -65 35 -131 -189 45 -45 -25 116 -317 288 349 92 -95 -204 79 184 -114 -112 -8
6055 -8 148 44 215 -221 -322 -225 -155 -70 32 -64 -54 -126 -120 -237 -27 41 256 -124 133 -140 86 112 -217 187
6079 187 257 255 -41 1 140 148 38 16 159 129 63 69 71 14 77 245 49 -262 239 46 72 -14 -3 -23 -146 205
6105 205 -204 97 263 54 95 -330 -88 198 155 -57 -48 -67 -6 -94 -79 -18 -374 -72 153 124 -32 -117 -134 52
6129 52 234 145 64 -20 111 43 96 128 -19 106 45 -25 104 8 -220 92 29 -27 -151 -346 -79 168 132 48 175
6154 175 -19 -297 -166 132 305 150 -142 77 142 3 123 46 -39 144 105 120 149 -161 -40 160 -30 -53
6176 -53 132 -252 -21 -186 44 -78 39 -38 105 -86 -12 -1 27 12 40 2 28 -155 -93 -30 -220 -98 174 -84
$$ packed form
6005C0J60n6M5n3M6Qq3k11pQ2p3J43M2l53R6K05k12J07J33j16J7j7P2lj95K36
6031D3pj9K22k42r0K8J00j66n8K34r0K0J41m33O05O1k57j87j09K83J05k98KJ04
6055hJ56j04J71m36j01R7P0Q5J02r6J0p2Oj17K10O8K15l80K57k73K26K6l29M04
6079A87P0kk96M2J39Qj10k2J43l0o6OKn7O3J68j96l11N01j93K6q6J1k0j23L51
6105B05m09L01J66k09M1m25K42K86m3k12Rj9O1q8J5O1l56L02K25k9j56q5j7J86
6129E2J82q9q1q4J31o8N3L2j47J25o1p0J29r6k28L12o3n6j24j95K67K47l6q4J27
6154A75j94k78J31K98J73j55k92K19O5j39J20p7q5J83l9J5K9l10J21K00j90k3
6176e3J85l84K31j65K30j22J17p7J43j91P4J1K8j5K8l8K6j83O2O3j90J22K72k58
$$ plain form
6200 -84 -303 -117 126 -190 58 176 -2 116 39 178 -187 138 133 -85 50 19 63 -52 -119 -140 168 -52 -42
6223 -42 21 -1 -54 -192 -167 156 -8 91 23 61 -258 -145 250 -3 115 -55 87 -95 75 205 216 -174 137
6246 137 92 168 -83 75 -271 98 -127 -132 125 -113 -24 153 -152 14 -243 -234 -109 -274 -25 224 18 -150
6268 -150 -28 157 192 -111 20 -121 -148 -49 350 -321 173 43 181 116 255 -203 -259 223 3 155 -55 -204
6290 -204 -53 37 -88 -28 -54 -166 -322 88 -195 -98 -35 -198 17 -314 -96 -74 -151 -177 210 75 -58 59 184
6313 184 -129 -113 -178 111 69 -290 -65 -20 -145 -34 163 176 80 -139 -269 -30 -441 -168 -210 129 157 206 239
6336 239 127 17 71 -2 -81 -177 -242 55 -57 78 48 -24 -78 176 -68 -212 89 -160 -75 -38 -92 86 -34 27
6360 27 -251 122 105 -107 14 211 -60 19 276 -127 -30 -121 -8 140 -119 290 83 197 -106 -161 122 -91
$$ packed form
6200h4k19J86K43l16K48J18j78J18p7J39l65L25nk18J35l1M4j15o7k1L08k20J0
6223d2O3k2n3j38K5L23j64R9o8L8l19J13L95k53J18j70J42j82J70J30J1l90L11
6246A37m5P6k51J58l46L69k25nK57k38Q9J77l05J66k57RJ25j65K49K49k06j68
6268a50J22J85L5l03J31j41k7R9L99o71M94j30J38o5J39m58n6M82k20J52k10j49
6290b04J51R0j25O0k6j12j56M10k83R7O3j63K15l31K18K2p7k6L87j35j33J17J25
6313A84l13J6o5K89m2l59K25M5j25J11J97J3r6k19j30K39m11K73m2L39K8M9L3
6336B39j12j10N4p3p9r6o5K97j12J35l0p2n4K54k44j44L01k49Q5L7n4J78j20O1
6360B7k78L73j7k12J21J97k71P9K57m03R7r1J13J48k59M09k07J14l03n5K83k13
$$ plain form
6382 -91 15 -35 -195 -173 233 -108 -3 150 9 247 -57 140 138 93 51 113 -97 -70 194 72 86 340 235
6405 235 72 -271 -34 389 -19 -245 -85 265 216 -37 -207 -62 -135 50 113 109 31 49 -126 -20 -106 131 190
6428 190 -233 9 -95 198 -189 196 118 -102 -102 248 1 -38 -22 147 19 53 288 -13 2 5 28 107 -24 92
6452 92 16 126 8 15 86 -202 -49 82 -181 12 49 176 -65 -177 83 -187 26 103 57 -60 -362 67 -5
6475 -5 -67 101 83 -41 106 4 -7 -121 -68 29 166 -14 -55 -30 -1 -159 -31 -42 -62 -127 128 179 18 46 -38
6500 -38 -243 31 89 -19 -41 224 18 -61 194 93 202 -142 -10 -4 242 11 -115 -1 148 29 96 -38
6522 -38 -175 -107 51 -107 -47 -68 4 -141 80 111 38 -103 -55 -76 271 -117 227 291 -151 49 -14 -11 90 -300
6546 -300 -317 1 44 97 -116 -71 68 106 65 -40 1 228 -192 -49 4 -18 -151 327 86 136 104 -52 257 -81
$$ packed form
6382i1J06n0j60K2M06l41J05J53j41K38l04J97km5m2O2k10K7K64j22J4K54j05
6405B35j63l43K37M23m08k26J60L50m9k53j70J45p3J85O3mp8J8j75J06q6K37N9
6428A90m23K42j04K93l87L85p8k20%L50k47l9J6J69j28L4K35l01J5LK3P9j31J16
6452I2p6J10j18PP1k88J53J31k63J93L7J27k41j12K60k70K13P7m6j17l02M29p2
6475eo2J68j8j24J47j02j1j14N3R7J37j80m1K5K9j58J28j1k0o5K55N1j61K8q4
6500c8k05K74N8j08k2K65k06p9K55j01J09l44J32OK46k31j26J14J49j19O7j34
6522c8j37O8J58j58O0k1P2j45K21L1p3j41M8k1L47l88L44O4m42K00o3LJ01l90
6546c00j7L18M3N3k13M5J39L8m1j05M1K27m20J43N3k2j33M78k41N0l2j56L09l38
$$ plain form
6570 -81 -117 201 -45 99 204 -75 -206 -15 5 129 -36 220 -96 156 -247 8 14 120 166 110 32 -280 -159
6593 -159 -39 -18 68 18 107 259 90 -11 -66 196 -55 135 68 4 -43 -1 -264 54 243 -322 -169 72 -38
6616 -38 -96 -153 54 155 42 12 387 74 77 14 243 132 145 -100 -187 -144 126 -98 130 190 28 79 -244 -165
6640 -165 58 251 -141 -163 48 -97 -190 13 -4 -148 -20 -99 90 -155 -61 26 141 147 -92 -115 130 6 128
6663 128 -172 58 194 118 64 139 -111 13 -34 -397 -162 -197 -68 -176 -121 -218 155 -2 158 -268 167 -164
6685 -164 132 163 -55 -67 -137 43 79 -37 103 -92 -55 31 154 -10 -240 204 81 -100 -111 -152 83 14 38
6708 38 -45 -49 -2 148 -292 -37 -78 -183 276 28 288 -279 10 94 24 -389 169 112 -50 187 -79 -100 -55 -9
6732 -9 -44 38 149 -58 -99 123 -153 31 27 74 -91 120 -287 14 -31 -63 167 -9 -158 89 -23 -59 -259 76
$$ packed form
6570h1l6L18k46J44J05k79j31J91K0J24j65K56l16K52m03K55OJ06M6n6p8l12J21
6593a59J20K1Q6n0Q9J52j69j01n5K62k51J90o7o4m7M2k63L18J89n65J53K41j10
6616c8n8n7K07J01j13l0L75l13Lo3K29j11J3k45q7M3K70k24K28O0j62N1l23P9
6640a65K23J93l92k2K11j45r3K03j7j44J28p9J89k45R4Q7J15Ok39k3K45j24J22
6663A28l00K30J36p6n4P5k50J24m7l63K35l5J29j08N5r7L73j57J60m26M35l31
6685a64K96L1k18j2p0J80L6j16J40j95L7Q6J23j64k30M44j23j81j1m1K35o9K4
6708C8q3mM7J50m40K55m1j05M59k48K60n67K89Q4p0m13N58n7j62K37k66k1M5M6
6732il5Q2J11k07m1K22k76J84mM7j65K11m07L01m5l2K30j76j49K47j12l6k00L35
$$ plain form
6756 76 323 -206 51 -33 -226 -44 107 107 -13 -182 -103 -62 13 -154 103 136 -25 210 -113 321 131 -27 76
6779 76 162 65 -43 -41 -104 -200 -131 89 -40 239 4 -124 35 -67 299 -234 31 -46 107 -129 -117 208 -290
6802 -290 27 -80 50 15 -87 -126 57 -137 -26 172 24 142 23 246 165 -112 -142 -88 -259 -37 106 266
6824 266 114 61 -41 -68 161 -58 -64 187 234 -117 -108 -106 -155 49 -179 72 21 -31 205 98 -109 44 255 -36
6848 -36 -104 180 -117 135 -29 -82 -148 -20 159 -175 152 -15 -53 -60 81 46 73 -24 72 -275 -194 101 86 -208
6872 -208 4 -111 -116 120 -108 41 82 130 56 -156 181 119 -163 8 220 -24 3 -317 -251 143 132 -12 61
6895 61 152 -9 35 -23 106 -212 205 158 83 -61 42 274 96 70 -140 -119 -62 -82 11 134 -245 -202 -183 129
6919 129 -117 -103 -108 63 -134 221 86 123 9 38 150 -64 57 -55 42 -61 104 43 -38 236 20 62 137
$$ packed form
6756G6K47n29K57q4j93J82J51%j20j69P9M1P5j67K57L3j61K35l23M34j90j58J03
6779G6Q6r7j08Ko3r6O9K20j29K79k35j28J59j02L66n33K65p7J53k36J2L25m98
6802b90L17j07J30l5j02l9J83j94J11J98j48J18j19K23q1k77l0N4j71K22J43J60
6824B66j52n3j02k7K29k19oK51M7l51RKm9K04k28K51n1n2K36j07k07J53K11k91
6848c6o8K84k97K52j64n3o6J28J79l34L27j67l8pJ41l5K7r7R6l47Q1K95j5k94
6872b08K12j15nK36k28J49M1M8p4k12L37o2k82J71K12k44K7l20O6L94j1j44P3
6895F1R1j61M4n8J29l18M17m7p5j44J03K32j78k6k10K1N7k0R3J23l79M3J9L12
6919A29k46J4nJ71j97L55j35L7j14K9J12k14J21j12R7j03J65o1q1K74k16M2P5
$$ plain form
6942 137 134 -36 -19 70 -119 130 80 64 12 11 -90 184 -194 -16 -30 31 157 57 89 -63 -16 179 -69 -12 151
6967 151 104 -109 -27 117 59 52 91 97 -145 -60 -63 -56 139 -119 45 -163 -54 -281 -111 5 -398 151 -89 248
6991 248 96 -205 -233 -51 -82 -56 169 79 -256 -10 -189 -71 20 196 127 -144 -132 60 12 -137 -279 33 28
7014 28 11 22 -49 -55 135 183 28 286 -24 93 159 29 281 -96 -164 -37 -24 5 -44 -114 118 -32 -41 210 51
7039 51 -74 44 139 5 189 10 -268 -202 -62 257 104 115 -37 164 -8 -50 29 -66 184 -286 -130 -44 163
7062 163 -48 -85 161 -27 152 -10 88 110 -67 44 242 -44 179 16 109 62 -55 108 -85 459 -292 58
7084 58 -1 109 70 -23 346 4 -88 57 103 -83 -146 -189 -6 -37 254 -68 13 -71 -164 -260 -70 125 40 -52 8
7109 8 -182 -7 -53 124 -100 -147 197 121 -227 47 -88 196 100 -50 51 -18 -124 40 32 -242 -76 135 -122
$$ packed form
6942A37lj70J7Q9j89K49n0j6n2jj01K74l78J78j4O1J26j00L2j52M7J95k48N7J63
6967A51m7k13Q2J44n8pL9Ok42Q5lPJ95k58J64k08J09k27J70J16m03N49k40L37
6991B48j52l01k8J82l1K6K25r0l35K46j79J18R1J76o9k71J2J92m8j49j42L12n
7014B8j7J1p1oJ90M8j55K58l10J17O6j30K52l77o8J27J3K9m9p0K32j50rK51j59
7039E1j25J18R5j34J84j79k78O6J40L19j53J1j52K01j72m2P9r5K50m70J56Q6K07
7062A63k11l7K46j88J79j62R8K2j77J11J98k86K23j63R3m7j17J63j93N44p51L50
7084E8n9J10l9r3L69l42r2J45M6j86o3m3J83l1K91l22Q1q4r3r6J90J95q5r2O0
7109Hj90J75m6J77k24m7L44p6l48K74j35K84r6j50J01o9j06J64qk74J66K11k57
$$ plain form
7132 -122 -51 -8 -125 50 -76 9 -66 170 7 47 -175 159 -70 17 143 80 26 -103 208 63 9 -63 21 -199
7156 -199 89 -125 -146 92 12 -59 36 -196 54 -206 -139 -12 -292 -156 -62 -5 -212 139 -53 -96 -84 -20 136
7179 136 106 -1 -122 -144 116 -375 -83 22 -163 -9 353 -115 -114 -66 -338 227 17 -186 -192 71 -123 96
7201 96 62 112 44 6 171 -20 216 26 113 164 -155 -128 -65 -122 -197 -92 -129 -107 -176 119 -5 139 301 152 -346
7226 -346 -296 -57 -17 -28 -116 117 -299 -6 78 -28 253 -85 -90 17 116 13 162 -141 -43 -355 -16 78 112 138
7250 138 -52 126 -50 -39 229 -78 24 26 -22 -11 101 35 -229 24 -128 -4 119 -152 190 138 151 -17 128
7273 128 -24 -105 -104 -102 -59 -26 -59 40 149 77 191 -26 -109 -55 64 115 -39 132 -27 -244 87 -88 -54 56 174
7298 174 -252 248 -126 -98 -100 -87 67 -76 -10 206 83 7 -18 2 -103 140 166 -143 -198 143 -81 138 -137
$$ packed form
7132a22P1M3j17J75j26Q5p5K36j63M0k22L34k29Q7J26o3n4j29L11j45n4p2Q4k20
7156a99K88k14k1K38q0p1R5k32K50k60O7J27k80J36R4N7k07L51j92m3J2O4J56
7179A36l0j07j21k2K60m91K92J05j85J54L62m68JM8k72N65k10k03oK63j94K19
7201I6l4N0o8l8J65j91K36j90Q7N1l19K7O3n7p5J05l7K2o9K95j24J44J62j49m98
7226c46N0K39M0j1q8K33m16K93Q4j06K81l38nJ07R9j03J49l03R8l12L39R4L4K6
7250A38j90J78j76J1K68l07J02Km8J1J12o6k64K53j52J24J23k71L42n2J3j68J45
7273A28j52q1JKM3L3l3R9J09p2J14k17q3N4J19N1j54J71j59k17L31j75L4J10J18
7298A74m26N00l74K8kJ3J54j43O6K16j23p6k5K0j05K43K6l09n5L41k24K19k75
$$ plain form
7321 -137 -48 218 -164 -128 -94 149 -44 -131 -11 24 -128 5 144 -123 -36 109 -216 1 52 156 105 61 38
7344 38 89 188 -26 326 52 8 135 -250 100 95 -32 134 7 -166 45 -69 -100 -39 -29 97 -29 44 139 -185
7368 -185 -214 -266 57 -204 -11 -8 -24 -20 121 43 -88 145 -52 61 109 -139 234 -298 -233 -130 -228 -187 26 -26
7392 -26 -235 126 183 73 -36 -8 -321 221 48 -103 -6 -219 -209 151 29 -126 25 117 162 -34 -227 -8
7414 -8 95 78 -11 150 110 32 33 165 78 158 114 231 -38 8 135 -112 -252 -29 -231 192 178 -33 -14 -85 -126
7439 -126 111 90 -8 148 -191 -307 -67 201 -196 179 -139 -59 126 89 303 -114 -96 14 218 32 -21 154
7461 154 119 124 -286 130 -27 -58 -127 69 11 -62 76 -30 148 184 -113 133 -73 -283 -81 -31 136 -9 56
7484 56 43 -55 -126 -284 -220 -27 -43 -59 177 112 146 -217 22 169 61 -80 257 -242 148 117 36 -9 -23 -43 -69
$$ packed form
7321a37Q9K66l82L6L4K43j93q7J20L5j52J33J39k67Q7J45l25K17N1J04n1m4k3
7344C8N1R9k14L52k74m4J27l85L50nj27J66j27j73K11j14l1O1J0J26j26P3R5l24
7368a85k9n2L23k61J93Lj6MJ41p8j31K33j97J13M8k48L73n32O5J03r8M1K13n2
7392b6k09L61N7j10j09K8l13N42j73j51R7k13J0L60j22j55J51R2M5j96j93K19
7414hJ03j7q9J61m0p8JJ32q7Q0m4J17k69M6J27k47j40K23k02M23j4k11J9p1m1
7439a26K37k1r8J56l39j16K40K68l97L75l18Q0J85l7K14m17J8J10K04j86n3J75
7461A54l5Nm10M16j57l1o9J96n8p3J38j06J78L6k97K46k06k10K02N0J67j45O5
7484E6j3r8p1j58O4J93j6j6K36o5L4l63K39J47j08j41L37m99L90l1q1m5j4k0k6
$$ plain form
7509 -69 -90 -154 -33 34 73 269 129 -103 -229 49 202 -185 84 89 51 61 -111 -219 -36 -57 33 -11 112 -4
7533 -4 -190 89 -108 -152 -211 41 -52 -69 -105 -57 11 153 -260 19 29 -37 173 -114 51 -282 -126 -75 -46 60
7557 60 18 -10 -163 -229 137 131 -125 -152 114 -70 46 -77 -126 2 -1 -73 62 161 132 69 -25 -194 -144 -52 -59 27 171
7584 171 67 -19 214 -168 313 -2 144 -150 70 80 53 24 124 -167 75 79 -144 -70 -203 10 -80 -77 -94 106
7608 106 21 78 -119 -83 -38 -69 -26 -88 -103 -45 -161 -164 -9 68 89 215 -289 -91 211 44 89 -64 -239 104 -180
7633 -180 7 127 101 -158 145 52 -124 96 -84 95 -222 -16 68 -152 -44 -147 -87 71 -155 -98 -92 121
7655 121 150 220 -11 215 -52 -23 62 -34 -332 -27 -14 144 19 75 213 -155 69 114 122 82 -71 201 79 -163
7679 -163 31 163 -51 40 -25 -54 -126 122 -252 39 111 -208 146 -191 -195 37 72 -113 66 33 24 77 -320 -190
$$ packed form
7509f9k1o4J21O7L9J96j40k32j26K78J53l87K69Nl8J0j72j08J83k1R0m4J23j16
7533dj86K79j97m4n9K52r3j7l6M8O8J42m13K79J0o6K10k87J65l33J56N1K9J06
7557F0m2k8j53o6L66ok56k7K66j84J16j23m9J28lp2J35R9k9o3r4j69N0R2pQ6J44
7584A71j04q6K33l82M81l15J46k94K20J0k7k9J00k91K42Mk23P4j33K13r0Lj7K00
7608A06q5N7j97L6M5l1M3o2j5N8j16lJ55P7K1J26n04J98L02j67M5j53j75L43k84
7633a80J87J20k6k59L03r3j76K20j80J79l17K06Q4k20J08j03O0J58k26N7OK13
7655A21K9P0k31K26k67K9Q5r6k98L05J3J58j25N6J38l68K24M5Qm0j53K72j22k42
7679a63J94J32k14R1o5k9p2K48l74K91P2l19L54l37mK32L5j85J79l3rN3l97J30
$$ plain form
7703 -190 -3 -162 -48 -336 78 -38 -274 -131 -5 202 -233 -44 -121 -163 87 -195 -184 169 -150 -150 -102 -89
7725 -89 -2 146 -40 -92 -47 88 370 -84 99 -136 129 -16 -46 200 145 127 184 34 -263 71 166 102 69 -60
7749 -60 -209 -259 85 -90 -169 -155 39 -26 56 3 -60 -177 -111 221 52 10 129 -87 9 147 103 229 -162 123
7773 123 215 -10 -285 -51 -162 19 161 -212 15 117 87 19 244 -62 -138 -278 298 114 97 4 -34 131
7795 131 -150 142 -79 117 69 -113 -81 -19 -35 -82 251 2 -220 -18 -73 -151 204 -219 25 -82 48 -161
7817 -161 -100 -30 -50 -84 221 25 -392 155 89 -100 76 -132 -119 5 -189 -227 86 10 21 -190 -244 -81 -122 -253
7841 -253 178 109 -23 -93 -165 57 66 -144 70 -174 -59 57 -193 79 88 -10 -119 34 111 196 114 42 25 88 -101
7866 -101 204 -297 -222 -118 127 201 66 -209 -15 -35 -56 28 -98 -83 -176 -68 138 30 -210 -172 153 -14 58
$$ packed form
7703a90J87j59J14k88M14j16k36J43J26K07m35J89p7m2K50k82J1L53l19%M8J3
7725h9Q7J48j86n2M5J35K82m54J83k35K65j45l0K46n5j8N7j50k97L34R5o4l3j29
7749f0j49n0L44j75p9J4J94o5Q2n3o3j17O6L32j69m2J19k16R6J38m4J26l91K85
7773A23R2k25k75K34j11J81J42l73K27J02l0o8K25l06p6j40N76j84j7r3l8J65
7795A31k81K92k21J96m8j82L2O2j6m7L33k49k22K02n5p8L55m23K44j07J30k09
7817a61O1P0k0l4L05j96m17N47o6j89J76k08J3J24j94l8L13p6J1k11n4J63m1j31
7841b53M31o9j32p0p2K22Rk10K14k44J15J16k50K72Rr8j09J53P7Q5q2p2j7O3j89
7866a01L05n01P5J04K45P4j35k75J94k0k1Q4j26J5r3J08K06j08k40L8L25j67P2
$$ plain form
7889 58 197 249 118 -124 -39 -47 -10 -139 61 45 -64 -71 -92 -48 182 -79 16 201 51 82 -78 -101 -36 0 37 67
7915 67 -221 51 -36 -5 -161 -7 91 252 182 -71 278 107 103 -90 137 -136 -210 188 -58 262 -160 237 191
7938 191 17 88 -95 114 -70 -3 -129 -12 -40 -172 -31 -81 145 45 -30 -50 7 -3 4 1 -365 60 54 48 -51 141
7964 141 109 139 14 -34 72 -82 -342 72 -176 119 34 -61 152 -135 185 -135 160 202 -84 -92 23 15 -21 -322
7988 -322 276 -10 -68 135 59 -213 143 -86 -117 -58 -251 230 103 -77 -22 -24 150 214 68 -223 -43 13 56
8011 56 -54 -36 -123 -42 126 -49 -107 105 -280 -107 78 -34 23 202 -106 -82 42 240 -32 -69 182 97 44
8034 44 49 -159 -100 -67 -201 -145 -117 11 180 -141 -37 208 -101 -18 114 -96 217 133 6 -313 115 174 32
8057 32 -260 226 -16 -336 122 47 93 66 253 -279 -195 -4 -38 56 50 52 37 60 -65 10 89 69 -18 33 35 -45 116
$$ packed form
7889E8J39N2j31k42Q5qL7j29K00j6j09pk1M4K30k61R5J85j50L1j60k3O5L6L7L0
7915F7k88K72q7L1j56J54R8J61p0k53L49j71mj93K27k73p4L98k46L20m22L97m6
7938A91j74P1j83K09j84O7j26J17k8j32J41n0K26j00p5k0N7j0Pll66M25oor9J92
7964A41l2L0j25m8J06j54k60M14k48K95q5r5K13k87L20l20K95M2k86qJ15ql6l01
7988c22N98k86n8K03p6k72L56k29l1N9j93M81j27j80N5kJ74O4j46k91J80N6M3
8011E6j10J8q7Q1J68j75n8K12l85J73J85j12N7J79l08K4J24J98k72l7K51q5n3
8034D4Nk08N9L3j34N6K8J28J69l21J04K45l09Q3J32k10L13q4j27l19M28N9j42
8057C2k92M86k42l20M58p5M6k7J87n32Q4J91l4R4oKj5K3j25P5P9k0q7N1Kq0J61
$$ plain form
8084 116 -357 63 14 180 272 85 283 203 99 38 -98 -200 130 -81 132 45 -180 231 122 -176 63 0
8106 0 226 -208 83 -140 146 -29 111 59 -95 133 14 5 39 42 191 -265 -128 -52 -30 218 -4 114 65 -138
8130 -138 95 42 -248 -78 -184 61 -138 -89 87 -238 -10 338 -161 72 38 28 16 190 33 -1 2 -94 237
8153 237 2 -171 -23 -149 117 -146 52 -32 -124 187 -11 90 2 -118 150 255 64 -343 45 -81 -59
8174 -59 80 -149 142 78 72 -171 76 183 -141 48 -86 -189 -48 -38 -196 14 -23
$$ packed form
8084A16m73M20m9J66R2j87J98q0j04o1j36j02L30k11K13q7k25M11j09k98K39o3
8106@K26m34K91k23K86j75J40n2j54K28j19rL4LJ49m56J37P6K2K48k22J18m9k03
8130a38K33n3k90J70j06K45j99M9J76l25K28L48m99K33l4j0j2J74j57l4Lr6L31
8153B37k35j73J48j26K66k63J98q4r2L11j98J01q8j20K68J05j91m07L88j26K2
8174e9J39k29K91o4ok43K47J07l24J89j34j03J41J0j58K10l7
8191b3
$$ Imaginary data points
##PAGE= N=2
##DATA TABLE= (X++(I..I)), XYDATA
$$ plain form
0 0 0 0 0 0 0 0 0 0 0 0 0 0 0 0 0 0 0 0 0 0 3 -8 8 -8 8 -8 8 -10 16 -16 16 -19 24 -24 31 -32 36 -41 47 -49 56 -63
42 -63 68 -76 84 -93 103 -112 124 -136 149 -164 182 -200 222 -247 275 -307 347 -390 446 -516 605
63 605 -726 897 -1155 1592 -2471 4893 -23046 -79835 7696 69659 17973 -47978 -7203 46837
77 46837 21169 -4275 1311 -1504 10081 17139 6552 -13898 -23050 12496 19170 -26250 -22253
90 -22253 1238 -1338 -3361 -11145 -8099 -5043 -6614 19649 5483 -26990 8365 30352 4056
103 4056 -11631 -1265 27690 9984 -21335 11165 16478 -11882 -2899 1781 117 -4898 -11642
116 -11642 4435 -8298 -16431 16680 -1884 -29432 1446 23451 7390 -29844 -14675 46026
128 46026 17193 -36306 -5332 27493 19939 -9595 -19486 13221 11810 -4400 4146 -11754 -10995
$$ packed form
0@%%%%%%%%%%%%%%%%%%%%Lj1J6j6J6j6J6j8K6l2L2l5M3m8N5o3O8p7Q8r6J05j19
42f3J31j44J60j77J96k15K36k60K85l13L46l82M22m69N22n82O54p37Q36r62J121
63F05j331J623k052K747m063P364k7939n6789Q7531O1963n1686o5951M0775N4040
77D6837k5668k5444N586k815J1585P058j0587k0450r152L5546O674m5420L997
90b2253K3491k576k023p784L046L056j571K6263j4166l2473L5355K1987k6296
103D056j5687J0366K8955j7706l1319L2500N313k8360Q983M680j664n015o744
116a1642J6077j2733q133L3111j8564k7548L0878K2005j6061l7234J5169O0701
128D6026k8833n3499L0974L2825p554k9534r891L2707j411j6210Q546j5900P59
$$ plain form
141 -10995 13323 5053 -9288 -17443 -4568 19490 -3000 -16784 1229 -350 6075 9517 -7269
154 -7269 -7733 1342 18275 13840 -23255 -9972 27311 11138 -15213 -13274 9264 15062 -11094
167 -11094 -9110 5938 -4971 -1959 4686 -4341 -7935 -3787 9946 4677 -15294 -530 13044
180 13044 -578 -4855 850 6479 895 -4835 7396 4414 -9730 1195 7855 -728 -5879 -2172
194 -2172 6628 -2212 -7719 4573 564 -7201 -45 4149 859 -6912 -2017 9588 -188 -5590 2999
209 2999 1584 1834 1550 215 311 -3925 4612 7454 -8853 -5482 7507 3827 -4204 -7813 3566
224 3566 6508 -7626 -2005 4804 -4089 -1585 2005 2846 -735 -7759 5232 8258 -6494 -2100 2469
239 2469 2207 3551 -4492 -1019 2298 -1211 5162 -2452 -8941 5535 4976 -3104 -5586 -3422 9279
$$ packed form
141a0995K4318q270j4341q155J2875K4058k2490j3784J8013j579O425L442j6786
154g269m64R075J6933m435l7095J3283L7283j6173k6351J939K2538N798k6156
167a1094J984J5048j0909L012O645r027l594M148J3733n269j9971J4764J3574
180A3044j3622m277N705N629n584n730J2231k982j4144J0925O660q583n151L707
194b172Q800q840n507J2292m009p765P156M194l290p771M895J1605r776n402Q589
209B999j415K50k84j335R6m236Q537K842j6307L371J2989l680q031l609J1379
224C566K942j4134N621O809q893K504L590Q41l581p024J2991L026j4752M394M569
239B469k62J344q043L473L317l509O373p614o489J4476n59q080k482K164J2701
$$ plain form
254 9279 853 -9911 3579 3009 -1846 1066 -1668 3155 -285 -3489 6987 -330 -5359 3886 710
269 710 716 12 -4100 3513 418 -1999 3315 -5118 -1167 6560 -2227 -3261 -1407 2422 6202 -6849
285 -6849 -3949 7897 362 -2074 -1247 218 5117 -3204 -2322 4392 -2106 85 1037 -2731 2780 26
301 26 -1677 1128 -2330 2727 1568 -6068 2021 3684 -1601 -1646 -2723 4630 2708 -6114 1327 3088
317 3088 -739 634 -1970 1192 1545 -2724 2157 214 -2985 2172 -515 -158 859 -2668 1564 78
333 78 -1243 2579 -2833 -1487 4050 230 -1156 -2489 469 5582 -2942 -3908 2868 561 1068 -1717
349 -1717 -2540 3375 -224 -602 1377 -2849 1549 1971 -2177 640 -1247 128 2082 -3036 866 1467
365 1467 -2697 1708 698 -866 556 -2870 2359 2587 -4304 510 731 -184 1903 -3126 25 2574
$$ packed form
254I279q426j0764J3490n70m855K912k734M823l440l204J0476p317n029R245l176
269G10Op04m112P613l095k417N314q433L951P727q787j034J854L829L780j3051
285f849K900J1846p535k436Q27J465M899q321Q82O714o498K191R52l768N511k754
301B6j703K805l458N057j159p636Q089J663n285m5j077P353j922q822P441J761
317C088l827J373k604L162L53m269M881j943l199N157k687L57J017l527M232j486
333G8j321L822n412J346N537l820j386j333K958N113q524r66O776k307N07k785
349a717q23N915l599l78J979m226M398M22m148K817j887J375J954n118L902O01
365A467m164M405j010j564J422l426N229K28o891M814K21r15K087n029L151K549
$$ plain form
381 2574 -1651 1631 -894 -2346 3234 -967 -890 958 -2031 2141 194 -2434 2907 -962 -1311 2313
397 2313 -1170 1163 -744 -2704 3767 -70 -2047 1270 -1850 2152 1522 -3672 831 16 452 2176
413 2176 -3785 -550 2905 -798 1073 -1458 -1913 3714 -400 -264 381 -2919 2751 1531 -2508 100
429 100 -1819 2363 2954 -4091 -625 1275 141 2201 -2777 -1659 2532 -619 845 -860 -3176 2853
445 2853 1048 -993 -105 -2751 2561 2304 -3245 10 309 856 1981 -3197 155 1920 -1794 900
461 900 -449 -428 1733 -2479 306 2643 -1757 -86 -578 429 2890 -2861 -1468 2122 -158 1423
477 1423 -1101 -2061 2457 -68 472 640 -3275 1422 2156 -691 -918 -2522 2047 4254 -3467 -2178
493 -2178 774 1587 2681 -3513 -2070 2995 611 957 -1186 -3033 2295 1173 -210 55 -3674 1683
$$ packed form
381B574m225L282k525j452N580m201P7J848k989M172j947k628N341l869l49L624
397B313l483K333j907j960O471l837j977L317l120M002o30n194M503q15M36J724
413B176n961L235L455l703J871k531m55N627m114J36O45l300N670j220m039K608
429A00j919M182N91p045L466J900j134K060m978J118M191l151J464j705k316O029
445B853j805k041Q88k646N312k57n549L255K99N47J125n178L352J765l714K694
461I00j349K1K161m212K785K337m400J671m92J007K461n751J393L590k280J581
477A423k524r60M518k525N40J68l915M697P34k847k27j604M569K207p721J289
493b178K952Q13J094o194J443N065k384L46k143j847N328j122j383K65l729N357
$$ plain form
509 1683 3413 -1774 -1098 -1366 1776 3975 -3050 -2427 2110 894 1454 -3188 -1517 3959 -648 -1562
525 -1562 531 -446 1671 -1342 -1519 3143 -1701 -1767 1584 -536 1080 -1212 -1467 2788 -1006 -943 1640
542 1640 -1832 428 755 -717 1144 -2635 -212 3930 -1421 -1638 -270 656 3195 -2450 -2999 2459
558 2459 298 638 -813 -2638 2304 1057 -710 843 -1967 553 2533 -1054 -33 -1698 -323
573 -323 3968 -1292 -2742 215 899 2966 -1879 -3534 3129 1439 -1234 -1043 -1173 2638 133 -2494
589 -2494 1860 -455 -542 979 -874 989 -405 -1454 2696 -556 -1770 1255 -721 839 131 -1638
605 -1638 1905 -291 -1281 1662 -1096 136 678 -1347 1639 -397 -1451 1342 -684 873 596 -2536
621 -2536 1279 1088 -507 662 -1615 476 1874 -2175 586 -27 -559 1779 -910 -430 679 -1072
$$ packed form
509A683J730n187O76k68L142K199p025O23M537j216N60m642J671N476m607r14
525a562K093r77K117l013j77M662m844o6L351k120J616k292k55M255l794O3K583
542A640l472K260L27j472J861l779K423M142n351k17J368R26K539n645n49N458
558B459k161L40j451j825M942j247j767J553k810K520J980l587J021j665J375
573c23M291n260j450K957O84K067m845j655O663j690k673J91j30L811k505k627
589b494M354k315q7J521j853J863j394j049M150l252j214L025j976J560p08j769
605a638L543k196r90K943k758J232N42k025K986k036j054K793k026J557k77l132
621b536L815j91j595J169k277K091J398m049K761o13n32K338k689M80J109j751
$$ plain form
637 -1072 1919 -23 -2506 1701 717 -317 52 -1800 1883 927 -2166 1180 -416 -516 1422 -1326
653 -1326 474 580 -1326 1684 -548 -853 1636 -1018 182 456 -1458 1514 -237 -941 1261 -869
669 -869 649 1180 -1726 659 -67 -562 1286 -1534 622 1867 -1831 290 419 -669 1436 -1403
685 -1403 140 1527 -1681 363 636 -1329 1133 -935 -487 1389 -1580 789 443 -1205 1659 -267
701 -267 -580 784 -1124 1081 548 -1835 954 -336 -761 1125 -956 390 791 -1308 1278 -492
717 -492 -1120 1682 -850 -209 256 -1123 1439 66 -1479 1208 -440 304 975 -1750 763 494 -606
734 -606 997 -1581 -204 1892 -1089 90 230 -1059 1290 -890 -359 1173 -1327 501 452 -1318
750 -1318 1132 -601 -89 1178 -1323 245 815 -911 1226 -449 -1064 1241 -1037 471 508 -1598
$$ packed form
637a072K991j942k483M207r84j034L69j852L683r56l093L346j596j00J938k748
653a326J800J06j906L010k232l05K489k654J200K74j914K972j751p04K202k130
669h69J518N31k906K385p26m95J848k820K156J245l698K121J29j088K105k839
685a403J543J387l208K044K73j965K462k068M48J876k969K369l46j648K864j926
701b67l13J364j908K205n33k383K789j290m25J886k081J346M01k099K586j770
717d92o28K802k532O41M65j379K562j373j545K687j648P44O71k725K513k69j100
734f06J603k578J377K096k981J179J40j289K349k180N31J532k500J828m9j770
750a318K450j733N12J267k501J568N70j726K137j675o15K305k278J508L7k106
$$ plain form
766 -1598 1571 390 -1223 1073 -1125 323 891 -1519 977 -153 -1116 1352 -991 -261 783 -1281
782 -1281 1172 194 -1187 1139 -267 -158 1180 -1527 642 293 -963 963 -926 -267 1478 -1538
798 -1538 109 40 -1012 1347 -538 -824 1093 -1040 860 532 -1309 857 -441 -590 1359 -1261
814 -1261 61 932 -1022 1124 -229 -781 1488 -597 10 611 -1270 1022 38 -1077 798 -734
830 -734 305 981 -1759 921 355 -863 983 -831 -239 1212 -1158 361 130 -1069 1349 -749
846 -749 -673 781 -869 539 568 -1237 1159 -551 -372 1207 -1147 -92 483 -852 979 -527 -604
863 -604 1544 -1173 82 951 -1311 790 -34 -590 1062 -1110 211 1035 -1223 698 -128 -798 890
880 890 -1139 -42 711 -1101 772 485 -1170 1004 -500 33 1017 -1720 797 490 -1002 958 -593
$$ packed form
766a598L169j181j613K296k198J448N68k410K496j130r63K468k343P30J044k064
782a281K453r78j381K326j406J09J338k707K169l49j256J926j889O59J745l016
798a538J647o9j052K359j885k86J917k133J900l28j841K166j298j49J949k620
814a261J322Q71j954K146j353n52K269k085O07O01j881K292r84j115J875j532
830g34J039O76k740K680n66j218J846j814N92J451k370J519k31j199K418k098
846g49P6J454j650J408K9j805K396j710J79J579k354J055N75j335J831j506p7
863f04K148k717J255Q69k262K101q24n56J652k172J321Q24k258J921q26o70J688
880H90k029J097P53j812J873k87j655K174j504N33R84k737K517l07j492J960j551
$$ plain form
897 -593 -163 932 -882 261 306 -1097 1318 -455 -824 929 -823 429 396 -1305 972 -32 -370
914 -370 664 -1153 280 738 -800 466 -302 -470 1033 -752 -282 660 -1166 775 -86 -1034 967
931 967 -578 -41 735 -1085 443 426 -494 1050 -502 -84 996 -1057 532 515 -1075 898 -241
948 -241 -268 727 -1150 666 947 -831 514 -130 -417 803 -733 395 365 -1088 1025 64 -477 756
966 756 -820 519 198 -1587 940 35 -527 706 -1117 501 1188 -965 387 -271 -343 1259 -740
983 -740 -295 836 -741 996 -232 -927 1099 -443 30 730 -1203 292 699 -815 439 -726 -56
1000 -56 1281 -987 -44 448 -520 625 -547 -81 875 -1032 626 890 -1189 644 -106 -235 867
1017 867 -936 203 707 -821 625 -117 -572 980 -619 -4 593 -899 762 279 -445 947 -688
$$ packed form
897e93M30J095j814J143M5j403K415j773l69J753j752J252l3j701K277j004l38
914c70J034j817J433M58j538J266p68j68J503j785M70R42j826J941q61r48K001
931I67j545N37P76j820J528j7r20J544j552M18J080k053J589j7j590J973j139
948b41k7R95j877J816K81j778J345o44k87J220j536J128l0j453K113r61n41J233
966G56j576J339l21j785K527r05n62J233j823J618O87k153J352o58p2J602j999
983g40M45J131j577J737j228o95K026j542M73P00j933J495M07j514J254j165O70
1000e6J337k268R43M92r68J145j172M66R56j907J658K64k079J833p50j29J102
1017H67j803J139N04j528J446p42m55J552j599O15N97j492J661m83p24J392j635
$$ plain form
1034 -688 -85 1058 -736 103 75 -722 1296 -602 -437 668 -302 562 -133 -856 866 -403 -73 853
1052 853 -1233 -62 317 -461 565 -643 -422 1514 -1024 -189 473 -493 656 -322 -584 1035 -838
1069 -838 116 860 -859 295 -339 -319 1018 -904 -205 963 -952 358 -117 -737 866 -593 175
1086 175 454 -756 663 85 -841 784 -466 -170 770 -773 769 -212 -976 1289 -174 -468 697
1103 697 -546 679 37 -1027 942 -218 -180 762 -867 -98 492 -529 766 -436 -502 1313 -844
1120 -844 -11 393 -671 652 -150 -785 823 -583 -30 538 -877 302 -31 -325 771 -858 68
1137 68 838 -929 532 285 -658 620 -302 -320 574 -836 456 424 -882 848 -449 -310 429 -635
1155 -635 167 119 -1300 721 -168 -693 697 -482 166 377 -888 819 -152 -625 950 -587 -148 403
$$ packed form
1034f88O03J143j794Q39k8p97K018j898J65J105r70Q64o95p23J722j269L30R26
1052H53k086J171L79p78J026j208K21J936k538Q35O62r66J149r78k62J619j873
1069h38R54P44j719J154o34K0J337j922O99J168j915J310m75o20J603j459P68
1086A75K79j210J419n78r26J625j250K96R40j543J542r81p64K265j463k94J165
1103F97j243J225o42j064J969j160L8R42j629P69N90j021J295j202o6J815k157
1120h44Q33M04j064J323q02o35J608j406N53N68j415J179l33k94J096j629R26
1137F8P70j767J461k47r43J278r22j8Q94j410J292l2j306J730j297J39P39j064
1155f35Q02m8j419K021q89n25J390j179O48K11j265J707r71m73J575j537M39N51
$$ plain form
1173 403 -600 744 -176 -560 989 -555 29 270 -784 209 200 -581 681 -527 -15 634 -605 303
1191 303 186 -472 939 -618 -92 930 -826 658 232 -589 618 -384 88 270 -912 331 341
1208 341 -1066 538 -114 -147 586 -844 88 242 -871 881 -92 -510 742 -213 234 302 -824 912
1226 912 15 -485 963 -407 1 365 -814 516 -237 -743 791 -617 -136 503 -477 522 4 -773
1244 -773 848 -344 -227 616 -810 194 107 -452 760 -500 -314 837 -681 46 309 -675 429
1261 429 -269 -315 763 -922 -3 540 -781 624 -198 -168 590 -591 196 491 -907 416 -119 -547
1279 -547 673 -280 -23 440 -737 480 181 -560 560 -521 138 454 -754 492 71 -507 834
1296 834 -330 -212 466 -648 285 298 -453 912 -377 -108 600 -618 147 317 -786 556 -313 -141
$$ packed form
1173D03j003J344r20l84J549j544N84K41j054R93rp81J262j208N12O49j239R08
1191C03j17o58J411j557N26J022j756J484m26q21J207j002M72J82j182J243J0
1208C41j407J604o52l3P33j430R32J54j113J752r73m18J252r55M47O8j126J736
1226I12q97n00J448j370M08L64j179J330p53n06J534j408M81O39r80R99n18p77
1244g73J621j192J17Q43j426J004q7n59J212j260J86J151j518P27K63r84J104
1261D29o98m6J078j685R19N43j321J405q22L0P58j181P87K95j398J323n35m28
1279e47J220r53K57M63j177J217k99p41J120j081O59L16j208J246m21n78J341
1296H34j164J18O78j114R33J3p51J365j289K69P08j218P65J70j103J342q69J72
$$ plain form
1314 -141 890 -732 271 402 -694 393 -346 -337 582 -472 3 355 -531 330 92 -381 653 -936
1332 -936 43 631 -659 191 41 -844 411 -294 -17 369 -824 528 273 -750 432 -306 -222 614
1350 614 -507 331 505 -682 759 -209 -565 474 -459 371 215 -606 388 220 -132 576 -522 376
1368 376 311 -316 447 -25 -212 835 -671 66 379 -667 439 -85 -204 948 -575 -323 440 -607
1386 -607 494 274 -193 680 -460 -296 463 -460 329 -76 -461 608 -408 24 411 -380 360 119 -628
1405 -628 424 -264 57 730 -581 -4 151 -707 618 17 -227 601 -522 110 441 -533 376 40 -361
1424 -361 368 -692 -62 411 -635 312 46 -172 450 -384 22 273 -398 556 -56 -608 640 -505 -111
1443 -111 645 -508 350 85 -503 414 -361 -17 655 -705 334 158 -407 693 -329 -338 646 -350 -8
$$ packed form
1314a41J031j622J003J31j096J087p39RR19j054M75L52q86Q61k38m73J034j589
1332i36R79N88j290Q50j50q85J255p05K77L86j193J352k55j023J182p38Q4Q36
1350F14j121Q38J74j187J441r68l56J039r33Q30j56q21R94j68l52P08j098Q98
1368C76o5o27P63m72j87J047j506P37L13j046J106n24j19J152j523K52P63j047
1386f07J101k20m67Q73j140J64P59r23P89m05l85J069j016M32L87p91P40k41p47
1405f28J052o88L21O73j311N77J55q58J325o01k44Q28j123O32L31r74R09l36m01
1424c61P29j060O30M73j046R47k66k18O22q34M06K51o71R54o12n52J248j145L94
1443a11P56j153Q58k65n88R17p75L44O72j360J039j76n65J100j022rR84r96L42
$$ plain form
1462 -8 382 -703 478 -106 -293 431 -479 -11 147 -474 735 -211 -300 408 -331 -162 55 -336 528 -6
1482 -6 -435 635 -313 -91 371 -717 532 72 -355 703 -542 99 171 -300 365 36 -592 858 -502
1501 -502 -187 191 -554 364 169 -380 416 -72 -253 280 -236 160 174 -516 480 -198 -492 382 -472 -7
1521 -7 267 -471 438 69 -81 366 -121 47 555 -403 311 -75 -147 478 -137 -243 361 -737 130 -214 -638
1542 -638 659 -358 -66 273 -548 351 132 -251 501 -333 -227 475 -154 -36 112 -376 619 169 -128
1561 -128 53 -588 68 317 -634 293 -259 -232 489 -548 118 428 -365 216 -62 -325 509 -119 131 349
1581 349 -275 364 84 -379 418 -334 -16 620 -349 351 107 -169 364 -432 -349 425 -378 193 208 -599 528
1602 528 -20 -300 181 -451 378 299 -291 472 -251 -245 241 -351 355 91 -523 433 -190 -573 321 -555 1
$$ packed form
1462hL90j085J181n84j87P24r10M68J58o21J209r46q9P08p39J69K17l91Q64n34
1482fm29J070r48K22M62j088J249m60m27J058j245O41P2m71O65l29o28J450j360
1501e02L15L78p45R18j95n49P96m88j81N33n16L96J4o90R96o78k94Q74q54M65
1521gK74p38R09l69j50M47m87J68N08r58P14l86p2O25o15j06O04j098Q67l44m24
1542f38J297j017K92L39q21Q99k19l83P52q34J06P02o29J18J48m88R95m50k97
1561a28J81o41O56K49r51R27n52K7P21j037O66L10p93N81k78k63Q34o28K50K18
1581C49o24O39k80m63P97p52L18O36r69P00k44k76N33p96Q3P74q03N71J5q07J127
1602E28n48k80M81o32Q29p9n90P63p23OM86n92P06k64o14R56o23l83Q94q76N56
$$ plain form
1623 1 235 -403 173 52 -309 162 -307 -88 515 -599 426 31 -118 600 -398 -296 395 -375 130 -164
1643 -164 -352 377 -274 -147 436 -254 366 158 -605 600 -101 14 339 -193 269 244 -195 359 180 17
1663 17 416 -457 50 429 -352 288 25 -119 503 -448 -54 398 -448 304 -69 -254 276 -221 3 335
1683 335 -719 46 -75 -671 423 -310 2 670 -521 278 -22 -168 560 -115 -379 211 -443 35 105
1702 105 -358 426 12 152 242 -297 261 -40 -343 330 -88 -131 352 -286 -24 378 -494 131 87 -225 292
1723 292 -440 -233 308 -289 287 -26 3 637 -341 -67 348 -190 341 -32 -209 361 120 -72 487 -322
1743 -322 306 -127 -303 301 -8 -14 272 -265 190 86 -478 336 -175 -383 229 -247 50 233 -429 311 -109
1764 -109 -145 612 -434 136 365 -360 4 -18 -46 427 -386 -181 459 -422 344 83 -240 364 -341 -45 144
$$ packed form
1623AK34o38N76j21l61M71m69K19O03j114J025l95j49P18r98J02O91p70N05k94
1643a64j88P29o51J27N83o90O20k08p63J205p01J15L25n32M62k5m39N54j79j63
1663A7L99q73N07L79p81O40k63j44O22r51L94M52q46P52l73j85N30m97K24L32
1683C35j054P65j21n96J094p33L12O68j191P99l00j46P28o75k64N90o54M78P0
1702A05m63P84m14J40R0n39N58l01l03O73m18m3M83o38K62M02q72O25m4l12N17
1723B92p32K07N41n97N76l13K9O34r78K74M15n38N31l73j77N70k41j92N59q09
1743c22O28m33j76O04l09oK86n37M55j04n64Q14n11k08O12m76K97J83o62P40m20
1764a09l6P57j046N70K29p25L64k2k8M73q13K05O40q81P66k61l23O04p05K96J89
$$ plain form
1785 144 -375 488 239 -112 294 -393 35 377 -426 337 -65 -401 254 -157 -159 328 -767 340 219 -402
1805 -402 357 -30 -163 588 -493 141 169 -214 320 -68 21 500 -203 58 331 -318 333 65 -202 263
1825 263 -273 -33 349 -231 542 -165 -254 372 -208 -187 386 -478 36 6 -251 299 -125 -204 66 -535 147
1846 147 165 -302 352 -277 -15 508 -541 104 174 -465 314 -139 21 325 -190 88 111 -278 257 -51 25
1867 25 511 -471 -52 321 -242 305 15 -292 633 -370 98 58 -424 751 80 -262 123 12 -358 46
1887 46 -239 392 107 -405 308 -106 -215 123 -360 140 205 -307 209 -395 172 254 -433 89 172 -217 300
1908 300 19 -104 409 -294 -10 353 -384 258 -272 -471 439 -179 47 137 -136 279 -243 -324 132 -185 230
1929 230 140 -24 325 206 -230 404 -51 -15 240 -299 230 266 -344 178 -201 67 74 -488 250 -22 -274 190
$$ packed form
1785A44n19Q63k49l51M06o87M28L42q03P63m02l36O55m11kM87j095J107j21o21
1805d02P59l87j33P51j081O34K8l83N34l88Q9M79p03K61K73o49O51k68k67M65
1825B63n36K40L82n80P73p07q9O26n80K1N73q64N14l0k57N50m24p9K70o01O82
1846A47J8m67O54o29K62N23j049O45P0o39P79m53J60L04n15K78K3l89N35l08P6
1867B5M86r82M19L73n63N47k90l07R25j003M68m0m82J175o71l42L85j11l70M04
1887D6k85O31k85n12P13m14j09L38m83N00O5n12N16o04N67Q2o87N22Q3l89N17
1908C00k81j23N13p03K84L63p37O42n30j99R10o18K26R0k73M15n22q1M56l17M15
1929B30r0j64L49j19m36O34m55L6K55n39N29L6o10N22l79K68Pn62P38k72k52M64
$$ plain form
1951 190 -307 -118 365 -318 70 137 -331 489 38 -203 505 -52 -76 56 -249 337 258 -95 329 -63 69
1972 69 194 -399 286 -258 -297 191 -162 162 -142 -479 179 71 -352 311 -199 194 304 -26 210 118 -245
1993 -245 258 -205 141 265 -329 86 458 -221 424 -125 -232 432 -263 82 -201 -220 157 -185 -499 466
2013 466 -290 0 -25 -561 352 123 -105 269 -32 144 -88 -396 168 -22 -387 -141 -275 -165 47 -454
2033 -454 97 52 -336 138 -172 -193 554 -308 -42 263 -339 188 -33 57 369 -178 156 140 141 471 -106 -34
2055 -34 272 25 99 2 -364 215 -187 -188 546 -281 89 113 -262 319 187 -282 10 -358 189 246 -251 14
2077 14 -42 -242 138 -185 210 158 -325 230 -201 -32 176 -193 65 461 -174 203 129 -245 362 -243 77
2098 77 440 -225 118 136 -329 117 48 -294 576 33 389 171 -334 282 -140 -136 385 -428 91 90 -509 172
$$ packed form
1951A90m97J89M83o83L88O7m68Q20m51k41P08n57k4J32l05N86p9l53M24l92J32
1972F9J25n93O85n44l9M88l53L24l04l37O58j08m23O63n10L93J10l30K36r2l63
1993b45N03m63L46J24n94M15L72o79O45n49j07O64o95L45k83j9L77l42l14R65
2013D66p56K90k5n36R13k29k28L74l01J76k32l08N64j90l65K46j34J10K12n01
2033d54N51m5l88M74l10k1P47q62K66L05o02N27k21R0L12n47L34j6JL30n77P2
2055c4L06k47P4r7l66N79m02jP34q27L70K4l75N81j32m69K92l68N47N7m97K65
2077A4n6k00L80l23L95n2m83N55m31J69K08l69K58L96o35L77p4l74O07o05L20
2098G7L63o65L43J8m65M46o9l42Q70n43L56k18n05O16m22MN21q13N19jn99O81
$$ plain form
2120 172 -100 -317 268 -172 70 -34 -367 347 59 -74 261 -219 18 185 -390 87 288 -257 429 -201
2140 -201 -12 238 -133 -15 6 -65 94 -290 22 328 -257 40 41 -143 506 -142 -228 331 129 35 -106 -226
2162 -226 232 -166 -170 130 5 86 259 -198 192 105 -141 312 -148 13 324 -287 396 25 38 335 -331 13
2184 13 245 -261 156 -33 17 303 -107 131 269 -263 172 153 -262 444 -122 -218 161 -120 71 -45 -397
2205 -397 308 -95 -80 71 -43 174 104 -308 165 -60 -427 138 -239 -81 241 -98 144 -219 -384 272 -138
2226 -138 -79 548 -284 125 -18 -268 393 -304 -1 152 -283 103 7 -106 190 -323 -23 234 -189 263 -50
2247 -50 -107 231 -234 -213 653 -117 150 262 199 268 -136 -145 173 -15 151 88 -125 44 138 -161 85 -232 -58
2270 -58 119 -241 177 -123 48 151 -276 -124 431 -490 -104 -46 -153 100 -405 -107 289 -377 64 -122 -301
$$ packed form
2120A72k72k17N85m40K42j04l33P14k88j33L35m80K37J67n75M77K01n45O86o30
2140b01J89K50l71J18K1p1J59l84L12L06n85K97Jj84O49o48q6N59k02r4j41j20
2162b26M58l98mL00j25Q1J73m57L90q7k46M53m60J61L11o11O83l71J3K97o66L44
2184A3K32n06M17j89N0K86m10K38J38n32M35j9m15P06n66r6L79k81J91j16l52
2205c97P05m03J5J51j14K17p0m12M73k25l67N65l77J58L22l39K42l63j65O56m10
2226a38N9O27q32M09j43k50O61o97L03J53m35L86r6j13K96n13L00K57m23M52l13
2247e0n7L38m65K1Q66p70K67J12o3O9m04rL18j88J66o3k13J69R4k99K46l17J74
2270e8J77l60M18l00J71J03m27J52N55r21L86N8j07K53n05K98L96o66M41j86j79
$$ plain form
2291 -301 343 -79 -98 363 -133 130 208 -296 233 15 -241 323 -327 6 -114 -333 64 -65 -137 169 -188
2312 -188 207 61 -332 78 -164 -48 470 -148 -343 280 -183 141 203 -236 357 -130 -153 180 21 -8 3
2333 3 -312 277 73 -135 92 -56 23 176 -130 38 -16 -314 341 -110 202 206 -466 294 24 45 92 -158 182
2356 182 230 -284 361 -51 -44 115 -298 46 -14 -261 170 -86 -151 300 -133 -85 260 -146 98 9 -136 17
2378 17 -159 -208 237 -101 259 9 -155 433 -425 216 51 -124 140 -147 -329 78 -125 -145 64 -326 77
2399 77 278 -292 368 -121 1 -21 -222 -36 -28 -252 -48 -42 -83 115 -316 -25 227 -180 258 105 -355 274
2421 274 -101 -58 232 -492 122 0 -207 474 -130 -70 97 -363 159 74 -200 426 -121 -218 76 -246 -83
2442 -83 267 -314 172 -91 -241 -30 -332 157 83 -285 138 -201 -75 165 -178 251 186 -133 180 18 -172
$$ packed form
2291c01O44m22j9M61m96K63P8n04N29k18k56N64o50L33j20k19L97j29p2L06l57
2312a88L95j46l93M10k42J16N18o18j95O23m63L24O2m39N93m87k3L33j59k9J1
2333Cl15N89k04k08K27j48P9J53l06J68n4k98O55m51L12Mo72P60k70K1M7k50L40
2356A82M8n14O45m12PJ59m13L44o0k47M31k56o5M51m33M8L45m06K44q9j45J53
2378A7j76m9M45l38L60k50j64N88q58O41j65j75K64k87j82M07k03k0K09l90M03
2399G7K01n70O60m89J22k2k01J86Qk24K04Om1J98m31K91K52m07M38j53m60O29
2421B74l75M3K90p24O14j22k07O81o04O0J67m60N22q5k74O26n47r7K94l22J63
2442h3L50n81M86k63j50K11l02M89p4l68M23l39J26K40l43M29o5l19L13j62j90
$$ plain form
2463 -172 242 25 96 283 -253 289 263 -4 241 -265 -19 185 -94 126 209 -3 -49 -104 -114 199 -312 128
2485 128 -7 -210 298 -488 83 116 24 217 113 -96 147 -212 88 204 -154 -137 205 -105 334 -18 -73
2506 -73 310 -87 179 29 -86 342 -104 -213 232 -200 80 -33 -74 170 -126 -61 231 -62 193 86 -115
2527 -115 477 248 -211 143 -89 -160 350 -190 249 -71 -318 288 57 -308 -78 -455 -61 134 -299 278
2547 278 -21 198 231 91 -68 46 -286 78 -229 -177 373 -150 182 307 -23 294 -352 -177 279 -220 253
2568 253 -9 -542 3 130 -130 -38 -24 -79 97 -220 16 -14 -197 24 -277 -56 312 -204 -154 -139 -199 446
2590 446 109 18 94 -318 -61 56 -84 244 -208 -128 74 -335 342 105 -96 351 -16 224 131 -440 -19
2611 -19 130 -289 127 -73 97 302 -257 -179 157 -28 0 -182 -160 131 -206 46 214 30 41 245 -141 144
$$ packed form
2463a72M14k17P1J87n36N42k6k67K45n06K46K04k79K20Q3k12m6n5j0L13n11M40
2485A28j35k03N08p86N71L3r2J93j04k09K43l59L00J16l58J7L42l10M39l52n5
2506g3L83l97K66j50j15M28m46j09M45m32K80j13m1K44k96O5K92k93K55j07k01
2527a15N92k29m59L54k32p1N10n40M39l20k47O06k31l65K30l77L94J95m33N77
2547B78k99K19L3j40j59J14l32L64l07N2N50n23L32J25l30L17o46J75M56m99M73
2568B53k62n33N45J27k60R2J4n5J76l17K36l0j83K21l01K21L68n16N0J5o0O45
2590D46l37r1P6m12K57J17j40L28m52Q0K02m09O77k37k01M47l67K40r3n71M21
2611a9J49m19M16k00J70K05n59P8L36j85K8j82K2K91l37K52J68j84J1K04l86K85
$$ plain form
2633 144 5 -35 303 -146 61 76 -134 149 -33 -320 176 -301 179 12 15 -27 -335 -21 135 -410 -167 300
2655 300 -140 270 69 28 235 -178 -3 3 -146 -28 -48 -10 45 -167 -297 347 -139 274 24 -220 312 -336
2677 -336 -160 256 -15 -102 -104 -203 94 50 -254 312 -177 44 -44 -161 310 -81 202 110 -224 324 206 -55
2699 -55 -20 73 -117 28 -116 -217 79 -219 67 135 -127 294 -118 279 137 -30 128 10 -47 121 -274 -89
2721 -89 339 -240 167 -80 -175 161 -393 -262 265 -38 -24 -23 -304 304 15 -233 63 -125 230 153 86 196
2743 196 75 160 -79 94 137 -37 -302 125 16 9 102 -247 12 405 150 134 -124 -152 196 119 24 105 -48
2766 -48 114 -45 -216 210 -339 149 176 -147 181 104 -364 30 13 -379 150 -317 22 59 -258 262 -138 -148
2788 -148 371 43 282 110 -191 458 -198 -12 309 -286 251 115 -74 303 149 65 -3 -221 -98 -10 96
$$ packed form
2633A44j39m0L38m49K07J5k10K83j82k87M96m77M80j67Lm2l08L14J56n45K43M67
2655C00m40M10k01m1K07m13J75Oj49J18k0L8N5k12j30O44m86M13k50k44N32o48
2677c36J76M16k71q7kr9K97m4l04N66m89K21q8j17M71l91K83r2l34N48j18k61
2699e5L5R3j90J45j44j01K96k98K86O8k62M21m12L97j42j67J58j18n7J68l95J85
2721h9M28n79M07k47r5L36n54J31N27l03J4Jk81O08k89k48K96j88L55p7o7J10
2743A96j21Q5k39J73M3j74k65M27j09pR3l49K59L93k55j6k58k8L48p7r5Q1j53
2766d8J62j59j71M26n49M88K7l23L28p7m68L94j7l92N29m67L39L7l17N20m00j0
2788a48N19l28K39j72l01O49o56J86L21n95N37j36j89L77j54q4o8k18J23Q8J06
$$ plain form
2809 96 286 298 -132 197 1 172 315 -262 -153 -90 -220 238 -149 0 24 -55 -132 64 64 118 -238 84 120
2832 120 -234 289 106 -143 71 65 -148 201 105 220 -68 -75 138 -293 -98 55 158 -247 28 -158 314 -102
2854 -102 -93 122 -92 -225 -103 -187 12 76 -547 328 -119 198 140 -66 -64 65 -281 149 -51 49 284 -86
2876 -86 92 -228 -21 226 -453 6 190 -380 -135 206 -290 -48 166 -128 56 -329 -9 483 -73 187
2896 187 62 -51 183 -164 8 211 -143 215 -253 245 84 -29 169 69 -305 311 106 -24 154 -91
2916 -91 130 125 -189 6 70 -190 271 22 150 51 -234 12 12 -50 161 -377 31 182 65 -77 57 -179 59
2939 59 -123 14 275 -217 99 -273 -293 93 -135 -39 61 -163 -248 47 -199 103 -13 -66 60 -3 -35 211
2961 211 -71 208 -188 -151 95 -156 -6 158 -86 146 8 -98 82 7 -56 9 -94 206 -48 -171 189
$$ packed form
2809I6J90J2m30L29j96J71J43n77J09O3j30M58l87J49K4p9p7J96%N4l56L22L6
2832A20l54N23j83k49K14ok13L49r6J15k88pK13m31J95J53J03m05K75j86M72m16
2854a02RK15k14j33J22q4J99O4o23Q75m47L17n8k06KJ29l46M30k00J00K35l70
2876h6J78l20K07K47o79M59J84n70K45L41m96K42K14k94J84l85L20M92n56K60
2896A87j25j13K34l47J72K03l54L58m68M98j61j13J98j00l74O16k05j30J78k45
2916i1K21nl14J95O4k60M61k49J28r9k85K46%o2K11n38M08J51j17j42J34k36K38
2939E9j82J37K61m92L16l72k0L86k28R6J00k24q5K95k46L02j16n3J26o3l2K46
2961B11k82K79l96L7K46k51J50J64k44K32j38j06J80p5o3O5j03L00k54j23L60
$$ plain form
2982 189 5 -69 123 -199 -217 424 -78 212 62 -142 360 -152 48 68 16 -25 -140 -114 179 184 106 -3 -187
3005 -187 274 -23 -2 214 -23 -27 220 -180 235 -238 142 367 -41 104 229 -200 -4 29 -28 121 -145 -77
3027 -77 180 -29 42 257 55 107 -162 -125 196 118 321 154 80 77 -186 27 349 -282 176 207 -65 291 40
3050 40 -294 -21 -119 -78 296 -43 70 128 0 68 -55 313 6 -285 11 -169 15 179 59 -32 17 -149
3072 -149 -14 175 77 86 136 -89 178 -32 -173 32 -27 255 -119 0 114 -223 -162 162 -194 34 -352 -344 183
3095 183 -25 -209 78 -291 70 -7 -78 -31 -411 277 -261 -203 65 -175 -55 137 -195 118 15 -299 4
3116 4 -81 -126 331 80 -7 203 -259 49 144 202 198 -91 -99 269 -210 130 251 -345 162 -114 -48 -23 -296 -292 130
3141 130 -115 7 26 -105 -203 -349 -51 101 -139 137 -156 -119 260 64 -70 145 202 -87 -64 119 97 -224
$$ packed form
2982A89j84p4J92l22j8O41n02K90j50k04N02n12K00K0n2m1j15K6K93Np8j09j84
3005a87M61k97K1K16k37mK47m00M15m73L80K25m08J45J25m29J96L3n7J49k66O8
3027g7K57k09P1K15k02N2k69L7L21p8K03j67p4lk63K13L22o31M58L1k72L56k51
3050D0l34K73r8M1L74l39J13N8j28O8j23L68l07k91K96j80J84J64j20r1M9j66
3072a49J35J89r8RN0k25K67k10j41K05n9K82l74J19J14l37O1L24l56K28l86QN27
3095A83k08j84K87l69L61p7p1M7l80O88n38N8K68k40J20J92l32L13j03l14L03
3116Dq5m5M57k51q7K10m62L08R5N8mk89qL68m79L40J21n96N07k76O6K5k73MM22
3141A30k45J22J9j31r8j46K98J52k40K76k93L7L79j96j34K15N7k89K3J83k2l21
$$ plain form
3163 -224 -93 105 -70 228 -41 -59 206 -204 -221 94 -71 105 -63 -361 92 -70 -34 -18 -157 -76 233 -140
3185 -140 108 -25 18 109 24 202 -11 -82 240 157 -22 127 -52 251 321 -133 171 88 192 191 -107 31 -10
3208 -10 -26 183 -235 -169 -21 43 1 211 -248 313 -62 -34 68 -167 -41 162 -13 -180 72 -63 314 -15
3230 -15 -55 234 -173 -111 218 -35 162 -33 -202 -54 -410 72 62 -243 193 104 -66 167 -144 62 1 -298
3252 -298 56 114 104 194 -288 264 32 -198 175 110 213 57 -336 86 355 -7 353 125 -134 -16 65 -102
3274 -102 25 -29 225 -33 103 339 -142 42 35 -173 -70 116 -450 65 73 -179 179 -224 116 83 -242 117
3296 117 -74 36 -45 -59 -17 340 60 94 57 141 204 -191 71 182 -337 -31 379 -260 65 -116 35 266
3318 266 -175 185 -239 -163 166 -50 13 133 -152 158 181 -4 134 -200 -205 -337 -123 313 -118 24 129 -58
$$ packed form
3163b24J31J98j75K98k69j8K65m10j7L15j65J76j68k98M53j62L6J6j39Q1L09l73
3185a40K48j33M3R1q5J78k13p1L22q3j79J49j79L03P0m54L04q3J04jk98J38m1
3208a0j6K09m18O6J48O4m2K10m59N61l75K8J02k35J26K03j75j67K52j35L77l29
3230a5m0K89m07O2L29k53J97j95j69J48l56M82j0l05M36q9j70K33l11K06o1k99
3252b98L54N8j0R0m82N52k32k30L73o5J03j56l93M22K69l62L60k28k59J18Q1j67
3274a02J27n4K54k58J36K36m81J84pk08J03J86n66N15Qk52L58m03L40l3l25L59
3296A17j91J10q1j4M2L57k80L4l7Q4O3l95K62J11n19L06M10o39L25j81J51K31
3318B66m41L60m24P6L29k16O3J20k85L10K3j85J38l34nj32K14M36m31J42J05j87
$$ plain form
3340 -58 107 -104 -332 83 -146 -125 99 192 199 208 -132 168 133 -111 290 95 225 -24 -107 -33 -111 -242 159 130
3364 130 -376 -78 -155 15 143 -339 -254 -17 -237 224 -57 -104 -35 -231 6 329 -201 109 9 100 -243 -292
3386 -292 340 -123 70 -244 -40 15 -109 104 -38 -30 -259 213 14 -348 254 -64 -121 -101 -165 23 -40 -242
3408 -242 265 184 -165 289 -455 219 -155 -92 430 9 -21 485 -142 103 77 -175 253 -156 156 30 -397
3429 -397 -108 -3 -164 126 -140 -37 -34 -220 -82 49 81 201 -267 -160 -48 -151 -107 -91 -341 186 -118 -84
3451 -84 149 -326 3 -307 -252 159 -71 -115 33 196 301 -56 -83 -27 2 -285 308 77 19 128 -446 250
3473 250 -41 -26 -281 -192 -225 -76 -94 243 -147 79 120 -17 26 -42 -98 336 -182 -402 241 -98 -18 -52 68
3496 68 181 -90 -260 19 -77 -27 235 -220 38 201 -151 -30 25 -175 331 -103 52 -2 -71 42 -105 93
$$ packed form
3340e8J65k11k28M15k29K1K24R3PRl40L00l5k44M01j95J30k49q3P4p8j31M01k9
3364A30n06K98p7J70J28m82Q5K37k20M61k81m7O9j96K37L23n30L10j00R1l43m9
3386b92O32m63J93l14K04N5j24K13j42Qk29M72j99l62O02l18n7K0o4J88o3k02
3408b42N07q1l49M54p44O74l74O3N22m21l0N06o27K45k6k52M28m09L12j26m27
3429c97K89J05j61K90k66J03Lj86J38J31L2J20m68J07J12j03M4J6k50N27l04L4
3451h4K33m75L29l10N5M11k30m4J48J63J05l57k7N6K9k87N93k31n8J09n74O96
3473B50k91J5k55Q9l3J49j8L37l90K26M1j37M3o8n6M34n18k20O43l39Q0l4J20
3496F8J13k71j70K79r6N0K62m55K58J63l52J21N5k00N06m34J55n4o9J13j47J98
$$ plain form
3518 93 187 -72 -201 63 -157 170 -68 -64 167 65 14 224 107 -83 -85 -118 -139 -89 -31 -18 -116 50 186 -234
3542 -234 61 -29 21 -190 -352 -221 167 -85 -83 96 -70 -41 -438 -107 325 -67 164 -70 -387 140 24 114
3564 114 136 -17 71 -105 -242 144 -278 -181 6 -131 244 -219 -271 90 -97 -78 -21 -251 -94 79 -10 75 -20
3587 -20 -152 183 -115 147 196 22 320 -112 29 -94 -136 356 297 -51 197 91 -247 132 -119 -236 294
3608 294 -49 53 -249 -123 -79 -338 82 230 -73 68 171 -20 -134 28 -55 127 -207 -72 127 -117 41
3629 41 211 76 272 -356 -126 -217 -38 207 -201 95 113 -100 -106 -10 -201 172 -42 -339 3 -44 115 -8
3651 -8 177 -261 128 -339 -32 -259 154 133 -217 101 69 212 118 -105 -61 28 -9 90 -141 -32 -114 -109 126 -143
3675 -143 -163 48 102 -66 139 72 -73 -238 14 91 187 22 147 12 107 263 -304 123 262 283 -6 213
$$ packed form
3518I3R4k59j29K64k20L27k38MK31j02n1K10j17j90kl3k1N0N8J3r8J66J36m20
3542b34K95r0N0k11j62J31L88k52KJ79j66K9l97L31M32l92K31k34l17N27j16R0
3564A14K2j53Q8j76j37L86m22R7J87j37L75m63n2L61j87J9N7k30J57J73q9Q5r5
3587b0j32L35k98K62M9j74K98m32J41j23m2M92n9l48K48j06l38L79k51j17N30
3608B94l43J02l02J26M4k59M20J48l03J41J03j91j14J62q3J82l34J35J99k44J58
3629D1J70j35J96o28K30r1J79K45m08K96J8k13oR6j91L73k14k97L42m7J59j23
3651hJ85m38L89m67L07k27M13k1l50L18l2J43r4k23M4Q9l7R9k31J09q2NK35k69
3675a43k0K11N4j68K05o7j45j65K52P7R6j65J25j35R5J56n67M27J39K1k89K19
$$ plain form
3697 213 37 -1 -75 138 -13 -180 -195 97 -187 -195 -146 -136 234 -161 -37 76 229 142 -81 35 -34 -168 -36
3720 -36 -52 117 319 27 -49 -107 -211 -10 -10 -80 40 140 -115 -35 -164 299 276 -48 110 -153 -197 -321 186
3743 186 135 344 -279 110 77 114 236 121 153 -114 -301 -161 -70 -139 223 -29 -61 24 -136 299 -151 -19 24
3766 24 -224 -23 -59 -158 151 54 -116 289 291 -154 61 17 -51 -31 111 3 86 -30 228 -62 200 -16 -2 99
3790 99 -157 -220 28 -335 69 -130 -110 -155 106 -58 135 -258 31 -43 -386 72 171 30 8 -260 -149 -64 -47
3813 -47 264 23 120 153 -132 46 98 -166 -185 -66 -258 -9 -137 -214 152 -80 89 35 -116 102 121 -245 -192
3836 -192 -307 -169 227 -247 140 -17 252 -36 -21 -331 82 -125 -103 -229 13 13 -29 451 52 -325 -172 226
3858 226 -104 -18 -127 196 179 -372 32 -2 -20 7 193 -5 -86 -286 28 63 153 182 -18 -97 307 23 -41 -151
$$ packed form
3697B13j76l8p4K13j51j67j5K92k84qM9J0L70l95J24J13J53q7k23J16o9j34J32
3720c6j6J69K02k92p6n8j04K01%p0J20J00k55Q0j29M63k3l24J58k63m4j24N07
3743A86n1K09o23L89l3L7J22j15L2k67j87J40R1o9L62k52l2Q5j60M35m50J32M3
3766B4k48K01l6r9L09r7j70M05Km45K15m4o8K0J42j08Q3j16K58k90K62k16J4J01
3790I9k56o3K48l63M04j99K0m5K61j64J93l93K89p4l43M58R9j41k2k68J11Q5J7
3813d7L11k41R7L3k85J78N2k64j9J19j92K49j28p7L66k32J69n4j51K18J9l66N3
3836a92j15J38L96m74L87j57K69k88J5l10M13k07K2j26K42%m2M80l99l77J53L98
3858B26l30Q6j09L23j7n51M04l4j8K7J86j98q1k00L14L5R0K9k00p9M04k84o4j10
$$ plain form
3882 -151 -395 417 -189 -178 -82 -124 219 -251 204 -105 4 12 -30 -92 -302 -36 -119 174 50 264 181 -103 -42
3905 -42 166 -55 365 -288 -239 -7 -45 -10 63 47 70 95 82 98 -12 -77 146 107 66 9 177 -114 253 41 121
3930 121 -64 76 -17 112 299 -33 -19 7 -258 200 17 -172 209 -145 -287 45 -228 -133 54 268 284 103
3952 103 -46 40 -263 -242 -201 -296 78 -78 13 169 -222 239 260 -86 195 261 -48 131 -186 -1 -140 123
3974 123 69 172 -7 273 24 -156 136 -34 334 127 -26 153 -204 -258 103 -144 211 -212 -287 122 -52
3995 -52 -110 -43 166 178 100 -252 50 -141 -12 -16 217 24 -90 -108 96 99 -115 114 253 46 274 -158 9
4018 9 295 -20 77 234 27 176 151 205 70 11 133 -129 -7 4 -116 -108 -117 -139 279 -24 48 88 -109 96 108
4043 108 53 183 -28 -75 17 1 131 18 113 199 11 -70 97 -135 5 80 -106 110 94 -179 160 -68 71
$$ packed form
3882a51k44Q12o06J1R6m2L43m70M55l09J09Qm2o2k10K66q3K93j24K14q3k84O1
3905d2K08k21M20o53M9K32l8L5P3j6K3K5j3J6j10o5K23l9m1n7J68k91L67k12Q0
3930A21j85J40r3J29J87l32J4K6k65M58j83j89L81l54j42L32k73R5J87K14J6j81
3952A03j49Q6l03K1M1r5L74j56R1J56l91M61K1l46K81O6l09J79l17J85j39K63
3974A23n4J03j79K80k49j80K92j70L68k07j53J79l57n4L61k47L55m23p5M09j74
3995e2n8O7K09J2p8l52L02j91J29mK33j93j14j8K04Lk14K29J39k07K28m32J67
4018IK86l15R7J57k07J49k5N4j35n9J22k62J22J1j20Qrk2M18l03P2M0j97K05J2
4043A08n5J30k11m7R2j6J30j13R5Q6j88q1J67k32J40P5j86K16j6k73L39k28J39
$$ plain form
4066 71 -34 -152 -37 -32 17 -8 -99 2 273 67 -64 -207 -265 117 45 -165 122 -4 -15 -121 -366 95 25
4089 25 -261 -113 -91 -64 314 -165 237 -243 -131 157 -192 156 235 76 228 0 -136 -143 224 -2 -19 -68 91
4112 91 109 -5 90 1 288 154 -251 -209 92 -244 51 -56 -162 107 -116 -94 37 -25 61 51 -19 -120 -22 270
4136 270 -23 -288 35 -53 85 385 147 280 -99 -68 -111 -24 364 -99 -109 72 -112 -349 -18 110 -330 212
4158 212 30 -54 9 -183 60 160 -12 76 -70 -85 172 -50 233 217 -123 260 -138 7 -80 -100 82 9 -269
4181 -269 200 -180 120 273 62 92 -110 50 135 86 79 -78 -105 -187 182 29 -123 76 -35 183 -42 110
4203 110 -139 -92 103 29 4 217 -15 -51 -215 -281 232 -160 296 -17 -147 211 107 15 145 162 -41 148
4225 148 -114 -144 93 -301 -31 47 -113 -220 -98 124 -89 -175 -92 136 106 -191 115 37 183 -324 61 84
$$ packed form
4066G1j05j18J15NM9k5r1J01K71k06j31j43n8L82p2k10K87j26j1j06k45M61p0
4089B5k86J48K2K7L78m79M02m80J12K88l49L48P9j59J52k28j36pL67k26j7m9J59
4112I1J8j14R5q9K87j34m05M2L01l36K95j07j06K69k23K2J31o2Q6j0p0j01R8K92
4136B70k93k65L23q8J38L00k38J33l79L1m3Q7L88m63j0J81j84k37L31J28m40N42
4158B12j82q4O3j92K43J00j72Q8j46j5K57k22K83j6l40L83l98J45q7k0J82p3k78
4181b69M69l80L00J53k11L0k02J60Q5m9pj57k7q2L69j53j52J99j11K18k25J52
4203A10k49M7J95p4k5K13k32l6j64o6N13l92M56l13j30L58j04r2J30J7k03J89
4225A48k62l0K37l94K70P8j60j07J22K22k13q6Q3K28l0k97L06p8J46n07L85K3
$$ plain form
4247 84 -47 214 -161 -28 261 -200 -100 196 -102 -25 -196 39 307 -120 -215 258 18 121 -131 -94 -85 -30
4269 -30 190 286 -16 -53 92 45 81 -197 68 -67 93 229 148 39 -40 133 -157 25 -2 114 240 39 -137
4292 -137 191 -36 -43 35 181 -117 -32 329 -152 33 104 125 57 297 -49 103 289 76 -143 77 -154 83
4314 83 -224 171 -140 -366 17 -184 -81 166 162 25 93 -191 217 -90 -70 -58 -148 176 -255 -154 -32 144
4336 144 -217 -71 -83 114 423 170 -23 125 -106 250 -47 125 -72 1 174 47 181 181 18 109 128 -11
4358 -11 -8 -183 -10 -233 -154 -120 183 -133 145 2 -85 -109 3 -34 20 -18 -3 136 -150 238 75 140 -119 92
4382 92 3 -302 3 159 32 65 85 -84 44 -7 -70 156 8 6 68 17 -19 -50 -126 -118 -44 31 -229 -78 72 15
4408 15 -224 330 -33 -318 -169 -262 -185 -77 66 -137 6 -148 -156 9 -33 212 11 66 -58 -226 14 63 62
$$ packed form
4247H4j31K61l75J33K89m61J00K96k98P7j71K35K68m27r5M73k40J03k52L7RN5
4269c0K20R6l02l7J45m7L6k78K65j35J60J36q1j09p9J73k90J82k7J16J26k01j76
4292a37L28k27pP8J46k98Q5L61m81J85P1K1o8K40l46J52J86k13k19K20k31K37
4314H3l07L95l11k26L83k01J03K47mj37O8k84M08l07K0J2r0L24m31J01J22J76
4336A44l61J46j2J97L09k53j93J48k31L56k97J72j97P3J73j27J34%j63R1J9j39
4358a1Lj75J73k23P9L4L03l16K78j43q7k4J12l7N4l8J5J39k86L88j63O5k59K11
4382I2q9l05L05J56j27L3K0j69J28n1o3K26j48kO2n1l6l1p6QP4P5k60J51J50n7
4408A5k39N54l63k85J49r3P7J08J43k03J43j54qJ65m2K45k01N5j24j68K40M9j
$$ plain form
4431 62 -27 -239 79 83 -6 263 -194 -63 -7 173 -193 212 -111 142 192 -165 23 93 299 -4 239 -71 251
4454 251 -150 233 -44 115 -128 -302 54 110 -268 84 51 52 128 -116 -187 -2 188 -95 21 -127 -37 -71 26
4477 26 -46 -110 151 106 83 12 -52 173 -192 39 36 -115 94 206 -149 68 71 96 63 -81 65 5 -131 174 23
4502 23 -30 49 -105 -49 136 -181 -166 66 42 65 -70 132 14 -184 -265 -33 -95 104 -46 150 62 -175 51
4525 51 -50 205 182 148 -220 28 175 -61 217 149 28 -412 -158 152 -17 -246 98 -110 235 30 -34 -167
4547 -167 -54 -57 155 -66 89 282 106 -34 39 -36 -43 -115 75 131 -210 -34 114 -81 -199 -94 20 -47 -208
4570 -208 70 84 56 281 253 -151 151 78 89 55 152 63 -195 -216 -118 -134 -39 227 -121 103 -211 -218 -189 -203 -235 175
4596 175 24 67 -69 144 -238 -248 -130 65 -208 170 -40 21 17 -8 66 153 -271 -200 -20 96 -124 49 -84
$$ packed form
4431F2q9k12L18Mq9K69m57J31N6J80l66M05l23K53N0l57J88P0K06l03K43l10L22
4454B51m01L83k77J59k43j74L56N6l78L52l3JP6k44p1J85J90k83J16j48R0l4R7
4477B6p2o4K61m5k3p1o4K25l65K31lj51K09J12l55K17LK5l3j44J46o0j36L05j51
4502B3n3P9j54N6J85l17J5K32k4K3j35K02j18j98q1K32o2J99j50J96q8k37K26
4525E1j01K55k3l4l68K48J47k36K78o8j21m40K54L10j69k29L44k08L45k05o4j33
4547a67J13lK12k21J55J93j76j40P3p5pp2J90N6l41J76J48j95j18J05J14o7j61
4570b08K78J4k8K25k8m04L02p3J1l4R7q9k58k1R8j6R5K66l48K24l14pK9j4l2M10
4596A75j51M3j36K13l82j0J18J95k73L78k10O1mk5P4Q7m24P1J80J16k20J73j33
$$ plain form
4619 -84 -75 -207 231 -95 268 42 -31 -44 -113 48 54 -271 -54 242 112 -118 -73 -95 -29 -119 -355 36 29 160 -38
4644 -38 -196 93 262 71 125 102 158 -78 -402 -23 209 -191 -142 166 -66 173 4 -43 294 -78 70 -46
4666 -46 -12 56 -126 167 272 -34 -34 -104 34 -11 -218 -14 299 -39 53 -23 -32 187 210 -53 36 -29 -178 21 -192
4691 -192 47 124 -58 42 -73 144 216 73 176 -249 -14 186 -95 -121 -81 -310 194 184 -77 11 -69 3 9
4714 9 62 87 51 0 264 -89 78 316 -153 -267 -42 -127 -160 -405 -7 144 8 -122 113 -124 -58 158 125
4737 125 71 -108 -84 -213 -67 53 -167 -27 115 -251 30 222 -185 30 33 18 210 5 -6 -250 -133 -162
4759 -162 27 186 126 -144 64 35 168 86 88 24 -179 -14 47 78 -261 61 -76 7 -9 35 -177 290 5 4
4783 4 7 120 44 -33 55 -1 -287 85 204 -113 89 7 -134 103 -18 -46 132 -333 -108 -59 255 -33 -6 -18
$$ packed form
4619h4Rj32M38l26L63k26p3j3o9J61Ol25K17K96j30k30M5k2O6r0k36L91pJ31j98
4644c8j58K89J69j91N4k3N6k36l24L79K32m00M9L08k32K39j69m7L37l72J48j16
4666d6L4O8j82K93J05l06%p0J38m5k07K04L13l38R2p6rK19K3k63Q9o5j49J99k13
4691a92K39P7j82J00j15K17P2j43J03m25K35K00k81k6M0k29N04j0k61Q8q0P2O
4714IN3K5l6n1K64l53J67K38m69j14K25q5l3k45L98J51j36j30K35k37O6K16l3
4737A25n4j79K4j29J46J20k20J40J42l66K81J92m07K15Lj5J92k05j1k44J17k9
4759a62J89J59o0k70K08k9J33q2Ko4k03J65O1L1l39L22j37Q3j6M4k12M67k85j
4783DLJ13p6p7Q8n6k86L72J19l17K02q2j41K37j21k8J78m65K25M9L14k88K7j2
$$ plain form
4807 -18 48 -120 78 -29 164 -152 -21 87 -29 -211 89 -101 -235 -47 71 -30 24 64 -173 -49 -176
4828 -176 133 116 -248 38 -195 -29 -2 143 -57 -163 31 -181 -135 -69 80 70 28 -188 19 -24 -110 0 -59
4851 -59 -160 42 61 108 193 -114 -89 165 -112 -247 33 39 -169 -65 -32 271 -193 68 -67 -52 -35 92 47 -1
4875 -1 -68 49 349 -131 98 296 36 87 -92 109 -239 -91 -144 -191 20 -135 45 165 -215 -70 1 -81 -229
4898 -229 161 -234 -62 -175 60 84 -35 116 120 107 347 403 -316 189 85 -202 40 138 65 -92 -326 274
4920 274 99 -271 126 28 -132 -80 168 13 -107 -37 -94 101 46 -52 -17 228 43 102 -341 11 -113 210 88
4943 88 -62 -242 -122 -10 44 3 -11 -104 14 20 -64 -147 -112 225 33 -241 26 144 -192 57 -62 191 -107
4966 -107 26 125 -116 -96 41 -59 -238 -165 28 128 270 31 28 103 27 -25 -168 -315 171 -78 -118 -37 -190
$$ packed form
4807a8O6j68J98j07J93l16J31J08j16j82L00j90j34J88J18j01N4M0k37J24j27
4828a76L09j7l64K86k33J66K7J45k00j06J94k12M6O6J49j0m2k16K07m3q6J10n9
4851e9j01K02J9M7Q5l07K5K54k77j35K80Ok08J04L3L03m64K61j35J5J7J27m5m8
4875ao7J17L00m80K29J98k60N1j79K01l48J48n3m7K11j55J80J20l80J45P1q2j48
4898b29L90l95J72j13K35K4j19J51Mj3K40N6p19N05j04k87K42R8p3j57k34O00
4920B74j75l70L97r8j60N2K48j55j20P0n7J95n5r8L5K45j85N9m43L52j24L23j22
4943H8j50j80J20J12N4m1j4r3J18Oq4q3L5L37j92k74K67J18l36K49j19K53k98
4966a07J33R9k41K0J37j00j79P3J93J00J42k39lP5p6n2j43j47M86k49m0Q1j53
$$ plain form
4989 -190 -281 -78 136 272 -43 -100 -16 220 213 35 112 69 -282 89 -226 -106 -151 394 -101 -292 -158 -115 -125
5012 -125 -63 229 197 212 -54 86 176 -375 -22 -16 293 45 95 -143 -192 149 -32 137 146 -267 375 25 29 18
5036 18 131 -113 -31 12 29 160 -301 -4 147 157 60 -30 13 144 -68 84 111 88 74 -103 34 -74 -75 167
5060 167 52 83 81 222 -151 -15 -30 157 162 -62 -35 -142 10 272 94 -191 -83 -31 -31 -308 123 96 -92 -140
5084 -140 48 76 144 -98 -231 1 110 -147 42 151 34 -80 249 -52 145 -161 -31 34 92 8 67 -129
5106 -129 -272 54 -394 169 -296 -78 -8 96 -66 155 -151 29 16 -15 -118 174 -85 64 -2 30 71 -84
5128 -84 122 64 88 96 -200 -90 -4 -111 -37 105 39 -86 85 91 -9 -69 -23 0 -41 60 175 135 -27 64 -29 66
5154 66 -72 -23 31 -159 9 29 -100 119 -118 -103 -120 95 33 51 -158 -96 62 -38 -153 119 -136 118 -93
$$ packed form
4989a90r1K03K14J36l15n7Q4K36pj78P7m3l51L71l15J20m5N45m95j91J34M3j0
5012a25O2K92l2J5k66J40R0n51L53OL09k48N0k38m9L41j81J69Rm13O42l50Mj1
5036A8J13k44Q2M3J7J31m61K97J51J0r7r0M3J31k12J52K7k3j4j77J37j08jK42
5060A67j15L1kJ41l73J36j5J87Nk24K7j07J52K62j78k85J08N2%k77M31k7j88m8
5084a40J88K8O8k42j33K32J09k57J89J09j17j14L29l01J97l06J30O5N8q4N9j96
5106a29j43L26m48N63m65K18P0J04j62K21l06J80j3l1j03K92k59J49o6L2M1j55
5128h4K06n8K4Qk96J10Q6j07P4J42o6j25J71Oj00o0M6K3m1J01J15m0j62R1r3R5
5154F6j38M9N4j90J68K0j29K19k37J5j7K15o2J8k09O2J58j00j15K72k55K54k11
$$ plain form
5177 -93 82 -104 -295 180 61 31 87 38 155 44 216 288 95 148 129 159 74 -5 -182 267 -276 -28 71 -78
5201 -78 -99 67 120 91 -206 -7 -36 137 129 -64 -14 151 170 -182 -187 -152 61 262 48 -49 280 3 48 -98 12
5226 12 77 50 -44 319 120 31 -226 142 -366 -186 -174 23 156 251 -181 110 80 97 271 -1 173 29 -178
5249 -178 -45 36 225 -57 132 52 -246 -65 -265 -24 52 -123 -98 40 147 -238 186 213 275 147 18 -71
5271 -71 282 -70 -149 138 35 -39 44 -84 187 -86 -38 -60 177 43 50 99 95 -101 -209 123 -55 -14 23 55 -197
5296 -197 106 74 308 -90 -10 -27 -22 -14 119 269 35 -248 -96 47 54 178 -249 -103 -94 -48 -118 -205 1 122 -39
5321 -39 136 87 -237 30 151 -25 -69 29 80 60 -218 234 51 -391 99 107 6 -2 65 -39 -84 -3 0 -109 -214
5346 -214 131 98 -19 140 59 173 30 2 150 98 301 21 -112 55 -209 -264 69 23 -12 -39 -11 -165 277
$$ packed form
5177i3J75j86j91M75j19l0N6m9J17j11J72P2j93N3j9L0q5p9j77M49n43K48R9j49
5201g8k1J66N3k9k97J99k9J73qj93N0J65J9l52nL5K13K01k14r7L29k77M5j46J10
5226A2O5k7r4L63j99q9k57L68n08J80J2J97J33R5m32K91l0J7J74k72J74j44k07
5249a78J33Q1J89k82J89q0k98J81k00K41P6j75K5J38J07l85M24K7O2j28j29q9
5271g1L53l52p9K87j03p4Q3j28K71k73M8k2K37j34PM9mj96j08L32j78M1L7L2k52
5296a97L03l2K34l98Q0j7NQJ33J50k34k83J52J43PJ24m27J46RM6p0q7K06J21j61
5321c9J75m9l24K67J21j76m4R8N1k0k78M52j83m42M90Qj01qO7j04m5Q1Lj09j05
5346b14L45l3j17J59q1J14j43k8J48n2K03k80j33J67k64n5L33m6l5k7K8j54M42
$$ plain form
5369 277 -116 12 223 42 32 51 -43 -38 -170 -112 87 -141 -23 32 -114 157 -67 -80 172 4 71 -12 -176
5392 -176 29 -239 -27 37 120 -72 -110 76 1 194 301 240 -270 -69 52 44 -48 -161 73 -124 -25 -95 171
5415 171 28 -221 -26 -17 42 50 -159 -244 -93 35 -97 115 11 85 170 -95 -19 31 -70 -2 120 -40 10 -153
5439 -153 -212 -311 -37 91 16 -1 124 -3 -141 -11 109 65 -104 -142 82 79 -19 -145 -44 76 230 67 -38
5462 -38 -84 -363 -148 194 -121 -156 194 -13 264 -128 -55 -198 -44 101 99 -177 20 -145 -192 147 -85 -13 3
5485 3 269 -27 22 216 27 -15 -145 -219 131 -3 -222 136 93 -208 108 96 106 203 136 79 49 -205 -74 9
5509 9 -115 -28 -82 92 31 -146 -137 52 -48 17 76 -59 -39 -28 59 20 20 93 14 -39 280 -53 67 349 37 -34
5535 -34 -395 -66 -13 -72 9 -48 -118 139 46 178 145 24 130 -74 -62 56 -11 281 -59 70 -153 -71 116 103
$$ packed form
5369B77l93J28K11j81j0J9r4Nj32N8J99k28J18N5j46K71k24j3K52j68O7q3j64
5392a76K05k68K12O4Q3j92l8J86p5J93J07o1n10K01J21qr2j13K34j97R9p0K66
5415A71j43k49J95RN9Qk09q5J51J28j32K12j04P4Q5k65P6N0j01O8J22j60N0j63
5439a53n9r9K74J28p5j7J25j27j38J30J20m4j69l8K24lr8j26J01J20J54j63j05
5462c8m6k79K15L42l15l5L50k07K77l92P3j43J54J45kk76J97j65m7L39k32P2J6
5485CK66k96M9J94j89m2j30p4L50j34k19L58m3l01L16j2J0R7o7n7l0k54J31Q3
5509Ij24Q7n4J74o1j77RJ89j00O5N9j35K0J1Q7l9%P3p9n3L19l33J20K82l12p1
5535c4l61L29N3n9Q1n7p0K57r3J32l3j21J06k04J2J18o7K92l40J29k23Q2J87j3
$$ plain form
5559 103 103 -63 105 -33 202 21 76 -58 -126 36 186 19 -185 -31 299 98 -295 348 68 -121 64
5580 64 -35 -257 52 -327 -8 12 144 133 -39 384 -40 -75 -155 -11 -211 193 -45 -226 -130 139 -218 242
5602 242 211 -83 105 -75 -51 -3 -67 226 131 -89 -23 111 -18 4 23 47 206 -118 145 275 279 257 48 247
5626 247 246 9 206 -96 -92 249 -83 150 77 -171 137 286 100 -81 225 95 -56 202 211 -198 129 -75
5648 -75 206 149 102 -130 150 17 -35 219 44 -271 196 28 -101 11 -12 -88 -219 -148 -54 -111 59 -24 198
5671 198 33 -163 0 -236 36 -52 -25 -38 121 31 13 56 -153 -110 -101 -188 226 16 -235 111 -64 14 2 36
5695 36 112 100 -7 -109 57 24 -50 -246 98 130 10 -60 -296 -74 -258 162 152 26 -44 264 22 -293 -145
5718 -145 -47 194 -115 -31 25 73 337 -10 -153 -23 139 43 361 -58 -110 28 -249 -104 -66 -264 -62 -260
$$ packed form
5559A03%j66J68j38K35j81N5j34o8J62J50j67k04J54L30k01l93O43k80j89J85
5580F4r9k22L09l79L19K0J32j1j72M23m24l5q0J44k00M04k38j81R6K69l57M60
5602B42l1k94J88j80K4M8o4K93r5k20O6J34j29K2J9K4J59l24K63J30Mk2k09J99
5626B47jk37J97l02ML41l32K33p3k48L08J49j86j81L06j30j51K58Rm09L27k04
5648g5K81n7m7k32K80j33n2K54j75l15M67j68j29J12k3p6j31P1R4n7J70q3K22
5671A98j65j96J63k36K72q8K7j3J59r0j8M3k09M3Rq7M14k10k51L46j75P8j2L4
5695C6P6j2j07j02J66l3p4j96L44L2j20p0k36K22j84M20j0j26p0L08k42l15J48
5718a45R8K41l09Q4N6M8K64l47j43J30J62r6L18m19n2J38k77J45L8j98K02j98
$$ plain form
5740 -260 -173 35 -37 141 158 11 165 83 42 -66 120 -172 135 174 112 61 201 66 -156 -20 -53 128 169
5763 169 -166 71 -225 -319 -158 166 -148 -39 -81 169 -117 174 27 217 254 -2 12 -56 -89 -149 42 -102
5785 -102 201 173 182 137 -7 -56 151 81 -128 49 74 80 136 -40 -135 -12 164 -72 254 -123 131 98 216 -105
5809 -105 -44 -86 25 91 70 -111 163 -67 95 -10 99 -132 -51 50 -54 9 173 119 -36 34 71 24 109 -46
5833 -46 -67 193 -52 126 -162 53 -222 99 135 -174 186 -20 11 29 115 228 -60 -390 -159 17 16 255 26
5856 26 -92 99 -136 270 -231 304 -93 257 168 171 -78 -21 -47 -266 -123 136 132 102 221 -312 -34 -41 71 -178
5880 -178 129 291 33 -117 283 -151 72 58 34 -162 172 -29 -37 -107 -5 20 130 66 -52 31 47 194 157
5903 157 103 -97 183 -119 68 49 -216 13 -83 28 -119 16 4 -208 -113 99 -82 -77 64 -37 -189 -141 -117
$$ packed form
5740b60Q7K08p2J78J7j47J54q2m1j08J86k92L07L9o2n1J40j35k22J36l3J81M1
5763A69l35K37k96r4J61L24l14J09m2K50k86K91j47J90L7k56J4o8l3o0J91j44
5785a02L03k8Rm5j44m9K07p0k09J77K5ON6j76r5J23J76k36L26l77K54l3J18l21
5809a05O1m2J11O6k1j81K74k30J62j05J09k31Q1J01j04O3J64n4j55P0L7m7Q5j55
5833d6k1K60k45J78k88K15k75L21L6l09L60k06L1J8Q6J13k88l30K31J76jK39k29
5856B6j18J91k35M06n01N35l97L50q9Lk49N7k6k19J43K59ml0J19n33K78pJ12k49
5880a78L07J62k58j50M00m34K23j4k4j96L34k01qp0J02K5J10o4j18Q3J6J47l7
5903A57n4k00K80l02J87j9k65K29r6J11j47J35j2k12R5K12j81NJ41j01j52M8K4
$$ plain form
5926 -117 -223 -90 -76 115 -113 99 0 -40 90 101 -147 165 9 -62 -68 49 -54 -130 120 -32 -99 -12 -180
$$ packed form
5926a17j06J33J4J91k28K12r9m0J30J1k48L12j56p1oJ17j03p6K50j52o7Q7j68
$$ [...]
8191b64
##END NTUPLES=NMR FID
##END=
