##TITLE=1H_Pr BuOPr
 CDCl3
 8 sc, 
 10.12.2021
##JCAMPDX= 6.0         $$ Bruker NMR JCAMP-DX V2.0
##DATA TYPE= NMR FID
##DATA CLASS= NTUPLES
##ORIGIN= UXNMR, Bruker Analytische Messtechnik GmbH
##OWNER= root
$$ XWIN-NMR		Version 3.5
$$ Fri Dec 10 12:37:58 2021 Russian Standard Time (UT+4h)  she@DPX200
##.OBSERVE FREQUENCY= 200.131346
##.OBSERVE NUCLEUS= ^1H
##.DELAY= (6, 6)
##.ACQUISITION MODE= SIMULTANEOUS
##.ACQUISITION SCHEME= undefined
##.AVERAGES= 8
##.DIGITISER RES= 18
##SPECTROMETER/DATA SYSTEM= spect
##.PULSE SEQUENCE= zg30
##.SOLVENT NAME= CDCl3
##.SHIFT REFERENCE= (INTERNAL, CDCl3, 0, 15.7039)
##AUDIT TRAIL= $$ (NUMBER, WHEN, WHO, WHERE, WHAT)
$$ ##TITLE= Audit trail, XWIN-NMR		Version 3.5
$$ ##JCAMPDX= 5.01
$$ ##ORIGIN= Bruker BioSpin GmbH
$$ ##OWNER= she
$$ F:/spectra/data/she/nmr/H-F/1/audita.txt
$$ ##AUDIT TRAIL=  $$ (NUMBER, WHEN, WHO, WHERE, WHAT)
(   1,<2021-12-10 12:36:40.89 +0400>,<she>,<DPX200>,
      <created by zg, POWCHK disabled, PULCHK disabled
       configuration hash MD5:
       00 E9 B6 7A A2 85 ED C7 34 08 36 98 17 FE 4E 26
       data hash MD5: 16K
       3E 0F D8 24 8E 94 C1 1D 70 E7 A3 B7 96 50 70 B2>)
$$ ##END=
$$ 
$$ hash MD5
$$ 8A 83 24 D7 31 8E D8 8B ED 97 57 F4 D6 E5 D8 64
##$RELAX= 
##$RELAX= 
##$RELAX= 
##$RELAX= 
##$RELAX= 
##$RELAX= 
$$ Bruker specific parameters
$$ --------------------------
##$DU= <F:/spectra>
##$EXPNO= 1
##$NAME= <H-F>
##$PROCNO= 1
##$TYPE= <nmr>
##$USER= <she>
##$AMP= (0..31)
100 100 100 100 100 100 100 100 100 100 100 100 100 100 100 100 100 100 
100 100 100 100 100 100 100 100 100 100 100 100 100 100 
##$AQSEQ= 0
##$AQ_mod= 1
##$AUNM= <au_zg>
##$AUTOPOS= <>
##$BF1= 200.13
##$BF2= 200.13
##$BF3= 200.13
##$BF4= 200.13
##$BF5= 200.13
##$BF6= 200.13
##$BF7= 200.13
##$BF8= 200.13
##$BYTORDA= 1
##$CFDGTYP= 0
##$CFRGTYP= 5
##$CHEMSTR= <none>
##$CNST= (0..31)
1 1 145 1 1 1 1 1 1 1 1 1 1 1 1 1 1 1 1 1 1 1 1 1 1 1 1 1 1 1 1 1 
##$CPDPRG= <>
##$CPDPRG1= <>
##$CPDPRG2= <>
##$CPDPRG3= <>
##$CPDPRG4= <mlev>
##$CPDPRG5= <mlev>
##$CPDPRG6= <mlev>
##$CPDPRG7= <mlev>
##$CPDPRG8= <mlev>
##$CPDPRGB= <>
##$CPDPRGT= <>
##$D= (0..31)
0 1.2 0 0 0 0 0 0 0 0.06 0 0.03 0 0 0 0 0.0002 0 0 0 0 0 0 0 0 0 0 0 0 
0 0 0 
##$DATE= 1639125400
##$DBL= (0..7)
120 120 120 120 120 120 120 120 
##$DBP= (0..7)
150 150 150 150 150 150 150 150 
##$DBP07= 0
##$DBPNAM0= <>
##$DBPNAM1= <>
##$DBPNAM2= <>
##$DBPNAM3= <>
##$DBPNAM4= <>
##$DBPNAM5= <>
##$DBPNAM6= <>
##$DBPNAM7= <>
##$DBPOAL= (0..7)
0.5 0.5 0.5 0.5 0.5 0.5 0.5 0.5 
##$DBPOFFS= (0..7)
0 0 0 0 0 0 0 0 
##$DE= 6
##$DECBNUC= <off>
##$DECIM= 32
##$DECNUC= <off>
##$DECSTAT= 4
##$DIGMOD= 1
##$DIGTYP= 9
##$DL= (0..7)
0 120 120 120 120 120 120 120 
##$DP= (0..7)
150 150 150 150 150 150 150 150 
##$DP07= 0
##$DPNAME0= <>
##$DPNAME1= <>
##$DPNAME2= <>
##$DPNAME3= <>
##$DPNAME4= <>
##$DPNAME5= <>
##$DPNAME6= <>
##$DPNAME7= <>
##$DPOAL= (0..7)
0.5 0.5 0.5 0.5 0.5 0.5 0.5 0.5 
##$DPOFFS= (0..7)
0 0 0 0 0 0 0 0 
##$DQDMODE= 0
##$DR= 18
##$DS= 0
##$DSLIST= <SSSSSSSSSSSSSSS>
$$ [...]
##$SUBNAM2= <"">
##$SUBNAM3= <"">
##$SUBNAM4= <"">
##$SUBNAM5= <"">
##$SUBNAM6= <"">
##$SUBNAM7= <"">
##$SUBNAM8= <"">
##$SUBNAM9= <"">
##$SW= 18.0517287032376
##$SWIBOX= (0..15)
0 0 2 0 0 0 0 0 0 0 0 0 0 0 0 0 
##$SW_h= 3612.71676300578
##$TD= 16384
##$TD0= 1
##$TE= 0
##$TE2= 300
##$TE3= 300
##$TEG= 300
##$TL= (0..7)
0 120 120 120 120 120 120 120 
##$TP= (0..7)
150 150 150 150 150 150 150 150 
##$TP07= 0
##$TPNAME0= <>
##$TPNAME1= <>
##$TPNAME2= <>
##$TPNAME3= <>
##$TPNAME4= <>
##$TPNAME5= <>
##$TPNAME6= <>
##$TPNAME7= <>
##$TPOAL= (0..7)
0.5 0.5 0.5 0.5 0.5 0.5 0.5 0.5 
##$TPOFFS= (0..7)
0 0 0 0 0 0 0 0 
##$TUNHIN= 0
##$TUNHOUT= 0
##$TUNXOUT= 0
##$USERA1= <user>
##$USERA2= <user>
##$USERA3= <user>
##$USERA4= <user>
##$USERA5= <user>
##$V9= 5
##$VALIST= <valist>
##$VCLIST= <CCCCCCCCCCCCCCC>
##$VD= 0
##$VDLIST= <DDDDDDDDDDDDDDD>
##$VPLIST= <PPPPPPPPPPPPPPP>
##$VTLIST= <TTTTTTTTTTTTTTT>
##$WBST= 1024
##$WBSW= 4
##$XGAIN= (0..3)
0 0 0 0 
##$XL= 0
##$YL= 0
##$YMAX_a= 403378
##$YMIN_a= -467521
##$ZGOPTNS= <>
##$ZL1= 120
##$ZL2= 120
##$ZL3= 120
##$ZL4= 120
##$ABSF1= 10
##$ABSF2= 0
##$ABSG= 5
##$ABSL= 3
##$ALPHA= 0
##$AQORDER= 0
##$ASSFAC= 0
##$ASSFACI= 0
##$ASSFACX= 0
##$ASSWID= 0
##$AUNMP= <proc_1d>
##$AZFE= 0.1
##$AZFW= 0.1
##$BCFW= 1
##$BC_mod= 2
##$BYTORDP= 1
##$COROFFS= 0
##$CY= 11.3945322036743
##$DATMOD= 1
##$DC= 2
##$DFILT= <>
##$DTYPP= 0
##$F1P= 2.36226072786647
##$F2P= -0.459571619588291
##$FCOR= 0.5
##$FTSIZE= 0
##$FT_mod= 4
##$GAMMA= 1
##$GB= 0.15
##$INTBC= 1
##$INTSCL= 1
##$ISEN= 128
##$LB= 0.24
##$LEV0= 0
##$LPBIN= 0
##$MAXI= 10000
##$MC2= 0
##$MEAN= 0
##$ME_mod= 0
##$MI= 1.114404
##$NCOEF= 0
##$NC_proc= 0
##$NLEV= 6
##$NOISF1= 3.799351
##$NOISF2= 2.8
##$NSP= 1
##$NTH_PI= 0
##$NZP= 0
##$OFFSET= 15.70392
##$PC= 1
##$PHC0= -15876.53
##$PHC1= 19.2008
##$PH_mod= 1
##$PKNL= yes
##$PPARMOD= 0
##$PSCAL= 0
##$PSIGN= 0
##$REVERSE= no
##$SF= 200.130013532006
##$SI= 16384
##$SIGF1= 3
##$SIGF2= 2
##$SINO= 400
##$SIOLD= 16384
##$SREGLST= <1H.CDCl3>
##$SSB= 0
##$STSI= 0
##$STSR= 0
##$SW_p= 3612.71676300578
##$SYMM= 0
##$S_DEV= 0
##$TDeff= 0
##$TDoff= 0
##$TI= <>
##$TILT= no
##$TM1= 0
##$TM2= 0
##$TOPLEV= 0
##$USERP1= <user>
##$USERP2= <user>
##$USERP3= <user>
##$USERP4= <user>
##$USERP5= <user>
##$WDW= 1
##$XDIM= 8192
##$YMAX_p= 0
##$YMIN_p= 0
$$ End of Bruker specific parameters
$$ ---------------------------------
##NTUPLES= NMR FID
##VAR_NAME=  TIME,          FID/REAL,        FID/IMAG
##SYMBOL=    X,             R,               I
##VAR_TYPE=  INDEPENDENT,   DEPENDENT,       DEPENDENT
##VAR_FORM=  AFFN,          ASDF,            ASDF
##VAR_DIM=   8192,          8192,            8192
##UNITS=     SECONDS,       ARBITRARY UNITS, ARBITRARY UNITS
##FACTOR=    0.0002768,     1,               1
##FIRST=     0,             0,               0
##LAST=      2.2672688,     0,               0
##MIN=       0,             -467521,         0
##MAX=       2.2672688,     403378,          0
$$ Real data points
##PAGE= N=1
##DATA TABLE= (X++(R..R)), XYDATA
$$ [...]
1622c64M22l70Q57k38j334O24Q08k05O27p78j138J345Q24j164N04q4j662J555
$$ -364 58 -312 545 307 -1027 -403 405 200 827 49 -1089 256 1080 -84 420 336 -1326 229
1640B29J586k361j69J352j418J46K457j876j962K003M45j155J507o68k043J706
$$ 229 1815 -546 -715 637 -781 -635 1822 -54 -2016 -13 432 -723 784 116 -1927 -221
1656b21J475j452J41J0j175J744J067j905l4P82j005J160J313k546o32K188o53
$$ -221 1254 -198 -57 -47 -1222 522 1589 -316 -350 432 -573 587 1900 -646 -1278 910 257
1673B57l36J374j835j253K362L49j522P62p24q04J883M67j832P00J36j087J751
$$ 257 -79 1295 -540 -1793 569 918 -604 158 -566 -1370 513 980 -852 -152 -16 -1103 648
1690F48Q12k539N35J421j478J019J338k506o22K631p80o87J331j489j467K811
$$ 648 1460 -1079 -544 877 -601 418 1756 -750 -1372 1259 479 -208 1123 -366 -1833 978
1706I78K77k039N82q0j054J952N58k298K90O26j44J355r1k430P13J766q33K99
$$ 978 1255 -784 -202 -282 -1336 616 1174 -1124 -834 -208 -352 1003 912 -1518 -805 961 128 427
1724D27M69k266L92K939j374j292J104p34l63K238p57j864Q11O64p20J141o61
$$ 427 896 -1370 -978 1961 587 -705 399 -335 -698 1540 783 -1081 -270 394 -326 815 154
1741A54j490J053O97o24O53l70j628J341J426j763K63Q99j691P87J846j475q54
$$ 154 -1336 -283 414 -210 443 73 -1555 -214 1212 -551 -288 611 -1080 -293 1553 78 -776
1758g76J613p76n36J885q80j522J090K69n73R15l22j658J056P84p49K84k03j324
$$ -776 837 61 -475 1410 530 -992 98 367 -206 709 387 -1271 -215 569 -180 104 -99 -1423
1776a423J177J301j216l79N70j068J172J299j727o04J253k66n3J246j381j121
$$ -1423 -246 1055 -161 -540 30 -1038 134 1433 -294 -898 355 89 36 1282 -99 -1220
1792a220J731L78q25N69q59p66J565L34j312L92K9j124J345O92j774J48R04r93
$$ -1220 511 889 64 633 -226 -992 573 907 -405 -13 16 -1108 237 929 -845 -697 207 -786
1810g86Q33R55j549l20J096j42j66P80r22n32J083K59l95M17o33p70J470M2r49
$$ -786 47 1002 -547 -867 229 87 -79 701 -221 -753 330 589 194 611 -22 -792 678 720 -229
1829b29M51n16m42J269K37j277J43K97o55Q29O19j418q8J339q03J43R49j353n30
$$ -229 222 -294 -736 533 770 -507 -364 -67 -722 107 726 -692 -780 559 -244 -101 848 -505 -1035
1848a035J557L3p53O17l37q13J323K10r20K96Qq25R74K33r85L48L38r38N73P69
$$ -1035 522 555 -198 419 82 -731 592 802 -118 178 186 -639 335 568 -417 -69 269 -669 -96 673
1868F73j280L6Q86o32J12R03j118k69R17k33j52P11n75m98J006L8q26Q17j88q83
$$ 673 -607 -571 315 -317 -205 698 -420 -689 228 -5 -157 554 -21 -519 487 525 -301 516 328 -555
1888e55Q09K86p48M51K19r83L42O90p25j10P24j004K81R00m66o87P30m71l07J378
$$ -555 254 540 -208 243 462 -521 -179 511 -214 -324 400 -604 -323 577 111 -576 154 -317 -624 754
1908G54l93j120P06M04m72M03J65q83L56P14m92J69j53m81L07O36p12J59J14n86
$$ 754 361 -759 -53 351 -121 282 447 -436 -80 634 142 311 158 -323 -16 620 -92 67 181 -405
1928d05O7Q03o67j92M99m09j23O98n8o69O41k40l25O92L33q30o0M39l12N37L48
$$ -405 -338 465 -202 -394 105 -304 -427 271 213 -456 185 -55 -380 312 645 -185 -245 194 -118 419 767
1949G67j038J4O37j34p1J16m77k84Q66l4m46K8l37q3P80Ro52N1K3k2N44J7o22
$$ 767 -271 -257 380 246 175 291 -186 -470 396 362 -84 -56 -393 -476 304 313 -339 -288 -265 -287 257 274 -348
1972c48J44L22j23J57L46o29Q2K31j2Q8M0l95q0J94J70p7r1k47k76L93M50j32
$$ -348 -204 118 -5 152 498 -131 -49 182 170 258 298 -97 -177 17 187 110 19 -228 -504 -111 339 207
1994B07n63k65J82N16L91l55m16p8K84M33P6k78m92J02O77J73m44k66m8J13L53
$$ 207 -356 -621 -439 77 468 113 -303 -381 -97 336 412 134 -358 -256 421 594 150 -116 -164 -51 302
2015C02P7l98k31N7K45K39q5n39j06L42j91L44J19m74l41P52P5j89J37l04k55
$$ 302 379 -19 -250 -193 52 291 206 -333 -439 -97 -288 56 175 -299 -640 112 187 -2 135 -169 -424
2036d24N68L02k39k15j29j92O12M60o94j01k2j28M07K24q06k27P07j42LK34l72
$$ -424 144 446 207 -8 -137 -329 283 743 49 -52 -74 -202 205 429 -377 -604 103 -39 -36 198 -174
2057a74l90M23J57k8P0k87j98N93J29o15M87om63O94J66q95K12P38p19j2O75n23
$$ -174 -564 -141 16 -12 58 -229 -427 166 295 -320 167 161 -302 392 558 -337 -125 613 -106 -118 557 34
2079C4m66Q19k52m92N62j70m86P20j69n04N27J16p42M81J88p41P22L10p94R4P70
$$ 34 -432 387 135 -357 205 35 -451 269 100 -404 123 239 -503 -22 166 -575 147 457 -337 -243 527
2100E27r13M09N70p76n0O98l65k36P58o65m59J014l43l96N02l49n76P81K04j009
$$ 527 -386 23 593 -183 -233 465 100 -136 622 -43 -502 512 169 -227 275 -74 -650 131 335 -674
2120f74O64j51n28R47L82j430M46O49p31N93P71j491j93J229j02l74O61p52n69
$$ -674 -10 -161 -689 258 640 -790 -344 305 -426 167 938 -553 -746 483 381 7 668 -84 -653
2139f53J052K98p88J88m41j79J109l8j075M48Om72J060P8j537M42J095j022N70
$$ -653 399 697 -91 97 -344 -523 586 548 -527 -79 -73 -545 515 593 -944 -502 593 -429 141
2158A41M94j291p5J549k94o89M34m79k66J245m7j216N15n1l53J300m21j332N72
$$ 141 635 -656 -731 818 524 -165 269 -210 -476 769 722 -494 21 -30 -383 917 496 -836 -264
2177b64N43m03M80r1j388N62J110p96J70K03q60L67J142m70q53O04l55J51J014
$$ -264 279 -124 356 265 -1123 -561 549 -247 -77 126 -734 -367 775 305 -548 56 -299 -148 866
2196H66n02r81P82k9j58Q56o66q75P83N06p67L53L5j020M85J120j035k42M92n01
$$ 866 364 -617 165 136 -22 834 168 -707 76 582 -185 168 203 -817 -332 788 -247 -489 3 -498
2216d98K41Q30n85o29N46N4J70N42o95n40O92K61k59L41m94p10J221K60p64J25
$$ -498 -257 573 -12 -641 -95 -41 129 671 -24 -564 128 389 130 471 -23 -733 488 748 -16 109
2236A09n7p07Q86N69j153j45N59k73J95N24r28l32O18K99j78L77q35j11Q49J78
$$ 109 52 -655 231 800 -353 -498 61 -212 -17 507 -421 -753 -135 164 -14 363 -472 -583 266 444
2256D44n73K54l74k24R39L79j147K50K34l98O10K64j057J88K84k69L06L65j019
$$ 444 -129 125 -249 -473 466 845 -302 -52 182 -216 394 658 -399 -211 73 -196 110 475 -544
2275e44k7P06k94J51L04q15KQ05j65j60J7k33q2Q15k4o92J60n4K39M36j88p01
$$ -544 -571 135 -159 -8 296 -519 -517 288 123 -37 -20 -253 -335 480 456 -236 -76 -130 109 545 357 -344
2297c44L4M18j96L36Q5p27l9P64k92r3j07j88m0Q62l57m10K61k2k03P26l36n23
$$ -344 -310 108 -88 248 333 -394 -433 331 39 -54 -161 -349 -389 473 116 -294 -33 -55 -258 468 132 -391
2319c91L64K31o9K17o6o39L14L72j84L4k8n81M45L85n12l8K6j94L48L43m82l81
$$ -391 -27 204 135 352 286 -353 -39 333 149 183 155 -426 19 404 -108 -146 -120 -314 34 377 -105 -486
2341d86N45k22K7L76l69m50O65K8k56L83k22k67M21K94n01q1J27j93L53Q8l68
$$ -486 59 -163 -136 240 -129 -579 86 114 -142 241 19 -248 173 467 -34 -115 12 -181 172 260 -108
2362a08O2J3j42J86J39m98J20K63j73o0K89k58j32N90k40k44K59K7j74L43J01
$$ -108 -46 -33 -175 11 150 -348 -228 35 -138 -198 91 -167 -299 291 51 -193 66 93 -81 262 363
2383C63m38J2L13l30L04Q7m39j25L10R9J10k39k63KJ98k0J75j24n08L29L17k61
$$ 363 -75 -63 250 -80 224 311 -128 -253 57 156 266 27 -236 -234 -36 -56 119 -5 -513 -184 133 -128
2405a28j49K83k50J91L62k86k67K50j03J50P1M9k69J35K13q4n8j3m9j9K09l41
$$ -128 -277 6 -244 -53 309 23 -244 6 -97 53 124 173 -96 39 252 168 110 97 48 29 238 -103
2427a03J01J7j00P6j37j07J75J23l89L54J35k06m6K09j83k5L17j35j89K56j22
$$ -103 -2 15 -85 -9 -146 -253 -78 45 -344 10 145 -61 -107 102 -81 -106 211 76 -113 143 21
2448B1o5K55p4j98J84r1L3N9j15r6L03L2l86R0o5O1J35p0k64j15M93j59J07r8
$$ 21 -44 211 137 -61 123 32 65 124 9 -87 216 248 -138 -48 -113 -52 83 13 -251 -366 127 -32 75 -23
2472b3j66J34M62l97j5J04j17O7L17k60k25P5J70j26N3o2j72K80j88n4R5K32l72
$$ -23 -189 -55 407 10 -5 99 -18 49 366 106 -119 -44 126 0 53 -9 -181 99 -89 -143 -48 184 -188
2495a88qK09l67L62Lk17N2L12m11K81J0j65J00L71k97j44K19j83P6L78j65m72
$$ -188 -196 13 -354 8 11 -206 -154 158 -253 28 38 -127 -27 344 47 -97 122 -61 15 393 228 -244
2517b44M60k72J70L58m74k71J15J88j49J38R5l49M6K60j90J09Ok08J68L77j30
$$ -244 216 -56 114 472 -2 -273 -158 30 -119 19 114 -235 -189 71 -119 -10 -4 -212 -44 333 203
2538B03k64L36k80J0N70m53k81K89j77j38N42j55m54J16K06p9L21j30p09K97N43
$$ 203 -61 275 -5 5 575 122 -159 130 -47 -185 357 202 -252 -136 70 -9 312 182 -527 -230 313
2559C13m55J02L72p55J37N37o1k15P6j99M3N00k92j06K89j85k37N72k75o90O03
$$ 313 -142 -40 332 -423 -286 251 190 -25 51 -148 -105 395 103 -3 286 101 -136 436 161 -529 74
2580G4K11m35K90K68p49J21N02k70k60N19n70N4N06l72k17M04k81P1L36n8k58
$$ 74 285 -150 140 408 -341 -220 282 12 -248 271 -299 -245 261 -111 -328 76 -205 -134 202 144 -114
2601a14N04l85k46N62j15m09M22qm44M94L8m29J22N4l56K71L36n36k9L99m62Q6
$$ -114 390 5 -241 321 206 -203 219 211 -233 261 299 -130 -8 46 -310 -39 297 -239 -268 131 -331 -245
2623b45M93j92m14M73k16n5M59l03l72N67N0k81J46J55o10N86K16m24rlk90J77
$$ -245 248 56 -358 115 -101 -156 303 0 -372 195 245 -36 110 265 -345 241 457 33 24 21 -269 -92
2645i2M50m19n3J94k73J01N31p22l8L39j12j53M71l73m44P50k1k76L10k91k19
$$ -92 358 -61 -114 80 -193 -92 439 -283 -321 18 -94 -247 224 -149 -593 157 136 -140 170 -121 -340
2666c40K53N06n11p7K74l28L38K15l55q1J06j74J34L14p40J61M11l00J73L01n04
$$ -340 -87 419 -92 -169 105 -223 115 330 -25 -106 0 -174 -40 274 -466 -305 106 -194 -21 280 -224
2687b24k14N82Q4l82L14j53l80L52K69m21J81J4j05L72P3m40P4N0j05J87Q9k78
$$ -224 -438 144 228 -154 160 7 -373 -21 248 -173 8 22 -83 289 362 -78 -4 46 -59 128 217 -61
2709f1k53M52k36n2J56l64j04N37L3l91M10j04k51M99q2l37R1J48q2K47j3k97
$$ -61 -314 138 -98 -150 6 -358 -462 75 108 -283 127 23 -228 271 189 -148 -57 91 9 256 243 -54
2731e4J12N6j13L20p4m07R3L21l02l7J17k32m8M03j84k18j3K24k06K44J66l04
$$ -54 58 114 1 321 247 -160 -67 254 -48 -85 32 -200 -248 155 -29 -247 -260 -36 -242 2 168 -136
2753a36MJ17K9K11j58p6J75k12PK34j63j71K13J59k49m1J71k43Q1M34l86l65L81
$$ -136 -132 -15 14 225 67 -9 166 -46 -39 195 32 -139 74 233 -16 -57 114 -129 -48 386 0 -365 16
2776A6k16J30M8qj04k5K90Ro6j32m6K60J76k79L7j55q1K72K28m20J29j64J44K61
$$ 16 -200 -70 -22 -30 -134 -159 131 140 74 -58 -104 156 332 53 90 -65 -146 126 354 -66 63 -101 43 304
2800C04k05k99j54L10p2n5K12l57J45J68m7K06j27l04l6M59qk47O3m5J4L53M9
$$ 304 99 -200 -354 -44 -116 -171 41 -316 -171 -3 -50 156 29 -275 -311 148 140 -107 -44 -89 -75 278 327
2823C27l67n8J89QJ09n0k27L7n8J66N3k51j14K15J00%N1k64r1J60L96m53j05M65
$$ 327 -40 -98 91 99 208 158 -69 -32 -90 76 129 -122 -236 -21 79 79 130 -134 -225 -65 331 -122 -227 238
2847B38m06R1L33k38l78N16O9j55J86k96j1K0L3l6N0j54OK52l3l2j58K01k87M55
$$ 238 -168 -77 256 18 -360 156 225 70 256 -40 -51 -31 2 -34 16 -138 -132 120 87 55 -103 98 -189 266
2871B66j46l80N2J71q6K81k6l41L2J80P8j91L12j44j64L22L1k74P1J54l22L10
$$ 266 120 -260 -208 -37 -123 158 132 -209 -177 3 81 -110 202 58 -106 216 247 -27 44 198 -124 186
2893A86p2k25O0K1r0K99l7m37K29P0n3O3M3k51J30J00mk5N3j11J13J90j78j98
$$ 186 114 -111 -51 -30 -120 179 142 -295 -66 4 -49 14 57 -194 -64 36 32 7 60 -51 62 252 74 -124
2917a24J59n9R3K79k57j98J27J8k1J57m6m55J68L37l18J73j91k31K97J89j20j60
$$ -124 35 -24 69 348 91 -107 20 38 17 174 128 -327 -159 178 -140 33 -158 -389 -92 97 -23 -183
2939a83K56j06R6J24j65j88K00o1n5K89n0l59L96j61j94M56k01l35L83kj93J45
$$ -183 73 -33 63 187 22 -166 34 -27 -82 207 157 -202 194 33 -161 295 94 -241 142 140 -53 92
2961I2J12l88pK16l7m5J14k83j6M84k20j27OK54j08L58l31k77L14R7k64J95M0
$$ 92 204 -184 -191 25 -12 -57 57 -226 -242 242 22 -105 -99 155 47 405 74 -203 111 208 -56 139 179
2984A79k10lP4m8Q5J63l19O7J88k51j64J60j88J58L79n21J46P0j56o1L57j09j77
$$ 179 -31 -34 40 -8 77 240 -79 -12 176 -75 -239 -79 -267 -109 270 -251 -105 -35 -191 -252 105 -4 -181
3007a81K62K53k90R0j81j00K74K09l22J52J26m19K63n5r3k1J49l74k8N30l77j05
$$ -181 81 334 44 134 -47 -147 127 336 14 166 292 -127 136 81 -12 -33 116 -258 -286 244 -133 -238
3029b38L17l04J36K92m54J7M21M2k74K40m7l67L80O7m38J37K16j03K6Lp7PK25
$$ -238 79 -225 -89 203 -251 -234 187 229 -45 195 148 -219 161 228 -210 -73 143 40 66 69 -8 -1 224
3052B24k67K3N5k05m4M18j73k65L61k49k15M15o4k23K77o6k62L52J18l45K22O2
$$ 224 -43 -20 35 -170 -214 204 31 -234 127 -122 -337 78 14 -209 68 2 -260 92 210 -135 87 149
3074A49j76J84J35k82R3Q2k52J17J18k25j62M33l73N3L24l71P9L42l03k24L12
$$ 149 -27 157 292 10 103 185 -67 50 168 -57 -219 214 -159 -106 218 -153 -74 268 -35 -259 53
3095E3l3j66J99q2n6J23J29l04K04j2j10P3J69l79K75M6n3j46J09l25K40J59l22
$$ 53 20 -146 53 -29 -85 38 167 -137 67 55 -55 18 187 -192 83 129 76 -70 39 -286 -46 113 -209
3118b09k1K92Kl48L67r4k59L89j16l29L42J13j10K93k51j73J60J77j80M7N5r9
$$ -209 -230 62 64 -284 83 -11 -270 119 3 -326 16 129 19 312 61 -112 48 225 45 92 147 48
3140D8M9K1j60K4P0j65J02J7J3p7k0J01j34l3J36k07K17o1j27NJ52l9J32j27l4
$$ 48 97 118 -42 -18 52 -113 -11 6 19 -58 -78 23 -111 -144 -8 -215 2 -59 -186 -181 -29 -68 64 -63 -97
3165i7K02oj26J49l1j99nK45j20M9r6J25j73M6J45k19J56k18m5K42j56Q2N9j34
$$ -97 105 99 -27 122 91 -108 -113 132 12 61 -35 90 -83 -37 108 -111 45 -173 -218 24 -132 -50 9 -125
3189a25N2J37J4j41J95J08k70O8J19j79N3K16q7k59%J22j12L24j67j25o8K65k79
$$ -125 -73 64 78 -63 132 240 -30 38 157 -22 31 247 160 -99 -99 23 -89 235 68 -57 -125 140 -139
3212a39J93k18O5l3J9R5m9p2o6K04J6l6J68k79j49N07P6l58j5LJ1K15j58r9J83
$$ -139 54 -164 -99 -132 -113 -18 -67 -139 -205 -1 15 -21 147 -132 -281 226 302 -56 -71 -68 -57 158 0 -99 84
3237H4j82J6L30k14l00L19j17n2K13j2k20m9J88pp3K9J08k14Q8J46p7k3rJ3J65
$$ 84 -98 -82 248 34 -266 53 -64 -116 97 85 -135 -184 4 -3 -76 -47 61 -153 -65 81 4 -19 -28 -15 150
3262A50k09N2J08k61L8K91j3l30K15J79m43J66J43l65J56K04q0j87J63N4j63K06
$$ 150 -59 -7 101 -160 -122 169 156 -174 41 220 -223 -57 86 -279 -123 81 1 -186 -23 31 -132 74
3284G4q7j50K04Q2J54k67j3m4J46J51q1j9j45n5J66J63l27Q4j07j52L71N2k94
$$ 74 -13 -163 41 123 277 10 -3 -47 99 250 169 150 5 -50 116 279 -48 36 -71 -223 148 200 -94
3307i4K9J69k90L37m0k40KN9j3J12J9l07J1M56j47o8M6n9R3K08k57j66qK18j11
$$ -94 -65 104 -186 151 111 -129 -127 -68 -81 31 50 -257 -246 210 63 -5 41 -18 75 283 26 -140 -148 70 -41
3332d1O9P9j79j54M58q2j04j84J61o8M2n8J09O3l45L40R0n9k50L9k8P9K33o3k64
$$ -41 28 107 -72 -226 232 150 46 -138 23 -45 -3 -61 48 111 -234 106 196 137 -113 -74 -102 -23 210 147 -117
3357a17J85j5j12K42M5l77J39L2L5k01lk1Q6K20j12k3k0j21J67pj94J04L36j54
$$ -117 68 53 -59 183 228 -149 -10 22 57 -144 -147 -168 -82 138 26 3 -17 -138 29 22 -172 -68 268 114
3381A14j02Q1k4j67K13R4k03J11M6k48J37J9j73J61K18k45k00M09k28j35J78k55
$$ 114 12 93 69 -98 115 209 6 117 163 -85 52 71 -102 59 277 32 -168 241 13 -122 56 -199
3403a99O0K47k33m4J31p4q8J06O8j05R7J36o9J27q0r8J84j43k9J46l5j77K19p4
$$ -199 -139 108 -125 -169 -38 -112 -200 -94 -26 -131 -34 102 33 160 80 -18 166 23 -6 140 105 -72 147 73
3427G3k41O3L29k90N6J7j04l0K42j93n8M81m21j46K28J34l96L70j44m3K60j06
$$ 73 -168 -105 224 -66 -10 7 -97 -127 115 -78 -136 345 -76 -222 6 140 -256 114 -30 -73 187 81
3449H1L6j82J34J5j08K35k54M3J11j50J01J44m36J53L15k66l2J44j88k8J35pj90
$$ 81 117 -65 69 84 -24 211 -43 0 111 -39 62 206 -230 -77 238 -28 -60 84 -104 -132 3 -4 -194
3472a94J14P3j17J63O2j97J24J92j80p6m8L8J32p4J6m8J88l04J94O9j30l9J07
$$ -194 -80 -7 -124 39 101 -96 28 220 40 -36 -84 -46 86 12 28 -20 168 -136 58 127 -3 -42 65
3495F5O1l21K40q8j90M11k05j28J11J32k56J97J69l60K03J38k59J09P9oj7J69
$$ 65 126 -195 45 -43 -233 178 -27 -155 -44 88 -168 29 198 -162 41 179 -80 29 108 102 85 254
3517B54k08L4J2q3n1j3o4o1K11r3Q4j40J31l9J25j55m7l0N7j33K29J11j36M4O9
$$ 254 46 80 92 9 -42 -55 -119 -180 31 -62 22 -118 13 -26 99 -56 -103 -133 -76 -209 20 131 -5 39 108
3542A08l7J57m4k16Q3R4r3j37K37j81j22K62j36K19k02j55J1J46o2j9n5n0R0N2
$$ 108 71 228 184 -32 51 145 52 -85 152 -29 -151 111 -25 194 -8 -163 -152 -6 -68 -87 -142 -192 -102 -50
3566e0J38p9J58j72M7J5N2j53P0K27j59j18J96j89q3J16k5l7P9k19L9M4J19j90
$$ -50 88 9 167 -5 42 57 109 -44 26 253 94 -24 172 -17 -100 16 -9 -46 33 -186 -147 -103 16 -174
3590a74J97j53m4J18J46j82l7K3kk4J90q9P4J43k90J88K4n7K6m2rO7j54J59j13
$$ -174 23 -130 -174 -56 90 -92 -129 -106 -108 -132 58 -31 43 186 -104 84 108 51 77 35 26 93 -61 98 -15
3615a5J81j29lj77J41j04J66k9R2r2l16K47N3p7k7J05k36L49j91K03j7j17J53
$$ -15 166 37 34 -143 -2 -106 60 31 123 31 -285 -38 15 -62 -89 16 -220 129 -62 141 124 7 160
3638A60k54R1K41j47r8k8K3J0%K2J18j47n6j15J43l1j37K51m1L9P8k1l0j75J27
$$ 160 -94 -3 238 91 -7 -35 -12 -2 -2 20 138 -9 -65 -180 -37 -68 -205 46 5 44 122 101 71 -104 23
3663B3L4j40M4k9J67k6j42J45K6o5L4L2k12M8J17j16J55k9N2l76K49r9L3M3m6
$$ 23 57 -83 -39 -68 99 73 -69 76 102 37 71 103 -109 -61 56 -60 95 66 118 -258 -9 -108 -75 -32 -78
3688g8R0j8L4qk1m9J07J5q0K3O8n1J05k9o1K5j44K35k16Q9n4j22Q3K3l3l5L19
$$ -78 12 -6 28 20 -1 -50 57 72 -8 15 83 32 137 108 47 72 -72 163 -53 36 -18 -140 -57 -34 -67 -102 217
3715B17k87L2R6n6O6O2l91L07J84k88j17K35j05q7K45p1pJ31r4kK8o2R3j45J8
$$ 217 -70 -38 58 2 68 130 -261 46 230 -58 -175 60 -45 -132 113 42 35 166 72 70 98 36 129 -16 2
3740BJ7k14J03p4J56j04J55j04J14Q3j35J89l46Q0Q9mL1K9n2k23K57R0l3k91K14
$$ 2 19 -195 -92 -166 -10 -114 41 -63 51 134 -1 188 -158 -78 11 7 38 67 15 -208 49 139 106 -185 29
3765B9j02j20L24j52j12J89j2k40J97j33PJ03j98J36M1q9Q5O0n1m1M9m5O9n9J71
$$ 29 -73 -193 131 -21 -133 56 44 -196 1 -132 -125 -22 -220 -84 -43 -132 -47 13 -38 -79 -30 -75 -6 -65 106
3790A06j59qJ28j47J43K39j99j10K28k12J90k00q5J63J6j13n4K1J32j47o3J78
$$ 106 -53 -61 67 -80 63 302 103 -7 221 9 199 -1 -86 77 93 -20 -74 -53 79 -68 -131 47
3812D7l02K40j0q0K39j14j27m9J61p5N5J09j89K77m8j67J10l2j89J92O0j7j93
$$ 47 -255 -15 -25 -105 134 20 -107 -156 5 -70 -15 94 -95 182 134 -33 77 45 -144 48 108 91 -102
3835a02J79n2r8J95k03k7J16N2lL7j96O9n4J17n5J03j90J25k4J14j82rO7J71j2
$$ -102 77 25 -73 122 -81 -108 8 60 57 94 -102 -33 -87 30 -25 78 -112 13 -11 103 -79 -88 -21 150 138
3860A38j55L8J26j8l16L37on6N4k85J20J69k84J00j67J87L1L9j32j5J40K6q5j22
$$ 138 -17 21 147 129 -187 150 144 88 142 -143 -23 146 -138 -38 -205 -18 13 52 -80 -95 45 71 -14 -136
3884a36J03R8o6K2J14q1j5K6j7k6J10k93L2J09p5M1J05k07J39J17L7k54k9J76
$$ -136 -33 65 -1 21 135 54 39 65 48 22 132 -161 -129 -20 -95 -54 51 -156 -17 100 137 -117 -146 30
3908C0r9J20n0j20J57K1j8k47K16j03K9K52j63j81J70o6k6Q4l2O0k8j88J81L4
$$ 30 -69 51 1 -119 38 59 41 -206 10 -93 -64 188 25 -156 14 -52 -78 6 -26 34 6 -182 -1 33
3932C3n8J81r6j49j6K1P0K0j9J93j35pq6l0K06m5j06J69k03K4J10Pj88k1J53r3
$$ 33 -25 156 60 -89 -105 -84 -14 6 -13 180 45 38 -48 -78 128 83 -23 146 -57 -33 77 84 -104 -125 28 -65
3958f5l3J25k00L06o1j2j30J6J91l01K18J08k54J32Q6j51J08M5j29R6L0j34m7
$$ -65 -98 27 -173 133 72 60 -70 -54 137 -164 54 162 -92 40 126 -25 83 128 -1 95 125 -9 -56
3981e6K88k73O2J37l7j63K08k2j04K3N0o3j40N5j85K84K3p8j24K3oJ61k42Q5Q8
$$ -56 232 -41 21 158 121 -42 166 144 40 63 113 50 -90 -35 -220 64 87 9 -115 -92 -98 63 -179 -94 -6
4006fm2q7J34J58j32rR1q2N0j22J78j17K6R1q3R0q0j56J19J9j72L1J62n1j28J34
$$ -6 -48 -135 -1 157 25 16 107 25 75 -47 131 14 40 131 48 138 58 -98 21 40 -132 -101 61 10 -118 16
4032A6L7q8J7J86k39J93j97m8L7J69L4k70J16j48K98K9m6j98J65N5j9j78Q4J21
$$ 16 53 -35 -18 168 -71 122 -75 -123 -86 83 117 -153 -37 -185 113 142 96 -102 63 118 99 -79 5 126
4056A26j18p7J05j39J84q3O4j81M42l22p2J49j42J13n5L70m29N9p6J41r3K50k23
$$ 126 8 -69 36 -103 81 -2 62 -119 323 1 -71 78 -64 49 -6 364 -65 -6 -82 59 -34 216 -7
4079gJ16j90l5K02j33o6N5O3O9o6J20k63J07o8K5J89j40M0j0kk2k4J24k0J6jK5
$$ -7 109 -81 -116 86 -47 -113 -58 5 74 8 128 -135 -28 -96 -71 118 -22 18 8 6 -16 -40 84 64 80 79 104
4106A04K9j71R2o2Q6j85Q1O2P6k40N6J95j74r3J09M5p5r2J61n0J20j38R0k4l1
$$ 104 133 -38 54 -8 78 -107 -26 36 112 -128 -72 123 -51 -144 -35 10 -65 -157 4 -46 74 -64 26 2 -29
4131b9q8J96j98K69k44k8J22MO2j15K30j25m2J3N1K4r0J1j9j16J20QJ6j43J50
$$ -29 -117 79 -119 150 -94 -122 0 4 66 -49 181 56 14 27 78 102 12 23 4 -112 8 16 32 -111 39
4156C9j01J49L5k17l9J34Q7j80Q8j88K27m1l7K03l0l48L37J59k31J0p1K6J03j41
$$ 39 -62 87 122 -95 -134 0 87 -93 -5 -193 34 -7 -44 159 129 -219 118 277 46 56 -15 11 114 -27
4180b7Ok4M2pj09J67j07K2J12n4j42J1L8J08K6q8L4m8K0R6L8J6n4j27J4r2K22
$$ -27 -21 -45 -3 -10 -119 48 -59 -37 75 21 -121 -110 -72 36 62 -26 8 -40 -20 76 114 130 76 -51 -37 -129 93
4207I3m1r7J12j77Q2J6N1l7p1M1n9n3J68J2q7Q4Rj98J60n1J62k32J66N7k9j15
$$ 93 52 -45 67 -110 -28 -12 39 2 -69 -28 -87 -140 28 40 -47 37 46 -152 8 -43 119 -113 53 110 81 -34
4233c4O7L9O6k79J89K2j50J52p9J5o0K8J22L8j58K33j21k76K50q8P9Q8k17J29
$$ -34 33 72 138 -141 48 70 -80 72 -7 8 -52 -24 98 136 -22 211 90 -186 64 -24 55 143 -74 55
4257E5R2j94J03r6k5J15m1J67j47j5j66J57M6o1m0Q3l4j44K99q6j65J21l1k19
$$ 55 147 -47 56 -40 -65 50 9 176 29 14 -152 5 51 -10 -50 33 -1 -145 154 68 -97 24 -7 -226
4281b26J63J10p6m6l9N9L5J71k78Q9J02M2q7N1Q7j80J51k64J93N1p5j10m4N6K2
$$ -226 -63 47 -29 -75 -114 -55 -20 151 -127 -38 64 106 19 70 157 -23 128 -136 57 108 33 -77 -121 -65 -43
4306d3j5l6P0MJ19j06j19j1l18J44J98N5M4K71j35m23K68J18NL2n8r0K35j05p3
$$ -43 -58 -94 -24 -20 99 -7 -126 -137 -455 -311 -113 -58 -14 257 122 -301 -33 85 90 122 64 -26 209 104 31
4331C1r1K5k4J8O4J7j8m3P5oqN6qJ18m49J19J97j96L8NO7r8J59O8n4M0j43J74
$$ 31 -60 -35 -59 -41 23 40 22 -21 54 48 40 96 88 206 -243 -124 73 -123 -85 -80 -13 -111 48 116 62 102 -41 133
4359A33L5n7k08J59j49P1J34j61M4j37j6K34L03k79k97J80K5j65K39j12Q7q0j25
$$ 133 168 111 -97 62 -87 -16 118 -43 1 -136 -152 82 385 106 -191 -11 14 -151 88 -24 63 -17 -142
4382a42K09j15n7J1O4K13j80Q3L1M2M22p27j95R8N10j98l50L26k89j70L95Q0r5
$$ -142 67 -48 -105 -94 -30 183 3 86 117 159 581 -146 -341 -243 267 69 -281 45 -244 -414 -19 61 -34
4405c4M6l3Q8p8OM2j23J54n1L3m8J3o8J71j28J66n4k06J31KP1j37p0J01J1L0p3
$$ -34 12 -21 67 -11 -5 37 -86 68 17 50 2 15 -53 118 -10 156 102 -104 27 29 100 -37 -107 -6 5 35 -38
4432c8K5j0Oq4J95k30J09R2j61lO9no3m2O2O3%J44j73J90q7mJ7Q9j07o1N6m1q6
$$ -38 -13 -23 -17 -101 94 -136 -27 65 -96 -99 -30 -35 -98 -140 -78 -15 -15 129 -44 146 59 55 72 161 54 -7 49 8 -78
4461g8J74k49J72P7m9j42Q7K4rK08j38j27k1OO3Q5j81o9L70l07n0K01K1j11O1
$$ -78 96 -153 19 96 47 -95 -8 16 7 215 77 -50 -71 -65 -2 83 -98 -167 203 -104 -154 47 68 -43 18
4486A8n9R1M5K2j59qJ92r6j75K53m9j37M2oNok9q4O4J44o4l3J4K8N9o7Pq3J10
$$ 18 -41 50 95 117 -42 -50 142 46 -129 124 75 -62 -20 -26 -21 -27 -56 -140 -76 68 4 -29 -15 13 72 5 12 -71 39
4515C9l0J63m0k3J1j46J37k0r0K5O8j61J73q2Qo8l3o2J59p6J8j45J74m9P0N2p8
$$ 39 9 172 132 109 120 -26 111 91 1 26 94 -67 106 24 32 -36 -69 -131 28 -48 -30 -175 -1 -50 20 72 -6
4542fM6m3O5M8l9RJ0j4n7n0j9O7j65J71Q9q8j36J41J74l44J08L7j23J68j3j19
$$ -6 40 -3 62 110 71 80 90 76 19 -31 -50 17 -148 23 112 24 -112 29 203 -141 -33 4 -119 49 36 -83
4568h3J02P9j29O1K1q6J63m4k66J45p6J24Q1j41J11j73Q3j4M8L4j92r6K35J1p3
$$ -83 19 98 -31 30 51 -35 128 84 -182 -37 -113 11 92 -49 62 -111 -28 -42 6 40 -152 -248 -13 -2 -75
4593g5n8J63r3r3K83r8j00J14j03J33o2j21J14J35j03j84j9K56k75K15L1m6OM5
$$ -75 -133 30 -63 -156 127 29 -71 43 -60 73 11 -110 4 139 36 -148 -167 89 -186 29 60 14 20 65
4617F5J25j38J04l3j03N3j75o5J79Oj84O7K33o6j18J27j00J22q8p0J21k11Q9J34
$$ 65 190 52 156 123 20 73 -102 -167 12 18 -166 -99 134 68 -50 77 -23 99 11 -59 62 -149 -60 74
4641G4J23k59J04qj43Q5o4K7R0J36l39O6J66j32KJ30o2l5J96k29Q1J06j17oJ21
$$ 74 197 -62 42 34 -109 -24 -88 -61 29 165 -174 -108 58 -74 -72 58 -4 -39 157 -72 9 115 -2 -8 113
4666A13l83J92k6P6J67k24K58k41Q9M8j84K12K7j71j8J2k8J17r2J48j54N9j58
$$ 113 -270 -78 -104 -28 139 -85 173 -68 21 69 -115 97 124 -47 -65 -53 -81 36 -56 92 -62 -3 -161
4689a61J04K15j91Q7K9l5l7J41j20q5R1O5j01q9j8PJ76K0n6J55q3j75Q6k7K4j2
$$ -161 -57 158 -33 54 83 48 11 152 32 -53 38 103 2 -87 -105 -98 78 98 42 197 114 -61 25 -2 22 10
4715A0j18J03n5L3r6m9L14m7j10o1J66r8%J04q3q7Q9j55P3Q3J36p1r6J36j38J6
$$ 10 -108 -5 -60 -27 -123 -172 142 95 -15 -76 90 -8 -8 96 13 -74 15 -140 -67 16 152 81 -15 121 -17 -1
4741aM5p1J38j47j8J11l3r7j6O5j21N6K17n2K0p4j72L47k27m8J11mo0Q0p2O7r5
$$ -1 44 -27 111 -36 -54 57 24 -73 -89 -24 -145 -89 128 76 96 22 -150 197 -30 -78 33 29 -31 49 -23 44 -51
4768e1N2N4Lr3r5J10r4Q6j44J39J10m4j50J47j40M9M9j27O2J3J00m0o8p4J49o7
$$ -51 1 55 58 -35 -130 -20 -114 -28 -172 -33 77 33 -117 30 -110 -61 -12 -139 -77 -64 36 -4 -72 -146 3 -64
4794f4J24j68J58P1j35J02J1Nnk06O3M9l3K6k8p0K8J62j78pO4p0N0j04J48J17
$$ -64 60 -108 50 121 -14 88 99 104 99 -107 -44 5 -28 -2 -30 -100 -72 90 -88 -95 -31 -101 -51 -155 -7 110
4820A10j13J02q0M6p7K1o3k7J53k9N2j06J54J1k95Q4LQ8l7L6p5r3J44O8r6l9M8
$$ 110 -3 99 19 65 -12 9 -54 -81 72 43 95 -11 143 154 -141 -57 -54 34 -3 33 -42 -135 9 77 -19 -58 -10
4847a0M1j1J48j63M9P7j63K48j28j9j51K20j08j1P1k19L7K28j20q1P2l9N5o3r
$$ -10 31 20 168 5 54 131 -32 216 88 69 -82 138 30 19 90 -129 -92 136 16 -65 7 -32 23 -40 -49
4872d9M6N4l9j77K29j35P9Q9n7j48J8o7J36o6J96k44K41j93q3K35J79j47k55J19
$$ -49 -3 51 12 -165 64 -71 8 97 40 -108 -90 -157 -21 -87 109 -135 106 -87 -170 65 244 97 -158 -39
4896c9P0j03Q2O6k20J73k5o6J09j62J23M6j13P2oL5j04J2J24jj56P8J02r2J14
$$ -39 31 -72 10 76 -144 29 4 -62 47 -115 8 54 -59 13 7 42 -62 -50 74 73 -83 -5 97 5 119
4921A19j82P7J69l98K49q7L2J53r1k32J04J13L6j12K9Q2j22Qnj79L15j81rJ64
$$ 119 -63 14 183 -215 34 -53 -21 132 41 -191 -87 26 62 -50 -21 61 -61 -53 -58 -237 78 -103 -112 52
4945E2q3j09N5P6J5kj3N6M6k1l55L44j5r0lo5P0M2J03n5m9L6q5k4J73k02M4j4
$$ 52 -31 -140 -85 -9 6 4 -9 47 93 72 -283 61 46 -44 -47 -112 -42 0 103 48 -1 35 -50 -74 99 -103 -59 -73
4973g3l8J25K2N5j72J7J21j44J51k0L0J42r3j75J45j81K8P6oJ09j62K8k4N8j37
$$ -73 -111 14 36 91 -81 -64 57 -87 64 44 74 216 123 -52 93 -88 -60 16 10 119 -43 -15 -39 19 -118
4998a18J48j73J42q8J18k19K40j37N8Q1J6p6J55j39jJ59m7R1k68L8j16J65N3M6
$$ -118 30 -143 -1 -89 29 -190 50 -87 -29 52 68 -8 147 8 7 166 119 210 -58 -20 -136 29 82 128
5022A28j65M6L4j33r4Q9J60jj95J85j49j41K82m4m6K4Q8j80Q4L4K03j22No9j04
$$ 128 -37 9 43 -90 -184 -95 65 64 -131 54 -95 -236 46 2 -44 -20 68 -112 -28 6 209 87 92 23 -81
5047h1N4J27k29K97M2k06o4J40j36K24k49P3o2j27L1J86lj26J12r8N2nK1O5m1
$$ -81 -27 100 -129 168 210 4 -60 80 -56 168 -81 -8 -70 -197 -166 20 17 -109 3 -95 -43 -48 -27 38 -3
5072cJ38k41K81m1j16J61j91KN6L5q4K6R0p2l7l6l5j09J99n7q9R2k8j1n1J51r
$$ -3 135 -106 175 134 18 179 -12 -10 46 81 -3 23 113 41 4 -32 -67 -176 23 -34 -123 -31 -59 -70 -121 30 21
5099B1r5J19q9Q4n8%l1L4j1J27p4j75P9Q9J5j17Q3QK15k79J40j19n5J34l1K1j2
$$ 21 -74 45 -44 40 -18 -18 -49 -15 -26 101 27 -148 -69 20 35 -82 1 9 224 -55 85 -34 -89 45 14 35 23
5126B3p1k1J23j90O3J45J10r8n5l5k0l9J06P1r5J1p5J78k31K26L2j67j09N9m2
$$ 23 -48 -69 54 -136 -73 72 182 84 29 -6 -26 -65 41 112 17 28 -47 131 -100 126 158 -9 -118 -59 -101
5151a01P1N3N3j09J34o7j55L23j05j1lnL7p5M8j00j35J81M2p9P9r2J38n5j53J00
$$ -101 -30 23 76 -33 101 34 -121 202 97 86 83 78 115 40 88 -12 -147 34 76 -3 76 -16 122 67 -86 14
5177A4L8M1l08L12L0Pk08o3L47j67j81J63R1Q5m55K21Q46r18l28K52L23n2l54
$$ 14 52 93 -215 97 127 134 -74 -137 210 43 -138 25 116 201 -254 -33 813 -105 -433 -181 142 90 -264
5200b64N44m50K44%k73J12l2J82J4j75l1K4K75l00J29k87K14J06j20K39j07O9
$$ -264 280 -170 74 74 -199 -87 -119 63 77 -98 -129 -105 170 -130 -1 -288 -74 32 -88 151 44 113
5222A13l14K98p8J48l40K27k41J53O6j3JM3J88j80j17mJ39p1L8pp6K16l78K08
$$ 113 -201 97 19 167 -173 54 -187 -34 32 19 20 63 251 71 -46 -50 89 18 56 49 -27 189 -189 19
5246A9j54K52l03J63p1M7Om2L5K3m9K00p8j09PJ0K98m28J76J6K7O2j4j19J45j78
$$ 19 -135 117 -186 -23 -94 -47 -41 -83 -48 -25 -74 126 48 -61 -54 -44 254 -174 2 18 45 107 93 -26 119 -59
5272e9p1K42J15l30O3Q0o6J16j32Mq3K52k41N7Q3p7J27o3M7j31j2l4K87ol9o4
$$ -59 -130 112 227 -103 -40 40 -26 90 -42 -38 -121 131 -110 -53 30 -47 80 17 64 -67 -79 -113 174 168 129 65
5298F5j75J96Lr8q6LJ38j8q0P7j2L6k3j13J81J4j37j1LP1j53O4l4L0J9L5l3K00
$$ 65 -110 86 89 -9 -95 -92 46 28 -52 25 13 49 26 -87 94 108 -29 -40 -37 34 -119 -55 -89 -59 -40 -5 -38 162
5326A62p4j37J17j13l4K09j56K29o6j05R9j2j09r1J30j75R0j32J03P6J5j84J00
$$ 162 88 -49 68 -45 -79 130 -26 203 137 32 131 119 10 -81 49 -126 -36 -168 -65 11 26 -158 -58
5349e8j9K19K7k16M13m58L67l36J39K8k87J98k77M57k90J10k42O0L41j32L3j73
$$ -58 -77 142 169 -47 366 -92 275 -61 78 106 -181 17 -260 197 -93 17 -225 -165 176 44 77 -96
5371i6M9K81j51Oj0j91L08R1p4m04M61k86j24P2O9j43K03J19k28L2J62J3J7j13
$$ -96 -47 234 83 89 79 -112 196 287 213 -191 270 -16 -140 -68 1 -142 61 180 -48 -16 146 159 176 63
5395F3r3j6L2O4m8l3lR7j38M4J16q6j33J09J51j51r8l5O5P6NR9p8Pmk3L0j12N8
$$ 63 -30 -46 -14 50 2 -31 -34 63 -75 -31 85 -1 -134 -25 126 -25 -123 -158 -93 -17 -12 87 9 16 12 -11 19 -93 -35
5424c5L8O7j22J65o7K6j02J80k02R5j13pJ58j17j55J67okJ34k4o4r2P5k9j4O7
$$ -35 3 70 -52 113 46 72 -30 150 -52 43 -70 -77 81 -36 -191 -24 -30 -32 102 78 14 -78 -3 -32 -46 21
5450B1J1k5j79K89m0P5J8j17l8K3r7J77l3n4L4q7P2j87K40j59L6J07j50J38j57
$$ 21 32 7 -172 117 77 152 170 53 15 38 -59 118 85 31 65 -22 50 -137 103 -56 -20 87 -63 75 -82
5475h2P9o5R7r6J13K2jOj27J74o2o9K35p9j50j7J00o7j06J58j13P4J31j90O7q0
$$ -82 -3 -68 29 -67 46 68 67 73 -54 120 58 -11 224 145 -5 -22 78 11 -95 63 -50 24 155 -35 32 -48
5501d8L7P2j66J02j4QR1j87J62Kl6J33r0Ko0K7p7M8j61J80p7M7j65K11m1m6nm1
$$ -48 -11 61 -105 -3 -17 -9 82 -105 57 59 23 156 66 68 8 35 -42 6 -155 25 -52 -5 -170 41 0 -46 -51 -92
5529i2J63J36k63j38J08J06n9l5j6M0K03k69J20j34J36K02k73kK24j53N9j58J16
$$ -92 71 207 -56 -194 -86 20 -39 -74 -90 -50 153 -116 4 -130 6 208 -65 -67 157 4 63 -95 21
5552B1N0j17j12J26K0J24m7J8j86O5n8J2K9R3j40j0K0r9J95J73j88J22k37nK46
$$ 21 71 -46 -158 -32 -12 112 65 83 -103 -38 -96 -84 -55 38 -102 -112 -92 -191 4 177 -11 111 -126 -131 115
5577A15j18J05k37K55q5r6J29p5J17N1j86m4Q3O1n8n1J34k66M4o6J58J4J4j37
$$ 115 -3 102 -135 120 35 -61 68 -7 110 161 -25 -69 14 75 17 -34 100 -166 -122 -188 -30 -16 -2 -139
5601a39J05J4m5n8J05L8j78J49J5m4J12j31K0K4N1k7L2L8k24K4Q0K9j55J37j77
$$ -139 -34 -20 -65 -123 -18 20 -158 -9 6 -38 74 -57 -37 -13 38 11 43 81 -143 -119 -39 -10 -165 -28 -205
5626b05J72O0j34J22j60J77O2j56N3l3L6j09P5N2O4l1O3km8j82K52jk14n5J11
$$ -205 -33 27 -107 15 -145 32 94 -62 -9 -42 -6 -115 -40 12 76 45 108 106 58 -124 128 127 -87 -142 -31
5651c1j9kJ12k66K32j21O8P0j09J17L2o4j97K89k62J13l2P4Np2Q8P6j72K8N4k0
$$ -31 -50 -52 60 -206 26 -95 -27 43 -66 51 83 19 -178 111 -151 -38 -70 4 9 -63 25 101 -71 -43 11 -9
5677iMLJ0K81k12j48J29l6k0j58J13J23M2j79K30p2l5j10nJ15J73k69M2l2Q6j6
$$ -9 -5 -2 8 289 77 -71 58 22 2 -156 -43 80 122 -57 173 101 66 -44 -49 66 239 -30 12 -20 66 50
5703E0m6J53k01L7%Q1j53K34o0k19J69j60R2QJ5Pj05L0J3O3n4J1J71j15L8j6J10
$$ 50 4 157 -44 -7 -7 74 -79 155 95 -124 45 -115 -23 -15 0 7 -98 -68 -55 8 -46 -35 136 21 59 43 153
5730A53j30J08o8l4q6R1J35j70O2j22p3K04j71k8J98r8j0r9nJ0J97j19O0m2J4
$$ 153 23 131 63 29 -57 34 169 -1 61 -61 -134 70 -101 -129 69 -29 -39 -138 -143 -133 64 -55 5 -37 -23
5755b3m6J1L4q0N3N2J11mj70k3J61O3k31J0J54oMj4j09O9K5k08K23l4Lo2J52j74
$$ -23 -69 -58 -24 -104 -51 1 112 108 -62 -85 76 139 -92 -82 72 66 70 56 -53 16 41 -167 56 22 25 -37 115 -59
5783e9M2M2q8L7n3N4J32q2o0J59j17l3J13p0j04J50l2J40k99J17q4K66j84q4Q3
$$ -59 -17 25 -63 -26 -79 -25 107 25 -35 124 7 -26 87 17 -87 63 31 171 -128 -11 -95 171 -13 -97 -14
5808a4K8K0j49J65m6K9P8j16K6n6j07J34J0j29J10l0JL1K11j89k6P5q3j6J30Q9
$$ -14 14 34 -115 50 4 33 111 -5 21 -35 -142 -8 2 -127 -17 -47 -46 -15 196 7 -19 56 -27 -43 87 176
5834A76k41R2L2r0K3j26O0q4J94K2j36k7k5K03o1l6j6p0J72n5M8k1N8r8m0n8J31
$$ 176 -65 27 59 -31 -8 -134 -74 -158 36 58 -78 -105 -130 73 12 -24 -40 -110 62 7 55 34 92 -6 -46 -104 27
5861B7k6N9q5%O4m6J05j16O8J28j82L4q0J29j37J4K5J34j31ON2k3R8p7r8R9k1
$$ 27 1 60 -25 -25 39 -7 98 -18 50 178 -4 30 -50 79 -58 -44 -19 115 -16 -10 42 19 117 40 -58 41 20
5888B0N7K2o0P4j59M0M2j30J26J89j20k67J22P2Qp9J24j15J23j28L5K4k04M58
$$ 20 77 99 39 113 -46 -6 36 -94 32 221 101 -166 -44 28 36 -43 81 -34 89 -39 -4 20 -184 274
5912B74k37o0K2J13o8j61K83k03O9J43k00J57k3j64R1o2O1r3K06q1j36J80j43
$$ 274 37 -23 -1 112 44 -117 166 -37 32 175 -25 132 109 -55 36 -26 35 -58 148 67 -69 111 -32
5935c2o2N3O9l3R6j56K2n1J24o2M4L3j15J48K6j22m2J00J4j45L4P9j04J80j03
$$ -32 -94 -41 28 -5 91 -65 -43 -94 30 -32 12 45 -70 78 104 -18 -60 40 54 -91 -57 22 -82 98 -5
5960eJ0M0p3m9J8J19p8M9ll7J30j64J1N9%L1j68Q2O3j30J69K3j21RJ57o4j08J46
$$ -5 5 45 -28 -77 -59 60 -18 31 28 -9 121 -43 -32 27 27 58 -110 -28 35 -95 74 97 -24 -15 142 78 -30 116
5988A16Jp1Q2k54K07n5j26N2L6k9R0j14kO3nRm5Q6m5l6k8J04j14K01j57p5J4J24
$$ 116 117 46 128 -126 81 26 -100 -48 -12 -41 49 -65 -67 -4 -9 0 -45 41 -4 -40 -68 36 -78 123 -34 -109 -95 29
6016B9J09j90oJ93n3j67J11M6l0q1l3J01O8j32N7r6J21M5j69J30n2O8k07K01j06
$$ 29 138 -52 -58 135 82 -85 26 72 42 -39 -72 29 97 -35 22 -74 47 92 -77 53 1 69 -138 63 -43
6041d3O7n5J90l5p7N4j25J42j52O8L7m4q4J64l24J45J64l6J9M6p6r4K7p2O1Q4
$$ -43 24 -31 159 124 47 101 -24 118 -34 34 71 27 -57 107 -217 -72 92 56 75 121 45 -49 -22 -94 -33 51
6067E1l3j4J3K8j32Q5j30P3m9P9K9nR4M7j60j26K07j14k8J08P6j78J42k54J57
$$ 51 18 4 17 45 -87 -2 -132 -59 -108 -29 0 -5 89 136 -24 -150 57 -57 -85 23 99 -79 63 -191 -34
6092c4Q6j62L7K14j03n6j37K76j91m6J17j77J34Q8%L1j38Q1N9q2P4n4j11J92l0
$$ -34 52 -110 -73 141 38 -18 -155 121 -70 -116 1 -176 -42 46 46 77 -61 20 79 -3 71 17 -94 98 68
6117F8j19P9N7k9j13J61n6j90Q3J03J2j10l8K36j48n2N8j1R2j50M1O1j69Q3M0
$$ 68 -51 28 85 56 -57 104 48 -142 -59 44 56 -54 -92 144 -4 -56 2 -9 83 -67 -26 35 -134 -51 -11
6142a1j06J08P5l7j43J46m7rm2R4j62N02m25rJ12n1k9L7N8k1j49J50N1j67J98
$$ -11 -117 -9 66 29 -114 32 -15 -24 -66 28 -134 368 -57 -66 46 -5 -34 3 61 40 -109 41 92 -75 123
6167A23j86R9r0J52Qj07N8%j19nJ23p6n6J43l8r7J99Qp3k42J05J00J5j29J0J62
$$ 123 -63 36 -54 98 106 -1 57 57 -62 -67 56 -20 -76 67 29 -68 131 139 66 -176 -71 29 44 -85 -75 87
6193H7k08J3J36j07O0j01J2N5k9J68L9N6k54J51j7j7q9pQ2O9k13J71j64k2J27
$$ 87 -121 -108 28 -79 -19 -120 -108 -53 -82 86 125 181 -73 78 61 44 -45 -52 30 99 -114 57 -107 -129 -2
6218bNJ05k19j16K77j5L5j07L6R2j17j16lJ56J5l5N2k0J31k35k6J22l1m5%J03
$$ -2 3 108 -111 -227 50 35 70 -37 -1 91 -26 -142 -145 11 26 -9 43 23 154 -81 -107 15 -16 -61 -61 42
6244D2N4j69J2O3p9Q4p1N9Njj02L60j10j02j1Q2j35Q0j38J80p6J30j81pJ14p5
$$ 42 96 -73 -61 2 -77 7 -64 -5 0 -1 -103 257 147 45 34 116 -19 61 -77 103 27 157 -24 -31 83 8
6270Hm9j3J44j47J63j78R8j15K7Q6p5j28K08n0O5J9J0j14j3Q9J98j84QO8n8mJ59
$$ 8 -41 -54 90 -57 106 -72 26 -89 -62 24 -51 -179 29 -21 44 63 73 -41 -54 35 233 49 57 125 67 63 222
6297B22k11J35k20O0q0K22k22k8mJ71n3q8J67ok60N9J17R6r3m4N8K4j29J96l7
$$ 222 11 146 -74 -14 -94 128 -94 -122 -126 45 -8 -96 71 65 -195 -136 -19 77 -16 -60 -2 22 -107 89 52
6322E2K1J63k81K62j54l7j42K05k8q7N9J61k91mN4P6Ln0M4j35J64j12O3j9l2M6
$$ 52 73 236 -45 217 63 26 -116 89 61 -26 33 194 -97 -101 -47 29 32 -18 26 -109 55 -57 6 -13 -45 1
6348Ar5Q2j0j4J45k6r8P9j54R6J7Q7j18j1Q8j47R4N7o5J27j83j18L86j69m7Q7
$$ 1 -94 -12 -22 -36 109 83 -15 64 -90 6 23 110 -8 -19 69 -78 16 73 8 135 -48 -166 220 51 4 91
6374I1r5j08J35l0R9l6r7O6kj3kJ18j22J5%p7J24q2j41J38R8j58K15j5j51J43
$$ 91 -4 -112 23 -7 92 56 -41 25 23 10 8 126 4 19 19 -58 66 -16 -157 -19 79 -79 136 121 -30 113
6400A13l20K37o9P5k8oq3l7M0r6J76Qp3O0k0M4n6J3R6o9j1n3M5O1oM3r1N8j31
$$ 113 -207 30 -39 36 8 2 -81 -118 -78 -174 2 10 -63 -3 -23 21 -35 -22 74 5 -6 -59 -14 47 41 84 -7 51 -80
6429h0J60M5k08K4R5o5l3J07m3J49k98K06j36J9k8J58N0m2j20J26m4K0l7rR1K9
$$ -80 80 125 -83 -59 36 -29 -62 45 2 151 -147 59 -77 -58 -86 72 122 80 -40 86 42 62 25 16 107 136
6455A36O0k03L3p5N4J22j17l9j00P2L9Q9r2R3j99J25q3K4J22m3P5l8M3j15J45
$$ 136 196 -7 26 -49 5 127 10 -29 -129 -57 -18 71 -21 72 -127 -2 -85 -61 61 18 93 55 98 -17 128
6480A28j39K7kJ0r9rP6o0j5J6Q9n2J20k44K53j66J21p5J06j67J26m1J23p1p5J00
$$ 128 -11 16 14 24 -75 -84 -8 -68 -83 -67 22 -30 90 -154 99 -67 54 -21 85 -82 44 3 126 55 -20 80
6506H0J1j81Q1J57k4m5J50k62j8J14o4j27P0J32j36P6p7K81k94O1oJ07j03J11
$$ 80 91 -90 -9 148 124 79 229 -33 -51 63 -1 -128 -58 74 -62 14 -63 218 -76 -15 -21 86 -17 94
6530I4Jj32K8Nl1j29J73L0J31o5p5k2kqn1r1J72K3N0q8p1L5J6J03J8k58K07k8
$$ 94 95 -37 -9 -4 -35 -164 9 39 170 105 30 8 6 -2 -53 -144 28 51 101 13 -58 -23 -7 96 114 -144 63 35
6558C5j37J15L3k89J91Q2rj6M7J7o6m4K8k1j5J00k20J68P1j4o6Q7j8q4L9J14q3
$$ 35 -102 13 46 -243 -52 30 21 5 52 69 3 -41 -13 -34 -49 51 -169 -1 70 56 -10 77 59 -25 14 128 45
6585D5r1J58q1M7k20K30j42P9np0k9J25kJ8k8N0j50R1Kj46N0k8J6L9K0j3j51K78
$$ 45 -46 112 31 78 -142 88 -54 25 20 -50 -79 46 44 62 34 84 -66 25 27 -119 -69 -97 -81 -42 -22 -35 -186 92
6613I2K5k52J33Rj13L5J7K5p8J10M1M9j96K8mP3K9l4P0L0k07R0J48l9r1J02J42
$$ 92 117 -135 -2 7 -106 -71 -54 -29 -107 3 44 93 -103 -75 -79 -6 23 -11 59 89 -118 -28 120 81 -10 92 234
6640B34l38M8m4K25n9j43Oo3J19l2J13m7n8K1m5k6O0N1L1l1J28l59K14o0r4J57
$$ 234 -104 -56 -100 125 66 -77 -71 -134 -15 -47 66 19 -39 -18 -63 -89 -29 22 53 22 150 -209 5 -55 -149 8
6666HP6j59pJ65j53j1P8r6K0l4J76o1M9%o1j54Q9P0n8R5j99J00K21k29k2J50L4
$$ 8 84 -75 -82 83 -70 -81 -3 -99 -79 -113 63 2 51 51 -10 -164 -75 -5 -63 32 -167 -67 154 -75 -97 53 87
6693H7j80K35q9Lj10M1p1K14p0Jk0j40O1j28N1J31n5J85k41J5J79k54K55j38O4
$$ 87 -93 142 53 56 -54 -13 -84 130 60 61 41 -99 -38 -166 -115 16 -39 146 -95 -80 99 -155 100 -38 26
6718B6k1K1j53R2O0k24J57J30j41P6o8J19m2Pj42K87j59O1N0q2K3j84O1R4j04
$$ 26 5 26 -127 -35 25 -199 -42 88 -53 23 -45 74 32 39 -103 184 25 86 136 54 77 -107 -46 48 -56
6743e6J64j85J5J76j35j6R3l3J7J4j23P4L8j15O3p5J54k50K35j13K3J3N7l6K0
$$ -56 108 -77 -62 114 -21 -37 56 23 40 54 -69 5 43 -72 -9 -84 70 -180 55 -58 -35 -22 35 -1 19
6768A9o9L4k1J13j6k3L1o2J2J32j23J01j55M9k7n9r8K10P3l84K72K4j25J63j16
$$ 19 -50 -16 -37 76 60 37 68 6 18 150 27 128 -27 22 -5 -64 -162 48 121 -263 9 33 -92 71 -45
6793d5R5l4J0P5j45Q7J8j06J34J22l47K16J7j48o6J22M8p2J18o2j6j58J99j88
$$ -45 50 16 26 101 -44 43 61 -45 89 211 -136 80 97 -51 -117 5 53 -19 99 37 21 -137 62 -126
6817a26J09j26J03n0QR1j4j51J19nO3J04k58K49o5j45J35kk5p9j24K14P1q1j21
$$ -126 -17 -143 -40 -90 -82 9 -5 -156 -37 -42 21 125 -133 116 51 -94 41 39 14 -65 -189 25 96 15 -106
6842a06K38k54Q1j50K11q2O4o3Q0k61L14n5M4j73L7J50r1R2L0j68J8j0j25N4P4
$$ -106 132 -122 -41 -191 20 -62 2 -61 19 -242 72 17 61 -112 -75 75 -16 76 106 -62 -44 -54 -179 -125 -51
6867e1J63j39K21k70J56j36J14J52j15q5O1k19J70J25k3j31J0L1J38j72O6O7k40
$$ -51 112 -27 194 -76 80 -56 58 210 95 10 71 -148 22 147 124 -7 3 34 172 0 66 133 -107
6890a07Q6j7O6l0q8M9R1j30K08j26n6n7R3J8pj10P5M2j6o2R3P0j31L5k4J23Lr5
$$ -107 -21 -38 28 -2 -90 -41 50 -80 128 2 -54 -111 -18 0 -7 -117 -42 0 -16 -78 15 85 -46 -11 -35 88 91 -4
6918dj1p5J49p1J1kK9p6J6j23L37k43p6J60L1J05k73J14k01K49q1R0j3J16k68
$$ -4 -15 -90 59 -12 -1 -3 26 -50 -34 -157 180 -63 -139 21 52 157 -116 -2 -203 46 -35 55 42 158 -110
6943a10J07r2K5J61j06K4L9L0n7p0J74o3j9k05L31j99L1j8j57K74j01lo4k1J43
$$ -110 -3 -95 -70 91 -15 9 48 78 21 -49 125 62 43 -162 169 -30 1 -17 -174 100 -1 -4 -68 -89 54
6968E4K9J9j20l9k3N8N3K3j23K8j8M8j3j41L5J67j8J32r6q0l6Lj0J43q7P9j70
$$ 54 83 102 -18 -57 -80 -22 31 54 -69 -41 -59 -11 -24 -165 -130 37 19 151 55 -25 -61 -58 -68 75 -12 67 -103
6995a03J24n9K9n3l1J16l8q0J48l8k9m4P9nJ65j28J12j44n6r6J12J37j63J77j35
$$ -103 21 -38 -9 -62 -93 23 -15 -95 53 15 -14 -58 21 16 181 53 165 21 -35 -131 -19 118 -45 132 -3
7020cQ5m9P1j92J92j51J00m4N3j19mJ7P1l6m9j6K6N9n3J17j18J52q0o0j4L9n4
$$ -3 82 33 104 -88 104 -47 53 9 62 -57 -61 -44 27 -9 -58 -74 -48 11 -42 75 -43 109 29 -31 -45 -6 -60
7047f0N8n5q3J78j8l2j69J80q1J37o9o3J96l3j21r0J45j47Q9J56k42J56j7j47
$$ -60 -2 -57 -140 38 20 -12 -181 -1 -82 55 -14 -77 119 86 -35 -125 20 -127 -38 118 -124 32 15 -132
7071a32J58j02J17J00m3r5j34J19j4K3P4J28m2p0q5J46k18lO4P3M1L4l3q9j26
$$ -132 26 -76 41 141 98 3 -131 -12 -26 -3 71 199 157 87 2 148 -70 -73 -9 64 105 139 106 17 -109
7096a09Q0J86k65J46l7L8j05J9J62j04K10k6k10K1qQ6j51Q1RM1j34J00j69O2N8
$$ -109 -29 157 -108 38 1 39 -66 -47 115 11 221 195 -15 6 -2 84 -67 14 23 64 -70 30 -139 -77 -19
7121a9J10j55O8J5K5o5p1j4K18j29j53K32j60Q2o0O3M5j67J45K2nr7N6J34n0j98
$$ -19 91 -64 4 19 44 -21 -92 -106 112 -17 -170 62 -98 -16 -76 -13 32 -135 10 32 27 -70 -14 120 70 -128
7147a28L7N0k1L6J60j63j00O9r1J16K9J17J0p9K8k6M7r9k3N8L1P9k00P7k6M5O1
$$ -128 -91 -41 -62 -26 134 -29 -129 -60 -151 -35 -6 111 121 42 70 44 91 -8 -31 27 58 137 -63 14 -12 33 94
7174I4K4j93J2N5lJ14j23R1k67L06k23L0K10l7l0j06J31p0N9k00R3J52k3l00J25
$$ 94 118 -75 -63 -8 -11 103 -20 71 -196 110 -113 -83 127 90 60 -46 85 15 74 -126 -33 119 96 -204 -79
7199g9M5q5J79Ok67K60N5j94J51m1j2J18j55L1L5j10J12j25J12J0M9j52k0J18
$$ -79 -34 -119 60 66 -201 59 114 -80 71 30 18 136 -19 12 47 -63 49 -76 36 46 95 -57 -77 41
7223D1j3PJ8n1o2K6J38j34M2J8k9l5L5J30j18O8n5j17K5p8K01j0K2K5j47M6r8
$$ 41 28 35 53 2 -60 -34 104 -30 12 30 1 -34 1 131 13 81 26 -91 -66 -144 57 47 69 94 -53 -7 -105
7250a05j8J11J2J88l93J30Q1j19J22J8M5j43M3J67j87j87J94Q0j2j22J83j78M6
$$ -105 -123 -12 0 188 -205 -75 6 -113 9 27 72 -71 -28 139 -48 -235 -41 39 27 -95 88 -90 -44
7273d4q4j0J10j02K39q5K3k68K85J2q8R6q2L5p0n4N3M3O3k29M3J59K3m9o5QJ05
$$ -44 -128 -138 -28 -130 109 24 47 -221 64 76 -12 84 2 37 -33 -87 -34 9 72 -157 -114 45 68 19 -46 -38 67
7300F7q9J84j71j5J13j56J8m4P8pR0o1q4N8J0N8K6n0N9j56m0R1J43j53M9k5O6
$$ 67 -22 162 -9 -24 89 -67 -49 -93 -15 -22 68 7 -77 -19 -9 49 75 25 84 -72 -112 -21 122 -31 18 -7 59
7327E9n3j14Q6N8j00l8N4Q8Mm6P6m0j85J22O8M7o8K3Q5j46P3j34J08N1p6k1o0
$$ 59 6 -108 -22 36 -64 -102 -48 40 44 -2 74 34 -151 -29 39 86 18 41 126 -20 53 -81 27 78 2 -19 -79
7354g9J74m7k0J01j15p1R3pL7r0k3l4J42L5j28o5J9J27j80J77j33J56n3l5R8q4
$$ -79 95 48 28 129 14 -57 36 29 66 -24 -47 -81 61 96 -32 -97 -78 49 -131 46 -87 69 16 -19 79 -5
7380ej28R1J65k18J12M9rj59J89m1m0O0j81K06k2n7K0%lk9J03j42J18j22m1O2
$$ -5 -133 -42 123 -95 17 66 57 -102 87 46 6 66 -115 91 69 12 32 32 29 0 103 -39 79 -43 -84 -22
7406b2j39K14k5j12J34l3Qj59J57q9J54j23J29q6R5k30J66j30J4l4J15nK7n0P
$$ -22 -161 53 28 -84 50 17 25 -134 23 -66 88 -35 94 8 103 -127 39 -91 -77 -111 4 -1 26 -24 -17
7431a7J62l12J31N0j27J70j16r9K32j41J39j53N6J03q4p5j8P0LlP7r1O7kR4j62
$$ -17 145 -167 -36 14 -113 57 -59 -158 74 -67 72 -81 -25 78 -6 -81 -99 -29 -26 -29 48 -43 24 22 116 -46
7457d6K81k74M1j60J08J34o8M7j80J31p8J64j09K5m4r1J13oo1N2o2K1J7R9Q5r0
$$ -46 235 -39 2 -158 -50 84 16 63 -117 14 -64 100 -9 16 -28 -119 -6 -12 -73 -21 -83 -62 -45 54 139 49
7483D9N9q2m6nK5M5j8M4m4n6j3J11j09P4j3r2R3O7j45N0p1J67j11o3J30k6j08
$$ 49 108 26 -20 -25 0 45 27 71 27 -29 -42 69 -40 34 21 -71 22 89 -56 -6 -77 90 -21 -84 46 20 -88
7510h8m0R9L0p7K4N6J10p7m3m0K2J21j09k0N4J0q5N8k07K37n5Q8Qp3j81J10J98
$$ -88 -128 -29 1 -76 -52 4 114 37 -6 -46 -24 97 -12 -32 22 32 -53 5 -202 35 -20 68 76 3 -178 -68 130
7537A30n9m6MlJ29j80j7K79m73L12J10n69M47J29l04k30N14k11Q6r9r7p8J29O9
$$ 130 71 25 29 26 155 -25 -42 237 -236 76 186 -383 64 193 -111 -341 173 -38 48 -51 -148 -226 -97 -28
7561b8l0LJ28k04J27p3J80k23K60j05Rj6k9R3q7o1K33k29n3K34j90J25p4O0j86
$$ -28 -58 -55 73 -131 -4 -77 103 -120 140 35 44 28 -1 92 5 -56 177 -52 -105 129 -61 64 -10 50 -136
7586a36J34L9l7j18J12j08K33k35J01R8QR7k80J31k02J93p8Q7Q0j91P2k5k8k9
$$ -136 -2 37 0 -118 -6 -114 119 -116 -15 83 91 188 -92 39 -163 30 -48 39 119 -72 0 -25 -53 -82
7610h2J20j15Q4J25j81j05K28j03NJ49j80l4J16Kj0n4M6n8k0J80j86J71j20j8
$$ -82 38 -77 7 132 -49 -154 74 -29 -24 125 -55 -89 27 29 19 -35 11 -47 -67 113 -73 98 -22 -40
7634d0K44j22k41K52o4kj63J06J15q6j14J64p6J12j05J6p6P3p2K02q6J6l2j1R2
$$ -40 204 82 -159 93 29 27 -136 -30 85 -1 -115 49 -27 85 -20 -4 -80 -7 -79 123 37 53 21 10 102
7659A02j22QnK6R6j40j17K60m2j57J75k38N5K6J01j50j0K11j15K5jQ3o5j02M4
$$ 102 -20 -12 -17 9 105 -35 -152 108 66 -91 84 -154 -99 -73 28 -122 -132 79 -36 -11 -12 71 6 -96 -52
7684e2m4J20J57j72pm8n2J84r1J3J04j02j95J85pO6Q0j36m9O7O0j72P0Nl0K5n0
$$ -52 -96 24 181 9 2 -46 -98 86 -5 8 112 10 -185 0 -7 59 139 3 -46 21 81 -91 -21 -16 -46 -21 -71
7711g1J6J2Q1k05K03q1q4O4qJ53m0m6k70L28K48l80N0M2j38J67k2L8Lm4n7M8j01
$$ -71 -55 -43 38 -167 36 -45 -129 -65 -73 80 40 -6 -276 52 300 -80 -30 12 -126 41 19 57 60 16 -41 7 -94
7738i4K20j56P6j36J51k15J23m9R6J15j48j38R6J53o8p4k3J16lJr4MJ64q4n6J6
$$ -94 126 -30 46 -90 61 -154 -31 -80 16 131 -17 -155 -59 94 26 -48 -71 45 42 43 -51 -47 117 33 -23 -7
7764gj51J25j7o3M3J03j01OJ10K9r8M2J5r2QJ77Qk24Q5q8J01O2j00JJ11P1k62
$$ -7 -158 -33 -50 -113 -70 33 -68 -62 48 77 -21 21 36 -56 -48 129 137 -87 -2 -90 11 73 -27 -26 85 156 -106
7791a06J62M0j73l0MJ73j62rJ06j3L7r1J6J5Q9j39l5N5p3K95j21k6n0M5j24K06
$$ -106 56 96 -77 -107 -103 70 -92 -101 5 -8 29 -62 -46 -31 58 -81 -116 -61 -134 161 40 14 -36 9 -115 91
7817I1Q2k31J02qr1N1r5P1R3k09M15j69J3nM9l11J45l9O8j44L29k34J77k37M33
$$ 91 173 -58 44 36 -55 -4 -99 -28 65 -144 271 102 115 110 159 -152 -7 -46 22 -122 207 -27 150 -87 346
7842C46l10q2pJ7L6J05j52J4J25k71J04J7J89j99J7m2P5L4jQ2k9j04k2j06P0n2
$$ 346 36 -46 -53 -36 0 105 -47 -33 92 -179 -75 -58 131 -68 -51 -93 -18 16 15 97 68 -36 -58 -164 -94 -146
7868a46j8M5q7L20J3j00O1j22m3J60j45J70o1j02R9j31J84n8l3j44K11j13Kl7
$$ -146 -164 -119 -206 114 127 27 88 -34 -77 83 -62 108 47 -55 44 -87 97 39 6 -138 73 -40 -38 -75
7892g5J40j09rJ15j30J57j70q2R7J3k1O2P6Kj68pJ93k19N5PJ25r3o6J27j2Qqk2
$$ -75 65 -44 -53 62 -68 89 -81 -163 -66 -53 -74 -12 64 66 -102 -109 84 -135 -80 -73 52 -41 -107 20 8 16 8 -14
7920a4P5j43K21j99J69k6j12r3K00j36k7K00k10J38j03K09k78K25k18J33o0l3
$$ -14 61 -82 139 -60 109 83 -29 -122 78 -58 -85 115 -95 43 -60 149 -129 96 -122 11 -49 -82
7942h2J34o7K17j57L4O8n6n7l0qk0J28R0k27K27l86J6L44k2j2j63J2P7N4j11M5
$$ -82 52 -15 202 45 79 147 91 34 4 -4 -24 104 194 -33 194 -192 -176 168 146 134 -29 -17 60 114 3 48
7968D8n0J26l34L73Pj47mL5j27P3n2J4P3L1O4k42J94j21J27j62J40j31J13Oo4
$$ 48 -2 124 -210 163 170 23 19 54 -73 0 -52 -38 35 66 130 -112 82 -39 88 -74 66 -65 48 54 -10
7993a0j9N0J9n3J94k00J9m3m8p4K12j00J42o6k69K91j54p4q3J49N38k49L2k43
$$ -10 -29 21 40 -13 181 -19 0 -43 -91 -165 47 -53 89 23 -246 45 -109 -183 -266 -117 421 172 204 -39
8017c9J38m55K66O0o3J76p1q4L2n7J05N5m0Q4j96Q9K7l2m6K53l09J31pK1n2P4
$$ -39 99 -356 -90 -30 -93 83 12 -72 -40 -97 8 63 23 107 -89 0 27 -5 -51 202 -107 24 17 38 -14 60
8043F0q4Q7o8o3M9j6j5J28q0L4k9j18J61K0n4J1q0k1j44K51R3R8j73O9ok74K77
$$ 60 -24 63 -5 -68 -19 -35 -50 78 -2 32 3 -115 46 66 12 23 -57 -78 -222 29 122 220 47 116 110 -164 113
8070A13k36P0K10k6k43K8J24k0q6m3J47n0n4o4K61k05J26j8n1J07j61J48q0p7
$$ 113 -123 -53 157 131 -112 -84 40 20 -66 -109 38 -12 -66 -130 131 -74 52 34 -17 90 -71 77 -3 -80
8094h0R0oQ3r3n6j1J01J6j62Q7j06J0K47j16j52K60j87J01J4J8l1j49J37j71J54
$$ -80 10 4 87 -6 -62 -73 28 44 -118 -31 -137 -127 120 4 -148 112 -75 26 40 58 27 -122 15 -156 -2
8119bo7J22m9K5m0p9K12K6l53K11J49o9j26P8j8m3k4L9o2N6J21m9p7o0J06N3k15
$$ -2 -69 53 4 29 -11 -90 122 148 -205 6 155 86 -40 38 20 -23 -47 -8 -70 -14 107 58 -19 -79 27 80 -135
8146a35J60o1j4K0rn9J80j8p1M3rjj91O9Q7L6j0m3O1K2K1k7k3j3QM0JJ40k53L4
$$ -135 25 -36 -50 -30 -39 -98 82 64 -7 36 27 26 -165 -96 -9 27 17 -26 35 57 78 51 28 15 23 63 64 204 -49 -15
8176a5J14n1M0m4Mo4R7K4n0j25j2J32n6j05N6
$$ -15 99 48 88 44 48 -16 81 105 55 -70 -82 50 -6 -111 -55
8191e5
$$ Imaginary data points
##PAGE= N=2
##DATA TABLE= (X++(I..I)), XYDATA
0@%%%%%%%%%%%qJ6j6J6j6K4l2L2m0N0n8P2q6R8j14J34j53J75k01K29k62K96l31
$$ 0 0 0 0 0 0 0 0 0 0 0 0 -8 8 -8 8 -8 16 -16 16 -24 26 -32 40 -46 52 -62 72 -81 94 -107 122 -140 156 -175
34a75L72m18M71n27N84o51P24q03Q92r88J090j201J325j462J610j771J950k149
$$ -175 197 -221 250 -277 307 -344 380 -423 469 -519 571 -630 695 -767 843 -928 1022 -1127
52a127K373k620K895l211L573l990M481n068N779o666P803r314J1424j4569J9729
$$ -1127 1246 -1374 1521 -1690 1883 -2107 2374 -2694 3085 -3581 4222 -5092 6332 -8237 11492
67A1492k9522N3968k13920k89539P53548j03240m83926M35990P8396n68963L15762
$$ 11492 -18030 35938 -177982 -467521 286027 182787 -301139 134851 213247 -355716 -39954
78c9954M43332m74115j89302L93918r9264j78193K65374j1726k88857J27342K12778
$$ -39954 403378 -70737 -260039 133879 34615 -143578 121796 110070 -178787 -51445 161333
89A61333j42364j11325J19062p909j12951J00080J09812j68063m5765K07092o9961
$$ 161333 18969 -92356 26706 18797 -94154 5926 115738 -52325 -98090 109002 39041
100C9041j75164K01662M6482k72695J23725K02969k60362O902K94906k31382j76264
$$ 39041 -136123 65539 112021 -160674 -36949 166020 -94342 -87440 207466 -23916 -200180
111b00180L47657m7790k86517K43455N8863l13332K06704K23796l48022j4582
$$ -200180 147477 99687 -186830 56625 115488 -197844 8860 232656 -115366 -129948
121a29948K98790j97446j03559K88303j39221k36162K96468Q8655k96285Q3582
$$ -129948 168842 -28604 -132163 156140 16919 -219243 77225 165880 -130405 -46823
131d6823J79512j94767k1693K14328j13605j75430J82417J12089j84775k9695
$$ -46823 132689 -62078 -83771 130557 16952 -158478 23939 136028 -48747 -78442
141g8442J61681n5708j18787J37819M2710k09198N1742K20312j43410j39765K01098
$$ -78442 83239 27531 -91256 46563 89273 -119925 -68183 152129 8719 -131046 70052
152G0052p514j79620J60095O9395k51566P0349K18768j73342p1681J94117j02021
$$ 70052 62538 -117082 43013 112408 -139158 -68809 149959 -23383 -95064 99053 -2968
163b968j12271K16777k5155k19345J37664J09207j74869M7906J32597j59325l1834
$$ -2968 -115239 101538 76383 -142962 -5298 103909 -70960 -23054 109543 -49782 -81616
174h1616J85121o9791j31294J21388K9841j20839N8887Q2205j01838k2109J05208
$$ -81616 103505 33714 -97580 23808 53649 -67190 -8303 73902 -27936 -50045 55163
185E5163l4594q4988P1013M3967r1494N027Q7107n4555m6240J01188j5918j16438
$$ 55163 20569 -64419 6594 50561 -40933 -35906 51201 -3354 -49594 51594 35676 -80762
197h0762Q0312P8728j22885K396J15179r3262m9382J56373m0926j48873J15532
$$ -80762 -450 78278 -44607 -42211 72968 -20294 -69676 86697 45771 -103102 12430
208A2430O7082j45680M3327J11184j33142l0590J61857n3886j17241J08573K5748
$$ 12430 79512 -66168 -22841 88343 -44799 -75389 86468 32582 -84659 23914 49662
219D9662j18775N9793Q0691j08132j6662J10180m1088o8975P9422J2148q8285
$$ 49662 -69113 -9320 71371 -36761 -53423 56757 15669 -53306 26116 38264 -50021
230e0021L6893O4739o9597j9159Q3171l0221o8287P1799L0469q9969J9716P0506
$$ -50021 -13128 51611 -17986 -37145 46026 15805 -52482 19317 49786 -40183 -20467 50039
242E0039p2244k3509J01102l4808q7171Q2025L4028r6796L5573O8594r3656j3724
$$ 50039 -22205 -45714 55388 20580 -66591 15434 49462 -47334 -11761 56833 -36823 -50547
254e0547J09548m3787p3383Q3725Q205q5594N6402N2265r2245j802Q5122m4863
$$ -50547 59001 15214 -58169 25556 33761 -51833 4569 56834 -35411 -37213 47909 3046
266C046m2251P3366j0224p1158N1568M1682p0748j335O1466l9287l3680O5399
$$ 3046 -39205 34161 23937 -47221 4347 46029 -24719 -26054 35412 -3875 -37555 27844
278B7844j062o7252L3986M3872n7931n323O1546l6320m3904O6555J0201o8968
$$ 27844 26782 -40470 -6484 37388 -20543 -25866 35680 -640 -44544 22011 32212 -36756
290c6756L1887M4909o3174k664O9204m1871m5236O9292K536o6690M2979L6404
$$ -36756 -4869 40040 -23134 -25798 43406 1535 -43701 25591 28127 -38563 4416 40820
302D0820o9190O888O3369m7812l1986O6006j0999n6645M7060K4957o0921J3425
$$ 40820 -28370 -21482 41887 -5925 -37911 28095 17096 -39549 7511 32468 -28453 -15028
314a5028M8740m4669j9802N6481j3097m5062L9188J9781m8187J1575M0351l6816
$$ -15028 33712 -10957 -30759 25722 12625 -32437 6751 26532 -21655 -10080 30271 -6545
326f545j9487M7870o836m1579L1104K1318m4471O844M1382l3500k3708M6671m847
$$ -6545 -26032 21838 15002 -26577 4527 25845 -18626 -11782 29600 -3900 -27608 19063 14216
339A4216m3281L2319K2129m7591Q413M3405l6543k1054M9280j0324m1242L7548
$$ 14216 -29065 3254 25383 -22208 -13795 29610 -6933 -27987 21293 10969 -30273 7275
351G275J6749m7270J4945L7997l8685j2573M5372j6518l3223L7124R006m0978
$$ 7275 24024 -23246 -8301 29696 -8989 -21562 23810 7292 -25931 11193 20199 -20779
363b0779J6685K9087l4743p212L7708j6553k7734L1881Q103l5627J3645K5438
$$ -20779 -4094 24993 -9750 -16962 20746 4193 -23541 8340 16443 -19184 -5539 19899
375A9899k9649o679L5096j4805k7784L0767J0112l4568J3022K5336l0450n025
$$ 19899 -9750 -16429 18667 3862 -23922 6845 16957 -17611 -4589 20747 -9703 -14728
387a4728L6799j7248k7339L2075O739l2971J6435K0101l2206J85L3667j9486k2273
$$ -14728 22071 4823 -22516 9559 16298 -16673 -238 19863 -12343 -12158 21509 2023 -20250
400b0250K8562K101k5984J6358J3616k7401J579K7539j4273j8578K1355M359k0979
$$ -20250 8312 10413 -15571 787 14403 -12998 -11419 16120 1847 -16731 4624 8983 -11996
413a1996J1179J5292k2871l529K7914r999k2402K2006P845k6553J1868J9666k8327
$$ -11996 -817 14475 -8396 -11925 15989 5990 -16412 5594 13439 -13114 -1246 18420 -9907
426i907k371L2932j8451k2960L1346J146l0002K1358J2059l3810J1758K9995k9785
$$ -9907 -12278 20654 2203 -20757 10589 11735 -18267 3091 15150 -18660 -6902 23093 -6692
439f692j2358L1480r045j6940K4112l901k6460K0035J8536k2339n031J3398n525
$$ -6692 -19050 12430 3385 -13555 10557 6656 -19804 231 18767 -3572 -8603 4795 -730
452g30j177J1964n680j4815M750J6092j367j5189P19R144o817K903J3063j8887
$$ -730 -1907 10057 4377 -10438 -5688 10404 9037 -6152 -5433 3711 -3106 -203 12860 -6027
466f027j3712K9855L477k7703J2727J0217k4432J5172K2163l3998m676L4895j5897
$$ -6027 -19739 10116 13593 -14110 -1383 8834 -15598 -426 21737 -12261 -16937 17958 2061
479B061j5973K8016j2023k0305L2010o10l2618K1654J3866k8347J1418J6146k8062
$$ 2061 -13912 14104 2081 -18224 13786 13176 -19442 2212 16078 -12269 -851 15295 -12767
492a2767O318K6261k4956j0768K6400p983j2328J6870o462j4061J7757N575j4901
$$ -12767 -6449 19812 -5144 -15912 10488 2505 -9823 7047 585 -13476 4281 9856 -5045
505e045m16L575K791N980q003m847Q126l676L614J2196k1405j0045L1535k599
$$ -5045 -5461 -1886 905 6885 -1118 -5965 2161 -1515 2099 14295 -7110 -17155 14380 11781
519A1781k4357J7598r01k3339L0457J3129m5707O222L4325k3720k337K5772l2129
$$ 11781 -12576 5022 4121 -19218 11239 24368 -21339 -15117 19208 -4512 -6849 18923 -13206
532a3206j1253M7879r307l4690K1672L041j9142K7331M601l7145J1133K3945j5488
$$ -13206 -24459 23420 14113 -20577 1095 4136 -15006 12325 16926 -20219 -9086 14859 -629
545f29K040Q094k1893M890K3385j3411r562J1171o652k004J3430o494q345O348
$$ -629 1411 9505 -12388 -7498 15887 2476 -7086 4085 -2567 -4571 8859 2365 -5980 368
559C68j792j24M247o484M285N180j6318N792K0117j8619p554K3515j7020j4944
$$ 368 -1424 -1548 2699 -3785 500 5680 -10638 -4846 15271 -3348 -10902 12613 -4407 -19351
573a9351L9770l730m2813K3359K2975l1327J1053K3107l9470o185M5268r931k6604
$$ -19351 20419 16689 -26124 -2765 20210 -11117 -64 23043 -16427 -22612 22656 12725 -13879
586a3879J6647l330j3085K5446M007k9485K105J4841k925M768O94j5440P62J3824
$$ -13879 2768 -562 -13647 11799 15806 -13679 -11574 3267 342 5110 5804 -9636 -8874 4950
600D950J517m241n702l014P320K595k313M311o244p975J3755L788j5376P164P631
$$ 4950 6467 2226 -3476 -6490 830 3425 1112 5423 -821 -8796 4959 8747 -6629 535 8166
615H166j7390L645J8108j2434o554J3090j0197p107J9928k773j6358Q501J250
$$ 8166 -9224 -5579 12529 95 -6459 6631 -3566 -10673 9255 6482 -9876 -1375 -125
628a25p175J6607J460k4163N432J6705r301M16R441j6895n854K4205K969j8412
$$ -125 -7300 9307 10767 -13396 -7964 8741 -560 -144 9297 -7598 -13452 10753 13722 -4690
642d690k63O073m094M213P769q002j1420O329J2579k968r708J970J385m464O609
$$ -4690 -4953 1120 -2974 1239 9008 1006 -10414 -4085 8494 5526 -4182 -2212 -827 -5291 1318
657A318O013j1149l930R834K66k559M346n464n300R068P38o166O377m14r812Q262
$$ 1318 7331 -3818 -7748 2086 2352 -207 4139 -1325 -6625 2443 3181 -2985 3392 2978 -6834 1428
673A428Q177j2272k029J0512o388n804J1155J02j1338M298Q271o541m380N796
$$ 1428 9605 -2667 -4696 5816 -572 -6376 4779 4881 -6457 -2159 6112 -429 -4809 987
687I87p9m941K820L955m717j777O669L98n988J588J937k827M398J460q438K226
$$ 987 908 -4033 -1213 2742 -1975 -3752 2917 3315 -2673 -1085 852 -1975 2423 3883 -4555 -2329
703b329Q265m915j482O262r457m928J5957n6j4975N716O504r922N185J0487j3562
$$ -2329 5936 1021 -461 5801 -3656 -8584 7373 7317 -7658 -1942 4562 -5360 -175 10312 -3250
718c250q051J2795K368n828L691j594o873N576P891k913n881k287Q87N166M089
$$ -3250 -11301 1494 3862 -1966 1725 131 -6742 -1166 6725 3812 -2069 -4356 -3469 1697 5786
733E786k254o047k885N503O302j998m302m222l289Q143J0031r028r941O606J741
$$ 5786 3532 -2515 -5400 103 6405 4407 105 -4117 -7406 737 10768 1740 -8201 -1595 146
748A46j738R979m563j8181P494J6280o704m811M655q445p22J6280k017j4139K572
$$ 146 -1592 8387 3824 -14357 -6863 9417 2713 -2098 2557 -5888 -6610 9670 7653 -6486 -3914
763c914L950j191P315j85j1432J540P800k493J80J321p300r40Q504N98m610M79
$$ -3914 36 -1155 6160 5975 -5457 -3917 3883 1390 1570 2891 -4409 -5349 3155 3753 -857 -378
779c78r8k324J701L491o74m806j153M945R15j971L167j153p837M761Q239o292
$$ -378 -476 -2800 -1099 2392 1718 -3088 -4241 704 1619 -352 2815 1662 -6175 -1414 6825 533
795E33l815N423l406j660J0117k641j0786N028M663n743L602K950r738J168R914
$$ 533 -3282 2141 -1265 -2925 7192 4551 -6235 -1207 3456 -2287 1315 4265 -5473 -4305 5609
810E609m319m618N076l053l707P148P29o555K478L553l564L69L414j864k182J570
$$ 5609 1290 -3328 1748 -1305 -5012 2136 2865 -3690 -1212 2341 -1223 -854 2560 696 -1486 84
826H4K40p96J192J678j387k842J524L235j804j980J188k741l70O614j131o939
$$ 84 324 -472 720 2398 1011 -1831 -307 2928 1124 -856 332 -2409 -2779 3835 2704 -4235
842d235K776K828l429L035K552q462L53Q786k986l545M609k509l895P265J122
$$ -4235 -1459 1369 -2060 975 3527 -4935 -4582 4204 1218 -2327 2282 -227 -4122 3143 4265
857D265p651K302L699l825J337L822m147k074M134r56k321K099j00k202O52J247
$$ 4265 -3386 -1084 2615 -1210 127 3949 -198 -2272 1862 906 -1415 684 584 -1618 -966 281
873B81M29p33q37O12q12q55L159J61m628K284L503l401P24L634n366j230P125
$$ 281 710 -23 -860 -248 -1060 -1915 1244 1405 -3223 -939 2564 -837 -113 3521 -1845 -3075 4050
890D050k640m526N642p67n261N957J785p721K699M234o524J374N821n622j982
$$ 4050 1410 -3116 2526 1759 -3502 2455 4240 -3481 -782 3452 -3072 -1698 4123 -1499 -3481
905c481O076k921k808N590j647m748L889J502k819K256L21l086J691J959j208
$$ -3481 2595 -326 -3134 2456 809 -3939 -50 1452 -1367 889 1210 -1876 -185 1774 566
920E66L39j187j338L395p7k294J515m45k968M823L44o350K861L381n605K584L906
$$ 566 905 -282 -1620 1775 1698 -596 919 474 -2494 2329 2673 -3677 -816 2565 -3040 -456 3450
937C450p034N41P812n654m010Q574l342n379Q153o83p668O875K978q354K910N054
$$ 3450 -3584 -3043 4769 -885 -4895 3679 337 -5042 3111 2428 -5240 1635 4613 -3741 -831 4223
953D223o098J104M959o052o41O520l164k740L316k517p02M679k872l045L722j012
$$ 4223 -1875 -771 4188 -1864 -2505 4015 851 -1889 1427 -1090 -1792 2887 15 -3030 692 -320
969c20p75L878l911l089O236o36l802M134j588m371P242J209q257L684L684o124
$$ -320 -1095 2783 -1128 -4217 2019 1383 -2419 1715 127 -4244 2998 4207 -4050 -366 3318 -2806
985b806L763M014q791J260Q230n906k505O408n151k637Q592l433o584P133K71
$$ -2806 957 4971 -3820 -2560 5670 -236 -2741 3667 -1484 -4121 4471 1038 -5546 1587 1858
1000A858n932N491P32o805M617L351o372K268L927m983R65L724m534Q85M508m270
$$ 1858 -4074 1417 2149 -4656 -39 3312 -3060 -792 3135 -1848 -883 2841 -1693 -808 3700 -570
1016e70j384M311k969K53M221n205k223O537j506l395L782k833l415P513K18p390
$$ -570 -1954 2357 -612 -359 3862 -1343 -3566 2971 1465 -1930 1852 -981 -4396 3117 3335 -4055
1032d055K779K335l511M147J487p819J857O181l042m50J869m866J377O766l956
$$ -4055 -1276 1059 -2452 1695 3182 -4637 -2780 3401 359 -91 1778 -3088 -1711 5055 1099
1047A099l596L690k000m40O112l696n892N388J771m029K978K06o020L562M578
$$ 1099 -2497 1193 -807 -1247 4865 1169 -4723 665 2436 -1593 1385 1591 -4429 -867 3711
1062C711m672j044K608k168J32L403j653j944J578k64M65J284j623j76Q64j379
$$ 3711 -961 -2005 603 -1565 -1433 1970 317 -1627 -49 -313 152 1436 -187 -363 501 -878
1078h78J272K589l315j699L299q87j204L522k004m671L967L007l707nJ248l215
$$ -878 394 2983 -332 -2031 1268 381 -823 2699 695 -3976 -9 2998 -709 -714 534 -2681
1094b681J340M822k976l617J944J223K95J734j712l302J836K995M2j060j893q34
$$ -2681 -1341 3481 505 -3112 -1168 55 350 2084 372 -2930 -1094 1901 1943 883 -1010 -1844
1110a844K064K541r53k341j009P80J767R60j209k239n14K076J480r28j471q89
$$ -1844 220 2761 1808 -533 -1542 -762 1005 1965 756 -1483 -1997 79 1559 631 -840 -1729
1126a729J56J968J470j768k008O39J142R47Q16j542j737P31K129Q28j164j524
$$ -1729 -1573 395 1865 97 -1911 -1272 -130 817 1633 91 -1646 -915 1214 2042 878 -646
1142f46j37N95J328R39j393k768J086L116j262j029M67k070l04M012k19l806Q12
$$ -646 -783 -188 1140 2079 686 -2082 -996 2120 858 -171 296 -1774 -2078 1934 1715 -2091 -1279
1159a279J153r92K208J014m243K50L222j076O5J330k945l87L832n75k003J269
$$ -1279 -126 -1118 1090 2104 -2139 -1889 1333 257 322 1652 -1293 -1680 2152 1577 -426 843
1175H43j395j107L524K03l327O49O39q57J907L53l107M47J598p81J205l82k721
$$ 843 -552 -1659 1865 2068 -1259 -610 29 -828 1079 1432 -1675 -1228 370 -411 794 412 -2309
1192b309J329K498j897K99P69k464J252L520k900j871K668o05o44K964k530k753
$$ -2309 -980 1518 -379 -80 689 -1775 -523 2997 97 -1774 894 289 -355 2609 79 -2674
1208b674L786N34k317J690r51l265L972K323n057j3L177k470J282K569l272k127
$$ -2674 1112 1646 -671 1019 68 -3197 775 3098 -1959 -1972 1205 -1265 17 2586 -686 -2813
1224b813L755M83k012J571j965q44K937L5j208R12j421l62K931m80k652J206J53
$$ -2813 942 1425 -587 984 -981 -1825 1112 1147 -61 851 -570 -932 1999 1519 -1133 73 226
1241B26j644K407Q19l396Q61J211j992K350J245m279J84L338k103N63K691m070
$$ 226 -1418 989 1808 -1588 -727 484 -1508 842 2087 -2192 -2008 1330 -773 -210 2481 -1589
1257a589j924N329K86l000J502p70k455L789K361l718j189P03K82K516k2l561
$$ -1589 -3513 1816 2102 -898 604 -166 -2621 1168 3529 -189 -1378 -675 -393 2123 2101 -1460
1273a460RJ306m8J861N6m494O35L701j400m49J094k577l80L506k93j508P33j373
$$ -1460 -1451 -145 -193 1668 1724 -2770 -2135 1566 166 -283 811 -1766 -2146 1360 1067 -441 292 -1081
1291a081k49L060o69j802J546q73j626L386R58l549K97J199j645J868J742l350
$$ -1081 -1330 1730 1061 -741 805 -68 -1694 1692 2650 -899 -602 597 -1048 820 2562 -788
1307g88j435K092J21P98O11l058q55L047L09m92L91k563p16L882P91k339j95o09
$$ -788 -2223 -131 -10 788 1399 -1659 -2514 533 842 350 741 -1822 -2538 1344 2135 -204 -399 -1008
1325a008k52L086K32k447j91K77K7K431m58l470J029J516j396J284R61l197l40
$$ -1008 -1260 1826 2058 -389 -580 -303 -276 2155 1697 -1773 -744 772 -624 660 1621 -1576 -1916
1342a916K914o82r16J482j950j073K819K07j160N80j049p44K682K76k175Q79k69
$$ -1916 998 316 -600 882 -1068 -2141 678 885 -275 305 -744 -1488 1194 1470 -705 174 -95
1359i5j124K562P43k971J29J273r68R17J163k547l12J792p88J51J167k029n43
$$ -95 -1219 1343 2086 -885 -756 517 -451 466 1629 -918 -1230 562 -226 -75 1092 -937 -1480
1376a480K172o72r14J772j409j425K665o4j397J519m90k049K403J002k283R44
$$ -1480 692 20 -894 878 -531 -1956 709 645 -752 767 277 -1772 631 1633 -650 294
1392B94N72k093J430K211k637p72J706j279K07K293k290j233J885l29o56J841
$$ 294 866 -1227 203 2414 -223 -995 711 -568 -361 1932 -358 -1591 294 -35 -691 1150
1408A150j444j740K407J66j458J561k32k062K005J089k192J139O27k137R60K083
$$ 1150 -294 -2034 373 539 -919 642 410 -1652 353 1442 -750 389 1016 -1121 -161 1922
1424A922j877l61J447j890n2K744j507j793J914j008n07K545j151k468J868L84
$$ 1922 45 -316 1131 -759 -811 1933 426 -1367 547 -461 -968 1577 426 -2042 -174 210
1440B10j018J389k14k568K008J648k025Q30O44k439J201K456k269l90J949j805
$$ 210 -808 581 367 -2201 -193 1455 -570 260 904 -1535 -334 2122 -147 -537 1412 -393
1456c93m66K496j163j501J749m30j269J817j38j787J165p0j159J890L31k654R94
$$ -393 -859 1637 474 -1027 722 292 -977 840 702 -1085 80 10 -1149 741 1072 -1582 -588
1473e88Q07j228J414Q45k933O49K389j077j22R44k195j37L080q21j921J329o51
$$ -588 219 -1009 405 1250 -1683 -1034 1355 278 156 1100 -1095 -1232 1848 1027 -894 435 -216
1490b16o03K414m35k864Q81J517j108P21L95k172L59K001q79o55O80q62K72J382
$$ -216 -819 1595 1160 -1704 -823 694 -414 307 702 -1470 -1111 890 11 -644 36 -826 -554 828
1508H28q09n19Q28n39j05J376o73j022J124N9q94J083N1j358O87M59q98O53K40
$$ 828 19 -500 328 -211 -316 1060 387 -635 489 548 -346 737 788 -570 117 576 -322 331 571
1527E71j484L83J019p29j77P12r40j55J455n06j106P12J95n27J070Q1j223J68
$$ 571 -913 -530 489 -240 -417 295 -645 -800 655 149 -957 -245 -50 -577 493 574 -649 -481
1545d81J258l53m53K64n43N39P04j51j250M4O16J41K22o68q17N01O64J99n60n42
$$ -481 777 424 -29 235 -308 231 935 784 -466 -422 194 335 557 -111 -928 -427 237 436 -124 -666
1565f66k10Q76N74m54n01j11L27M85N33j060l42N63N02k53N24o75q36P72J111
$$ -666 -876 0 574 120 -381 -492 -165 320 853 -207 -549 14 516 263 787 112 -724 48 1159
1584A159r25m15N69q36M8J090k60j094L42K32n0N02k13r62M67K64j4O18n52j117
$$ 1159 234 -181 388 -448 -400 690 430 -664 -322 -90 -140 362 149 -813 -346 -82 -96 522 -30 -1147
1604a147Q96R93q48K57M72j492L98K257j189j444J308k52p47J782l27k363R42
$$ -1147 -251 742 -106 151 623 -869 -471 1786 597 -847 461 209 -538 1244 917 -1446 -504
1621e04J205r60M12k09j306Q73J152o09j19j72r89J236J036j193J2L60j199J115
$$ -504 701 -259 153 -56 -1362 -489 663 54 -65 -237 -1226 10 1046 -147 -135 225 -974 141
1639A41J934k116r65J790o84m24J924j166k322K048J309j898N98J75j826J149
$$ 141 2075 -41 -1006 784 100 -324 1600 434 -1888 160 1469 -429 169 344 -1482 -333
1655c33J850j646o98O72o84R27J200j713r30J540m12M71J136j961r90K297M12
$$ -333 1517 -129 -827 -155 -839 88 1288 -425 -1355 185 -227 244 1380 -581 -1571 726 1138
1672A138j464J268p94j544K209Q58k059J05M34r26J205J049k264k6R96p76O82
$$ 1138 -326 942 148 -1396 813 1671 -388 -283 151 -775 430 1479 -785 -811 185 -591 91
1689I1J094k272k54K088q32k40J376j839r76K990r9j808J245m77j601K565Q53
$$ 91 1185 -1087 -1341 747 -85 -325 1051 -788 -1764 1226 1127 -681 564 87 -1514 1051 1904
1706A904k578j5J193r82R96R99k435n1J417k88J41L53k156J38K471q38q62P18
$$ 1904 -674 -689 504 -478 518 1517 -918 -969 448 160 301 654 -1502 -1364 1107 269 -593 125
1724A25j392K6K792q38k171J512J12q25J941q9k610J083J215o36K35J96j735P76
$$ 125 -1267 -1241 1551 713 -1458 54 166 -659 1282 1193 -1417 -334 881 245 480 676 -1059 -283
1742b83J410j064j90K97j191Q58J417j664m66J250j010j27J943j128j553J771
$$ -283 1127 63 -127 170 -1021 -163 1254 -410 -876 374 -636 -763 1180 52 -1501 270
1758B70J8j069J414j2j886J064J208r94K83K44j482Q15J365j122k14J90q17P54
$$ 270 288 -781 633 621 -1265 -201 1007 13 296 540 -942 -127 1238 116 -98 92 -725 29
1776B9J282j336r62Q75k93K19J382j451j361J787Q9n62Q63r20j082J693R52j367
$$ 29 1311 -25 -987 -112 -405 -186 1196 -255 -1616 171 260 -302 561 -359 -1441 252 1204 -163
1794a63K23o2p74J427O90j511m3N52p06P85Q41j684m28J297l54m02J130j274p45
$$ -163 60 -2 -776 651 1341 -170 -213 339 -367 418 1259 -425 -853 444 90 -312 818 -456 -1201
1813a201J510K60j048O23n44p87J405M45q58lJ16p66J334M96j192RM11m18P86
$$ -1201 309 569 -479 144 -400 -1187 218 663 -195 -198 -82 -848 486 982 -210 -201 210 -208 578
1832E78N11j459j85J017m64K64N18j447k58J504l95o09R33r18p79J706J21j259
$$ 578 1089 -370 -555 462 -2 262 780 -667 -925 579 184 -425 508 -410 -1189 517 638 -621
1850f21N09J49o96Q93N80j092KN70o91P27O06j219N7P87o02L5Q93j068n32J250
$$ -621 -112 37 -659 234 814 -278 -276 294 -397 330 936 -283 -226 561 -41 -6 887 -181 -713 537
1870E37l76l59O19n91p03R61O9o61P20k39q74R57L52j048O75L02r28N66P34q82
$$ 537 161 -198 421 -170 -873 88 157 -504 216 -23 -897 60 412 -636 39 341 -587 -21 713 -169
1890a69p7Q65q84J27J054p44m92P62o11j46J094n22j023P84m4l67Q03j26j253
$$ -169 -246 619 -265 -138 916 172 -320 442 -169 -315 779 257 -766 18 -26 -393 410 284 -969
1909i69N73P26n96K76L24j002L82R26m78k47J85n10L81Q55p19l36O23m77M2P62
$$ -969 -396 330 -266 10 334 -668 -286 640 162 -85 100 -410 -29 826 107 -229 394 -83 -41 721
1929G21n70o71O92l3o87P43P6q18L86K36l68M14J87q61L9N77j26K16K24r61j4
$$ 721 151 -520 172 139 -548 195 271 -547 -161 75 -293 121 308 -553 -514 63 -63 153 377 -584 -598
1950e98J096L1m86J77k87k44Q69J00p63k1m4J53L82m8o54J9K47J76K4M8n28q0
$$ -598 498 529 43 220 -67 -311 558 658 -105 -126 -170 -17 365 317 -337 -318 -71 105 129 177 -351 -431
1972d31M16p2L4L66o34J6M19P0O7Mk66l51N53J98p1q8k16k09L88K98k03m63j16
$$ -431 -15 -87 -53 313 -321 -305 114 184 251 255 -11 -362 191 389 318 230 14 -195 193 491 288 -175 -291
1995b91J45L03K88m63o34K44K95M42l07l52l49L97N79q6l23m37M07J81L82Q7o56
$$ -291 -146 157 445 -18 -652 -408 -113 329 22 -330 -679 -282 297 211 -112 -549 -142 39 421 508 -148
2016a48k5L80n6J50l7l56j67N43j65l2J03k91l58M95K05m60K72l11l59N50L35
$$ -148 -173 207 151 301 264 -92 -259 284 119 87 190 -101 -459 36 241 -219 53 -258 -617 -67 268
2037B68m24k39K70j05L97K23l40l59L46l9K78L19o18n53Q21J02l52M48m34m73
$$ 268 -156 -395 -125 -230 167 390 50 -309 37 -2 276 595 -23 -576 245 347 -5 443 9 -464
2057d64N94K47n41N1l3j23M23J05p99J94L71m37L94M84p27j53R96p56k18R80l01
$$ -464 130 377 -164 -113 -146 -269 154 259 -540 -346 25 -412 -18 466 -261 -414 582 -174 -392 588 287
2078B87o90O73O2m86M31J1m56K26L34o27L12K08p10L93K29n82K99J96o59M6P82
$$ 287 -403 270 332 -154 277 288 -168 58 392 -235 77 285 -425 -32 197 -385 -86 110 -549 -503 279
2099B79n98o5P93o00k65Q62j98n81O69l20m39R18P8p31M88J06p95P31M09j185
$$ 279 -319 -384 409 -191 -456 406 208 -373 296 -24 -463 455 533 -198 290 396 -399 332 741 -444
2119d44M1N32m67M27N43j262k38J171m06m6Q05j179m64J287O6q34N41Q4q02J102
$$ -444 -403 129 -338 89 632 -630 -868 303 -103 -149 656 -523 -987 300 366 -468 73 157 -645 457
2139D57K38j010J06L52l68N55N46j243J63N53n18N78K50j625K56J395q15j93P88
$$ 457 695 -315 -209 143 -225 330 876 -367 -204 349 -169 409 659 -966 -710 685 -130 -323 465
2158D65j202q1J553j87j268M50o6k48J074J05j189M98M13l93Q02o2j384L65J122
$$ 465 -737 -818 735 548 -720 -270 -336 -584 490 595 -594 -96 317 -76 726 664 -720 -355 767
2177G67o51JN30j387L90J110o17o80N84m49l9J143m81j178R12R1k65O19l38q28
$$ 767 116 117 647 -740 -350 760 143 -537 47 -402 -441 702 221 -957 -45 46 -219 400 62 -766
2197g66N87L90k65M23j38q71Q04P73j000O8O57j051K65J261j019o51R62m91l03
$$ -766 -179 211 -54 369 231 -640 164 937 -63 5 662 -389 -124 1137 118 -533 429 -62 -365
2216c65J070o83r85P25L96k04K90m64m73O49O06o21J60k81n57J070M81r97K6K51
$$ -365 705 22 -963 -238 158 -46 244 -220 -693 -44 562 -59 101 -180 -737 333 814 -183 -157 94
2236I4l45M87R20j204m30J003m11n8N53p26q06J177L35o76jl43j69Q84K72q12
$$ 94 -251 236 1156 -48 -478 525 114 56 609 -117 -923 254 589 -87 -88 -431 -600 284 556 -256
2256b56ON3m45R93K17r98K7O28j79J42M34r76j34R30j93j02K07n43l73R53j7m48
$$ -256 -250 -197 -642 351 568 -430 -403 225 46 188 622 -354 -488 442 249 147 354 -189 -562 391 374 -74
2278g4O2l64q0R59j30q52L03j42m1O06M7q19O0O97k11K48N2p36R6P27j17j77J55
$$ -74 -12 -376 -456 503 373 -479 -176 -318 -359 247 294 -525 -465 232 21 269 321 -415 -319 408 291 114 269
2301B69m92J19P15k53n34L09k52k05P10j69n96L23j63L7N56k93n00J12M98j93
$$ 269 -223 -104 611 358 -176 133 -119 -324 386 217 -379 -56 -219 -182 374 81 -419 -307 191 -2
2321bP6J76m72J08M99k64k45J82j70P6O96o95r1J61NQ6K41l09n63N21J71k38K02
$$ -2 74 250 -222 -114 385 121 -124 58 -112 -36 660 -35 -126 35 40 126 367 58 -505 16 187 -51 151
2344A51m09l29L18M27l95n3Q6k05L32K55m57J99L46k71J91K07k42k07K79p1N9
$$ 151 -258 -587 -269 158 -237 -290 -204 -409 -77 178 -279 -80 266 -5 186 393 151 -56 223 152 211
2365B11P0m27q8M19j41j70J36j75M4M01k47k60J21J21k54K78J78n36J4L13n9L9
$$ 211 281 -146 -234 185 44 -126 10 -165 -121 280 33 -227 -106 15 -239 39 217 -319 -305 8 -51 -12
2387a2K11k26q0L70J58l25J92l60J18J86q8j08K11k80j68M35j13l55J49J28k06
$$ -12 199 -27 -107 263 421 96 288 -72 46 232 144 36 247 -33 -201 234 121 -234 -85 43 -163
2408a63J46K0l21L36J6q2M0Q5l50L04J86j85j24J50n6m2Q9j51K63J43k34J27j34
$$ -163 -17 3 -318 18 34 -48 -8 77 -273 31 217 32 -92 58 2 -40 49 -102 161 304 70 197 63
2431F3k35J24K89j78l35K42j86n5K58p4j82K85L9l01K24O7k68K62J01j84J76J14
$$ 63 -172 -48 241 63 -272 -30 -216 -271 -13 -87 -269 16 55 -246 -22 45 -223 39 140 -44 132 246
2453B46l06K04Mj25J65rk11l1L13k56J33l5k22J97M7k2j59%j98J32J80r7j27N9
$$ 246 -60 144 148 23 188 179 -32 -63 250 -6 127 92 -130 67 114 92 -67 -67 -265 -133 47 -50 -177 -118
2477a18M5q9L02M1l09K18M7OJ65k35l4R1M7j42O4M3k77J89J92l58J93k1k22J69
$$ -118 -73 -162 140 181 -128 90 137 143 308 73 39 130 177 35 99 142 -135 54 246 -112 81 60 -162 7
2501GJ21l16J6L37l85j8M17j35l59L10q3j08N02R8o47M89k07O4K00j01m30K42
$$ 7 128 -188 -172 165 -220 -238 179 44 -315 -5 -88 -196 306 404 -243 246 39 103 303 202 -228 14
2523A4K34m8j29N6l29M0M79l49K5pl78P7N91k44l63K71k4j60M11M8n14L15K50
$$ 14 248 200 71 127 -202 -162 317 -32 -7 -14 -392 -315 276 32 -331 -60 -84 -244 167 215 -299 16 266
2546B66k96J57J5k65j02N88n28L59m1m87J96M33l35q6K94l75j79O75j69m15M20
$$ 266 -30 127 142 -123 -225 363 -165 194 153 -334 -138 295 -40 -126 168 -207 -386 289 120 -295 125
2567A25l48p7N25j82l98L61K0k60N11p9n29M06M72n88Q1J99l29J7N11l66k10J51
$$ 125 -223 -300 225 43 -355 6 26 -234 277 198 -331 75 547 -41 40 239 -90 -73 438 72 -138 13
2589A3J5l43M46k56j73L48j51r9N69m01l25L15p5j97M80R5m77L34J72k97j5M08
$$ 13 28 -315 131 -125 -298 50 -101 -200 369 -32 -357 -42 -117 -314 166 261 -216 118 290 -7 -22 386
2611C86n01P4M56m42q1N89n73j53N99m97p6L40j65l29M39k2k32J55Q5l10J83J97
$$ 386 -115 -41 415 -27 -108 481 -92 -245 354 -143 -219 121 -44 -373 66 44 -188 -33 52 -258 -75 122
2633A22l58L0K28l41L70L05m24j40L66l06K21L35m17k00N08k42L8K71l47k68K73
$$ 122 -236 -206 22 -319 51 356 -68 -208 158 -148 73 408 -9 -209 299 57 95 366 19 -249 24
2654B4L1k09L59j15p26O85J70m80J76J44m32L34M81m59j74J18J57j9L15k59k83
$$ 24 55 -154 205 90 -636 49 219 -261 -85 59 -373 -39 442 -17 -191 -73 84 65 380 121 -162
2675a62K91q0K28j37k90k76O48O3n00L45k19n12P50K82o89J48J66k92L61R7l84
$$ -162 129 49 277 140 -150 -426 222 285 -215 130 -89 -601 149 431 -258 -110 56 -236 125 222 -162
2696a62m3K01j12J20L35m25j42L67j08O0K50l86j32M77ql73K99l45j09M61J3m80
$$ -162 -205 -4 -116 4 339 -86 -228 139 31 91 341 -45 -177 300 292 -81 218 -127 -236 225 238 -242
2718b42J58J0j8Q0J83l49r7J28J80n6Mp0p4K55j27K27p1m17J48M63j3k43J33j61
$$ -242 -84 -74 -92 -12 171 -178 -275 -147 33 -23 -19 -89 -163 92 -35 192 121 -296 -148 315 302 59 192 31
2742C1l06N96r7l26R4K7j29J57J0l87J00R9J93j52M3j74K75L9j75K48k67p3J13
$$ 31 -275 321 224 -102 -8 19 -110 47 57 -330 -230 -131 62 -90 -47 -221 54 93 -82 166 -101 -174 -61
2765f1L26l58k4K65j43J78O6k87j17K20K02j76j16j20o9J70L13l13N3j62n2K99
$$ -61 265 -93 -117 148 5 183 249 -38 -155 65 267 91 -25 -145 -214 -44 269 -44 9 -153 -205 94
2787I4R8m26J71o9j13L89O3k81K6L04j28Q1o3k70K3J09K54j75p7j85J61J60M0
$$ 94 192 -234 -63 -132 -245 144 207 -74 -48 256 128 209 146 -124 -101 8 262 87 10 -175 -14 146 186
2810A86k15P0l17J25J05J99k53j0J02r4J66j4m87K77L03j89O9J47j30j86L44j0
$$ 186 -29 41 -276 -151 -46 153 -100 -110 -8 -102 64 50 -437 -160 143 -46 23 170 40 -146 198 188
2832A88j25l7j64J67O8q6q8O0l11M00L24l76j98M2j83K73J56k81j05L24J54m25
$$ 188 63 26 -138 29 97 11 -77 -17 -328 72 396 20 -178 -136 -319 -46 110 -171 -276 48 202 -223
2854b23J84l7j39L51J23j66j77J15m8J59Q1k20j16J47J8p5J72k90NK46j58L5J95
$$ -223 -39 -76 -215 136 259 93 -84 31 -17 142 223 3 -113 34 52 -23 149 -141 -136 110 -48 -13 182
2877A82k65r0K87n4k45J54n4j78L35J76l47O3J56j12R4N5q4j76K21n8j3J03k73
$$ 182 -83 -173 114 60 -185 -31 -85 -263 72 248 -99 -36 120 8 102 157 73 -103 118 60 47 150 -123
2900a23J41J3K1r8L4nk45K95O8l01K41j18j66L81j77k23K09%k2J88Q6n27K81K63
$$ -123 18 31 52 -46 -12 -17 -262 33 101 -200 41 -77 -243 138 -39 -262 -53 -53 -75 113 199 -328 -47 216
2924B16p6m0o0j72K07N9o8j53L72l19n8L22k60p1J56k73O9K60k60p9P8J92j51
$$ 216 140 100 40 -132 75 134 66 -87 285 -34 -92 230 -30 -101 55 -218 -149 111 -149 -228 -150 42 -109
2947a09M9K25l75K92K11m01J92%l22K90J29Lm5m8j48l1M98m27k09R5Q7l1K37k27
$$ -109 -60 165 -210 82 293 -108 84 84 -238 52 181 184 139 91 -57 -88 410 -17 -226 -131 -44 -75 162 -65
2971f5k43J39J94k74L23K5l55J39J87j17J60Q1l73K55K80l75n8J80q0M6L48k56
$$ -65 -308 -169 25 -249 74 99 -256 -117 70 -47 113 194 -179 76 356 -19 -77 103 23 69 417 161
2993A61l04K87k90J05J85k14j32K55J7l36L57n1m04K88J72m08L59P7k57J30P5
$$ 161 -143 144 -146 -41 144 -70 -202 53 70 -266 91 40 -364 -76 96 -312 47 124 -133 -3 72
3014G2o1r1J80k04RM29k68o5M1r2N6K45k11l44L33o8P9M9p2l22L06N7j90J25J39
$$ 72 11 -80 100 -104 -95 334 66 1 42 -50 6 251 40 -304 29 -39 40 89 17 -305 1 58 -132 -7 132
3039A32l57L07Jk09J20J04j79QL37l84J28O2lj91L27k95j01M73l87L1J25R2l00
$$ 132 -225 82 83 -126 -6 98 -81 -73 264 -120 8 70 67 -124 203 -92 -193 280 -107 -76 49 141 -159
3062a59J76J94k23O7J34m21L87j43k67J24K21k86J45J75k76J08J91j31K2K55j65
$$ -159 17 211 -12 55 189 -232 155 12 -255 -131 90 -196 -51 124 -152 -44 147 16 38 293 128
3083A28j32J76j02l39N21k09k02L05J50m65J22N4j70K60m4r7j12K57k64R7L41
$$ 128 -4 172 70 -269 252 43 -159 146 296 -169 -47 7 -163 97 53 -44 -156 101 -163 -66 275
3104B75m01K09K3k17K04J45k56N1K94k32q4L03k33j46M53l91mR8l9j88K00j3k14
$$ 275 -126 83 106 -111 93 238 -18 33 327 95 11 314 81 -65 388 -3 -7 91 52 -136 64 51 -163
3127a63O2O7j50L6K12k07jL38j47j67K49r5l0J29m3n2J24j10j24K8Q3l5K30j82
$$ -163 -101 -34 -184 -148 64 -143 -144 194 47 -120 129 34 4 133 90 38 162 52 -72 -44 39 4 234 52
3151E2p0O5L7n9k6m4j06Q2O7j4K2ok29K12J23j75O7J27k09k2K78m4j58r1J72j39
$$ 52 -18 47 84 25 -1 -45 -151 -69 -2 -16 6 0 -229 -17 106 -69 -2 125 -84 -106 172 128 -30 -121 51 -88
3177h8J80j1j8m3N0J24j03j16L2p9j2O2J65o6k61R1K07r0j60Q3j80J62M14n27
$$ -88 92 81 63 20 70 194 91 -25 7 -72 -84 -22 143 77 -184 -93 114 24 -136 -53 -233 -71 343 -184
3201a84J10J46k2j7m3k8J27J26p9J3L0k27r6J21P2m3J50k94j7K61Qk33L1l3K5
$$ -184 -74 72 50 33 -10 -38 89 215 136 149 179 -48 -144 -23 49 6 156 -138 -155 106 114 -119 -88 -121 -96
3226i6L2K94l65o2N8K6K99q1j21p6J34J1J67m1j42j01L24k21K1K01l78j21L09
$$ -96 -64 230 -135 -197 -139 -113 186 105 -16 -92 42 53 220 179 37 -64 260 39 60 261 -117 -238 71
3249G1J07j78l3J21k92K93M6k27l6o9L7J45k0r0N3k9N1J47J6j97J84M9j07J5O4
$$ 71 178 0 -33 88 -204 89 135 -92 -128 -197 -160 -15 -35 -125 -72 -101 -50 97 113 -84 100 149 42 57 121
3274A21j78J51kl9q3O6J31k40K19l7l71K90K4k02N2m2K06j79Q1r4J45q5M0K12
$$ 121 -57 94 92 53 -30 36 167 -73 146 109 -262 28 52 -150 -98 -140 66 -113 -32 -126 19 -66 -26 186
3298A86Rl66K32J14k14N0J77N5j55Q4j15J39k27j37J28J28Nj04o2P5KQ8j36j38
$$ 186 195 -171 61 175 -39 11 188 243 88 172 57 196 -31 -168 -40 88 93 -11 -73 2 4 92 -44 -182
3322a82K73j03j4P1J04m52L21K92l68J73q3O7j56J22J15j90K5j04J54N6nj90Q4
$$ -182 91 -12 -26 45 149 -303 18 310 -58 115 32 99 -57 65 180 -10 15 -89 65 121 116 -74 10
3345A0k20J20K64k09k11J41J03k09L52p4j57J16J18j20J26P4l53o6M96j24k08
$$ 10 -210 -90 174 -35 -246 -105 -2 -211 141 67 -90 26 144 24 150 224 -129 -195 301 177 -31
3366c1J36j07O3K7K15m30J33N0j58K71q7k67O6j0O4K21j10j68M9K58l17N9J26
$$ -31 105 -2 61 88 303 -127 6 56 -102 169 82 -185 -119 -129 -65 156 46 -122 -73 185 -132 -73 53
3389E3l3o9K95k65j8J64j75%L61l07p8L8J15k17L09j13k30K67Mo9O2j91OK7L0
$$ 53 20 -49 246 -19 -37 127 -48 -48 313 6 -72 -34 81 -136 173 60 -170 97 101 32 94 -97 -91 -64 -34
3414c4j22N7M9q4J51R1j91J09K00j91j31K19k43N8K26j21M8J08j80j84K28o5j05
$$ -34 -156 -99 -50 -134 17 108 -83 26 226 35 -96 123 -120 -62 164 43 91 199 19 -165 63 -2 -107
3437a07P2J53k41J02rk5n4K80j49L6j7L1k00L71k80j18L60j22K5p3J3jM3lm5J38
$$ -107 -35 118 -123 -21 -30 -55 -109 171 22 58 41 72 -128 243 -37 -155 205 83 108 35 48 47 90 87 42 180
3463A80j36r0k6J54j96K06j5k85Q6oK5R7Q3k10N4Q1k8j53J77k14K91Q7l21J56
$$ 180 44 -46 -72 82 -114 92 77 -208 -122 -128 -103 -6 77 -133 -79 2 -26 -179 -2 -216 75 162 -159 -3
3487cL6kq8K70k1l58L44o8k01R8M0p0L3p4n9K28l3k52Q8R1r5L3Mk8J1K35j14k00
$$ -3 33 31 -57 213 192 -166 178 110 -91 7 47 -23 10 -64 -123 105 72 -180 -92 -1 -96 -63 -59 -87 -76 159 45 -155
3515a55K92j45j04L65j38j37rr2J53J71l1k16r5K2l3M33k04j65L4K05l69K17N2
$$ -155 137 -8 -112 253 115 -22 -31 -123 30 201 170 -46 -141 -119 -152 281 77 -88 -54 151 -218 -1 51
3538E1j47N6J0L9j26K01j38j18L03j14m3J63k03j3K02j48r3K02j22lJ08Pj15%
$$ 51 -96 -40 -30 9 -117 84 -54 -172 131 17 -26 137 -66 -79 123 -25 -118 84 -38 -41 67 74 -41 -41
3562d1Q3r2j5R6j75J38Jj66r9K04Jq9M1rL4N0K28l11K53j15o4P9Mj41J45j00k9
$$ -41 42 -50 -65 31 -144 -6 -5 -171 -270 -66 -65 -154 -113 -122 -88 -38 190 -121 132 17 -47 32 36 -105 40 -60 -89
3589h9K8JRK3l6jO9J56l38J65M5r8k04L03r6r4R0J37q5J38M6k24J56o7q7R7j17
$$ -89 -61 -60 -51 -28 -64 -65 4 160 -178 -13 32 -66 -270 33 -63 -157 -67 70 -15 123 169 -55 101 34 -53 44 -73
3616g3rJ27O5j2r4k7r4J61p6M4j1o3L2O9n7n1J18j22J77k48J36J7pq1J32k50K10
$$ -73 -82 45 110 98 4 -23 -117 44 -32 12 1 -62 -30 39 -18 -69 49 -73 104 -144 -8 9 2 -79 53 -197 13
3643A3J3J71k2k98J41P1p7K06j70j00J38L2Nj99J16j37p6J75J7J7j58J15M8o9
$$ 13 26 197 175 -123 18 89 12 218 48 -52 86 118 123 -76 40 -97 -173 2 19 36 -122 -7 41 -28
3667b8J11j09K3J9O3q9J49k27k4L19m1j32j09j2J19nP7o1j08q6R0N5J16o5o9l6
$$ -28 83 -26 -3 16 79 -10 139 -88 -112 207 166 34 -75 -87 32 27 104 43 -65 -151 -61 -6 110 45 -24 -60
3693f0J03n2k4J7j56Q8M0rj0NN8k4J6P7j66K9K50j16l0K2J09k3j51o7P9j05J08
$$ -60 43 -9 -33 -16 -172 -84 -44 -53 -63 -58 0 -24 -8 69 -97 -68 182 66 36 58 167 144 -7 -74 5 -100 8
3720Hj11j55K17Q5o8r8J99r3J77j40j28P7O9q8j50K66J10q4K6K1k96L32k58N2
$$ 8 -103 -258 -41 44 -24 -122 77 -16 161 21 -107 -30 39 -49 -199 67 177 93 119 140 -156 176 -82 -30
3744c0r3K14k83J98JN6j24J12j42M6KP3R7j66n5J56m1Mj08j13K37rJ83k08j9J90
$$ -30 -123 91 -192 6 7 63 -61 51 -91 -45 -43 30 127 -39 -94 62 21 25 -83 -196 41 32 215 7 -12 178
3770A78q2r8K07j98Q0L1j68R6p7K4jpN3m8J4N7m7J38k71j24J28K89k05q9K66j81
$$ 178 96 -2 205 7 87 118 -50 46 -31 -7 -8 -15 38 -10 4 61 14 152 -119 -243 -115 174 -31 -120 146 -35
3796c5Q2J26j31N5j06M7j29K14or1n7R6j51L0O5j58J58p6m6R5J19k37n8L39k61
$$ -35 47 173 42 97 -9 38 -91 123 117 26 -31 65 -86 -56 9 -149 9 -67 -113 -18 101 -136 -194 145 -116
3821a16J7M5lJ53L8j40N1q9n6rK40p2m5j3J96j05o5M7l9q5N0P8J2j72n7M5Q2r
$$ -116 -99 -54 -57 96 134 -6 45 -44 -100 -109 131 59 14 1 197 92 27 74 35 -50 0 78 90 -82 -139 -94 -12 -21
3849b1j00J16Q8k4J3k26J13q3J65n3l0k1P5J05j24L6K19l39m0K25L3r1J81l28
$$ -21 -121 -5 83 59 72 -154 -41 -124 41 -12 -42 -63 12 117 -7 29 248 -91 -131 94 127 36 217 -111
3873a11o0K64k2m4j56J74O6j24mj16O3Q9pp9Q9k18K58k5j46K57p7l5r2J96j06
$$ -111 -171 93 71 27 -129 45 111 -13 -17 -133 -70 19 12 -67 22 -196 62 37 -109 148 71 36 -56 140 34
3898C4Lj14lJ58j32J64k72J24q4R6J15j10o5O1O3p3pm8JQJ82o5j34R9R4k00J15
$$ 34 37 -77 -80 78 -54 110 -162 -38 -122 -26 89 -21 -86 -25 38 -35 -42 -90 -89 -81 101 36 -98 1 95 -105 10
3925A0J9r5J61r1n7J16J4j69J26O8j26j47J85p1M8J20k48K19j62J54p7M5p9j70
$$ 10 29 -66 95 4 -53 63 77 -92 34 102 -24 -171 14 -57 -9 111 -137 82 -80 74 -3 42 -37 -207
3949b07K19k31J49J47j16P7j46j6J62J0j48J47J49m6k19K59k73l3K45n3M5l4j37
$$ -207 12 -219 -70 77 -39 38 -108 -124 38 48 -100 47 196 150 -69 190 -83 -116 129 76 121 87 -50
3972e0J02j63J43K3k7l8n9R1R7j01O3q8j02K34q9R1J6j13l5K33l09N8J18k26L39
$$ -50 52 -111 32 55 28 -10 -69 22 119 18 81 -7 -109 125 36 127 143 30 -5 228 -81 -23 95 -131 208
3997B08k53q8O7L6m5J37L2j07j01J39o0R8j37n0J27p3rP0J0O3j45j0P8j4r2K9
$$ 208 -45 -133 -66 -30 -75 62 94 -13 -114 25 -35 63 -74 -124 3 -70 -79 -9 1 64 -81 -91 -13 -27 -119 -90
4023i0K67l2o1m0Q2q4N2r1j08J08p4R1p9k3R1J03q7m7m8O4L0j04K37k09K5l1M2
$$ -90 177 145 84 44 126 42 94 3 -105 3 -71 20 -59 -82 9 112 25 -22 -70 -6 24 -80 157 -52 -27 -58 -16
4050a6Q7LO8j08J06J1j46r6J74j83L02l21J78r1m6K35j66o7Q6J01m4j09j25K50
$$ -16 71 74 142 34 140 151 5 -91 83 -100 202 -119 59 -32 -78 157 -9 -76 10 111 67 -42 -167 83
4074H3j2J0m3R4k4l3J17j62o6K39Kj72l5M8q7j79K50n4r2J03j3j7j19K35r3J50
$$ 83 71 81 38 132 108 75 192 30 -36 203 205 33 -2 46 -41 -220 30 -24 -116 -13 -26 -43 -162 73 -20 130
4100A30M9j85N4J43k06p4J01n9j6j37J86o2oJ56qp2J84j93J17M4n3n1N4J5j43
$$ 130 179 -6 48 191 -15 -89 12 -47 -63 -200 -14 -76 -82 74 66 -6 178 -15 102 146 93 42 96 111 -32
4125c2N7k8j01O8j25J64o1K4j30Q2P5K1j6Q0j1L3j51O4J7L3j37R0J27j88J74J37
$$ -32 25 -3 -104 -36 -161 3 -58 -34 -164 -82 -7 14 -2 78 67 100 -51 13 30 63 -74 16 143 -45 129 266
4151B66k76J12Rk1n8o7R9lj17J35j19k3M5J4p2M1O7j29Q6k4L8J14j86J09N3j68
$$ 266 -10 102 111 90 32 -35 64 61 -56 79 -40 -63 -18 -4 -76 -35 32 -97 -11 -35 3 117 -69 40 93 -75
4177g5M9N5r7K4K39k40j21K83j98o2J91Kl6n2J4R8J7m5l4l5j10Q2J21Op7R7o9
$$ -75 -26 29 -68 -44 195 -45 -166 117 -81 -143 48 50 14 -38 -24 74 91 46 12 -23 -133 -51 70 76 -1 96 27
4204B7r3J64j2m5k9M0l4K2J20o5n3J4j9O0J28l12K6J2l4K7J1K1m0J36j09r8L5
$$ 27 -66 98 86 41 12 52 18 40 160 95 42 56 37 97 225 -87 -61 -49 -83 -56 -45 -24 -64 72 -37 -135 -100
4231a00K31l31J24M1o5o5L22j96l6J95m3k4k1J82j84k01K47k06J71J68j96R5j4
$$ -100 131 -200 -76 -35 -100 -165 157 -39 -75 120 77 53 32 214 30 -171 76 -130 41 209 13 108 94
4254I4p1o0L3o2J13k4j15P1O7k16J7J93K4K1k0O2P4k27J05k4j74J78j31R6P0k38
$$ 94 23 -37 -4 -66 47 23 -92 -21 46 -170 -153 40 64 85 65 127 201 -26 79 55 -119 59 -72 24 94 -144
4280a44K57J8L1n1r6O2j87J50j56Q0L9j39N1j30L30k14J1qNK17j51k8K42q6j1
$$ -144 113 131 162 111 15 77 -110 40 -116 -36 3 -136 -85 -215 115 -99 -88 -96 -91 126 -25 -53 189 103 92
4305I2q9O7j40r1K40j33J32j38L27k16l84J23o7J53L91l41K23k32j50J47K60j47
$$ 92 3 70 -70 -161 79 -54 78 -60 267 51 -333 -210 -277 -124 267 -74 149 -83 -233 -86 174 27
4327B7j7j4j8J07o6j6M6P6j48K56j79J6M7q8l3Q7j50r4K34j16J17m0n7MK0K37
$$ 27 10 -4 -22 85 19 3 49 125 -23 233 54 70 117 29 -4 83 -67 -161 73 -43 74 34 -23 -19 1 238
4353B38k68J2j56J75p4J90l8k09R9J21j67J55m9Lj47K17J53l57L14L3l79J96j62
$$ 238 -30 -18 -174 1 -73 117 79 -130 -31 90 -77 78 29 32 -115 102 255 -102 212 245 -134 62 -100
4376a00J30K80m77K53q7m5o2P0oK6j84K76k46K84k98J20J5n45M26P28m54r1L04
$$ -100 30 310 -167 86 -1 -46 -108 -38 -44 -18 -202 74 -172 112 -186 -66 -51 -596 -170 558 104 13 317
4399C17J42l01l0q1j27K2J39m2j1J9k10J57l8m7P6n3J4J09O6J6j14j43P4n8R9
$$ 317 459 158 128 47 -80 -58 81 39 28 47 -163 -6 -44 -91 -15 -68 -54 55 121 137 23 -120 -46 -104 -5
4424eJ5O2m4q7o8J25j43P3o2K42j45P9L1k03J05q9M7L7J41m5j30M2R5o2p3J35
$$ -5 10 72 28 -59 -127 -2 -145 -72 -134 108 -37 42 73 -130 -25 -114 -67 -30 111 66 -64 -22 73 11 -62 73
4450G3j57J14o4k9o7R4K81k14Oj90N0J09Q8m8Q2k11J00n2K1k0O6j21J98n3M7j11
$$ 73 -84 30 -34 -63 -130 -36 245 31 37 -153 -103 6 94 46 128 -83 17 -35 -14 -34 32 -89 109 56 103 -8
4476hj11l2j6J21j2J77k27J53j20L02k75pK37J7j75r8R3PL5o2m6J6o5N1J13k21
$$ -8 -119 -151 -167 -46 -58 119 -108 45 -75 227 -48 -55 182 199 24 -74 19 26 61 -1 -47 -31 -96 -45 68 -153
4502a53K39j97Q7l3J13J02j47k6Q2j98K06j88M1O9l5N2o1J27Or2j4q2J74j52q
$$ -153 86 -111 -24 -57 56 158 11 -15 67 -131 75 -113 -72 -3 -38 14 -47 80 86 -6 -20 -102 72 -80 -88
4527h8J47O7m2j61K14j31j37K9N9Oq6K2k0J19J11j13r3N3k1J52j62O5R2Nq1q3
$$ -88 59 126 84 -77 137 6 -131 -102 -43 -37 -123 -101 -121 -2 109 -4 -97 -44 -65 87 -75 -10 82 87 6 -77
4553g7Q1M1oP6n9q4J08o9k3p0P4p6K50l02J11P0k21P6N2K8n3K9L0O0P7j68J21
$$ -77 4 45 39 115 56 -28 80 11 -12 -82 -8 -84 166 -136 -25 45 -176 -100 -48 -20 -73 -44 -14 46 123 -45 76
4580G6p0J09k9o2l7J25l6J11j52p1J44p0M4j70J13r8k8R3k6J93j35q6M1j02K41
$$ 76 6 115 86 24 -13 112 76 187 35 -36 108 38 82 -88 25 -73 -101 -8 -34 159 24 -62 -21 -123 118
4605A18j33J51j84J7J5l9N1K2j32J27J9L0QN3p2m1Op0J18J2N6j10j2j0j6o8L7
$$ 118 -15 136 -48 -31 -16 -55 -4 18 -114 13 32 62 70 123 51 10 16 -54 64 76 132 22 10 0 -16 -84 -47
4632d7J50j89R9n0P8j8j73P8J99j50J35n0k2p9J44p9k2J74k93P8K05n7k00J72
$$ -47 103 -86 13 -37 41 23 -150 -72 127 -23 112 62 40 -39 105 26 4 178 -115 -37 168 111 -89 83
4656H3o1Pk6P6j58l5P7%L0Pq4K41k13j73J46K13k24J45m8j47N6J79j39J23r3j
$$ 83 22 29 3 79 -79 -114 -37 -37 -7 0 -84 157 -56 -229 -83 130 -94 51 3 -144 -88 91 -48 75 -18 -19
4682a9O2K4k2RNj30m2J37J90l69P2J55k17K36n1j58J40N9K2j63N1j02J81mk6l7
$$ -19 43 67 45 54 59 -71 -113 24 214 -155 -83 72 -145 91 40 -118 22 81 103 -60 -9 -111 70 66 40 3
4708Co4J74j07j2K50j3j49m2J29j60L0q7J40j37k9o3J78j13Q8K2r1J75j53o0O1
$$ 3 -61 113 6 -6 244 231 82 40 169 9 39 -48 92 -45 -74 -137 41 -72 16 38 -53 122 -31 -91 -30
4733c0J24j54p2QJ86p0R1K22l35J82mj40j16K24j75J38k20P1J45r6n0q4J32j44
$$ -30 94 -60 -132 -124 62 -8 83 305 -30 152 148 8 -108 116 -59 79 -141 -70 75 -21 -71 -155 -23 -167
4757a67k0K37l25K26O4j69M3J95j15k1J72j04o4P2q6N4o1J54o3k27L27k2j8j38
$$ -167 -187 50 -275 -49 15 -154 -111 84 -31 -52 120 16 -48 24 -62 -8 -69 85 22 -205 122 100 82 -56
4781e6j18K36M8q1j10R1j6l8k7o1L6J22N2j59k0J68j07J88j30k6O0k3km4j00Q3
$$ -56 -174 62 110 29 -81 10 -6 -44 -71 -132 -96 26 78 -81 -101 67 -40 148 18 -8 52 29 27 -17 -117 -34
4807c4M8p3q2P4J38j09mq2P4K1n5J36m2p1N8k0o7J10rJ08j67Q5J32j67j8P3J41
$$ -34 14 -59 -141 -67 71 -38 -42 -124 -50 -29 -84 52 10 -61 -3 -23 -90 20 11 119 -48 37 169 2 -16 57 198
4834A98j31j04Q9o9n3K72l01j1J23k8O1j35J74o1L0r4o7n1J64M1k28J29m0J53
$$ 198 67 -37 52 -17 -70 202 -99 -110 13 -15 46 -89 85 24 54 -40 -107 -158 6 47 -181 -52 -92 61
4858F1j07k8k6J67P6l9j39N3OM1j78J33N2M3j8j21j42J49N9j11L7O0q3P1j3O5
$$ 61 -46 -74 -100 67 143 104 -35 18 24 65 -113 20 72 115 97 -24 -166 -17 42 -69 -32 28 -55 16 3 68
4884F8k5j3k00K02Qk39J97L7M0j06L7O1LLj02J13n4rp3K62j23j80J70M4j73O0
$$ 68 43 30 -170 32 40 -199 -2 35 75 -31 6 67 70 73 -29 84 30 21 -52 210 87 -93 77 121 -52 8
4910HJ2N0l1rk32P5J11N1m7K19k17N9m2j5j51M2J71n6j00R2l5L8L3J8L6r4j3j29
$$ 8 20 70 39 30 -202 -127 -16 35 -12 207 -10 49 7 -8 -159 -117 54 -2 -102 -10 -45 -7 26 44 80 -14 -27 -156
4938a56J34J01k27J82j46J10K4L2Rr4K80j86j09J76m2j10K14j53r6J61k7kj2q4
$$ -156 -22 79 -148 34 -112 -2 22 54 63 -31 249 63 -46 130 88 -22 192 39 -57 104 77 75 63 -21
4962b1o8J26M0q7K9J11mj43J7L1j03mK51j74m5J68k49m9J69j3k6N9k6R7j64R5
$$ -21 -89 37 77 -10 19 130 126 -17 0 31 -72 -76 175 1 -44 124 -125 -174 -5 -18 -44 15 -11 86 -78 17
4988A7K6j6J9K6k24P6R7M1P9j02K2l2K7N1r9j28J05P9Kn4l9pL7p5K45j96r5l9
$$ 17 43 27 46 72 -152 -76 21 62 141 39 61 29 56 107 8 -120 -15 64 66 12 -27 -34 3 -72 173 -23 -118 -157
5016a57J10J40n7l7L0Oql9L0J40k39J57k05K17j84Q8N6j2o5K2J21q8K7j12L7k3
$$ -157 -47 93 36 -1 29 35 27 -12 18 158 -81 76 -129 88 -96 -8 48 36 -29 -7 114 26 53 -59 -22 -45
5042d5j38J62J49j64L8p7P0n1J35n2N6m0j01Q3Kj72K71q8j09Q1L5n6k1J62j69
$$ -45 -183 -21 128 -36 2 -75 -5 -56 79 27 83 43 -58 25 27 -145 126 38 -71 10 45 -11 -32 130 -39
5067c9J8O6r6l5J2rL1q1lO6L4J23oO5l7J3o3o5Q5q7Q7k23L08j16l3q7P5j29K44
$$ -39 -21 45 -51 -86 -74 -83 -52 -133 -136 -70 -36 87 81 146 109 122 59 -6 79 -8 79 -144 164 48 15 -72 3 -126 118
5096A18J7j92K68k28p4P8J24j05l4j18m2J26o2J52j21J93j72QK42o5m1o8qL0p6
$$ 118 135 -57 211 -17 -91 -13 111 6 -28 -146 -188 -62 -124 28 -93 100 -72 -64 178 113 72 4 -4 26 -50
5121e0M5J30j13J60j72K4p0p3K30j41L2lj5M3O5o7j02N3N3o2m7J39k61K62Jo4
$$ -50 -5 125 12 172 0 24 -46 -119 111 -30 2 -1 -16 27 92 25 -77 -24 29 -33 -80 59 -202 60 61 -3
5147cn9N9Ml2L8Nk8J06j11p2J1k8K32j71J69j07O7j6n3j77J25j07M2J13Q5j88
$$ -3 -62 -3 1 -31 7 12 -16 90 -21 -93 -82 -110 122 -49 120 13 80 64 11 -166 -41 -148 -106 7 92 -96
5173i6K14j16q2N8O6j7J41j16p6j69m8N13l78K69m85O03l41L3L0k31j98M43k5
$$ -96 118 2 -80 -22 44 27 168 52 -24 -193 -241 272 -106 163 -322 281 -60 -27 3 -228 -426 17 -8
5196hj77o8J89K4Q0J94l19J46R9K09m20m2K55j71n6j21K2R9J98q3K06j67P1l34
$$ -8 -185 -253 -64 -40 40 234 -85 61 160 369 -51 -93 162 -9 -65 -186 -164 -65 133 50 256 89 160 -174
5220a74K59l98Q6K02J51k85J36N4J55l85J53k16L46k15j83K98j71n7K00M9o2K15
$$ -174 85 -313 -227 -25 126 -159 -23 31 186 -199 -46 -262 84 -131 -314 -16 -187 -244 -44 5 -57 158
5242A58j23M0J7n7K7k18J37JR2l2O8j73J78j33q5Q7L4n9q2L9R8j05l2L4j2K07
$$ 158 35 75 92 35 62 -156 -19 -18 74 42 110 -63 115 -18 -103 -16 18 -41 -123 -84 14 -91 -123 -89 -101 106
5268A06j28j9j8L8p9K48Q2r0j72O0J09j36N9R9r7j33J09RJ07j07p7j71K09j23
$$ 106 -22 -41 -59 -21 -100 148 230 140 -32 28 137 1 60 159 62 -71 38 47 154 47 -30 -201 8 -115
5292a15p8J83r9r1L61l48J52O7L3Jj76J83k94l1M55j39Q1m1l5m3j07J59j87J47
$$ -115 -193 -10 -109 -200 161 -187 -35 32 65 66 -110 73 -221 -252 203 64 145 104 69 26 -81 78 -109 38
5316C8j06J70k16J06j18K59j88J2m8K15j90q4J93j01k31L94j61L1K12j87J82L4
$$ 38 -68 102 -114 -8 -126 133 -55 -43 -91 124 -66 -150 43 -58 -289 105 -56 -25 187 0 182 216
5338B16K6l99L82K7l41K11j39l79L95M5J86j62j11o7R5r0l5P9K3m6J68k02K72
$$ 216 242 -157 225 252 -89 122 -17 -396 -1 44 230 68 -43 -110 -15 -105 -140 -61 -38 -84 84 -118 154
5361A54N4k69K45j36j99K92l2j97N9j8K0P3L2l9L0p8j83L19k9k62R8j17Q2K11
$$ 154 208 -61 184 48 -151 141 109 -88 -29 -47 -27 46 78 39 69 -9 -192 127 98 -164 -66 -183 -101 110
5385A10j48N4pp8M8Jm3n5J9L5K1K2q7J57j0J9j9k7k6K03k56MJ25J47j18j11R1
$$ 110 -38 16 9 -69 -21 -20 -63 -118 -99 -64 -43 -21 -108 49 39 58 39 12 -14 189 -67 -63 62 209 91 -20 71
5412G1Kq9L3k6q1O3J05j21j15K79o1l6K4k5Ln5n8K5R0m1m5J75p2J4n4m4m2J39
$$ 71 73 -16 17 -9 -90 -27 78 -43 -158 121 60 24 48 23 26 -29 -87 -62 28 -13 -58 117 45 59 5 -39 -81 58
5440E8n1j15K76j35k68K69M4K3r3p5O6M4n2R4j20p7J13J00j40O6j12P2o8K13j92
$$ 58 7 -108 168 33 -235 34 78 101 8 -67 -1 43 -9 85 -35 -112 1 101 -39 27 -85 -13 -81 132 -60
5465f0O5O7n3j86K02Nr5j49K7K48j3j31N5J05j41M0r0P3%kN9N5r4O6o6L8J03r1
$$ -60 5 72 19 -167 35 40 -55 -204 -177 71 58 -73 -18 87 -54 -14 -104 -31 -31 -33 26 81 -13 53 -13 25 128 37
5493C7m0J42r2ml1J02k46O9l7K44k36Q1O0L4q9L6j10J24n2j04J47J61q6j63K7
$$ 37 -3 139 47 43 12 114 -132 -63 -100 144 -92 -11 49 83 -6 30 -80 44 -8 -112 35 196 110 -53 -26
5518b6j01J40j4j1j54M9R3J7lJ02r2j28K34q1j12R9j46J84j19J44k18N8P7K36
$$ -26 -127 13 -1 -12 -166 -117 -24 -7 -10 92 0 -128 106 25 -87 12 -134 50 -69 75 -143 -85 -8 228
5542B28k39o7R3J2P4o4O7k13NK66j12J3j34J39J3j2n1J26n0Op3o1J46k02m2K10
$$ 228 -11 -78 15 27 101 37 104 -109 -104 162 50 63 -71 68 81 69 18 144 94 100 27 -34 112 -90 -132 78
5568G8m5j45Q3n0KJ68P1j42J9j60L3J7J69j05Q5j62J63m7o4J31l4N6k42J62J6
$$ 78 33 -112 -29 -79 -77 91 162 20 39 -121 -88 -71 98 -7 78 -84 79 32 -32 99 65 121 -121 41 57
5593E7n4k07J68j23J56P1q5n1P6j6l8k8ON6rK21l29J79J04n7l0M4j43qJ15m6K3
$$ 57 3 -204 -36 -159 -3 68 -17 -68 8 -8 -46 -74 -68 -12 -21 200 -129 50 154 97 67 111 -32 -40 75 29 52
5620E2j34J13j0Kj6k4j0m5l5Q1N3RK6j36%mR9j51M6P3l5K12j48j7N7j72J20J2
$$ 52 -82 31 21 23 7 -17 -27 -72 -107 -26 27 36 62 -74 -74 -78 21 -130 -84 -11 -46 166 18 1 58 -114 6 18
5648A8r0J1N1J77p6K3J6r1l4P1j65N6K63k40J00j34Q6J2j8j4p1K1O3J19k6j98
$$ 18 -72 -61 -10 167 91 114 130 39 5 76 -89 -33 230 -10 90 -44 42 54 36 22 -49 -28 35 154 128 -70
5674g0K6j3K50k71K21j55J18k08J99q6q6J31j51l4n9K65r8j7M1P1j00o9J17J70
$$ -70 -44 -57 193 -78 143 -12 106 -102 97 11 -75 56 -95 -129 -188 77 -21 -38 3 74 -26 -95 22 192
5698A92k07j18J48L8R8j53J4J51k85n4J61%K1J10L1Kj65K3K2j06M3J76k23Q6K5
$$ 192 -15 -133 15 53 151 -2 12 163 -122 -176 -15 -15 6 116 147 149 -16 7 29 -77 -34 142 -81 5 30
5723C0r6J55o4n5n2O5o0K06l30J69J19J41j29j96J53j1M0j00P7l7j6O4M4L9o5
$$ 30 -66 89 25 -30 -82 -17 -77 129 -201 -32 87 228 99 -97 56 45 85 -15 62 25 9 73 117 156 91
5748I1Pj84Q1m3m8Q6LQ8j34p5N1J37k26R3Q1k17K26j96K35o8j59K39J12j7P8k45
$$ 91 98 -86 -5 -48 -96 -10 -7 81 -53 -128 -77 60 -166 -73 8 -209 17 -179 56 -12 -171 68 180 163 241 -4
5774dm6N7L8J02j50J7P9j29N8q6J34l9r0R5m4J2j08K4J85j15J8k8J74k83J41R0
$$ -4 -50 7 45 147 -3 14 93 -36 22 -64 70 31 -59 36 -8 4 -104 -80 105 -10 8 -20 154 -129 12 102
5800A02LJ25j88r5R4k60L01o1j14Q9r2J53k2O2j19J56j78J04j81Q8q5N4J6j4Q
$$ 102 105 230 42 -53 41 -219 82 21 -93 -4 -96 57 35 97 -22 134 -44 60 -121 -33 -118 -64 -48 -62 -54
5825e4P6k9n0R3K40k23k8m9j02P1K06k02R0k14K38r8j4o2J69l0L0l7j9p6P5j3
$$ -54 22 -7 -57 36 276 53 25 -24 -126 -55 151 -51 39 -175 63 -35 -49 -111 58 28 58 21 2 -74 1 -12
5851a2R8m4r5J5O6j57J41r6J54N7j80N4n9R5j7J38N2n5r4Nk06J11K0J51q8K1j44
$$ -12 86 42 -53 -38 28 -129 12 -84 70 127 -53 1 -58 37 20 158 210 155 61 66 -140 -29 -9 142 54 75 -69
5878f9J06j89K09K7k5r3M0K01k03o5O7L2j73Q4J20J41l20J35p2p0J98q7j12J94
$$ -69 37 -152 57 84 59 -34 6 207 4 -61 6 38 -135 -51 69 210 -110 25 -47 -117 81 -6 -118 76
$$ [...]
8191f6
##END NTUPLES=NMR FID
##END=
