##TITLE=1H_Pr BuDA
 200.13MHz, DMSO,
 8 sc
 
 17.1.2025
##JCAMPDX= 6.0         $$ Bruker NMR JCAMP-DX V2.0
##DATA TYPE= NMR FID
##DATA CLASS= NTUPLES
##ORIGIN= UXNMR, Bruker Analytische Messtechnik GmbH
##OWNER= pz
$$ XWIN-NMR		Version 3.5
$$ Fri Jan 17 14:52:47 2025 Russian Standard Time (UT+4h)  she@DPX200
##.OBSERVE FREQUENCY= 200.1313
##.OBSERVE NUCLEUS= ^1H
##.DELAY= (6, 6)
##.ACQUISITION MODE= SIMULTANEOUS
##.ACQUISITION SCHEME= undefined
##.AVERAGES= 8
##.DIGITISER RES= 18
##SPECTROMETER/DATA SYSTEM= spect
##.PULSE SEQUENCE= zg30
##.SOLVENT NAME= DMSO
##.SHIFT REFERENCE= (INTERNAL, DMSO, 0, 14.3821)
##AUDIT TRAIL= $$ (NUMBER, WHEN, WHO, WHERE, WHAT)
$$ ##TITLE= Audit trail, XWIN-NMR		Version 3.5
$$ ##JCAMPDX= 5.01
$$ ##ORIGIN= Bruker BioSpin GmbH
$$ ##OWNER= she
$$ F:/spectra/data/she/nmr/H-C/1/audita.txt
$$ ##AUDIT TRAIL=  $$ (NUMBER, WHEN, WHO, WHERE, WHAT)
(   1,<2025-01-17 14:51:59.31 +0400>,<she>,<DPX200>,
      <created by zg, POWCHK disabled, PULCHK disabled
       configuration hash MD5:
       00 E9 B6 7A A2 85 ED C7 34 08 36 98 17 FE 4E 26
       data hash MD5: 16K
       ED 00 B6 DB 3C 60 43 08 DA FE 9A 9D 86 ED 77 D7>)
$$ ##END=
$$ 
$$ hash MD5
$$ 38 98 FA AB A0 84 38 7B 1E 3E 52 18 D9 9F A0 2C
##$RELAX= 
##$RELAX= 
##$RELAX= 
##$RELAX= 
##$RELAX= 
##$RELAX= 
$$ Bruker specific parameters
$$ --------------------------
##$DU= <F:/spectra>
##$EXPNO= 1
##$NAME= <H-C>
##$PROCNO= 1
##$TYPE= <nmr>
##$USER= <she>
##$AMP= (0..31)
100 100 100 100 100 100 100 100 100 100 100 100 100 100 100 100 100 100 
100 100 100 100 100 100 100 100 100 100 100 100 100 100 
##$AQSEQ= 0
##$AQ_mod= 1
##$AUNM= <au_zg>
##$AUTOPOS= <>
##$BF1= 200.13
##$BF2= 200.13
##$BF3= 200.13
##$BF4= 200.13
##$BF5= 200.13
##$BF6= 200.13
##$BF7= 200.13
##$BF8= 200.13
##$BYTORDA= 1
##$CFDGTYP= 0
##$CFRGTYP= 5
##$CHEMSTR= <none>
##$CNST= (0..31)
1 1 145 1 1 1 1 1 1 1 1 1 1 1 1 1 1 1 1 1 1 1 1 1 1 1 1 1 1 1 1 1 
##$CPDPRG= <>
##$CPDPRG1= <>
##$CPDPRG2= <>
##$CPDPRG3= <>
##$CPDPRG4= <mlev>
##$CPDPRG5= <mlev>
##$CPDPRG6= <mlev>
##$CPDPRG7= <mlev>
##$CPDPRG8= <mlev>
##$CPDPRGB= <>
##$CPDPRGT= <>
##$D= (0..31)
0 0.7 0 0 0 0 0 0 0 0 0 0.03 0 0 0 0 0 0 0 0 0 0 0 0 0 0 0 0 0 0 0 0 
##$DATE= 1737111118
##$DBL= (0..7)
120 120 120 120 120 120 120 120 
##$DBP= (0..7)
150 150 150 150 150 150 150 150 
##$DBP07= 0
##$DBPNAM0= <>
##$DBPNAM1= <>
##$DBPNAM2= <>
##$DBPNAM3= <>
##$DBPNAM4= <>
##$DBPNAM5= <>
##$DBPNAM6= <>
##$DBPNAM7= <>
##$DBPOAL= (0..7)
0.5 0.5 0.5 0.5 0.5 0.5 0.5 0.5 
##$DBPOFFS= (0..7)
0 0 0 0 0 0 0 0 
##$DE= 6
##$DECBNUC= <off>
##$DECIM= 32
##$DECNUC= <off>
##$DECSTAT= 4
##$DIGMOD= 1
##$DIGTYP= 9
##$DL= (0..7)
0 120 120 120 120 120 120 120 
##$DP= (0..7)
150 150 150 150 150 150 150 150 
##$DP07= 0
##$DPNAME0= <>
##$DPNAME1= <>
##$DPNAME2= <>
##$DPNAME3= <>
##$DPNAME4= <>
##$DPNAME5= <>
##$DPNAME6= <>
##$DPNAME7= <>
##$DPOAL= (0..7)
0.5 0.5 0.5 0.5 0.5 0.5 0.5 0.5 
##$DPOFFS= (0..7)
0 0 0 0 0 0 0 0 
##$DQDMODE= 0
##$DR= 18
##$DS= 0
##$DSLIST= <SSSSSSSSSSSSSSS>
$$ [...]
##$SUBNAM0= <"">
##$SUBNAM1= <"">
##$SUBNAM2= <"">
##$SUBNAM3= <"">
##$SUBNAM4= <"">
##$SUBNAM5= <"">
##$SUBNAM6= <"">
##$SUBNAM7= <"">
##$SUBNAM8= <"">
##$SUBNAM9= <"">
##$SW= 18.0517328524113
##$SWIBOX= (0..15)
0 0 2 0 0 0 0 0 0 0 0 0 0 0 0 0 
##$SW_h= 3612.71676300578
##$TD= 16384
##$TD0= 1
##$TE= 0
##$TE2= 300
##$TE3= 300
##$TEG= 300
##$TL= (0..7)
0 120 120 120 120 120 120 120 
##$TP= (0..7)
150 150 150 150 150 150 150 150 
##$TP07= 0
##$TPNAME0= <>
##$TPNAME1= <>
##$TPNAME2= <>
##$TPNAME3= <>
##$TPNAME4= <>
##$TPNAME5= <>
##$TPNAME6= <>
##$TPNAME7= <>
##$TPOAL= (0..7)
0.5 0.5 0.5 0.5 0.5 0.5 0.5 0.5 
##$TPOFFS= (0..7)
0 0 0 0 0 0 0 0 
##$TUNHIN= 0
##$TUNHOUT= 0
##$TUNXOUT= 0
##$USERA1= <user>
##$USERA2= <user>
##$USERA3= <user>
##$USERA4= <user>
##$USERA5= <user>
##$V9= 5
##$VALIST= <valist>
##$VCLIST= <CCCCCCCCCCCCCCC>
##$VD= 0
##$VDLIST= <DDDDDDDDDDDDDDD>
##$VPLIST= <PPPPPPPPPPPPPPP>
##$VTLIST= <TTTTTTTTTTTTTTT>
##$WBST= 1024
##$WBSW= 4
##$XGAIN= (0..3)
0 0 0 0 
##$XL= 0
##$YL= 0
##$YMAX_a= 383064
##$YMIN_a= -276700
##$ZGOPTNS= <>
##$ZL1= 120
##$ZL2= 120
##$ZL3= 120
##$ZL4= 120
##$ABSF1= 10
##$ABSF2= 0
##$ABSG= 5
##$ABSL= 3
##$ALPHA= 0
##$AQORDER= 0
##$ASSFAC= 0
##$ASSFACI= 0
##$ASSFACX= 0
##$ASSWID= 0
##$AUNMP= <proc_1d>
##$AZFE= 0.1
##$AZFW= 0.1
##$BCFW= 1
##$BC_mod= 2
##$BYTORDP= 1
##$COROFFS= 0
##$CY= -3
##$DATMOD= 1
##$DC= 2
##$DFILT= <>
##$DTYPP= 0
##$F1P= 0
##$F2P= 0
##$FCOR= 0.5
##$FTSIZE= 0
##$FT_mod= 4
##$GAMMA= 1
##$GB= 0.15
##$INTBC= 1
##$INTSCL= 1
##$ISEN= 128
##$LB= 0.25
##$LEV0= 0
##$LPBIN= 0
##$MAXI= 10000
##$MC2= 0
##$MEAN= 0
##$ME_mod= 0
##$MI= 1.114404
##$NCOEF= 0
##$NC_proc= 0
##$NLEV= 6
##$NOISF1= 3.799351
##$NOISF2= 2.8
##$NSP= 1
##$NTH_PI= 0
##$NZP= 0
##$OFFSET= 14.38212
##$PC= 1
##$PHC0= 92.61472
##$PHC1= 9.992201
##$PH_mod= 1
##$PKNL= yes
##$PPARMOD= 0
##$PSCAL= 0
##$PSIGN= 0
##$REVERSE= no
##$SF= 200.129724274929
##$SI= 16384
##$SIGF1= 3
##$SIGF2= 2
##$SINO= 400
##$SIOLD= 16384
##$SREGLST= <1H.CDCl3>
##$SSB= 0
##$STSI= 0
##$STSR= 0
##$SW_p= 3205.1282051282
##$SYMM= 0
##$S_DEV= 0
##$TDeff= 0
##$TDoff= 0
##$TI= <>
##$TILT= no
##$TM1= 0
##$TM2= 0
##$TOPLEV= 0
##$USERP1= <user>
##$USERP2= <user>
##$USERP3= <user>
##$USERP4= <user>
##$USERP5= <user>
##$WDW= 1
##$XDIM= 8192
##$YMAX_p= 0
##$YMIN_p= 0
$$ End of Bruker specific parameters
$$ ---------------------------------
##NTUPLES= NMR FID
##VAR_NAME=  TIME,          FID/REAL,        FID/IMAG
##SYMBOL=    X,             R,               I
##VAR_TYPE=  INDEPENDENT,   DEPENDENT,       DEPENDENT
##VAR_FORM=  AFFN,          ASDF,            ASDF
##VAR_DIM=   8192,          8192,            8192
##UNITS=     SECONDS,       ARBITRARY UNITS, ARBITRARY UNITS
##FACTOR=    0.0002768,     1,               1
##FIRST=     0,             0,               0
##LAST=      2.2672688,     0,               0
##MIN=       0,             -276700,         0
##MAX=       2.2672688,     383064,          0
$$ Real data points
##PAGE= N=1
##DATA TABLE= (X++(R..R)), XYDATA
$$ plain form
0 0 0 0 0 0 0 0 0 0 0 0 0 0 0 0 0 0 0 -8 7 -8 8 -8 8 -12 16 -16 18 -24 24 -31 35 -39 44 -51 58 -65 74 -82 91
39 91 -100 113 -126 141 -156 173 -190 211 -231 255 -280 310 -341 376 -415 457 -506 560 -623 693
59 693 -777 874 -994 1141 -1326 1568 -1900 2382 -3137 4425 -9491 181820 353663 304189
73 304189 142414 -51827 -183591 -240484 -204205 -89797 76971 208902 232151 126028 -34136
84 -34136 -153085 -168909 -102547 -11180 54784 89582 97959 77600 17547 -62147 -112706 -90576
96 -90576 -11483 61718 74728 37888 222 -8551 -6889 -19779 -39926 -34628 4713 44714 44907
109 44907 7082 -27907 -27661 -2045 15247 6144 -12997 -15048 4300 21009 13566 -10144 -21970
122 -21970 -6616 18353 21342 -4095 -28063 -20197 11171 28753 13015 -14425 -18957 2704 18829
$$ packed form
0@%%%%%%%%%%%%%%%%%qJ5j5J6j6J6k0K8l2L4m2M8n5O6p4Q3r5J09j23J39j56J73
39I1j91K13k39K67k97L29l63M01m42M86n35N90o51P17p91Q72r63J066j183J316
59F93j470J651j868K135k467K894l468M282n519P562j3916J91311J71843m9474
73C04189j61775j94241j31764n6893L6279J14408J66768J31931K3249j06123j60164
84c4136j18949j5824O6362R1367O5964L4798Q377k0359o0053p9694n0559K2130
96i0576P9093P3201J3010l6840l7666q773J662j2890k0147N298L9341M0001J93
109D4907l7825l4989K46K5616J7292r103j9141k051J9348J6709p443k3710j1826
122b1970J5354K4969K989k5437k3968P866L1368J7582j5738k7440m532K1661J6125
$$ plain form
135 18829 6126 -19192 -22709 2847 27775 23210 -4630 -23743 -14796 7730 15858 2141 -13391
148 -13391 -9541 10085 21334 8621 -15851 -24649 -6555 18044 20616 -770 -18610 -10548 12151
161 12151 18841 -822 -22305 -16991 9682 24804 10027 -15520 -20720 -968 17622 12405 -8727
174 -8727 -18443 -5223 14267 16270 -1052 -17083 -13184 5826 17484 7889 -11307 -16575 -1129
187 -1129 16203 13527 -6441 -18732 -7213 13860 17569 -906 -17979 -11845 9330 18374 4319
200 4319 -14456 -14333 3803 16566 8427 -9491 -14860 -1869 13128 12134 -3236 -14432 -8030 7927
214 7927 14193 3274 -11959 -12641 2557 14985 8527 -9288 -15895 -2514 14111 12723 -5077
227 -5077 -16551 -7085 11213 14651 -683 -14979 -10184 6971 14716 4095 -11209 -12537 1230
$$ packed form
135A8829j2703k5318l517K5556K4928m565k7840j9113Q947K2526Q128j3717j5532
148a3391L850J9626J1249j2713k4472q798J8094K4599K572k1386j7840Q062K2699
161A2151O690j9663k1483N314K6673J5122j4777k5547n200J9752J8590n217k1132
174h727r716J3220J9490K003j7322j6031L899J9010J1658r595j9196n268J5446
187a129J7332k676j9968j2291J1519K1073L709j8475j7073O134K1175R044j4055
200D319j8775J23J8136J2763q139j7918n369J2991J4997r94j5370j1196O402J5957
214G927O266j0919j5233o82J5198J2428o458j7815o607J3381J6625j388j7800
227e077j1474R466J8298L438j5334j4296M795J7155P745j0621j5304j328J3767
$$ plain form
240 1230 12922 8653 -5898 -13211 -4564 9641 12393 -60 -12786 -9816 5634 14563 5541 -10535
254 -10535 -13432 812 14379 9897 -7186 -14993 -3577 12304 12452 -2787 -14027 -7566 8132
267 8132 13348 2125 -11136 -10345 2754 12111 6884 -6530 -11888 -2906 9664 10368 -1659 -11907
281 -11907 -7596 6193 12507 3051 -10618 -11050 2472 12784 6713 -7923 -12431 -1235 11216
294 11216 9262 -4252 -11969 -4555 8200 10241 -185 -10019 -7300 4113 10348 3951 -7161 -9395
308 -9395 -249 9306 7503 -3527 -10401 -4286 7423 10181 53 -10330 -7614 4934 11334 3352
322 3352 -8779 -9681 1889 10962 6124 -6193 -10467 -1638 8872 8149 -2549 -9859 -5026 5754
336 5754 9316 1535 -8128 -7864 1889 9418 5431 -5504 -9829 -2069 8476 8473 -2238 -10387 -5635
$$ packed form
240A230J1692m269j4551p313Q647J4205K752j2453j2726K970J5450Q929r022j6076
254a0535k897J4244J3567m482j7083p807J1416J5881J48j5239j1240O461J5698
267H132N216j1223j3261P91J3099R357n227j3414n358Q982J2570P04j2027j0248
281a1907M311J3789O314r456j3669m32J3522J0312o071j4636m508J1196J2451
294A1216j954j3514p717P414J2755K041j0426r834K719J1413O235o397j1112k234
308i395R146R555j803j1030o874O115J1709K758j0128j0383K716J2548O400p982
322C352j2131r02J1570R073m838j2317m274Q829J0510p23j0698p310M833J0780
336E754L562p781r663K64R753P529l987j0935m325P760J0545lj0711q149M752
$$ plain form
351 -5635 6331 10312 1165 -9438 -8016 3444 10385 4260 -6886 -9208 -117 8895 6814 -3448
365 -3448 -9165 -3608 6185 8427 454 -7906 -6591 2762 8852 4095 -5649 -8425 -738 8092 6849
380 6849 -3005 -9222 -3617 6493 8366 -305 -8491 -5831 3994 8680 2373 -6700 -7246 1117 7705
395 7705 4645 -4049 -7586 -1820 5982 6355 -1111 -7169 -4441 3799 7283 1882 -5936 -6527 1149 7442
411 7442 4400 -4321 -7660 -1319 6694 6174 -2155 -7739 -3500 5066 7186 229 -6769 -5327 2737
426 2737 7207 2762 -5013 -6510 -54 6397 4945 -2550 -6849 -2856 4723 6616 230 -6517 -5178
441 -5178 2608 7291 2826 -5212 -6763 189 7037 5033 -3222 -7348 -2245 5573 6349 -681 -6775
456 -6775 -4383 3388 6837 1838 -5297 -5865 717 6272 4067 -3143 -6555 -1959 4973 5772 -650 -6297
$$ packed form
351e635J1966L981r147j0603J422J1460O941o125j1146k322R091R012k081j0262
365c448n717N557R793K242p973q360J315R353O090m757r744k776P687Q830j243
380F849r854o217N605J0110J873q671q186K660R825M686o307r073n46Q363O588
395G705l060q694l537N766P802L73p466o058K728Q240L484n401p818n91P676O293
411G442l042q721l339O341Q013n20q329n584M239Q566K120o957o998J442Q064
426B737M470m445p775j497O456O451j452p495m299L993P579J893o386o747J339
441e178P786M683m465q038j551O952O848k004q255m126N103P818P76p030o094
456f775K392P771L449m999p135n68O582N555k205p210l412M596O932P99o422n647
$$ plain form
472 -6297 -4228 3140 6571 1735 -5195 -5663 1033 6371 3707 -3564 -6218 -1098 5339 4974 -1529 -5992
488 -5992 -2921 3667 5604 672 -4999 -4371 1556 5486 2648 -3462 -5200 -519 4826 4141 -1726 -5523
504 -5523 -2414 3706 5205 98 -5144 -3951 2202 5548 1886 -4209 -4966 511 5258 3369 -2721
519 -2721 -5297 -1335 4211 4439 -840 -5063 -2979 2757 5075 1163 -4191 -4391 842 5024 3010 -2763
535 -2763 -5135 -1047 4310 4388 -1049 -5199 -2750 3116 5156 732 -4528 -4139 1317 5127 2548 -3182
551 -3182 -4881 -529 4398 3755 -1415 -4815 -2278 3075 4679 461 -4185 -3691 1432 4786 2209 -3090
567 -3090 -4543 -386 4218 3611 -1551 -4691 -1969 3171 4254 54 -4162 -3172 1747 4415 1534 -3114
583 -3114 -3874 127 3920 2812 -1710 -4105 -1355 3010 3617 -308 -3827 -2621 1781 3916 1116 -3088
$$ packed form
472f297K069P368L431m836o930m68O696N338k664p271k654N120O437l65o503m463
488e992L071O588J937m932n671O28N927L930k838o110j738M681N345o85n867l797
504e523L109O120J499n107n242J193O153L346l662o095p57N477M747j889o090
519b721k576L962N546K28n279m223K084N736K318l912n354k00N233M182k014n773
535b763k372M088N357P8n437m150K449N866K040m424n260L89N456L810k579n730
551c182j699M352M927o43n170l400K537N353J604m218m646M94N123L354k577n299
567c090j453M157M604o07n162l140K722N140J083m200m216R90M919K668k881m648
583c114p60M001L793j108m522k395K750M365O07l925l519J206M402K135k800m204
$$ plain form
599 -3088 -3377 489 3810 2317 -2042 -3831 -832 3270 3228 -831 -3852 -2006 2315 3729 447 -3315
615 -3315 -2967 1115 3829 1816 -2414 -3526 -227 3378 2819 -1250 -3728 -1633 2553 3491 135 -3391
631 -3391 -2732 1288 3671 1450 -2649 -3487 6 3388 2571 -1498 -3694 -1325 2688 3267 -122 -3351
647 -3351 -2401 1500 3569 1164 -2633 -3121 211 3241 2287 -1543 -3382 -1098 2567 3022 -266 -3218
663 -3218 -2167 1614 3347 983 -2507 -2929 385 3143 1938 -1609 -3105 -746 2446 2619 -488 -2973
679 -2973 -1726 1618 2873 511 -2506 -2394 650 2804 1478 -1688 -2702 -467 2397 2178 -720 -2660
695 -2660 -1310 1715 2576 207 -2419 -1907 930 2673 1089 -1833 -2424 32 2446 1800 -1097 -2669
711 -2669 -945 1921 2365 -139 -2453 -1648 1205 2593 751 -2044 -2218 320 2485 1528 -1346 -2568
$$ packed form
599c088k89L866L321j493m359j789K999M102m2m059l021J846M321J414l282l762
615c315L48M082K714k013m230j112L299L605n59m069k478K095M186R38l356l526
631c391O59M020K383k221m099q38L493L382q17m069k196K369M013N79l389l229
647c351R50L901K069k405l797m88L332L030r54l830j839K284L665M55l288k952
663c218J051L781J733k364l490m22L314K758j205l547j496K359L192J73l107k485
679b973J247L344J255k362l017J12L044K154j326l166j014K235K864k19k898j940
695b660J350L025Q61k369k626N12K837J743j584k922n91K456K414o46k897j572
711b669J724K866M44k504k314Q05K853J388j842k795j74K538K165r57k874j222
$$ plain form
727 -2568 -608 2007 2171 -343 -2500 -1446 1315 2507 542 -2050 -2140 442 2446 1397 -1347 -2466
743 -2466 -476 2062 2078 -526 -2445 -1281 1420 2350 403 -2025 -1926 543 2329 1233 -1385 -2291 -361
760 -361 2008 1810 -612 -2258 -1136 1381 2141 245 -1972 -1714 657 2127 929 -1403 -1967 -140
776 -140 1857 1514 -733 -2010 -788 1338 1866 58 -1782 -1382 777 1967 702 -1454 -1713 98
792 98 1760 1258 -858 -1828 -555 1409 1592 -243 -1795 -1089 913 1747 386 -1475 -1514 275 1699
809 1699 992 -1018 -1726 -298 1435 1498 -435 -1765 -848 1011 1653 210 -1568 -1367 528 1796 850
826 850 -1085 -1657 -97 1563 1300 -513 -1728 -758 1107 1663 97 -1515 -1305 586 1698 710 -1091
843 -1091 -1562 -61 1536 1202 -560 -1650 -682 1137 1437 67 -1468 -1223 537 1552 602 -1086 -1456
$$ packed form
727b568J960K615J64k514k157J054K761J192j965k592r0K582K004j049k744j119
743b466J990K538J6k604j919J164K701R30j947k428R9K469J786j096k618r06J930
760c61K369j98k422j646J122K517P60j896k217K58K371J470j198k332n64J827
776a40J997l43k247j277J222K126N28j808j840M00K159J190j265k156k59J811
792I8J662n02k116r70J273J964J83j835j552P06K002Q34j361j861l9J789J424
809A699p07k010p08J428J733O3j933j330R17J859O42j443j778K01J895J268r46
826H50j935n72J560J660k63j813j215R70J865N56j566j612K10J891J112r88j801
843a091m71J501J597l34j762j090R68J819L00j370j535K45J760J015r50j688l70
$$ plain form
860 -1456 -47 1401 1070 -552 -1481 -580 1107 1322 -27 -1372 -977 630 1424 491 -1060 -1266 129
877 129 1304 828 -655 -1337 -395 1061 1129 -194 -1261 -795 619 1220 274 -1033 -1079 216 1222 644
895 644 -746 -1239 -217 988 980 -370 -1199 -582 751 1145 79 -1079 -897 399 1179 514 -829 -1099
913 -1099 -52 1083 879 -418 -1175 -446 812 1092 32 -1093 -778 496 1167 409 -834 -1087 39
930 39 1066 774 -510 -1215 -350 862 989 -62 -1050 -762 496 1084 369 -817 -945 2 980 686 -491
949 -491 -1029 -273 801 892 -96 -990 -626 463 1030 301 -722 -820 102 974 582 -444 -924 -273 727
968 727 843 -139 -853 -513 459 818 203 -746 -702 201 809 483 -538 -815 -139 657 607 -191 -790 -356 435
989 435 766 79 -688 -523 249 798 377 -530 -725 24 737 537 -260 -733 -244 542 684 -40 -708 -456
$$ packed form
860a456J409J448l31j622r29R01J687K15j349j345L95J607P94r33j551k06J395
877A29J175m76j483o82R42J456O8j323j067M66J414O01r46j307m6J295J006n78
895F44j390m93J022J205qj350q29O17J333L94j066j158J82J296P80o65j343k70
913a099J047J135k04j297p57P29J258K80j060j125L15J274O71p58j243k53J126
930C9J027k92j284p05Q65J212J27j051r88K88J258N88p15j186j28R47R78k94j177
949d91n38P56J074R1r88q94L64J089N67p29j023r8R22Q72l92j026m80O51J000
968G27J16r82p14L40R72L59o15r49M4R03O08l26j021k77O76P96n0p98n99M34P91
989D35L31o87p67J65P72N49m21r07j95P49P13k00p97m73M89P86J42p24o68K52
$$ plain form
1009 -456 322 796 228 -559 -733 57 675 425 -366 -716 -204 548 637 -82 -688 -482 374 734 188 -594
1029 -594 -623 90 677 435 -374 -657 -146 605 652 -103 -633 -416 358 682 223 -559 -632 116 713 393 -289
1050 -289 -678 -178 494 551 -50 -649 -346 324 564 130 -457 -489 86 594 335 -337 -600 -116 444 392 -110
1071 -110 -564 -294 268 570 131 -385 -350 151 537 263 -388 -517 -33 445 376 -137 -459 -220 310 403 68
1092 68 -424 -331 185 429 246 -325 -408 -8 362 326 -169 -463 -156 381 403 -51 -414 -283 200 428 160 -324
1114 -324 -348 7 466 249 -277 -480 -105 346 391 -83 -416 -259 164 453 133 -302 -377 54 385 257 -211
1135 -211 -398 -183 345 362 -69 -423 -234 215 398 104 -294 -348 18 357 286 -176 -404 -167 296 362 13
1156 13 -359 -303 178 401 120 -298 -347 -17 341 248 -187 -363 -202 233 298 -37 -299 -285 199 338 84 -185
$$ packed form
1009d56P78M74n68p87j74P90O18k50p91l50N12P52Q9p19o06K06Q56L60n46p82
1029e94k9P13N87k42q09k83N11P51M7p55n30K17P74L24m59p82p3P48N97l20o82
1050b89l89N00O72N7o01n99L03O70K40m34n87l2N75N08k59o72k63M84N60n2n02
1071a10m54K70N62L02m39n16L5N01L86k74o51j29M84M78o9n13l22K39N30R3l35
1092F8m92R3N16K44j83n71q3M00L70l6m95k94L07N37K2m54l63J31M83K28k68m84
1114c24k4L55M59k17n26k03L75M51M5m74l33J57M23K89l20m35p5M31L31j28m68
1135b11j87K15N28J7m31l54J89M49J83k94l98n4L66L39p1m62k28K37M63O6l49
1156A3l72N6M81K23k81m18m9L30L58r3m35j76J61M35O5l35k62J4M84J39k54k69
$$ plain form
1178 -185 -313 58 294 124 -141 -291 -81 231 254 -54 -309 -191 167 259 11 -260 -221 86 254 191 -191
1199 -191 -282 -46 255 214 -43 -306 -134 224 290 27 -268 -168 81 233 129 -184 -270 -5 292 202 -106 -322
1221 -322 -135 180 255 -1 -242 -201 43 274 36 -211 -309 -75 193 211 -83 -269 -139 118 202 51 -266 -238
1243 -238 36 241 134 -146 -256 17 256 207 -69 -272 -87 168 231 77 -225 -180 39 260 92 -159 -247
1264 -247 13 168 167 -23 -230 -118 164 233 -23 -173 -195 24 97 89 -127 -183 -96 149 176 -22 -265 -98 156
1287 156 234 52 -182 -224 106 208 77 -129 -215 26 173 177 -105 -178 -58 173 154 31 -172 -142 75 180 95
1310 95 -225 -177 -51 168 125 -83 -234 -32 166 136 5 -235 -187 100 219 129 -143 -171 -1 181 161 -107 -220
1333 -220 -150 157 243 38 -261 -130 112 230 127 -124 -244 21 175 186 -148 -275 -92 176 213 -21 -245
$$ packed form
1178a85j28L71K36j70k65j50K10L12K3l08k55J18L58R2k48k71L9L07J68o3l82
1199a91r1K36L01m1k57k63J72L58O6k63k95J00K49J52j04l13q6K65K97r0l08k16
1221c22J87L15P5k56k41M1K44K31k38k47r8K34K68J8k94j86J30K57Q4j51l17K8
1243b38K74K05j07k80j10K73K39m9k76k03J85K55O3j54l02M5K19K21j68k51q8
1264b47K60J55jj90k07J12K82O9k56j50k2K19P3qk16n6Q7K45K7j98k43J67K54
1287A56P8j82k34m2L30J02j31k06q6K41J47Mk82p3J20K31j9j23k03L0K17J05q5
1310I5l20M8J26K19m3k08j51K02J98l0j31k40M8K87J19r0k72k8J70J82k0k68j13
1333b20P0L07Q6k05k99J31K42J18j03k51j20K65J54J1l34j27J83K68L7k34k24
$$ plain form
1354 -245 -150 97 202 95 -122 -232 -21 142 204 -119 -169 -79 140 169 32 -167 -63 64 225 123 -149 -92
1376 -92 57 202 146 -59 -187 -75 114 183 -27 -186 -138 92 160 74 -173 -205 -21 194 35 -104 -196 -60 160
1399 160 187 -10 -190 -155 64 211 13 -175 -229 2 214 100 -170 -268 -35 183 174 -52 -215 -155 150 195 82
1422 82 -237 -236 8 232 118 -114 -226 -33 221 192 -45 -186 -139 149 209 -22 -233 -154 100 204 117 -167 -179
1445 -179 -12 166 168 -36 -215 -138 172 243 23 -231 -169 76 232 87 -64 -204 -4 178 202 -28 -218 -27
1467 -27 165 238 24 -170 -128 11 235 105 -120 -188 -54 171 74 -103 -200 -86 151 159 20 -148 -173 45 211
1490 211 129 -159 -248 -52 230 174 -95 -166 -51 172 239 -10 -205 -79 110 164 73 -161 -105 34 217 139 -110
1513 -110 -198 -59 185 184 -35 -179 -133 100 186 39 -193 -138 109 232 97 -157 -255 -43 162 141 -86 -206 -106
$$ packed form
1354b45R5K47J05j07k17j10K11J63O2l23n0R0K19K9j37j99J04J27J61j02k72N7
1376i2J49J45n6k05j28J12J89O9k10j59M8K30O8q6k47l2J84K15j59j39r2J36K20
1399A60K7j97j80L5K19J47j98j88n4K31K12j14k70r8K33K18rk26j63O0L05M5j13
1422H2l19JK44K24j14k32j12J93K54k9k37j41M7K88O0k31k11P9K54J04q7k84j2
1445a79J67J78Kk04j79P7L10P1k20k54O2K45J56j45j51j40K00J82K4k30j90J91
1467b7J92P3k14j94M2J39K24j30k25o8J34K25r7j77r7J14K37Qj39j68k5K18J66
1490B11q2k88q9J96K82n6k69p1J15K23O7k49j95J26J89N4r1k34N6J39J83p8k49
1513a10q8J39K44jk19j44M6K33Q6j47k32N5K47J23j35k54r8K12K05k1k27j20J00
$$ plain form
1536 -106 127 185 12 -148 -107 34 265 150 -122 -242 -30 142 154 -25 -177 -84 151 219 33 -190 -158 54
1558 54 204 31 -190 -215 35 194 118 -101 -266 -83 121 154 -16 -186 -177 66 275 97 -201 -168 -16 201
1580 201 153 -101 -223 -83 172 232 2 -212 -103 73 242 59 -199 -177 18 206 109 -93 -210 -92 84
1601 84 152 -42 -183 -138 96 153 70 -164 -152 37 161 142 -110 -249 -11 171 119 -65 -196 -99 166 184 -17
1624 -17 -141 -180 91 266 68 -116 -180 -55 240 185 -60 -183 -56 171 179 -20 -200 -177 71 185 78 -161
1646 -161 -228 -3 184 129 -120 -239 -76 113 165 -48 -197 -148 93 212 36 -176 -196 17 191 110 -118 -171
1668 -171 -45 179 184 7 -175 -102 139 172 80 -182 -185 -43 153 112 -132 -237 -4 181 119 -72 -174 -77 117
1691 117 164 9 -174 -140 71 154 70 -128 -161 -8 104 136 -41 -223 -129 185 200 -16 -149 -135 18 197 76
$$ packed form
1536a06K33N8j73j60M1J41K31j15k72j20K12J72J2j79j52R3K35O8j86k23L2K12
1558E4J50j73k21k5K50J59p6k19j65J83K04L3j70j70RK43K09j78k98L3J52K17
1580B01m8k54j22J40K55O0k30k14J09J76J69j83k58K2J95J88r7k02j17J18J76
1601H4O8j94j41M5K34N7q3k34J2J89J24j9k52j39K38J82n2j84j31R7K65J8k01
1624a7j24l9K71J75j98j84o4J25K95n5k45j23J27K27Qj99j80K3K48J14j07k39
1646a61o7K25J87n5k49j19J63J89N2k13j49M9K41J19j76k12k0K13J74q1k28n3
1668a71J26K24Nj77j82P3K41L3r2k62lJ42J96m1k44j05K33J85o2j91j02R7J94
1691A17M7j55j83L4K11Q3q4j98l3J53J12L2j77j82R4L14J5k16j33J4J53J79j21
$$ plain form
1714 76 -72 -167 -15 231 104 -115 -204 -66 116 171 -20 -190 -80 35 180 51 -163 -192 21 131 69 -91
1736 -91 -218 11 164 137 -29 -165 -132 123 209 -2 -194 -196 88 229 98 -133 -225 -15 141 132 -63 -208 -34
1759 -34 126 211 0 -123 -153 35 228 99 -63 -206 34 169 135 -95 -253 -130 95 199 -10 -169 -93 87
1781 87 191 48 -114 -233 13 169 76 -55 -194 -55 97 98 -14 -139 -89 77 214 69 -158 -122 -26 199
1803 199 116 -34 -201 -72 144 143 -32 -175 -103 99 168 32 -137 -207 61 191 94 -115 -135 -4 118 141 -14
1826 -14 -194 -110 55 195 19 -122 -136 21 234 65 -93 -174 -60 123 154 -80 -216 -104 104 223 27 -195
1848 -195 -114 86 173 77 -144 -137 -46 109 92 -36 -125 -91 102 136 6 -157 -138 18 172 65 -138 -98 32 140
1872 140 140 -74 -159 -5 84 100 -2 -175 -47 65 186 -6 -114 -99 28 140 67 -107 -174 -51 127 166 -22
$$ packed form
1714G6j48r5J52K46j27k19q9J38J82N5j91j70J10J15J45j29k14k9K13J10o2j60
1736i1j27K29J53k7j66j36L3K55Q6k11j92kK84J41j31k31r2K10J56rj95j45J74
1759c4J60Q5k11j23l0J88J93j29j62j43K40J35l4k30j58J23K25J04k09j59P6J80
1781H7J04j43j62j19K46J56r3j31j39J39J52Jj12j25N0J66J37j45k27L6R6K25
1803A99q3j50j67J29K16jj75j43P2K02O9j36j69p0K68J30r7k09k0J31J22K3j55
1826a4j80Q4J65J40j76j41j4J57K13j69j58q1J14J83L1k34j36J12K08J19j96k22
1848a95Q1K00Q7r6k21PR1J55j7j28q9L4J93L4j30j63J9J56J54j07k03M0J30J08
1872A40%k14q5J54Q9J6j02j73J28J12J21j92j08J5J27J12p3j74o7J23J78L9j88
$$ plain form
1895 -22 -202 -140 40 126 60 -198 -154 54 200 58 -114 -158 -41 160 107 -62 -175 -39 79 142 20 -128 -89
1918 -89 -7 144 132 -59 -168 -81 100 92 -74 -143 -26 78 232 27 -168 -122 91 160 66 -147 -173 0 135 55
1942 55 -130 -116 -51 100 148 -54 -104 -73 75 126 6 -99 -124 -7 103 111 -85 -129 -51 116 147 -38 -130 -85 89
1967 89 145 36 -99 -85 49 164 63 -61 -157 9 106 88 -40 -188 -78 36 68 -16 -108 -107 33 112 55 -20 -146
1992 -146 11 168 103 -59 -104 -55 72 91 -2 -88 -89 108 102 52 -82 -56 -3 118 104 -87 -31 -32 89 95 23 -87 -65
2019 -65 62 151 114 -118 -96 2 85 77 -32 -200 -100 105 94 -32 -169 -42 17 90 7 -80 -127 38 143 86 -59
2044 -59 -109 36 108 61 -20 -90 -41 118 138 57 -120 -73 59 114 27 -134 -102 -32 104 101 -92 -160 -27 92 66 -5
2070 -5 -57 -116 57 107 -14 -56 -112 8 88 121 -92 -72 -48 93 65 6 -102 -9 64 134 118 -67 -52 44 104 77 -55
$$ packed form
1895b2j80O2J80Q6o6k58M4K08J46j42j72m4J17K01n3j69j13J36J18O3j22j48L9
1918h9Q2J51j2j91j09Q7J81qj66o9J17J04J54k05j95M6K13O9r4k13k6J73J35q0
1942E5j85J4O5J51M8k02n0L1J48N1j20j05k5J17J10Qj96m4P8J67L1j85r2M5J74
1967H9N6j09j35J4J34J15j01j24r6J66R7j8j28j48J10J14L2q4r2JJ40P9n7p5j26
1992a46J57J57o5j62m5M9J27J9r3q6jJ97on0j34K6N3J21j4j91N6jJ21Op2j10K2
2019f5J27Q9l7k32K2R8Q3qj09j68J00K05j1j26j37J27N9P3q3q7m7J65J05n7j45
2044e9n0J45P2m7q1p0M9J59K0q1j77M7J32N5q7j61L2P0J36lj93o8J33J19k6p1
2070en2n9J73N0j21m2n6J20Q0L3k13K0K4J41k8n9j08R3P3P0j6j85J5R6O0k7j32
$$ plain form
2097 -55 -139 -8 89 89 -45 -115 -23 -5 129 3 -145 -120 23 104 -12 -57 -56 4 79 59 -48 -125 -41 67 128 -1
2123 -1 -94 -104 -4 82 27 -73 -88 -8 93 87 -101 -113 4 93 46 9 -74 -94 134 64 39 -77 -73 32 86 88 -56 -151
2151 -151 -102 111 90 -5 -36 -84 46 66 43 -119 -84 30 69 21 -111 -95 -46 109 57 13 -102 -22 74 70 12 -33 -132
2178 -132 -2 66 78 -64 -139 -47 58 73 -34 -115 -32 120 110 24 -91 -47 65 117 62 -33 -72 1 101 68 -97
2203 -97 -70 -46 111 80 6 -44 -60 54 92 31 -49 -27 16 107 18 -29 -89 -38 104 123 24 -69 -20 74 92 13 -49 -71 19
2232 19 91 17 -82 -105 -14 104 18 -39 -108 -65 60 43 -32 -25 -95 52 108 12 -106 -23 6 97 24 -52 -33 -37 59 95 15
2261 15 -61 -17 65 102 26 -51 -41 32 87 65 -63 -108 -12 67 23 -45 -92 -70 45 98 35 -98 -36 22 49 84 -99 -72
2289 -72 -29 119 87 6 -87 -31 26 54 -7 -42 7 -19 108 47 -86 -121 -6 59 62 -5 -103 3 12 63 3 -144 -52 17
$$ packed form
2097e5q4J31R7%j34p0R2J8J34j26j48K5J43Q1j16m5JO0P5k0j07p7Q4J08O1j29
2123ar3j0J00Q6n5j00j5Q0J01oj88j2J17Q9m7l7q3k0K28p0k5j16MJ05N4Kj44r5
2151a51M9K13k1r5l1m8J30K0k3j62L5J14L9m8j32J6M9J55n2m4j15Q0R6mn8m5r9
2178a32J30O8J2j42p5R2J05J5j07q1Q3J52j0q6j15M4J12N2n5r5l9P3J00l3j65
2203i7K7K4J57l1p4n0j6J14L8o1q0K2M3R1q9m7o0N1J42J9r9r3M9R4J8p9o2k2R0
2232A9P2p4r9k3R1J18q6n7o9M3J25j7p5Pp0J47N6r6j18Q3K9R1p3p6J9mR6L6q0
2261A5p6M4Q2L7p6p7J0P3N5k2j28m5R6P9m4o8m7K2J15N3o3j33O2N8K7L5j83K7
2289g2M3J48l2q1r3N6N7K8o1l5M9k6J27o1j33l5J15O5Lo7r8J06RN1o0j47R2O9
$$ plain form
2317 17 43 35 -91 -110 15 93 55 -66 -62 -69 53 8 -43 -83 -16 -63 180 10 19 -30 1 87 41 -22 -39 -8 55 82 29
2346 29 -58 -78 29 57 1 -66 -86 -8 86 18 -29 -71 -3 75 26 -34 -77 -30 21 46 -27 -84 -49 -6 22 41 -74 -137 64
2375 64 51 53 -47 -98 -42 35 79 -7 -33 1 85 84 46 -92 -97 -60 -2 82 -16 -36 -22 76 60 -40 -64 -42 27 81 67 -101
2405 -101 -69 -25 74 57 -56 -76 -35 24 -6 -56 -48 -67 18 67 28 -109 -5 10 42 100 -70 -25 -1 18 31 -45 -17 -30
2433 -30 37 47 8 -39 -5 40 106 -9 -20 -7 -1 69 -10 -38 -78 -41 43 31 -22 -95 -70 21 74 -2 -40 -14 16 96 35 -6
2463 -6 -65 8 87 32 36 -49 -12 36 68 -7 -51 -20 43 103 105 0 -8 -36 20 63 -27 -36 -38 19 87 19 -99 -42 18 54 -3 -41
2495 -41 -105 2 38 21 32 -10 9 50 -8 9 -61 -89 37 2 66 -25 39 -3 54 54 -63 -67 -10 111 10 -45 -25 -33 -15
2524 -15 12 19 -66 -80 -4 57 20 -40 -69 -28 11 1 29 -79 6 68 113 18 -80 -43 6 62 -30 -10 -53 -15 39 43 7 -68 -34
$$ packed form
2317A7K6qj26j9J25P8l8j21MpJ22m5n1m0O7m7K43j70Rm9L1Q6m6o3j7L1O3K7n3
2346B9q7k0J07K8n6o7k0P8R4o8m7m2O8P8m9o0m3M7N1K5p3n7L5M3K8J9j15o3K01
2375F4j3Kj00n1N6P7M4q6k6L4Q4jl8j38nL7N8Q4r8k0J4R8j6j00k4K2O9N4j4j68
2405a01L2M4R9j7j13k0M1N9l0n0Qj9Q5M9l9j37J04J5L2N8j70M5K4J9J3p6K8j3
2433c0O7J0l9m7L4M5O6j15j1J3OP0p9k8m0L7Q4j2n3p3K5R1N3p6l8K6L0Q0o1m1
2463fn9P3P9n5Mq5L7M8L2p5m4L1O3O0Kj05qk8N6M3r0rkN7O8o8j18N7O0L6n7l8
2495d1o4J07L6j7J1m2J9M1n8J7p0k8J26l5O4r1O4m2N7%j17mN7J21j01n5K0qJ8
2524a5K7Pq5j4P6O1l7o0k9M1L9j0K8j08Q5O2M5r5r8L7M9N6r2K0m3L8N4Ml6p5L4
$$ plain form
2555 -34 41 -18 39 -32 -120 43 43 27 -22 -18 25 48 -1 -44 -55 -44 4 27 -59 -18 -56 43 8 -43 -28 -20 -58 64 -3 -51 -33
2586 -33 -19 87 17 -71 -63 -10 -9 39 -36 -49 17 34 74 118 -17 -86 0 36 36 11 -40 16 67 32 -27 -92 -27 -11 40 -25 -22
2617 -22 -69 -24 30 -7 -21 20 -22 52 25 -26 -58 18 3 61 -34 -48 -3 12 72 37 -33 -70 20 70 45 -41 -10 8 6 44 26
2648 26 8 -45 -20 44 48 -52 -81 12 29 -20 -71 -41 -118 -12 32 -11 -14 -64 -32 -37 26 -18 1 -7 62 35 -26 19 25 -7 96
2679 96 66 -50 -92 49 9 51 -45 -44 32 -6 -4 -21 -20 -44 9 25 -9 -20 31 53 -22 5 -40 -21 29 -6 -51 -30 -79 3 111
2710 111 51 -39 3 20 48 23 -37 -71 -42 15 33 34 -28 6 -14 -3 -15 22 -23 37 -4 12 -30 -49 -28 40 46 16 -38 -75 -23
2741 -23 47 32 -33 5 64 69 3 -44 -27 -34 -11 37 25 -72 -57 95 69 24 57 12 6 29 48 -29 -5 5 22 2 -6 10 35 82
2773 82 22 2 19 -38 -36 52 -1 -60 -67 2 -14 10 10 -32 -79 21 60 9 -59 -84 -34 -5 -5 4 39 -12 63 72 2 5 7 -11 40 -5
$$ packed form
2555c4P5n9N7p1q8J63%j6m9MM3K3m9m3j1J1M8K3q6M1l8R9l5n1J5Ql8J22o7m8J8
2586c3J4J06p0q8QN3JM8p5j3O6J7M0M4j35o9Q6L6%k5n1N6N1l5n9o5O5J6N1o5L
2617b2m7M5N4l7j4M1m2P4k7n1l2P6j5N8r5j4M5J5O0l5p0l7R0N0k5q6L1J8kL8j8
2648B6j8n3K5O4Mj00k9R3J7m9n1L0p7J06M4m3ln0L2nO3m4J9qO9k7o1M5Ol2J03
2679I6l0j16m2J41m0M2r6JP6l8Kj7Jk4N3J6l4j1N1K2p5K7m5J9N0l5m5K1m9Q2J08
2710A11o0r0M2J7K8k5o0l4K9N7J8Jo2L4k0J1j2L7m5O0m1J6m2j9K1O8Ol0n4l7N2
2741b3P0j5o5L8N9No6m7J7pK3M8j2r7J5J52k6m5L3m5oK3J9p7K4J0J7k0qJ6K5M7
2773H2o0k0J7n7KQ8n3n9pO9j6K4%m2m7J00L9n1o8k5N0K9%RL5n1P5Rp0LKj8N1m5
$$ plain form
2807 -5 16 -14 -23 8 -3 -23 -87 1 71 -41 14 -23 -42 25 26 32 -26 -13 42 8 2 -72 -44 -6 -11 5 25 0 13 43 23 -9 0
2840 0 -39 6 11 23 22 -67 11 29 11 43 -9 -39 49 -10 2 -7 24 61 58 -45 -45 -14 0 27 33 -17 -40 5 -7 16 -18 -53 37
2873 37 22 -20 16 -36 20 -36 4 61 -41 -93 4 72 39 0 11 -2 -11 16 21 -12 4 20 11 -35 -5 -37 37 -32 -18 -11 -24 -42
2905 -42 -2 -40 -28 -23 -15 -6 62 1 68 -14 -40 13 -32 12 -24 1 71 -7 1 -17 43 27 35 11 25 -2 -16 20 11 -8 2 -16 49
2938 49 45 -25 8 6 5 16 3 29 -57 -5 -18 -33 -76 -31 40 30 1 1 -31 43 2 24 27 -5 -7 -32 4 -57 -14 21 -3 19 43
2971 43 -1 -1 -23 16 57 50 -4 -5 30 15 -15 -17 12 -4 0 31 -9 20 -64 22 -13 24 -21 -11 -13 -6 23 -66 -98 -45 39 -8 7 -35
3005 -35 34 83 9 -14 2 16 41 18 -26 34 -46 13 21 -6 9 36 27 4 26 0 -17 -3 -23 26 -3 -6 49 58 -35 8 -5 -9 14
3038 14 18 -7 -44 37 11 39 -14 -25 -15 -26 33 14 -52 -13 -18 -7 2 41 -10 14 -19 4 5 0 11 10 83 52 26 -70 -45 69 -7
$$ packed form
2807eK1l0rL1j1k0o4Q8P0j12N5l7j9O7JOn8J3N5l4op4K8L8nJ6K0k5J3L0k0l2R
2840@l9M5NJ2jq9P8J8j8L2n2l0Q8n9J2rL1L7lj03%L1J4K7On0k3M5j2K3l4l5R0
2873C7j5m2L6n2N6n6M0N7j02n2R7O8l3l9J1j3rK7Nl3J6J6rm6L0l2P4o9J4Pj3j8
2905d2M0l8J2NQRO8o1O7q2k6N3m5M4l6K5P0p8Qj8O0j6Qk4J4k7j4L6rj9J0j8O5
2938D9mp0L3kjJ1j3K6q6N2j3j5m3M5P1j0k9%l2P4m1K2Ll2kk5L6o1M3L5k4K2K4
2971D3m4%k2L9M1pn4jL5j5l0kK9j6ML1m0K9q4Q6l5L7m5J0kPK9q9l2N3Q4m7J5m2
3005c5O9M9p4k3J6J4K5k3m4O0q0N9Qk7J5K7rk3K2k6j7J4k0M9k9lN5Rr3M3j3mK3
3038A4Mk5l7Q1k6K8n3j1J0j1N9j9o6L9nJ1RL9n1K4l3K3JnJ1jP3l1k6r6K5J14p6
$$ plain form
3071 -7 1 6 -68 13 -10 0 -8 -48 35 11 17 16 6 -36 -15 66 -24 -41 -14 16 -1 28 48 41 23 -19 -66 -7 40 -9 67 28 -43 0
3105 0 -90 -4 5 -34 5 -16 29 30 16 -62 -33 -9 28 32 18 35 -11 -33 2 -11 -14 8 15 32 91 -65 -63 -45 35 -9 5 -30 -17
3138 -17 -38 -20 65 -23 33 -9 31 34 57 -37 67 55 23 -9 -3 -65 -21 69 4 -21 -33 -11 -11 -23 -28 -24 13 41 -11 -7 -12 -4 -15 72
3172 72 -8 15 21 -32 20 -12 -71 -19 1 30 14 -23 9 33 -13 94 12 -31 31 20 -16 -15 23 -20 -51 31 21 -12 12 -12 15
3203 15 14 46 -39 -38 11 -15 26 -22 63 11 67 -33 38 2 -72 15 44 4 -23 -5 23 -7 7 -36 3 50 53 -20 -11 46 12 23
3235 23 -24 -5 -44 4 7 -41 15 30 -15 -21 -105 21 -12 -28 15 25 23 -44 24 19 -22 -58 -35 15 33 12 -14 -58 -15 17 13 76
3267 76 13 70 -23 26 24 39 -28 0 -2 -12 4 1 5 -11 0 12 36 33 -22 -11 -6 -74 -49 -4 16 -36 -29 27 15 -43 -11 -16 68 -9
3301 -9 9 26 7 36 63 -14 -23 25 -12 10 12 -12 18 34 -23 35 -18 19 27 -28 30 21 -2 -22 42 2 -41 13 -20 -22 -9 18 25 -9
$$ packed form
3071gQNp4Q1k3J0qm0Q3k4Ojj0m2K1Q1r0j7K7L0j7K9K0pj8m2m7N9M7m9P6l9p1M3
3105@r0Q6Rl9L9k1M5Jj4p8K9K4L7Mj4J7m6k2L5j3lK2PJ7N9j56KJ8Q0m4J4l5J3
3138a7k1J8Q5q8N6m2M0LK3r4J04j2l2l2Oo2M4R0o5k5j2K2%j2nML7K8n2MnQj1Q7
3172G2q0K3On3N2l2n9N2K0K9j6l7L2K4m6J07q2m3O2j1l6JL8m3l1Q2j0l3K4k4K7
3203A5jL2q5JM9k6M1m8Q5n2N6j00P1l6p4Q7K9m0k7J8K8l0J4m3L9M7Lp3RN7l4J1
3235B3m7J9l9M8Lm8N6J5m5oq4J26l3j6M3J0ko7O8nm1l6K3N0J8k1k6m4M3L2mO3
3267G6o3N7r3M9kJ5o7K8kj0J6lMj6J1J2K4ln5J1No8K5M5K0n2PN6j2n8L2nQ4p7
3301iJ8J7j9K9K7p7rM8l7K2Kk4L0J6n7N8n3L7Qn5N8rk3k0O4m0m3N4l3kJ3K7Pl4
$$ plain form
3335 -9 33 -66 -8 -19 29 25 60 -31 -12 51 -12 -13 -5 14 32 -15 33 45 29 -6 5 2 -1 -20 11 4 13 -44 -21 -46 52 -6 -65 37
3369 37 -37 0 23 -38 66 -38 -61 3 -17 -28 -24 -11 -39 5 -30 36 -14 2 -10 -23 37 -40 -48 23 15 6 9 8 55 2 34 24
3401 24 -8 -41 -17 7 16 75 -18 -7 48 41 5 -34 -56 -81 -2 -59 -3 -4 10 -21 18 -10 -10 52 -23 -30 -14 -4 41 -15 -6 37 -22
3434 -22 -23 36 19 -1 -36 0 50 33 27 -42 -45 -1 30 -43 12 -5 -14 -28 -25 8 24 -6 -26 -1 -4 -23 -17 -3 12 -18 -27 -23 26 25 1
3469 1 -12 -23 -65 35 35 -12 -17 15 -20 6 23 -26 -10 -17 0 -45 45 26 39 4 3 15 -20 -28 8 -7 -24 1 15 33 -12 13 -15
3502 -15 -65 -28 -37 -11 2 10 26 23 13 18 -62 -55 12 41 -24 -28 25 24 -48 -59 -12 -4 -2 -11 24 1 12 15 -3 15 -6 35 23 15 22 -34 -16
3539 -16 11 -6 13 12 -52 10 -63 -51 -12 -4 25 -5 -10 -57 -35 -39 3 6 27 -25 -22 -68 2 53 27 -22 -13 -22 9 40 -61 36 74 -8
3573 -8 24 19 7 -12 -8 13 -28 31 -17 16 -11 11 16 32 13 21 -26 -22 40 19 -6 -24 -6 13 1 -2 5 33 19 27 -4 -30 -3 44 14
$$ packed form
3335iM2r9N8j1M8mL5r1J9O3o3jQJ9J8m7M8J2j6l5J1llj9L1pRn7K3k5R8n8n9J02
3369C7p4L7K3o1J04j04k3O4k0j1MJ3k8M4l5O6n0J6j2j3O0p7qP1qrLjM7n3L2j0
3401B4l2l3K4K4RN9r3J1N5pl6l9k2k5P9n7N6jJ4l1L9k8%O2p5pJ6J0M5n6RM3n9
3434b2jN9j7k0l5L6N0j7oo9lM4L1p3N5j7rj4LL3J6l0k0K5lj9OJ4J5l0rMM9jk4
3469Aj3j1m2J00%m7nL2l5K6J7m9J6pJ7m5R0j9J3l5jJ2l5qL6j5j7K5J4J8m5K5k8
3502a5n0L7rK6J3QJ6lj0Nq0PO7K9o5mN3jp2j1M7QKrL5k3J1Lj8J8k1M1j2qPn6J8
3539a6K7j7J9jo4O2p3J2L9QK9l0nm7K2mM2LK1n2Lm6P0N1k6m9RrL1L1j01R7L8q2
3573hL2nj2j9MK1m1N9m8L3k7K2NJ6j9Qm7MO2k1k5j8J8J9j2lPK8j4Ql1k6K7M7l0
$$ plain form
3608 14 -1 39 -54 66 -18 5 8 -65 -33 -19 31 -11 2 -48 -33 -12 18 -9 19 -49 -90 21 -20 3 -3 -20 -20 -15 14 7 -15 26
3640 26 -39 19 2 15 0 0 5 57 -8 23 21 37 -23 -4 52 -7 4 12 -5 29 -5 -12 -8 -42 -44 1 -3 -19 -25 -7 -6 -12 15 -10 -31 -31
3676 -31 -30 16 12 6 16 -34 11 39 -29 24 -58 15 11 7 37 10 -31 1 53 29 -23 41 28 -32 -46 7 -18 11 -42 -35 44 -4 -46
3709 -46 -47 14 -54 -32 -7 11 -28 28 -27 -7 -10 28 25 -12 -27 52 29 12 -3 5 -32 -28 20 25 -31 49 -54 -44 40 -16 8 -38 -13
3742 -13 -5 8 10 60 -35 -15 16 10 -3 -4 -29 34 -57 -27 2 -32 2 2 -9 -1 5 -3 8 -15 -15 22 -13 -49 -10 7 46 -18 46 -23 -34
3777 -34 31 -47 47 32 17 -35 -8 -37 -16 49 50 21 30 -11 -52 -8 -26 -82 43 14 -38 16 -21 -40 -19 -42 -6 -38 29 37 -52
3808 -52 -70 11 5 -20 11 0 -5 -17 -61 57 27 -10 39 -37 -11 -3 22 -4 -29 15 -11 -22 -20 -29 40 -47 45 42 -42 34 -1 -39 -19
3841 -19 2 70 -22 8 -8 0 11 18 -10 -13 31 3 -30 -15 -25 34 9 8 -14 18 -15 -35 26 -3 -32 7 -22 36 -21 37 -28 21
$$ packed form
3608A4j5M0r3J20q4K3Lp3L2J4N0m2J3n0J5K1L0k7K8o8m1J11m1K3oj7%NK9pk2M1
3640B6o5N8j7J3j5%NN2o5L1kJ6o0J9N6n9J1Qj7L4l4pMl4kM5mj6oJ8JoK7k5k1%
3676c1JM6moJ0n0M5K8o8N3q2P3mmL0k7m1L2N2k4n2O4j3o0j4N3k5K9n3PP9m8m2
3709d6jO1o8K2K5J8l9N6n5K0lL8ll7j5P9k3j7j5Ql7MM8Nn6Q0j03J0Q4n6K4m6K5
3742a3QJ3KN0r5K0L1oj3jk5O3r1L0K9l4L4%j1QOqJ1k3%L7l5l6L9J7L9o4O4o9j1
3777c4O5p8R4j5j5n2K7k9K1O5Jk9Rm1m1M4j8n6J25k9n2N4l7j9K1k3L6l2O7Qq9
3808e2j8Q1ok5L1j1nj2m4J18l0l7M9p6K6QK5k6k5M4k6j1KrO9q7R2lq4P6l5l8K0
3841a9K1O8r2L0j6QJ1Pk8lM4k8l3J5j0N9k5jk2L2l3k0O1k9k9L9k9N8n7N8o5M9
$$ plain form
3873 21 -24 -2 16 -45 6 15 32 -34 36 -58 -39 -54 -52 -3 9 -10 -31 -58 3 13 -6 -33 -23 16 -11 -6 -20 16 -33 5 -12 -24
3905 -24 -12 22 -3 30 -15 -64 -18 -38 -16 -35 14 44 -2 -9 -3 14 -14 10 9 14 -33 -30 -22 24 -64 0 7 -52 52 17 -1 -1 -48 -21
3939 -21 17 0 -3 5 3 20 13 1 2 -6 -49 7 -51 11 64 6 31 -27 42 2 -34 -35 31 -17 -89 18 -28 -23 -21 10 3 1 41 8 39
3974 39 23 18 -2 7 56 -40 -24 6 30 9 19 38 26 26 -6 64 -10 35 -35 -3 -40 -26 5 -29 0 -33 6 9 21 -36 -41 -20 14
4007 14 -20 3 -61 41 -29 -57 -9 1 -38 48 -10 -48 -7 -15 -14 30 51 0 56 32 26 -6 14 9 24 -10 25 11 35 -17 48 -44
4039 -44 34 -33 26 -32 -15 -67 17 -98 -77 23 -12 -38 -25 -63 -15 -14 2 -12 -22 -12 -12 39 -43 -13 -30 9 -12 33 -6 4
4069 4 -38 1 43 12 -5 -27 -16 40 -19 9 -27 -11 33 -20 72 1 3 -8 11 -4 -45 33 -23 -35 -21 -7 -50 16 65 -22 12
4100 12 -4 -1 20 -20 10 36 -4 -11 -11 -27 26 -33 -11 -17 17 -7 14 -23 -34 81 18 58 -29 -35 20 -33 -13 -49 19 -38 12 -25
$$ packed form
3873B1m5K2J8o1N1RJ7o6P0r4J9j5KM9J2j9k1k7O1J0j9k7J0L9k7Nj4L6m9L8j7j2
3905b4J2L4k5L3m5m9M6k0K2j9M9L0m6pOJ7k8K4jNm7LQM6q8O4Pn9J04l5j8%m7K7
3939b1L8j7lQkJ7pj2Jqm3N6n8O2N3n8K5n8O9m0l6jO6m8p2J07m6NKL1pkM0l3L1
3974C9j6nk0RM9r6J6L0K4k1J0J9j2%l2P0p4M5p0L2l7J4L1l4K9l3L9LJ2n7nK1L4
4007A4l4K3o4J02p0k8M8J0l9Q6n8l8M1qJM4K1n1N6k4ol2K0nJ5l4L5j4K4n2O5r2
4039d4P8o7N9n8J7n2Q4j15K1J00l5k6J3l8M8JJ6j4j0J0%N1q2L0j7L9k1M5l9J0
4069Dm2L9M2l1j7k2J1N6n9K8l6J6M4n3R2p1Kj1J9j5m1P8n6j2J4J4m3O6M9q7L4
4100A2j6LK1m0L0K6m0p%j6N3n9K2oL4k4K1l7j1J15o3M0q7oN5n3K0l6O8n7N0l7
$$ plain form
4132 -25 -8 -56 -13 5 16 -19 -17 65 -63 -3 26 -28 6 -4 7 44 -1 18 47 41 -10 19 -3 -33 -56 19 17 -39 48 12 -67
4163 -67 13 -10 -19 -16 25 -52 -62 -40 8 37 -61 -98 -8 45 -32 -23 11 -12 -29 -7 36 -19 -63 19 64 -73 13 -30 16 17 -19 59
4195 59 -2 16 -39 8 -15 -12 -23 1 -2 -38 -34 7 16 4 -4 21 34 -6 -28 -41 -41 -15 -5 -9 33 -14 -6 -27 2 -18 -57 13 41 -6
4229 -6 10 34 -10 5 50 23 -68 -20 -68 -17 -16 -24 19 -3 23 -6 51 -17 -41 -30 -36 2 18 -22 -24 -21 -19 -36 -1 49 35 27 16 -36
4263 -36 2 -70 34 10 15 -39 -22 -17 30 6 -12 48 -8 -4 -17 58 40 3 25 -14 50 61 57 -7 10 5 -31 -5 -15 1 42 27
4295 27 -61 -6 9 -43 14 -65 29 -5 80 -30 -41 4 44 -18 -3 -58 -7 23 22 -6 -53 -26 19 -20 27 -8 7 13 -20 14 -35
4326 -35 -6 -46 -11 -4 -46 -40 -27 -44 -24 35 -7 5 -2 -31 -29 -1 13 0 0 -47 11 -27 4 -4 -19 -37 -12 -13 29 -21 42 -15 6 12
4360 12 -2 -59 6 22 -55 -9 25 -1 12 27 21 16 54 5 17 7 50 86 4 -15 -17 -53 -29 -21 8 -21 21 31 -12 32 5 -9
$$ packed form
4132b5J7m8M3J8J1l5KQ2j28O0K9n4L4j0J1L7m5J9K9on1K9k2l0k3P5kn6Q7l6p9
4163f7Q0k3rLM1p7j0K2M8K9r8l7R0N3p7RL4k3j7K2M3n5m4Q2M5j37Q6m3M6Jl6P8
4195E9o1J8n5M7k3Lj1K4ll6MM1Rj2qK5J3m0k2j3%K6J0mM2m7Qk1K9k0l9P0K8m7
4229fJ6K4m4J5M5k7r1M8m8N1JqM3k2K6k9N7o8k4J1oL8J6m0kLKj7L5N0j4qj1n2
4263c6L8p2J04k4Nn4J7NM7k4j8O0n6Mj3P5j8l7K2l9O4J1mo4J7nl6K6j0J6M1j5
4295B7q8N5J5n2N7p9R4l4Q5j10j1M5M0o2J5n5N1L0jk8m7K7M5l9M7l5J5Ol3L4m9
4326c5K9m0L5Pm2OJ3j7K0N9m2J2pk9KK8J4j3%m7N8l8L1qj5j8K5jM2n0O3n7K1O
4360A2j4n7O5J6p7M6L4k6J3J5onL8m9J2j0M3L6q2j9kl6K4QK9k9M2J0m3M4k7j4
$$ plain form
4392 -9 22 54 23 -32 14 -42 26 37 55 -14 27 33 29 -13 13 45 9 25 12 -23 -15 46 39 -2 -6 40 -44 -4 15 34 -24 -13 2
4425 2 12 -14 -8 19 20 7 -22 -16 40 -1 29 -17 2 56 6 35 25 39 -23 6 -6 -4 34 37 -11 -2 17 52 0 39 -1 -20 -27 16
4459 16 -38 71 -19 16 29 16 24 32 -10 32 34 -53 -24 74 -11 50 6 32 -28 -2 18 -13 10 16 11 -10 -2 -3 -11 -7 -17 36 21 -6
4493 -6 45 30 22 20 -41 -29 34 10 27 -46 43 -21 -21 4 54 32 75 -9 -14 -36 -39 -40 35 -28 -27 -30 -22 23 6 -31 -2 16 37 36 -10 12
4529 12 -27 -22 40 15 1 -42 15 60 5 24 55 -23 29 14 16 40 -76 28 -43 -35 7 -1 -32 22 19 -10 -61 -4 33 -19 21 17
4561 17 -3 33 51 16 4 -9 -8 -55 7 -12 -11 -25 3 12 14 -19 -4 0 -3 31 -1 48 22 10 17 2 9 26 -21 12 -22 34 4 -26
4595 -26 2 3 17 12 47 12 34 -2 10 -53 -24 41 12 -42 -43 -1 -4 17 25 20 26 -2 -31 0 69 47 -9 84 5 -13 -26 16 -57 -31
4629 -31 -46 63 22 -6 43 -2 -23 -58 -19 52 26 -40 -17 41 24 36 13 51 -14 6 -11 -6 -60 -4 27 26 -41 28 9 -37 11
$$ packed form
4392iL1L2l1n5M6n6O8J1J8o9M1Omm2K6L2l6J6j3l5QO1pm1mM6q4M0J9J9n8J1J5
4425BJ0k6OK7Jj3k9ON6m1L0m6J9N4n0K9j0J4o2K9j2KL8Lm8RJ9L5n2L9m0j9pM3
4459A6n4J09r0L5J3j3QQm2M2Kq7K9R8q5O1m4K6o0K6K0l1K3Onk1QjqMj0N3j5k7
4493fN1j5qko1J2O3k4J7p3Q9o4%K5N0k2M3q4nk2ljP5o3JlQM5j7l7K9J8K1jm6K2
4529A2l9NO2k5j4m3N7M5n5J9L1p8N2j5KK4j16J04p1QM2ql1N4lk9n1N7L7n2M0m
4561A7k0L6J8l5j2j3Jm7O2j9Jj4K8RKl3J5MlL4l2M9k6j2Pj5PJ7m7L3l4N6l0l0
4595b6K8JJ4nL5l5K2l6J2o3K9O5k9n4jM2lK1QnOk8k9L1O9k2n6R3p9j8j3M2p3K6
4629c1j5J09m1k8M9m5k1l5L9P1k6o6K3N8j7J2k3L8o5K0j7Nn4N6L1jo7O9j9m6M8
$$ plain form
4660 11 16 31 12 18 -25 -75 -14 69 -57 -26 15 -65 -16 -7 -3 -33 30 -20 12 5 -48 -45 8 10 -38 11 1 14 -18 12 37 52 5
4693 5 11 9 33 -21 -12 26 14 4 26 -15 32 45 -49 -46 -26 1 44 -7 -61 22 18 -58 -61 56 34 -33 -7 -29 -14 -13 -29 13 -12 22
4727 22 41 -10 53 0 -10 -52 -39 -25 -33 9 -2 12 39 -4 -3 12 0 5 26 -13 28 56 21 9 11 42 -7 42 14 8 -41 71
4759 71 20 10 -1 -27 24 29 5 19 -49 -10 37 8 -15 -6 -15 17 17 6 65 -13 5 14 17 4 57 35 -33 3 -8 20 -71 17 20 22
4793 22 14 29 7 -8 -23 -6 -76 -27 31 19 17 -31 16 34 31 -29 8 24 -23 -51 -2 -49 -33 -18 -4 -14 16 -31 -25 -38 24 -24
4825 -24 63 25 -15 14 -24 -16 36 39 -29 18 45 8 23 -15 9 41 -31 -72 1 -18 -30 43 31 -3 35 30 19 18 3 -56 29 38 -6
4858 -6 -34 53 19 49 -26 -10 26 -15 -1 12 9 3 12 -31 16 8 61 -17 9 -34 -32 -37 -13 19 3 11 27 -6 -19 41 58 -36 9 2 26
4893 26 27 -19 -29 46 51 -8 -25 -2 -59 1 28 14 13 18 4 -21 56 16 17 27 12 10 -14 -1 14 45 -1 -24 -11 9 15 25 32 4
$$ packed form
4660A1NJ5j9Om3n0O1Q3j26L1M1q0M9RMl0O3n0L2pn3LN3Km8M9j0J3l2L0K5J5m7
4693EOkK4n4RL8j2j0K2m1M7J3r4LK0K7M3n1n4Q3mp6lJ17k2o7K6k2J5Jj6M2k5L4
4727B2J9n1O3n3j0m2J3J4qM2j1J4K7m3JJ5j2NK1l9M1K8l5j2KL1m9M9k8om9J12
4759G1n1j0j1k6N1Nk4J4o8L9M7k9k3RrL2%j1N9p8J8RLj3N3k2o8L6j1K8r1Q8LK
4793B2qJ5k2j5j5J7p0M9N8j2km8M7J8lo0L7J6m7k8M9m7J6J5J4j0L0m7Oj3O2m8
4825b4Q7l8m0K9l8QN2Lo8M7K7l7J5l8K4L2p2m1P3j9j2P3j2l4L8nj1jj5n9Q5Rm4
4858fk8Q7l4L0p5J6L6m1J4J3loRm3M7qN3p8K6m3KnK4L2j6QJ6l3j3O0J7r4M5pK4
4893B6Jm6j0P5Nn9j7K3n7O0K7j4jNj4k5P7m0JJ0j5kk4J3J5L1m6k3J3K0OJ0Pk8
$$ plain form
4927 4 5 53 -23 5 -11 42 -34 -28 5 -5 2 -20 18 -15 0 -6 62 14 20 32 24 90 -38 -46 71 25 28 58 43 -7 40 -59 -7 54
4961 54 -10 34 26 2 -24 4 -6 3 -43 1 -26 -38 49 -13 95 -13 -10 26 20 -4 55 28 35 -19 -23 9 22 20 -60 1 -34 -6 21
4994 21 29 -12 -34 5 -13 41 3 29 -37 24 -1 -4 -36 -34 16 6 45 -51 -93 -31 61 18 -65 13 29 11 -10 41 16 9 51 8
5026 8 -12 -22 -4 8 -17 -17 -45 -1 -2 -4 28 54 6 -21 -3 -2 0 4 -19 27 28 -63 -7 24 3 -2 26 6 -41 -32 -31 -26 44 -38 -36 40 -15
5063 -15 -75 2 -6 13 8 15 -10 41 -2 -45 21 -17 7 26 -21 37 20 24 36 -21 22 20 20 -15 -47 16 9 25 -43 -36 19 -25 39 -10
5097 -10 28 16 67 26 -2 -42 -7 -59 -11 4 49 -49 0 -8 37 -47 -47 29 6 1 -4 18 27 36 23 23 46 28 31 -6 24 16 20 35 3
5132 3 -7 -2 54 13 -9 45 0 -4 2 77 -65 14 -61 -33 29 11 26 -39 73 22 21 17 6 29 4 -7 52 37 41 10 11 -17 12
5165 12 -66 4 16 10 30 7 34 -9 0 -12 -8 0 26 42 -30 -10 34 -3 -10 13 -10 12 -10 20 9 -14 -39 20 -60 34 27 -5 3 15
$$ packed form
4927DJM8p6K8j6N3p6OL3j0Pk2L8l3J5oO8m8OJ2qO6j28qJ17m6LL0j5n0M7r9N2O1
4961E4o4M4qk4k6K8j0Rm6M4k7j2Q7o2J08j08LL6ok4N9k7Pn4mL2J3kq0O1l5K8K7
4994B1Qm1k2L9j8N4l8K6o6O1k5ll2KN0j0L9r6m2O2R2m3q3P8J6j8k1N1k5pM2m3
5026Hk0j0J8J2k5%k8M4jkL2K6m8k7J8JKMk3M6Jr1N6L1k1nK8k0m7RJNP0q2KP6n5
5063a5o0P7qJ9nPk5N1m3m3O6l8K4J9m7N8j7MJ2n7M3k%l5l2O3pJ6o8PN5m4O4m9
5097a0L8j2N1m1k8m0L5n2M8J5M5r8M9qM5q4%P6k3nnK2RRj3%K3j8Ll7L0qMJ5l2
5132Cj0NN6m1k2N4m5mOP5j42P9p5K8O2j8J5o5J12n1jmj1K3k5j1N9j5Ml1Jk8K9
5165A2p8P0J2oK0k3K7m3Rj2MQK6J6p2K0M4l7pK3k3K2k2L0j1k3k5N9q0R4pl2QJ2
$$ plain form
5199 15 -15 56 0 20 -7 11 29 -39 -25 61 21 -22 39 -51 21 -42 13 -42 6 -46 -6 11 25 -41 -2 11 -29 13 -2 -10 -9
5230 -9 0 36 -34 1 7 -29 -20 10 2 5 2 34 57 19 -26 -20 -10 27 -46 -13 2 17 -5 5 39 -19 -15 2 -12 4 18 43 -42 -1 21
5265 21 -19 49 -15 -6 20 38 -26 9 21 -31 20 -18 -19 15 14 -12 -40 15 29 3 9 -4 25 12 7 29 56 -36 31 17 -6 5 11
5298 11 15 -3 6 2 -15 -1 15 17 -38 5 -59 -31 32 -58 26 -29 -21 -76 13 25 -12 -14 4 35 4 25 10 29 13 -6 33 22 32
5331 32 7 7 33 -42 -14 -7 -13 15 -34 37 -53 -14 19 2 15 -51 -3 -33 -5 -32 -8 -17 -2 -8 -27 -28 -34 -22 -44 9 -11 -32 -30 10
5365 10 -8 -60 63 24 48 28 -11 -21 17 16 -25 -11 -33 7 45 31 -1 18 8 -32 -26 47 34 -1 -44 33 54 9 -21 6 -63
5396 -63 -3 -7 0 -61 -21 -22 -27 31 -39 -27 44 -32 17 27 -34 4 -24 31 -5 23 -5 49 -3 28 81 18 -4 1 -27 20 27 7 -73
5429 -73 -44 -17 -44 -47 -51 23 -5 20 -21 -6 4 -20 -32 -49 3 -25 58 -8 -23 6 4 -81 -38 66 66 6 101 11 -4 -8 29 49
$$ packed form
5199A5l0P1n6K0k7J8J8o8J4Q6m0m3O1r0P2o3N5n5M8n2M0J7J4o6L9J3m0M2j5qJ
5230iRL6p0L5Ol6RL0qLlL2K3l8m5OJ0L7p3L3J5J5k2J0L4n8MJ7j4J6J4K5q5M1K2
5265B1m0O8o4RK6J8o4L5J2n2N1l8jL4jk6k8N5J4k6Oj3K9j3nK2K7r2O7j4k3J1O
5298A1Mj8Rmj7J4J6Kn5M3o4K8O3r0Q4n5Qn5Q9J2l7kJ8L1l1K1j5J9j6j9L9j1J0
5331C2k5%K6p5K8PoK8m9P1r0L9L3j7J3o6M8l0K8k7K4rJ5oj9joJ2k2N3k0k1KM0
5365A0j8n2J23l9K4k0l9j0L8jm1J4k2M0L8j4l2J9j0m0OP3j3l5m3P7K1m5l0K7o9
5396f3O0mPo1M0jnN8p0J2P1p6M9J0o1L8k8N5l6K8k8N4n2L1N3o3k2Nk8M7Pk0q0
5429g3K9K7k7lmP4k8K5m1J5J0k4j2j7N2k8Q3o6j5K9kq5M3J04%o0R5r0j5mL7K0
$$ plain form
5461 49 -29 -41 -11 66 9 4 -9 -8 -3 10 44 39 21 3 4 26 -25 -6 -5 -41 -21 -32 -16 -26 -7 19 18 10 -11 3 18 19 -50 8 -11
5496 -11 17 -51 7 -15 -4 -10 5 0 47 -5 -34 34 -26 -7 5 8 -16 -34 29 -33 -17 42 -15 -16 -14 -43 54 19 -46 -7 -51 19 -6
5529 -6 -8 -28 60 12 39 21 45 7 27 31 28 2 10 12 34 36 -42 44 -43 13 -19 -8 0 -38 10 11 8 -72 65 11 14 -41 -40 -17 -39 6
5565 6 -13 -34 36 2 -6 38 -46 -33 14 -18 -24 16 6 -30 -5 8 -10 33 19 -26 9 -29 -8 -13 -8 4 27 -14 -58 3 -19 -2 14
5598 14 -12 8 -8 3 -51 30 -40 2 -8 -18 17 1 -3 -25 4 20 41 -9 85 33 0 13 8 36 49 9 -31 6 25 7 -37
5629 -37 25 -13 -3 -13 35 -38 -28 -11 0 12 -14 35 4 52 3 11 22 1 11 -21 -19 0 -24 19 -16 -3 30 6 15 48 -14 -18
5661 -18 -74 23 63 -8 -31 63 35 17 -34 39 6 35 22 -24 -6 -60 13 -29 -27 -1 -28 -66 -66 -27 -24 3 24 -1 -46 50 -22 -15
5693 -15 -26 -62 13 -11 -9 -6 -41 18 26 1 5 6 16 41 21 -42 18 37 1 0 50 -6 -87 -10 -38 43 -27 9 54 -8 2 -11 28
$$ packed form
5461D9p8j2L0P7n7nj3JNJ3L4nj8j8JK2n1J9Jl6K0j1J6j0J9K6jqk1J4J5Jo9N8j9
5496a1K8o8N8k2J1oJ5nM7n2k9O8o0J9J2Lk4j8O3o2J6N9n7jKk9R7l5o5L9m4P0k5
5529fkk0Q8m8K7j8K4l8K0Mlk6QKK2Kp8Q6q7N6l2J1Ql8M8Jlq0J37n4Ln5JK3k2M5
5565Fj9k1P0l4qM4q4J3M7l2oM0j0l6K5J3j8M3j4m5L5l8K1nNJ2K3m1m4O1k2J7J6
5598A4k6K0j6J1n4Q1p0M2j0j0L5j6mk2K9J6K1n0R4n2l3J3nK8J3m0m0L7J9j8m4
5629c7O2l8J0j0M8p3J0J7J1J2k6M9l1M8m9QJ1k1J0l2KJ9k4M3l5J3L3k4RL3o2m
5661a8n6R7M0p1k3R4k8j8n1P3l3K9j3m6J8n4P3m2KK6k7l8%L9LK7K1k5m5R6p2P
5693a5j1l6P5k4KLl5N9Qk5MJJ0K5k0o3O0J9l6jN0n6q1P7k8Q1p0L6M5o2J0j3L9
$$ plain form
5726 28 -17 -19 -27 14 -43 35 9 -17 27 -21 -29 13 -3 -29 -47 -34 17 -17 56 4 2 -32 29 15 1 -20 -1 -27 11 13 9 -20 -8
5759 -8 -47 -20 35 -2 -18 -12 60 8 4 -12 -42 -59 2 -52 -19 -29 12 45 -18 -19 -62 -15 58 -14 -11 9 37 -7 23 -42 11 64 22
5792 22 19 -46 8 -36 52 15 38 51 54 -23 29 59 24 -27 1 -49 -42 -7 5 -14 19 -20 -17 -12 4 37 -18 -6 5 -14 -32 15 42
5825 42 69 -57 29 6 12 -74 -11 -30 -4 31 -10 -6 5 28 11 52 -30 21 24 -16 48 -29 13 -7 15 -48 -9 -21 -75 -12 12
5856 12 -32 -28 14 2 -14 -42 11 7 -21 4 39 20 -14 34 -8 48 -36 -20 -44 -51 -49 6 51 9 -27 9 -18 -31 -15 14 34 38 -12
5889 -12 -61 -20 -27 9 13 42 -31 37 39 -55 4 -30 -8 15 -19 47 -12 24 -12 -14 52 -20 -36 -10 19 22 -70 56 8 39 -20 32
5921 32 -12 13 5 -29 0 2 -1 -31 -8 36 14 -12 -24 6 -39 -30 -11 9 27 -32 14 0 57 27 29 -20 -8 -25 -27 -34 10 25 -32 6
5955 6 33 -22 34 75 29 36 33 2 18 -4 23 -35 12 20 -8 13 81 -23 0 14 -33 64 -20 -36 68 31 -11 -16 -51 -52 -27 -26 5
$$ packed form
5726B8m5kqM1n7P8k6k6M4m8qM2j6k6j8J3N1l4P3n2kl4O1j4j4k1J9k6L8Kmk9J2
5759hl9K7N5l7j6OP2n2mj6l0j7O1n4L3j0M1L3o3jm3M7P3p2LK0K8m4L0o5N3N3m2
5792B2lo5N4m4Q8l7K3J3Lp7N2L0l5n1K8n0PL5J2j9L3l9LNJ6L3n5J2J1j9j8M7K7
5825D2K7j26Q6k3Oq6O3j9K6L5m1MJ1K3j7M1q2N1Lm0O4p7M2k0K2o3L9j2n4O3K4
5856A2m4MM2j2j6k8N3mk8K5L5j9l4M8m2N6q4J6k4pKN5M5m2l6L6k7j3J6K9K0Mn0
5889a2m9M1pL6MK9p3O8Kr4N9l4K2K3l4O6n9L6l6kO6p2j6K6K9Lr2J26m8L1n9N2
5921C2m4K5ql4K9Kll0K3M4k2k6j2L0m5RJ9K0J8n9M6j4N7l0Km9J2j7kpM4J5n7L8
5955FK7n5N6M1m6Pll1J6k2K7n8M7Qk8K1O8j04K3J4m7R7q4j6J04l7m2nl5jK5JL1
$$ plain form
5988 5 -5 11 -27 19 -42 46 -19 37 -18 -20 -2 5 -26 -21 -6 -44 21 16 12 -20 -42 3 -19 -11 23 38 10 40 38 11 0 -1 26 -46 -53
6023 -53 10 -11 -34 -43 -88 -39 -13 16 1 -41 -61 22 45 -17 12 -5 13 -31 -12 6 2 15 18 38 12 -3 -35 7 -4 -3 2 -17 10
6056 10 13 -14 26 9 -48 -51 -28 -6 -45 4 20 -18 -28 -21 -35 22 -1 -41 -18 -7 -40 4 -36 -61 35 -34 1 -14 -12 -32 -49 3
6088 3 33 -78 -1 34 -36 8 74 -10 -76 11 -68 6 -17 10 -84 -30 14 -1 -36 19 1 -57 11 -23 -45 -3 32 14 -12 19
6118 19 -6 20 50 0 -49 -19 32 13 41 33 51 14 18 -30 -24 -6 -35 -17 14 14 28 -23 -21 25 37 75 -18 -13 47 21 -22 -60 -41
6151 -41 -1 15 8 28 0 24 -59 63 33 12 20 -32 -8 49 -8 28 47 -22 24 1 6 -3 46 16 1 71 19 -49 4 15 -30 -62
6183 -62 -43 -29 10 82 -37 -4 32 -72 38 -15 21 36 -1 27 -11 9 24 26 -30 2 4 -8 14 55 28 -29 0 31 -1 35
6213 35 1 -42 17 38 14 31 1 38 49 5 52 -55 -17 41 41 34 -10 -8 -19 16 1 -30 -10 5 -10 22 0 -25 -25 -23 38 62
$$ packed form
5988Ej0J6l8M6o1Q8o5N6n5kJ8Pl1NJ5l8O5nml2k2M5k2QL4J5k8L0kk7j1jK7p2p
6023e3O3k1k3rm5M9K6K9j5m2k0Q3K3o2K9j7J8m4J9J8mJ3LK0k6j5l2M2j1JNj9K7
6056A0Lk7M0j7n7lK3K2l9M9J6l8j0Pj4N7k3m0K3J1l3M4m0k5R6o9L5j5Kk0j7N2
6088CL0j11P7L5p0M4O6q4o6Q7p9P4k3K7r4N4M4j5l5N5j8n8O8l4k2M2L5j8k6L1
6118A9k5K6L0n0m9L0N1j9K8qJ8l7Mm8OJ8k9J8L1%J4n1KM6J2L8r3NO0k6m3l8J9
6151d1M0J6pK0k8K4q3J22l0k1Qn2K4N7n7L6J9o9M6k3NrM9l0j5P0n2o8N3J1m5l2
6183f2J9J4L9P2j19L3L6j04J10n3L6J5l7K8l8K0J5Kn6L2Kj2K2M1k7n7K9L1l2L6
6213C5l4m3N9K1k4J7l0L7J1m4M7j07L8N8%pm4Kj1L5j5l1K0J5j5L2k2k5%KO1K4
$$ plain form
6245 62 34 10 6 5 51 -21 6 32 1 25 55 -12 31 33 5 -55 -5 19 -63 -10 4 -46 -31 -17 -34 -24 -24 -30 11 16 11 -22 14 15
6279 15 0 68 32 -8 -7 -2 -12 -7 16 2 6 -6 14 18 21 43 5 9 -33 -2 -6 -72 21 12 -4 8 44 31 20 35 1 21 24 8 -58
6314 -58 -51 -40 -20 -6 -5 -5 -52 17 -6 26 -6 41 -41 24 -18 54 34 -45 8 7 -12 -5 -27 47 -14 5 27 14 -15 24 -1 -1 43
6347 43 -2 32 6 13 23 -15 46 7 50 18 3 42 -21 -5 22 -31 -15 -104 13 17 -72 12 -35 -39 -28 -28 7 1 -33 -14 -19 27 -52
6380 -52 7 -1 -25 29 -29 -18 14 43 -13 -60 -2 11 -37 -57 35 -11 -8 -5 10 -43 3 44 50 -23 -19 30 -45 14 34 -24 -9 37 -27
6413 -27 52 15 -23 51 -15 -4 29 59 12 15 -58 -79 39 -16 -44 15 1 53 -14 3 -23 -58 -9 6 -20 -24 -56 -34 17 -38 11
6444 11 -12 5 -8 -19 -24 -7 -50 -2 -25 -33 -34 46 -65 -16 53 15 42 -6 29 0 4 14 -25 -9 35 24 1 60 23 14 17 -20 1
6477 1 4 41 10 -45 -44 8 -18 -11 -42 14 4 -27 -43 45 -40 41 45 35 -9 14 -24 -32 15 7 -26 38 13 1 23 18 -14 44 30 -22
$$ packed form
6245F2k8k4mjM6p2K7K6l1K4L0o7M3Kk8o0N0K4q2N3J4n0J5J4j7J0%oM1Nnl3L6J
6279A5j5O8l6m0JNj0NK3j4Mj2K0MLK2l8Mm2L1mo6R3rj6J2L6j3j1J5l4K0Lj6o6
6314e8PJ1K0J4J%m7O9k3L2l2M7q2O5m2P2k0p9N3jj9Pk2P4o1J9K2j3k9L9k5%M4
6347D3m5L4k6PJ0l8O1l9M3l2j5L9o3J6K7n3J6q9J17Mq9Q4m7mJ1%L5ol4J9nM6p9
6380e2N9qk4N4n8J1L2K9n6m7N8J3m8k0R2m6LLJ5n3M6M1Op3MM9p5N9K0n8J5M6o4
6413b7P9l7l8P4o6J1L3L0m7Lp3k1J18n5k8N9j4N2o7J7k6l5M9J5k6ml2K2N1n5M9
6444A1k3J7j3j1nJ7m3M8k3qjQ0j11M9O9l8K7m8L5k9MJ0l9J6M4j1k3N9l7rLl7K1
6477ALL7l1n5JN2k6Pl1N6j0l1j6Q8q5Q1Mj0m4K3l8qM7ql3O4k5j2K2nl2N8j4n2
$$ plain form
6511 -22 -23 20 16 2 33 -10 -8 -18 29 -29 22 -18 -7 25 -34 -41 67 37 -7 -32 46 -12 6 -8 -9 -17 -22 -49 -33 -16 23 18 -17 -17
6545 -17 -37 36 -15 -24 24 17 -16 48 26 -49 19 12 27 -12 -17 3 -25 -12 8 8 55 26 -26 -20 -16 -36 -12 -31 1 -20 36 -56 -14 2
6579 2 14 6 -3 46 80 20 74 26 -10 -42 -16 44 25 -71 -36 -31 5 -7 15 11 21 0 24 47 -10 -20 -10 -15 -27 -8 -10 -6 -34 -40 10
6614 10 -30 -39 0 -19 20 -10 26 20 -22 17 -15 1 -15 37 -24 13 17 -11 46 19 -3 40 12 73 5 -25 16 -15 -1 25 7 19
6646 19 -23 -15 -37 -32 39 -11 -12 -5 73 27 25 -20 8 -31 -26 -23 -3 -67 -10 50 -25 -41 9 3 30 5 1 -17 -7 13 -25 24 13 33 16
6681 16 39 -23 46 18 29 -22 10 -18 37 -46 -24 -32 -57 0 1 -53 17 -29 -79 3 -14 -1 -22 54 -30 24 2 -5 -9 -27 -22 -35 38
6714 38 34 11 -29 -22 -38 24 -31 43 -9 -41 -21 11 8 10 35 -7 -19 22 -7 -39 60 -31 8 -25 -25 -7 -46 -7 5 -5 4 3 23 45
6748 45 -71 -53 -39 40 25 -44 -30 10 4 49 10 36 -2 3 12 27 0 45 57 -32 32 20 -9 13 8 6 13 -36 -21 -9 -8 -31 35
$$ packed form
6511b2jM3mj4L1m3Kj0M7n8N1m0J1L2n9pJ08l0m4k5P8n8J8j4jqnk7J6J7L9nl5%
6545a7k0P3n1rM8pl3O4k2p5O8pJ5l9nK0k8J3K0%M7k9n2OMk0K4j9L2k1N6r2M2J6
6579BJ2qrM9L4o0N4m8l6l2K6O0j9r6L5NL6j2K2mJ0k1K4K3n7j0J0nj2J9kMk8oN0
6614A0m0rL9j9L9l0L6om2L9l2J6j6N2o1L7Mk8N7k7k2M3k8O1o8l0M1l1J4K6j8J2
6646A9m2Qk2NP1n0jPP8m6km5K8l9NLK0o4N7O0p5j6N0oK7k5mj8J0K0l8M9j1K0j7
6681A6K3o2O9k8J1n1L2k8N5q3K2qk5N7Jn4P0m6n0Q2j7J3k1P6q4N4k2pmj8Nj3P3
6714C8mk3m0Pj6O2n5P4n2l2K0L2lKK5m2j2M1k9l2R9r1L9l3%J8l9L9J2j0RjK0K2
6748D5j16J8J4P9j5o9J4M0oM5l9K6l8NRJ5k7M5J2q9O4j2k9K2nkPm9J5J2Jk3O6
$$ plain form
6781 35 -29 7 25 39 -19 -64 1 -49 9 46 43 -1 -5 -16 -24 43 -8 41 -16 -51 65 -34 31 18 -16 18 41 -52 -10 29 8
6812 8 41 6 28 27 -49 38 17 -32 -42 -55 27 -26 14 -10 -8 -12 -51 1 27 -30 -5 35 -41 -25 8 -73 -24 26 -44 3 -18 -2
6844 -2 15 7 27 -8 3 54 7 57 27 -20 16 63 19 -41 5 -21 30 -27 -17 -23 7 -9 -54 13 20 -39 -15 -34 -14 5 -56 4
6876 4 11 -1 -70 24 -18 14 45 -18 -7 21 -25 -10 13 -62 48 11 -49 -14 5 27 24 42 32 35 3 34 -37 -28 -8 25 -18 -48
6908 -48 45 2 -8 8 -9 5 28 7 40 32 3 -25 3 12 14 -36 13 68 18 33 40 6 -56 11 -7 39 -44 17 -20 -30 -21 -40 -15
6941 -15 -29 -32 -20 -40 48 -2 -5 -22 23 21 1 -37 -23 6 -37 -22 -38 28 15 -20 -86 0 65 -36 19 19 65 46 6 -12 39 -40
6973 -40 -23 73 -69 37 -38 -34 -40 22 42 -51 -53 36 -35 21 23 59 -46 -6 -12 11 17 10 -22 9 14 8 -12 -53 25 -27 -6 -6 -12 18
7007 18 41 66 55 1 41 -21 -30 24 -13 -32 48 15 -16 14 21 -5 -32 -12 -26 4 44 57 16 -2 -4 -3 6 3 -7 -6 -14 -24 -103 -41
$$ packed form
6781C5o4L6J8J4n8m5O5n0N8L7lm4mj1qO7n1M9n7l5J16r9O5j3l4L4K3r3M2L9k1
6812HL3l5K2jp6Q7k1m9j0j3Q2n3M0k4Kml9N2K6n7K5M0p6J6L3q1M9N0p0M7k1J6
6844bJ7qK0l5J1N1m7N0l0m7L6M7m4o0M6k6N1n7J0oL0j6m5O7Pn9K4j9K0J9o1O0
6876DPj2o9R4m2L2L1o3J1K8m6J5K3p5J10l7o0L5J9K2lJ8j0Ll2L1p1RK0L3m3l0
6908d8R3m3j0J6j7J4K3k1L3qk9k8K8RKn0M9N5n0J5Pl4o2O7j8M6q3O1l7j0Rj9K5
6941a5j4lJ2k0Q8n0lj7M5kk0l8J4K9m3J5j6O6j3l5o6Q6O5j01N5%M6j9m0j8N1p9
6973d0J7R6j42J06p5MoO2K0r3kQ9p1N6KL6j05M0oK3Opl2L1Nok0m1P8n2K1%oL0
7007A8K3K5j1n4M0o2rN4l7j9Q0l3l1L0Pk6k7K0j4L0M0J3m1j8kJRlj0Jqj0p9O2
$$ plain form
7041 -41 -53 6 -9 30 1 -11 3 7 -35 -14 18 51 9 17 14 20 40 -16 30 24 -49 43 -5 28 13 -27 -34 44 12 -15 -43 4 38
7074 38 -16 -59 8 2 19 -54 -40 27 -57 -43 -29 -21 -3 -11 5 -15 -13 59 31 46 7 -66 7 30 -27 -6 16 65 -1 -9 -8 -33 65
7107 65 6 19 43 6 21 -29 -40 -21 25 8 11 -43 -17 24 9 -4 -14 0 -40 -2 61 -27 -17 -32 60 13 -15 -42 33 35 6
7138 6 43 -21 -16 -24 28 -43 4 8 -27 -45 -11 -29 -7 -28 -12 -41 26 0 23 8 -24 -11 17 -55 57 9 -16 -23 15 -57 -17 9
7170 9 -25 -9 -6 -1 25 -33 -17 -20 -7 6 -1 -36 -15 20 27 -11 29 -7 -15 7 -53 -4 21 -25 -16 -41 -18 52 1 41 -18 15 -41 15
7204 15 -3 -21 69 -78 12 3 -5 10 2 27 -5 54 9 -1 -7 -15 -14 -61 -17 29 45 -62 6 -10 -16 -1 80 -3 -54 25 -16 11 -19
7237 -19 23 30 -48 -22 5 -47 -14 3 8 -2 -15 -15 -10 3 25 -46 -19 52 -61 -25 -69 -1 12 24 -5 -38 -1 -2 23 -34 50 -58
7269 -58 31 -53 -39 22 12 -28 38 -12 22 -29 -62 -26 0 -10 13 -28 17 -23 -48 50 -32 12 -19 -24 -31 19 -65 1 -34 16 16 29
$$ packed form
7041d1j2N9j5L9k9j2J4Mm2K1L2L3m2QlOK0n6M6op3R2m8L3j5m0pP8l2k7k8M7L4
7074C8n4m3O7oJ7p3J4O7q4J4J4QJ8qJ6k0KP2k8J5l9p3P3K3n7K1K2M9o6qJk5R8
7107F5n9J3K4l7J5n0j1J9M6j7Ln4K6M1j5j3j0J4m0L8O3q8J0j5R2m7k8k7P5Kk9
7138FL7o4NqN2p1M7Ml5j8L4j8K2k1J6k9O7k6K3j5l2J3K8p2J12m8k5pL8p2M0K6
7170Il4J6LNK6n8J6lJ3J3pl5K1L5Pl8M0l6qK2o0M9K5m6Rk5K3P0n1M0n9L3n6N6
7204A5j8j8R0j47R0rqJ5qK5l2N9m5j0oqJm7M4M6J6j07O8j6oJ5Q1q3n1P9m1K7l0
7237a9M2Pp8K6K7n2L3J7Nj0j3%NJ3K2p1K7P1j13L6m4O8J3J2k9l3L7jK5n7Q4j08
7269e8Q9q4J4O1j0m0O6n0L4n1l3L6K6j0K3m1M5m0k5R8q2M4l1npN0q4O6l5N0%J3
$$ plain form
7301 29 7 13 37 15 22 45 -1 -25 -15 -8 -18 10 -27 25 13 -19 17 25 -5 50 31 -91 -55 -13 35 -9 -4 -55 21 14 -40 -29 32
7334 32 -35 40 -28 -52 -16 33 2 45 3 -11 7 -10 25 27 -69 -11 -42 15 25 2 -39 19 -12 10 -33 -27 37 -27 17 -46 17
7365 17 -19 -3 -68 -29 49 -66 -83 -42 -36 14 38 18 20 8 14 -28 -6 20 35 -2 -29 12 82 -46 29 23 6 -41 14 66 25
7396 25 -9 65 23 -20 -21 -25 -33 -29 1 -35 -40 4 5 -1 -11 -9 -49 -23 5 6 15 -22 -8 -32 -24 -46 24 -2 21 -23 -54 41 11 -46 12 42
7432 42 -75 34 -29 21 -3 -37 -19 21 9 -17 49 33 -5 -44 16 -8 10 -17 -14 13 -21 -19 7 -40 -2 -11 19 -7 -4 -37 -25
7463 -25 27 25 -23 -9 12 25 41 -1 -1 -4 9 -3 21 -8 -13 30 69 40 -2 31 -15 5 -83 -57 -23 -26 52 -6 2 0 53 -53 5
7496 5 24 -82 5 -20 4 12 31 4 -45 39 37 11 -23 -18 -18 -22 -33 -19 -14 36 16 8 -16 10 29 -10 26 -3 42 -26 40 -11 -4 37
7530 37 -37 -32 -44 27 52 -12 5 -22 -1 54 31 -11 -49 -41 -5 -13 39 0 24 -10 2 -4 -22 32 26 41 31 33 24 54 -16 -34 4 4
$$ packed form
7301B9k2OK4k2PK3m6k4J0Pj0K8l7N2j2l2L6Ql0N5j9j22L6M2M8m4Nn1P6pn4J1O1
7334C2o7P5o8k4L6M9l1M3m2j4J8j7L5Kr6N8l1N7J0k3m1N8l1K2m3OO4o4M4o3O3
7365A7l6J6o5L9P8j15j7M1ON0K4k0Kj2Om2K2K6J5l7k7M1P0j28P5oj7m7N5N2m1
7396B5l4P4m2m3jmqML0l6nM4Joj0Km0K6K8JRl7J4k4Qk2P0k6K3m4l1R5l0n7N8L0
7432D2j17J09o3N0k4l4J8M0j2k6O6j6l8l9O0k4J8k7LK7l4KK6m7L8rL0k6Ll3J2
7463b5N2km8J4K1J3J6m2%lJ3j2K4k9nM3L9k9m2L3m6K0q8K6L4lP8n8QkN3j06N8
7496EJ9j06Q7k5K4QJ9k7m9Q4kk6l4N%mj1J4NN0k0qk4K6J9l9L6k9M5o8O6n1PM1
7530C7p4Nj2P1K5o4J7k7K1N5k3m2l8QL6qN2l9K4l4J2oj8N4oJ5j0KrL0p0j8L8%
$$ plain form
7564 4 -22 7 23 -46 -41 56 -17 18 -4 25 7 28 61 -34 27 29 -8 18 -18 38 -66 0 8 43 -36 -36 13 21 -17 -5 55 16 -16
7597 -16 37 47 -74 -17 -10 22 49 -20 -31 2 -28 -33 17 -7 51 -13 27 29 -27 38 -48 -3 -50 -77 -24 33 -6 -22 -12 -23 -31 -16
7629 -16 -30 40 -41 -44 37 66 28 5 -8 -49 -28 19 -36 4 18 -1 4 -7 34 -17 -52 -57 -22 -33 12 12 -2 26 17 20 -12 17 -19
7662 -19 -50 17 29 -26 1 -26 13 5 -21 25 0 1 22 46 -9 3 42 8 56 68 52 5 -20 -9 48 44 -27 -7 -17 16 40 67
7694 67 27 23 6 -32 21 79 16 -13 13 -19 -16 10 -9 7 -11 -6 -6 -40 28 32 -48 32 35 43 1 0 69 -7 -15 2 -82 38 -10 2
7728 2 36 51 38 -2 22 -16 -13 43 29 54 48 62 35 1 45 -7 13 -9 -25 16 -57 -11 50 37 -23 27 -28 -19 -12 20 -6 -15 2
7761 2 46 -21 12 39 31 63 11 16 0 -9 96 16 20 -10 10 41 -16 -2 20 24 14 -8 9 39 -3 43 23 -6 5 6 -22 -23 6 -59
7795 -59 -18 -32 27 66 22 -31 9 -9 -13 -6 -10 14 -51 7 31 35 11 -33 49 2 42 25 -32 50 -31 11 33 -36 -34 1 8 -12 32
$$ packed form
7564Dk6K9J6o9NR7p3L5k2K9j8K1L3r5O1Kl7K6l6N6j04O6QL5p9%M9Ql8J2O0l9l2
7597a6N3J0j21N7PL2K7o9j1L3l0nN0k4N8o4M0Kn6O5q6M5m7k7N3N7l9j6J0j1qJ5
7629a6j4P0q1lQ1K9l8k3j3m1K1M7n5M0J4j9Nj1M1n1l5nL5j1M5%j4K8rLl2K9l6
7662a9l1O7J2n5K7k7L9qk6M6k5JK1K4n5J2L9l4M8J2j6m7k5J1N7mp1K0j0L3K4K7
7694F7m0mj7l8N3N8o3k9K6l2LK6j9J6j8N%l4O8Mq0Q0LQm2jO9p6qJ7q4J20m8J2
7728BL4J5j3m0K4l8LN6j4K5oJ4k7l4M4n2K0k2j6M1p3M6O1j3o0N0n5RPL2k6rJ7
7761BM4o7L3K7qL2n2Nj6rJ05q0Ml0K0L1n7J4K2Mj0k2J7L0m2M6k0k9J1Jk8jK9o5
7795e9M1j4N9L9m4n3M0j8mPmK4o5N8K4Mk4m4Q2m7M0j7n7Q2q1M2K2o9KL5Pk0M4
$$ plain form
7828 32 -29 20 -24 -12 3 -12 -34 6 78 -30 -11 22 21 -15 5 4 -13 -46 13 14 37 -36 -4 56 -4 39 -28 -18 -14 5 -17 28
7860 28 8 -38 -40 -29 -33 1 -3 -25 -2 14 17 -64 -21 20 -22 -18 -13 -71 9 -3 -35 -14 23 62 10 -19 17 19 -32 19 -9 -14 -28 -2
7894 -2 60 13 -1 -29 12 -7 -6 -12 -15 -37 -22 -40 27 -32 -8 -3 -18 67 -12 8 -33 4 3 14 21 -22 51 -8 14 8 60 3 -16 17
7928 17 -25 12 -15 -5 16 -49 -11 22 -6 22 12 4 35 -3 34 25 -70 28 -14 6 24 29 26 -33 41 48 -47 -24 -17 -17 13 21 12 -17 3
7963 3 28 -6 13 29 -1 -40 3 69 5 -20 -26 49 36 -96 -24 14 32 10 47 18 34 -8 49 40 63 21 -1 -15 -37 23 -36
7994 -36 18 18 9 5 0 -3 3 33 -10 -31 -4 -25 18 39 -30 -14 71 -2 16 6 22 84 9 38 -19 -7 -11 13 13 20 17 36 65 78 22
8029 22 0 -21 20 1 5 46 -13 -15 -50 19 44 2 -14 26 41 8 64 -39 4 46 41 -18 -12 7 54 19 7 27 15 2 11 -51
8061 -51 16 -14 -45 33 48 31 -9 18 5 2 27 8 -46 -52 -15 -21 13 -58 -26 -12 -2 -11 -57 -22 -11 7 -33 1 13 -1 -13 -45
$$ packed form
7828C2o1M9m4J2J5j5k2M0P2j08J9L3jl6K0jj7l3N9JK3p3L2O0o0M3o7J0MJ9k2M5
7860B8k0m6kJ1mL4mk2K3J6Lq1M3M1m2MNn8Q0j2l2K1L7L9n2k9L6Kn1N1k8nj4K6
7894bO2m7j4k8M1j9Jolk2J5j8O7n9K4Nj5Q5p9K0m1L7jJ1Pm3P3n9K2oN2n7j9L3
7928A7m2L7k7J0K1o5L8L3k8K8j0qL1l8L7rr5R8m2K0J8Nln9P4Pr5K3P%L0Qrk9K0
7963CK5l4J9J6l0l9M3O6o4k5oP5j3j32P2L8J8k2L7k9J6m2N7rK3m2k2j4k2O0n9
7994c6N4%rmnlOL0m3k1K7k1M3K1o9J6Q5p3J8j0J6O2p5K9n7J2mK4%PlJ9K9J3n6
8029B2k2k1M1j9MM1n9kl5O9K5m2j6M0J5l3N6j03M3M2nn9OJ9M7l5j2K0j2j3Ro2
8061e1O7l0l1P8J5j7m0K7j3lK5j9n4oL7oL4p1L2J4J0rm6L5J1J8m0L4J2j4j2l2
$$ plain form
8093 -45 6 12 56 -10 37 -16 -33 -28 -2 3 -22 -5 -23 -29 17 11 27 -21 67 -18 -55 23 -22 -23 -2 21 14 25 13 101 -26 8 30
8126 30 -44 -8 -5 -29 16 -13 9 -44 -5 24 2 -21 -44 -4 8 21 34 7 1 13 38 -2 15 37 56 -50 -32 11 3 -16 -33
8157 -33 53 -5 28 -32 -25 -37 44 -15 -10 10 -2 39 -28 0 20 -20 -87 24 -1 59 41 8 -14 39 -44 49 31 1 -20 16 -4
8188 -4 19 -25 -57
$$ packed form
8093d5N1OM4o6M7n3j7NK6Nk5J7j8oM6oJ6m8Q8q5l7P8m5jK1K3pJ1j2Q8j27L4K2
8126C0p4L6Lk4M5k9K2n3L9K9k2k3k3M0J2J3J3k7oJ2K5m0J7K2J9j06J8M3qj9j7
8157c3Q6n8L3o0Pj2Q1n9NK0j2M1o7K8K0m0o7J11k5O0j8l3k2N3q3R3j8l0k1L6k0
8188dK3m4l2
8191e7
$$ Imaginary data points
##PAGE= N=2
##DATA TABLE= (X++(I..I)), XYDATA
$$ plain form
0 0 0 0 0 0 0 0 0 0 0 0 0 8 -8 8 -8 16 -16 24 -24 32 -40 48 -56 64 -72 88 -96 112 -128 152 -172 196 -224
33 -224 252 -286 320 -360 402 -450 504 -560 622 -689 763 -844 932 -1028 1134 -1251 1377
50 1377 -1516 1672 -1843 2034 -2248 2490 -2764 3082 -3450 3884 -4408 5051 -5867 6935 -8409
65 -8409 10572 -14078 20745 -38067 186003 383064 97236 -113814 -276700 -259831 -178032
76 -178032 -21888 113755 226531 226004 124406 -55484 -185356 -211037 -114357 12990 108096
87 108096 124063 96329 44236 -8515 -68884 -106381 -95731 -21860 64207 103762 66683 -603
99 -603 -41987 -36542 -19876 -17696 -21959 -3633 32335 51561 26365 -20266 -43734 -24444 9412
112 9412 21787 5398 -12934 -9317 10927 20095 5005 -17082 -19233 1922 21521 14386 -12737
$$ packed form
0@%%%%%%%%%%%Qj6J6j6K4l2M0m8N6p2Q8j04J20j36J60j84K08k40K80l24L68m20
33b24M76n38O06o80P62q52R54j064J182j311J452j607J776j960K162k385K628
50A377k893L188l515L877m282M738n254N846o532P334q292R459j0918J2802j5344
65h409J8981k4650L4823n8812K24070J97061k85828k11050j62886J6869Q1799
76a78032J56144J35643J12776n27j01598j79890j29872k5681R6680J27347R5106
87A08096J5967k7734n2093n2751o0369l7497J0650P3871Q6067L9555l7079o7286
99f03m1384N445J6666K180m263J8326L5968J9226k5196m6631k3468J9290L3856
112I412J2375j6389j8332L617K0244R168j5090k2087k151K1155J9599p135k7123
$$ plain form
125 -12737 -26683 -7770 22682 28230 2536 -22695 -18015 7472 18574 1122 -19862 -13759 13991
138 13991 28912 11618 -18268 -27311 -7538 15914 16916 -1655 -14195 -5073 12973 15871 -2461
151 -2461 -21924 -19025 5083 23904 15686 -9435 -21048 -5914 15412 14635 -7689 -22165 -8207
164 -8207 17897 22968 231 -22085 -17274 7005 20302 7357 -13739 -16317 2150 17831 11725
177 11725 -8353 -18309 -6747 12620 17009 1506 -15253 -13002 5590 17680 7856 -12182 -17208
190 -17208 -233 17715 13456 -7779 -19024 -5795 14704 16345 -2535 -17636 -10149 9718 16639
203 16639 2562 -13976 -12595 3917 14979 7519 -8984 -14519 -2775 12009 12017 -2661 -14324
216 -14324 -8691 7673 14666 3017 -13183 -13171 3701 16195 8096 -10383 -15813 -1117 14819
$$ packed form
125a2737j3946J8913L0452N548k5694k5231M680K5487J1102j7452k0984O103K7750
138A3991J4921j7294k9886r043J9773K3452J002j8571j2540R122J8046K898j8332
151b461j9463K899K4108J8821q218k5121j1613J5134K1326p77k2324j4476J3958
164h207K6104N071k2737k2316M811K4279J3297j2945k1096k578J8467J5681o106
177A1725k0078r956J1562J9367M389j5503j6759K251J8592J2090r824k0038n026
190a7208J6975J7948m259k1235j1245J3229K0499J641j8880j5101P487J9867O921
203A6639j4077j6538J381J6512J1062p460j6503n535J1744J4784Qj4678j1663
216a4324N633J6364O993j1649j6200J2J6872J2494q099j8479n430J4696J5936
$$ plain form
229 14819 11654 -6327 -15835 -5006 11820 13558 -1354 -13924 -8977 6750 13839 4221 -10059
242 -10059 -11761 886 12528 9297 -5281 -13546 -5217 10096 13215 -30 -13489 -10164 6218
255 6218 15051 4881 -11631 -13407 1848 14562 8620 -8152 -14281 -2621 11898 11293 -3231
268 -3231 -13257 -6899 7354 12103 2187 -10148 -10228 1855 11587 7155 -6222 -12138 -3277 9800
282 9800 10750 -1824 -12468 -7558 7047 12890 2341 -11083 -10274 3516 12776 5768 -8201 -11331
296 -11331 -190 10910 8119 -4398 -10885 -3850 7632 9566 10 -9387 -7221 3765 10182 4248
310 4248 -6977 -9638 -412 9694 7826 -3977 -10999 -4016 8179 10117 -867 -10868 -7093 5704
324 5704 11043 2285 -9183 -8943 2421 10369 5239 -6198 -9800 -1404 8442 7795 -2257 -9428 -5079
$$ packed form
229A4819l165j7981r508J0829J6826J738j4912j2570M947J5727P089r618j4280
242a0059j702J2647J1642l231j4578q265Q329J5313L119j3245j3459L325J6382
255F218Q833j0170j6512j776J5255J2714n942j6772o129J1660J4519o05j4524
268c231j0026O358J4253M749r916j2335q0J2083R732m432j3377n916Q861J3077
282I800R50j2574j0644M910J4605N843j0549j3424Q09J3790R260p008j3969l130
296a1331J1141J1100k791j2517o487P035J1482J934r556r397K166J0986O417n934
310D248j1225k661R226J0106j868j1803p022O983J2195J938j0984j0001L775J2797
324E704N339q758j1468K40J1364P948n130j1437l602Q396R846o47j0052p171M349
$$ plain form
339 -5079 5409 9381 1869 -8121 -8310 1894 9911 5611 -5813 -10183 -1837 9062 8606 -2769
353 -2769 -10638 -4948 6877 9940 590 -9173 -7317 3674 9845 3808 -6661 -8630 -105 8324
367 8324 6551 -3079 -8818 -3864 5803 8361 721 -7920 -6825 2746 8933 4067 -6039 -8661 -357
382 -357 8391 6412 -3714 -9049 -3065 6668 7819 -827 -8318 -5242 4124 8044 1894 -6368 -6581
397 -6581 1187 7352 4453 -3830 -7264 -1761 5867 6313 -1036 -7131 -4483 3915 7527 1753 -6406
412 -6406 -6449 1655 7698 4058 -4737 -7485 -738 6904 5833 -2567 -7509 -2963 5154 6798 27 -6642
428 -6642 -4998 2741 7048 2681 -4846 -6485 -181 6313 5086 -2424 -7096 -2959 4901 6745 88
443 88 -6794 -5249 2941 7398 2593 -5531 -6672 534 6981 4649 -3343 -7142 -2009 5458 6018 -820
$$ packed form
339e079J0488L972p512r990j89J0204Q017m300j1424m370Q346J0899m56j1375
353b769p869N690J1825L063r350r763J856J0991O171o037j0469j969Q525Q429
367H324j773r630n739M954R667K558p640q641J095R571O187m866j0106k622Q304
382c57Q748j979j0126n335N984R733J151q646p491L076R366L920o150q262k13
397f581P768O165k899q283l434N503P628M46p349o095K648Q398L612n774q159
412f406m3Q104O043l640q795k748O747P642j071q400m942M546Q117J644o771o669
428f642J644P739M307m367p527j639O304O494j227p510m672M137P860J844o657
443H8o882J545Q190M457m805q124j141P206O447k332p992l799N133P467N60o838
$$ plain form
459 -820 -6540 -4124 3250 6560 1805 -5090 -5720 608 6251 4223 -3037 -6484 -1985 5066 5775 -709
475 -709 -6351 -4032 3326 6504 1434 -5326 -5294 1303 6253 3278 -3707 -5934 -796 5223 4657 -1522
491 -1522 -5631 -2733 3511 5264 583 -4804 -4190 1597 5412 2489 -3603 -5238 -366 4984 4087 -1973
507 -1973 -5595 -2174 3963 5071 -175 -5322 -3698 2496 5464 1559 -4340 -4726 673 5171 3110
522 3110 -2730 -5155 -1194 4184 4359 -891 -5011 -2968 2746 5135 1190 -4243 -4424 936 5069 2923
538 2923 -2930 -5114 -922 4509 4293 -1301 -5187 -2694 3191 5014 625 -4521 -3969 1482 5012 2300
554 2300 -3071 -4650 -489 4284 3740 -1395 -4756 -2249 3071 4503 451 -4240 -3608 1427 4721 2091
570 2091 -3071 -4431 -239 4207 3417 -1599 -4595 -1837 3194 4140 -41 -4099 -2924 1806 4195 1431
$$ packed form
459h20n720K416P374L310m755o895o30O328N643k028p260l447M499P051P09o484
475g09n642K319P358L178n070o760L2O597M950k975o985k227N138O019n66o179
491a522m109K898O244J753m681n387O14N787L815k923o092j635M872N350q97o060
507a973l622L421O137J108n246n147J624O194K968l905n899l86N399M498k061
522C110n840k425L961N378J75n250m120K043N714K389l945n433j81N360M133k146
538B923n853k184M192N431k16n594l886K493N885J823m389n146N52N451L530k712
554B300n371j579M161M773n44n135l361K507N320J432m052m691O32N035L294k630
570B091n162j360M192M446p90n016k996K758N031R46m181m058J175M730K389k764
$$ plain form
586 1431 -3055 -3689 181 3868 2704 -1812 -3993 -1201 3042 3474 -335 -3755 -2452 1903 3929 990
602 990 -3149 -3330 672 3866 2169 -2225 -3857 -653 3319 3051 -1003 -3762 -1866 2419 3611 358
618 358 -3317 -2884 1192 3742 1643 -2485 -3551 -222 3384 2752 -1299 -3751 -1538 2542 3462 86
634 86 -3418 -2643 1437 3712 1373 -2684 -3393 70 3422 2483 -1531 -3664 -1252 2644 3175 -218 -3386
651 -3386 -2344 1593 3471 1169 -2573 -3047 233 3242 2170 -1519 -3373 -1041 2585 2921 -283 -3173
667 -3173 -2033 1578 3233 826 -2566 -2666 481 2991 1776 -1642 -2999 -632 2471 2461 -546 -2908
683 -2908 -1567 1630 2795 479 -2414 -2263 603 2765 1359 -1683 -2633 -272 2360 2109 -783 -2730
699 -2730 -1215 1772 2519 92 -2445 -1910 974 2645 986 -1914 -2386 78 2444 1797 -1137 -2602
$$ packed form
586A431m486o34L870L687j164m516k181K792M243M32l809l420J303M355K026k939
602I90m139j81M002L194j697m394j632L204L972k68m054k759J896M285J192l253
618C58l675M33M076K550k099m128j066L329L606o32m051k452K213M080R20l376
634H6l504P75M080K275k339m057p09L463L352r39m014k133K412L896N31l393l168
651c386J042L937J878k302l742m74L280L009j072l689j854K332L626L36l204k890
667c173J140L611J655k407l392j00L147K510j215l418j357K367L103j0l007k362
683b908J341L197J165k316k893J51K866K162j406l042r50K361K632k51k892j947
699b730J515K987P47k427k537N35K884J671j659k900m72K464K366o47k934j465
$$ plain form
715 -2602 -786 1947 2332 -240 -2468 -1616 1259 2563 636 -2056 -2212 327 2528 1532 -1368 -2558
731 -2558 -612 2124 2101 -484 -2419 -1493 1364 2499 489 -2104 -2130 465 2476 1328 -1383 -2371 -404
748 -404 2082 1987 -443 -2352 -1318 1401 2310 390 -1978 -1839 627 2312 1119 -1416 -2197 -271 1947
765 1947 1718 -625 -2243 -1065 1389 2094 125 -1889 -1640 653 2032 887 -1385 -1919 -64 1828
781 1828 1420 -730 -1935 -741 1386 1724 -18 -1781 -1320 832 1897 579 -1395 -1674 223 1796
797 1796 1119 -920 -1869 -418 1431 1546 -281 -1764 -1013 1001 1707 318 -1458 -1494 347 1719 950
814 950 -1084 -1713 -242 1486 1370 -429 -1733 -826 1071 1697 126 -1487 -1326 520 1758 824 -1121
831 -1121 -1634 -156 1521 1315 -529 -1643 -751 1183 1660 97 -1554 -1260 558 1631 770 -1098 -1505
$$ packed form
715b602J816K733L85k572k228Q52K875J304j927k692j56K539K201r96k900j190
731b558J946K736k3k585j935R26K857J135k010k593k6K595K011j148k711r88J967
748d04K486r5k430j909J034K719R09j920k368J39K466J685j193k535p81J926K218
765A947k29k343j618J178K454P05j969k014K49K293J379j145k272n34J855J892
781A828m08k150j205J194K127L38j742j763M61K152J065j318j974k79J897J573
797A796o77k039r49J451J849J15j827j483P51K014P06j389j776l6J841J372p69
814I50k034o29J471J728j16j799j304R07J897O26j571j613J61J846J238r34j945
831a121n13J478J677k06j844j114Q92J934M77j563j651K94J818J073q61j868m07
$$ plain form
848 -1505 -65 1464 1220 -530 -1606 -654 1055 1466 18 -1400 -1136 534 1550 610 -1027 -1427 -19
865 -19 1367 983 -540 -1408 -504 1071 1272 -57 -1289 -892 572 1377 420 -1057 -1172 68 1266 803
883 803 -670 -1350 -340 1026 1081 -172 -1275 -692 712 1250 213 -1006 -1051 313 1226 610 -724 -1146
901 -1146 -178 1090 934 -317 -1148 -522 823 1145 113 -1119 -893 453 1178 500 -794 -1079 1
918 1 1093 885 -404 -1168 -445 887 1044 -12 -1140 -812 501 1093 409 -884 -1039 91 1072 742
936 742 -508 -1127 -368 841 986 -63 -1044 -686 511 1141 353 -853 -893 94 1022 626 -474 -1019 -352
955 -352 756 843 -112 -924 -617 495 993 269 -734 -831 158 938 558 -479 -906 -188 708 773 -178 -892
975 -892 -495 535 819 121 -673 -729 203 822 423 -481 -810 -87 694 552 -268 -759 -346 503 742 45
$$ packed form
848a505J440J529k44j750j076R52J709M11j448j418K64J670J016r40j637m00J408
865a9J386l84j523q68R04J575K01j329j232L97J464Q05r57j477j15J240J198m63
883H03j473o80J010J366N5j253j103N83J404N38j037j219m5J364R13o16j334m22
901a146R68J268j56j251q31O26J345L22j032j232K26J346P25o78j294k85J080
918AJ092k08j289p64P23J332J57j056j128L28J313N92o84j293j55J130R81l30
936G42j250o19P59J209J45j049r81L58J197O30p88j206m0R87R28l96j100n45O67
955c52J108Q7r55q12L07J112M98p24j003r7R89P80l80j037m27P18Q96O5r51p14
975h92L97J030K84o98p94n6R32O19l99r04l29P23P81j42q20m91M13Q49K39o97
$$ plain form
995 45 -640 -514 326 685 278 -510 -683 56 714 509 -332 -751 -232 563 646 -105 -716 -502 328 697 174
1016 174 -547 -681 60 758 490 -401 -738 -223 565 639 -102 -645 -440 369 704 95 -567 -615 119 693 398
1037 398 -295 -638 -178 558 624 -110 -631 -412 353 669 192 -528 -613 118 609 396 -352 -638 -111 516 533
1058 533 -51 -545 -344 325 604 150 -478 -532 105 521 264 -258 -600 -86 481 451 -107 -498 -225 279 461
1079 461 105 -429 -384 126 486 261 -330 -469 -31 447 374 -161 -479 -206 351 437 -17 -400 -371 188 437
1100 437 189 -325 -462 -37 433 242 -178 -472 -106 335 393 -47 -441 -303 187 498 151 -369 -398 49 450
1121 450 257 -201 -412 -147 379 399 -79 -420 -284 190 445 162 -334 -372 11 450 280 -179 -481 -178 331
1142 331 403 -46 -382 -274 232 476 104 -325 -276 4 371 294 -163 -369 -120 357 379 32 -379 -242 146
$$ packed form
995D5o85J26Q40L59m07p88j73P39O58k05q41m19N19P95Q3p51o11K14Q30L69n23
1016A74p21j34P41O98k68q91l37N15P88P4p41n43K05Q09L35o09o62m8P34N74k95
1037C98o93l43M60P36O6p34n21K19P65L16m77p20q5P31M91k13p48k86N27O27J7
1058E33n84m94K01O69K79m54o28n4O37M16k57n22l42N14N67l0n58l91K73N04J82
1079D61l56n34M5N10L60k25n91j39M38M78p3n35l18K73N57Q6m54l83K9N59K49
1100D37k48n14j37M25M70j91m20k94L66M41N8m40l94J38M90L11l47n20k9M47M01
1121D50j93m58k11K65N26K0m78l41J36M74K55k83m96l8L83M39j70m59l02L03N09
1142C31P2m49l36J08N06K44l72m29M9K80L67p7m57k06K49M77K2l47m11J37L88
$$ plain form
1163 146 360 147 -253 -347 59 362 214 -105 -307 -129 232 289 1 -279 -233 186 299 55 -228 -292 29
1184 29 299 174 -146 -322 -64 252 227 -82 -314 -189 164 247 8 -252 -182 92 280 132 -169 -232 -38 275
1206 275 197 -118 -335 -104 201 233 36 -277 -272 108 348 159 -198 -272 -40 206 277 -71 -334 -125 159 229
1228 229 30 -311 -189 96 304 64 -167 -249 -43 265 191 -72 -270 -183 160 257 23 -195 -172 100 282 124
1250 124 -143 -293 -36 290 200 -24 -276 -136 169 321 20 -257 -245 47 218 110 -173 -265 -15 209 182
1271 182 13 -234 -103 183 211 42 -145 -162 19 261 60 -180 -225 -5 200 169 -101 -182 -90 194 177 6
1293 6 -175 -143 48 208 111 -154 -213 13 162 166 -62 -223 -43 188 152 15 -201 -115 66 228 34 -177 -215
1316 -215 4 182 170 -103 -205 -11 192 204 -8 -212 -157 152 204 90 -88 -225 40 233 108 -128 -266
$$ packed form
1163A46K14k13m00r4M06L03j48l19k02J78L61N7k88k80M6M19J13k44k83o4L21
1184B9K70j25l20j76K58L16k5l09k32J25L53Q3k39k60P0K74J88j48l01o3J94L13
1206B75p8l15k17K31L05L2j97l13NL80K40j89l57p4K32K46P1l48k63K09K84P0
1228B29j99l41J22K85K08k40k31q2K06L08p4k63j98Q7L43R7k34k18K3K72J82j58
1250A24k67j50K57L26r0k24k52J40L05J52l01k77J2K92J71j08k83r2K50K24k7
1271A82j69k47J31K86K8j69j87j7J81K42k01k40m5K20K05l1k70q1R2K84j7j71
1293Fj81L2J91J60r7k65n9K26J49Mk28j61J80K31l6j37k16Q6J81J62j94k11l8
1316b15K19J78j2k73j02J94K03J2k12k04N5L09N2j14j78j37K65J93j25k36j38
$$ plain form
1337 -266 -60 173 148 -42 -233 -156 74 221 38 -134 -222 9 224 143 -101 -174 -96 177 138 -57 -153 -134 111
1360 111 282 75 -142 -164 -4 187 182 -119 -222 -53 128 199 -34 -149 -114 70 249 34 -155 -214 25 205
1382 205 97 -124 -213 -41 157 158 -49 -204 -199 59 206 42 -122 -182 33 149 97 -76 -176 -77 166 184 -87
1405 -87 -211 -142 66 212 28 -211 -177 61 212 110 -143 -128 21 158 181 -98 -167 -85 149 206 75 -189 -125
1428 -125 77 185 119 -157 -198 -27 168 125 -76 -232 -103 184 230 -3 -156 -148 63 223 110 -156 -170 -59
1450 -59 183 170 -61 -235 -98 121 275 27 -223 -179 -5 183 89 -108 -202 5 166 178 -78 -171 -52 100
1472 100 159 42 -188 -185 64 196 63 -171 -235 -22 176 128 -116 -248 -33 152 181 -28 -261 -99 126 217
1494 217 69 -206 -183 -2 243 119 -84 -198 -98 165 144 -31 -166 -70 91 258 -24 -127 -96 2 241 124
$$ packed form
1337b66K06K33k5j90j91P7K30J47j83j72q8K31K15q1k44p3P8K73l9j95r6J9K45
1360A11J71k07k17k2J60J91nl01j03J69J81P1k33j15L5J84J79k15j89n9K39J80
1382B05j08k21q9J72J98Jk07j55NK58J47j64j64o0K15J16n2j73j00R9K43J8k71
1405h7j24O9K08J46j84k39L4K38J51j02k53J5J49J37K3k79o9Q2K34N7j31k64O4
1428a25K02J08o6k76m1J71J95m3k01j56J29K87M6k33j53QK11J60j13k66j4J11
1450e9K42j3k31j74J37K19J54k48k50M4J74J88r4j97r4K07J61J2k56r3J19J52
1472A00N9j17k30LK49J32j33k34o4K13J98m8k44j32K15J85K9k09k33J62K25R1
1494B17j48k75K3J81K45j24k03j14J00K63k1j75j35R6J61J67k82j03L1R8K39j17
$$ plain form
1516 124 -105 -273 -19 172 121 -48 -220 -139 141 177 33 -253 -232 51 302 121 -133 -183 11 199 114 -40
1538 -40 -248 -154 206 239 6 -268 -205 107 189 97 -170 -211 -64 158 215 -111 -258 -97 110 202 8 -209 -145
1561 -145 115 231 58 -142 -233 -6 178 171 -125 -254 -79 180 199 -34 -202 -180 74 136 92 -192 -216 68 191
1584 191 142 -83 -212 -51 214 144 -3 -208 -119 140 183 60 -166 -148 13 232 96 -126 -161 -9 158 171
1606 171 -34 -197 -136 140 215 79 -130 -126 78 236 102 -129 -189 -62 191 160 -22 -257 -50 141 210 37
1628 37 -171 -163 94 191 86 -177 -151 -61 167 158 -73 -207 -38 194 184 -18 -180 -160 98 191 79 -171 -235 -10
1652 -10 150 121 -135 -231 -17 186 218 -61 -227 -133 87 257 79 -150 -163 0 198 114 -58 -190 -23 142
1674 142 176 0 -179 -111 127 187 45 -167 -190 16 171 40 -137 -187 -38 119 166 -2 -192 -98 121 164 15
$$ packed form
1516A24k29j68K54J91n1j69j72Q1K80L6j44k86K1K83K51j81k54n0J94J88q5j54
1538d0k08R4L60L3k33k74O3L12Q2r2k67m1J47K22N7l26j47J61K07R2j94k17O4
1561a45K60J16j73k00r1K27J84pk96j29J75K59J9k33j68K2K54O2m4k84k4K84J23
1584A91m9k25j29J61K65p0j47k05Q9K59M3j23k26J8J61K19j36k22l5J52J67J3
1606A71k05j63O1K76P5j36k09MK04J58j34k31o0J27K53l1j82k35K07J91O9j73
1628C7k08QK57R7j05k63K6R0K28rk31j34J69K32j0k02j62K0K58R3j12k50o4K25
1652a0J60k9k56r6K14K03L2k79j66R4K20J70j78k29j3J63J98q4j72j32J67J65
1674A42L4j76j79O8K38O0j42k12k3K06J55j31j77n0J49J57M7j68j90R4K19M3j49
$$ plain form
1697 15 -183 -118 58 163 45 -112 -156 -42 156 142 -34 -190 -48 127 192 12 -213 -148 93 218 107 -121
1719 -121 -165 32 191 99 -89 -229 -36 154 123 -30 -155 -102 89 196 86 -170 -145 35 188 157 -108 -218
1741 -218 -86 173 181 -38 -213 -115 118 212 46 -153 -146 51 205 70 -68 -237 7 160 85 -25 -164 -64
1763 -64 109 208 18 -95 -123 92 244 25 -125 -205 -36 120 94 -67 -221 -58 143 162 -12 -206 -153 114
1785 114 194 40 -129 -132 27 194 154 -90 -129 -54 126 154 10 -132 -110 115 101 44 -165 -136 6 160 74 -118
1809 -118 -199 -47 138 153 -21 -173 -85 151 209 17 -189 -137 83 170 124 -57 -151 -6 118 120 -75 -202 -107 62
1833 62 191 86 -108 -97 38 181 117 -54 -147 -6 231 141 -64 -194 -25 151 164 17 -170 -76 68 129 64
1856 64 -176 -143 22 119 126 -61 -154 -117 114 114 -26 -178 -101 126 170 58 -106 -205 59 159 156 -76 -143 -56 121
$$ packed form
1697A5j98O5J76J05j18j57m4J14J98j4j76j56J42J75O5j80k25O5K41J25j11k28
1719a21m4J97J59r2j88j40J93J90l1j53j25N3J91J07j10k56K5J80J53l1k65j10
1741b18J32K59Qk19j75R8K33R4j66j99PJ97J54j35j38j69K44J53p5j10j39J00
1763f4J73R9j90j13k8K15J52k19j50q0J69J56k6j61j54J63K01J9j74j94N3K67
1785A14Q0j54j69lJ59J67m0k44l9P5J80K8j44j42K2K25j4n7k09K9J42J54q6j92
1809a18q1J52J85J5j74j52Q8K36N8j92k06N2K20Q7m6j81r4J45J24Kj95j27R5J69
1833F2J29j05j94J1J35J43o4j71r3J41K37r0k05j30J69J76J3j47j87R4J44O1o5
1856F4k40L3J65R7Pj87r3L7K31%j40j52P7K27M4j12j64r9K64J00lk32o7Q7J77
$$ plain form
1881 121 107 -57 -159 -51 96 126 68 -82 -87 78 122 92 -108 -196 -61 127 130 -31 -190 -48 70 125 -64 -103
1905 -103 -72 33 134 28 -100 -146 36 207 155 -66 -140 -76 87 96 -14 -134 -63 33 181 92 -95 -143 -10 115
1929 115 82 -26 -144 -78 84 152 30 -196 -66 132 144 62 -155 -138 -22 147 70 -44 -88 -21 150 62 -30 -102
1953 -102 -97 49 119 59 -65 -105 2 112 55 -17 -113 -12 144 108 -13 -141 -64 72 101 48 -144 -111 59 150 48
1978 48 -22 -122 -81 122 97 -64 -141 -103 135 96 67 -125 -115 54 138 111 -85 -107 16 94 85 -21 -161 -18 86
2003 86 139 -48 -120 -17 53 109 -25 -189 -41 -5 140 69 -9 -108 -63 89 156 -12 -140 -87 67 38 50 -139 -98
2028 -98 9 158 38 -75 -151 -31 102 149 -76 -142 -11 98 83 7 -60 -66 75 138 105 -67 -125 -43 87 108 -33
2053 -33 -109 -71 45 186 73 -96 -57 80 133 66 -88 -122 1 127 71 -71 -129 -52 80 86 -43 -76 -80 95 83
$$ packed form
1881A21j4j64j02J08J47L0n8j50nJ65M4l0k00q8J35J88Lj61j59J42J18N5j89l9
1905a03L1J05J01j06j28m6J82J71n2k21p4O4J63Rj10j20P1R6J48q9j87m8J33J25
1929A15l3j08j18O6J62O8j22k26J30J98J2q2k17J7J16J69p7j14m4O7J71q8r2p2
1953a02NJ46P0o0j24m0J07J10n7p2r6J01J56l6j21j28P7J36K9n3j92L3J70R1j02
1978D8p0j00M1K03k5j61p7L8K38l9k9j92J0J69Q4k7j96k2J23P8rj06j40J43J04
2003H6N3j87p2J03P0N6j34j64J48L6J45p1p8r9M5J52O7j68j28N3J54k9J2j89M1
2028i8J07J49j20j13p6J20J33M7k25o6J31J09j5p6o7oJ41O3l3j72n8Q2J30K1j41
2053c3p6L8J16J41j13j69L9J37N3o7j54l4J23J26n6j42n8P7J32Oj29l3mJ75j2
$$ plain form
2078 83 4 -86 -112 32 132 100 -68 -138 -67 116 154 32 -97 -55 66 138 72 -129 -139 -1 114 73 -49 -111 39
2103 39 98 91 9 -79 -44 65 80 11 -73 -85 30 112 46 -70 -103 -44 139 81 23 -92 -11 74 132 -31 -112 -79 35
2130 35 105 28 -80 -92 15 23 58 -55 -105 -31 100 100 9 -125 -57 12 125 -16 -76 -90 -15 112 100 -25 -100 -57 116
2157 116 99 -6 -165 -129 85 99 -11 -101 -50 69 137 32 -49 -112 6 124 70 -81 -126 1 66 122 4 -110
2181 -110 -60 62 83 15 -109 -103 -1 125 80 -49 -123 -52 93 126 19 -71 -54 57 96 37 -59 -94 3 113 49 33
2207 33 -138 -18 56 47 -4 -95 6 25 105 39 -91 -111 40 158 46 -72 -53 50 86 44 -35 -95 3 94 104 23
2233 23 -88 -64 -41 89 26 -13 -114 -22 103 31 0 -129 -71 83 97 -25 -108 -91 11 80 24 -58 -77 1 46 76
2259 76 -29 -124 -28 62 78 49 -57 -75 15 71 84 -68 -104 -5 86 52 -43 -82 -89 99 55 -64 -63 -49 61 27 5 -82
$$ packed form
2078H3p9r0k6J44J00l2j68p0P1J83L8j22j29M2J21P2o6k01j0J38J15m1j22o2J50
2103C9N9pq2q8L5J09J5o9q4j2J15Q2o6j16l3N9J83n8n8j15Q1Q5N8j63q1L3J14
2130C5P0p7j08j2J07QL5j13n0P4J31%r1j34O8O9J13j41o0j4P5J27j2j25p5M3J73
2157A16j7j05j59L6K14J4j10r0N1J19O8j05q1o3J18J18n4j51m5J27O5N6j18j14
2181a10N0J22K1o8j24OJ02J26m5j29p4P1J45L3j07r0J7J11L9n9r6l5R7J10o4j6
2207C3j71J20P4rn1r1J01J9Q0o6j30k0J51J18j12j18J9J03L6m2p9o0R8R1J0q1
2233B3j11K4K3J30o3l9j01R2J25p2l1j29N8J54J4j22q3J7J02O9n6q2j9P8M5L0
2259G6j05r5R6R0J6k9j06j8R0N6J3j52l6R9R1l4r5l9pJ88m4j19JJ4J10l4k2q7
$$ plain form
2287 -82 -40 3 73 38 -4 -46 17 78 14 -19 -34 -41 62 90 -1 -104 -12 32 40 75 -53 -80 1 3 9 8 -106 -20 124 45
2317 45 6 -65 -68 17 116 10 -75 -91 2 19 33 -92 -63 1 102 35 -11 -32 3 37 35 -1 -68 -58 2 64 61 -25 -99 27
2347 27 68 119 -50 -114 -79 41 16 17 -141 -70 17 30 57 -48 -31 27 38 45 -11 -34 -85 8 115 -28 -61 -69 -12 21 55
2376 55 -27 -58 -3 84 66 -18 -20 -5 41 45 20 -36 -4 19 14 13 -65 -74 -5 15 5 -92 -94 9 93 10 -55 -3 -63 43 63 -42
2408 -42 -24 -59 37 78 27 -55 -49 -17 54 96 -17 -11 -36 6 82 -40 -36 -53 -14 55 48 -63 -38 42 114 41 65 -36 -57 53
2438 53 79 0 -84 -81 52 53 14 -66 -77 -21 68 36 2 -56 -25 35 61 -25 -97 -24 -14 54 25 -54 -20 -78 65 35 -10 -73
2468 -73 -71 65 2 -21 1 -90 69 27 31 -45 -42 -3 40 64 -24 -61 -30 43 13 -58 -89 -40 2 -5 22 -45 -25 31 41 -46 5
2499 5 -96 19 10 -18 14 -75 -20 49 55 36 -5 -38 45 19 -11 -65 -71 21 58 51 -11 -20 5 37 81 9 -98 -21 9 12 -21 -48
$$ packed form
2287h2M2M3P0l5m2m2O3O1o4l3j5pJ03K8r1j03R2M4QL5j28k7Q1KOjj14Q6J44p9
2317D5l9p1lQ5R9j06q5j6R3J7J4j25K9O4J01o7m6k1L5L4kl6o7J0O0O2lq6p4J26
2347B7M1N1j69o4L5J20k5Jj58P1Q7J3K7j05J7N8J1Pn6k3n1R3J07j43l3qN7L3L4
2376E5q2l1N5Q7j8q4kJ5M6Mk5n6L2K3njp8rO9K0j0r7kJ03Q4q3o5N2o0J06K0j05
2408d2J8l5R6M1n1q2OL2P1M2j13Ok5M2P6j22Mj7L9O9pj11K5Q0P2p3K4j01k1J10
2438E3K6p9q4LJ33Jl9q0j1N6Q9l2l4n8L1O0K6q6p2P3J0O8k9p9L4n8J43l0m5o3
2468g3KJ36o3k3K2r1J59m2Mp6LL9M3K4q8l7L1P3l0p1l1M9M2pK7o7K0N6J0q7N1
2499Ej01J15rk8L2q9N5O9Oj9m1l3Q3k6l0n4oR2L7po2rK5L2M4p2j07P7L0Ll3k7
$$ plain form
2531 -48 -25 -10 64 34 -25 -26 -14 77 46 -32 -10 -3 -4 26 34 -26 -4 3 70 53 22 -65 -7 38 32 -36 -45 -120 29 63 45 -45 3
2564 3 18 82 33 -22 -59 32 12 55 -2 -40 -51 -2 71 -29 -99 -16 23 -34 42 -40 -17 14 45 -40 -21 -13 -9 22 11 -6 -4 -54
2596 -54 26 11 50 -44 39 11 21 49 -4 -46 -38 53 47 -33 -4 -72 37 -1 -27 -36 -64 -16 98 -9 -54 -34 36 64 -8 -24
2626 -24 -44 -12 57 15 -23 -33 -7 25 89 0 11 -16 81 106 11 -39 -32 30 17 82 -16 -14 -21 91 25 18 -46 1 -19 15 -37 -53
2658 -53 -48 13 35 35 4 -49 15 34 50 -24 18 -10 23 88 6 -58 -33 -21 55 56 6 -87 -14 19 40 -24 -18 44 -28 -38 8 -29
2690 -29 -11 6 51 1 -7 41 -99 7 -14 5 -4 -2 50 24 -9 -19 -51 -51 32 6 5 -46 6 27 100 42 -29 26 16 70 -48
2721 -48 -38 -18 7 65 20 -19 0 -14 15 36 -19 -71 -16 70 40 -25 -120 11 19 35 -43 -45 -63 16 47 -17 -48 -34 -34 70 -22
2752 -22 -37 -8 -10 -38 28 -10 -81 3 20 11 37 -6 -92 -89 39 9 -25 -7 -74 46 73 -25 -50 -28 -34 33 26 -31 -16 -45 -50 6
$$ packed form
2531d8K3J5P4l0n9jJ2R1l1p8K2PjL0Qo0K2PO7j7l1q7N8M5oo8rp5J49L4j8r0M8
2564CJ5O4m9n5l7R1k0M3n7l8j1M9P3j00p0Q3L9n7P6q2K3L1L1q5J9QML1j1j7Kn0
2596e4Q0j5L9r4Q3k8J0K8n3m2QR1oq0K9o8J09l8k6rk8M8J14j07m5K0P0K8p2j6
2626b4k0L2O9m2l8j0K6L2O4q9J1k7R7K5r5n0PO2j3O5r8KpJ12o6po4M7k0L4n2j6
2658e3NO1K2%l1n3O4J9J6p4M2k8L3O5q2o4K5J2P6Jn0r3P3L3K1o4OO2p2j0M6l7
2690b9J8J7M5n0qM8j40J06k1J9rKN2k6l3j0l2%Q3k6jn1N2K1P3n8p1N5j0N4j18
2721d8J0K0K5N8m5l9J9j4K9K1n5n2N5Q6l0o5r5J31QJ6p8kj8P9L1o4l1J4%J04r2
2752b2j5K9kk8O6l8p1Q4J7rK6m3q6LJ28l0l4J8o7J20K7r8k5K2oO7pn7J5k9nN6
$$ plain form
2784 6 -1 -49 -36 44 37 64 0 -69 -6 44 -17 15 -11 6 13 -5 8 -47 9 83 -14 13 8 -4 68 56 -12 -51 -4 8 24 -31 -18
2817 -18 -23 -37 25 8 6 -7 21 15 9 -15 -14 -30 6 22 78 -50 -14 18 45 38 -41 -12 15 38 89 -4 -5 -30 1 27 -3 -5 0 -32
2851 -32 -4 -7 12 -33 -38 -8 27 12 -46 -9 26 26 -3 -26 -51 41 20 4 -41 -55 10 29 -26 -12 -39 -76 -7 40 14 -25 -14 6
2883 6 -1 77 -20 -62 15 5 29 -10 -5 39 10 9 -25 -5 2 20 54 -30 -52 19 37 26 -10 35 -66 12 -39 57 -25 16 -13 68
2915 68 20 23 24 -24 -20 28 51 -24 1 18 -17 46 28 -63 25 0 57 -15 8 -16 3 70 19 -44 0 6 8 20 15 -21 -49 6 24
2948 24 -44 -8 -30 -12 33 -32 -14 4 -30 29 28 25 -18 -34 -4 8 -79 -22 35 -4 6 46 38 12 -7 28 59 25 16 5 -2 37 25
2981 25 -45 -11 74 -9 30 -36 0 53 33 35 -24 -13 -54 16 -37 32 -47 -49 11 21 -11 -18 35 -9 -31 -38 -19 -10 26 64 63 45 27
3014 27 -8 26 75 75 -32 41 7 28 21 -32 11 22 17 10 -28 -3 -43 7 22 -4 -30 -35 -2 32 -10 -60 4 -23 9 5 -12 -34 35
$$ packed form
2784Fpm8J3Q0pK7o4o9O3N0o1L2k6J7Pj8J3n5N6P4r7K7nj2P2j2o8l9M7J2J6n5J3
2817a8nj4O2j7kj3K8ook4Jj6L6J6N6j28L6L2K7pp9K9K7K3N1r3jk5L1K6l0kNl2
2851c2K8lJ9m5nL0L5j5n8L7L5%k9k3k5R2k1j6m5j4O5J9n5J4k7l7O9M7k6l9J1K0
2883FpP8r7m2P7j0K4l9NM4k9jl4K0PJ8L4q4k2P1J8j1l6M5j01P8n1R6q2M1k9Q1
2915F8m8LJm8MM8K3p5K5J7l5O3j8r1Q8k5N7p2K3k4J9O7n1o3M4OKJ2nl6k8N5J8
2948B4o8L6k2J8M5o5J8J8l4N9jlm3j6L0J2q7N7N7l9J0M0qk6j9L5L1l4rj1pL9j2
2981B5p0L4Q5q3L9o6L6N3k0Kn9J1m1P0n3O9p9kO0J0l2pN3m4k2pJ9RL6L8jj8j8
3014B7l5L4M9%j07P3l4K1pn3M3J1npl8K5m0N0J5k6k6nL3L4m2n0O4k7L2mj7k2O9
$$ plain form
3047 35 -26 -18 -4 -32 -22 33 -7 -10 -25 -33 14 -28 47 -47 -34 47 -21 -42 -42 -49 24 -86 -54 -13 72 -17 29 -14 -67 -44 -20 -16 -33
3080 -33 26 -33 -40 -25 -6 12 -8 -44 -46 36 -30 70 7 -3 14 64 20 8 7 -3 45 -12 86 23 31 2 29 11 21 -40 -25 11
3112 11 -14 30 -47 32 -20 -3 -55 -34 -29 39 -41 15 -5 -6 15 4 1 -9 -9 68 79 48 53 18 39 -8 -21 -23 -2 -45 -54 61 34
3145 34 10 -42 25 34 17 -6 14 48 -1 15 -34 19 8 -1 5 18 -13 -31 51 1 3 -75 -11 -9 -21 9 8 50 13 -12 35 -28 -8
3178 -8 -26 -2 -11 35 -45 -2 -14 37 -12 22 9 19 29 -72 11 -40 51 -51 -50 5 6 -54 8 -20 -3 18 -27 66 43 16 -43
3209 -43 -26 41 -56 11 -18 -5 -54 -23 -11 -7 -39 -15 30 21 21 15 -13 -30 -5 42 -24 5 -39 -37 -6 25 -18 4 -3 33 5 -13 14
3242 14 -30 -23 -6 -7 -37 6 7 -45 42 46 -25 -19 5 34 15 -17 -8 0 7 -33 0 1 20 41 -28 48 -7 -28 46 -41 -17 -21 11 26 -6
3277 -6 4 -36 17 38 6 23 32 5 39 -13 -3 26 8 42 28 -49 -31 26 65 92 34 29 -11 0 3 36 30 -16 17 47 71 1 10
$$ packed form
3047C5o1QJ4k8J0N5m0lj5qM7m2P5r4J3Q1o8k1%pP3j10L2M1Q5q9M6m3n3K3K4Mj7
3080c3N9n9pJ5J9J8k0l6kQ2o6J00o3j0J7N0m4j2jj0M8n7R8o3Qk9K7j8J0o1J5L6
3112A1k5M4p7P9n2J7n2K1NO8q0N6k0jK1j1lj0%P7J1l1Nl5K1m7j3kK1m3rJ15k7
3145C4k4n2O7Rj7k3K0L4m9J6m9N3j1rOJ3l1j8Q2n0Kp8O4Kj2L0jM2l7k5M7o3K0
3178hj8K4rM6q0M3j2N1m9L4j3J0J0j01Q3n1R1j02JN5Jo0O2k8J7K1m5R3k3k7n9
3209d3J7O7r7O7k9J3m9L1J2Ml2K4M5r%ok8j7K5M7o6K9m4KL1L1m3K2pL6k8j8K7
3242A4m4PJ7jl0M3Jn2Q7Mp1OK4K9j9l2RQPm0L3JJ9K1o9P6n5k1P4q7K4mL2J5l2
3277fJ0m0N3K1l2J7Rk7L4n2J0K9j8L4j4p7J8N7L9K7n8nm0J1LL3om6L3L0K4p0R
$$ plain form
3310 10 -4 -3 29 33 -18 -8 -42 -5 34 -4 -9 40 -66 38 -12 -9 -38 -8 16 -5 57 -77 -59 -17 76 9 -8 36 -14 -5 -39
3341 -39 -22 6 -17 19 23 9 31 6 29 67 -14 12 12 -22 24 -20 36 -63 -26 -16 -48 -24 17 -34 -11 20 -14 -5 -13 -24 -22 -12 -44
3374 -44 -31 -46 34 -9 -30 6 8 -39 -78 33 -1 -23 14 28 -26 -8 7 11 -11 45 54 -25 21 5 14 -15 -43 3 11 6 -4 40 -60
3407 -60 -97 -69 18 20 0 3 24 -2 4 68 -40 -37 1 -3 11 -23 -37 16 20 1 -26 7 4 0 21 -4 -10 -22 16 22 -8 44 -51 -31 28
3442 28 15 13 33 62 38 -71 -50 -31 38 -39 -22 -56 -10 -50 -58 -4 -24 -12 25 26 22 -7 -31 -31 12 25 48 -1 -41 41 1 -46
3474 -46 5 22 22 11 39 59 18 -30 -38 -5 30 55 -5 27 43 67 0 -11 9 48 -26 -1 22 24 -10 -16 -16 51 -39 -55 -31 -63 -21
3507 -21 -8 -11 -19 45 -6 1 12 64 21 -46 12 55 -10 -11 -20 -50 18 -2 50 -23 40 23 20 -25 1 -34 -5 15 -32 -13 -17 45 35 34
3541 34 21 11 27 -48 11 5 48 11 53 -15 -2 -26 -37 56 -9 -15 34 -38 34 17 -16 1 45 -17 31 18 -20 13 59 32 73
$$ packed form
3310A0j4JL2Mn1J0l4L7L9l8nM9j06J04n0Lk9L0K4k1O2j34J8M2R3o7j7M4n0Rl4
3341c9J7K8k3L6Mj4K2k5K3L8q1K6%l4M6m4N6r9L7J0l2K4M1n1K3L1l4Rqj1KJ0l2
3374d4J3j5Q0m3k1L6Km7l9J11l4k2L7J4n4J8J5Mk2N6Rp9M6j6Rk9k8M6Qnj0M4j00
3407f0l7K8Q7Kk0LK1k6OO4j08LL8mJ4l4j4N3Mj9k7L3lmK1k5oj2L8Ol0N2r5K0N9
3442B8j3kK0K9k4j09K1J9O9p7J7l4M6m0qN4k0J2L7Jmk9k4%M3J3K3m9m0Q2m0m7
3474d6N1J7%j1K8K0m1m8qL3L5K5o0L2J6K4o7j1K0L9p4K5K3Kl4o%O7r0j6K4l2M2
3507b1J3lqO4n1PJ1N2m3o7N8M3o5jrl0O8k0N2p3O3j7lm5K6l5K9K0m7J9mO2j0j
3541C4j3j0J6p5N9oM3l7M2o8J3k4j1R3o5oM9p2P2j7l3J7M4o2M8j3l8L3M6k7M1
$$ plain form
3572 73 -24 -11 58 -11 19 -27 37 -23 -5 -28 23 -9 -19 -28 -11 9 34 -7 21 34 46 -15 39 12 9 -69 -5 -29 31 -24 12
3603 12 6 19 26 45 5 -14 -8 -4 91 17 10 -11 50 13 7 -18 21 -4 5 29 -4 26 41 -17 25 -22 -39 -15 19 38 -1 -34 47 5
3637 5 19 13 4 60 17 38 24 70 23 50 -27 -19 0 -42 1 4 -29 -64 -8 83 45 -31 108 26 1 15 -5 3 20 -21 -1 -7 -19
3670 -19 -34 36 -48 -25 -8 8 -25 27 35 -16 -12 31 -24 -10 1 -15 30 18 -66 -4 13 7 16 2 62 4 -12 -17 18 1 -10 2 81
3703 81 26 2 7 3 -52 33 -37 30 8 13 -22 -12 -28 25 -37 -4 -18 22 -20 -42 13 -24 19 20 -43 -6 17 -2 -6 -3 26 -15 19
3736 19 -14 69 -15 12 36 27 17 -15 14 3 -3 45 -50 -57 22 -26 2 -5 -35 -32 35 -2 -13 -53 5 43 -24 -1 -12 64 10 27 17
3769 17 -48 -5 48 -2 56 16 25 -41 13 43 -14 34 -4 -9 16 -37 -3 -28 -34 10 7 -12 20 -47 -45 31 -23 3 0 7 -9 -19 -6 -7
3803 -7 16 11 14 -15 -20 -18 -29 -3 7 16 -41 11 16 3 17 -14 23 -27 -10 -106 11 26 -2 20 25 14 11 -45 28 -56 38 -53 -64 17
$$ packed form
3572G3r7J3O9o9L0m6O4o0J8k3N1l2j0rJ7K0K5m1K8J3J2o1N4k7lp8O4k4O0n5L6
3603A2oJ3PJ9m0j9OMR5p4pk1O1l7ok5L9k5RK4l3L0J5n8M2m7j7K4L4J9l9l3Q1m2
3637EJ4orN6m3K1j4M6m7K7p7QJ9m2M3Ll3l5N6R1l8p6J39q2k5J4k0QJ7m1K0oj2
3670a9j5P0q4K3J7J6l3N2Qn1MM3n5J4J1j6M5j2q4O2J7oRj4O0n8j6nL5j7j1J2P9
3703H1n5k4Nmn5Q5p0O7k2Nl5J0j6N3o2L3j4M0m2k2N5l7M3Jo3L7K3j9mLK9m1L4
3736A9l3Q3q4K7K4rj0l2K9j1oM8r5pP9m8K8pl0LO7l7j1m0N8L8o7K3j1P6n4J7j0
3769A7o5M3N3n0N8m0Ro6N4L0n7M8l8nK5n3L4k5oM4lj9L2o7KP6n4K6lPj6j0J3j
3803gK3nLk9nKj1K6J0Rn7N2Nj3J4l1L7n0J7r6J17J5k8K2Nj1ln6P3q4R4r1j1Q1
$$ plain form
3837 17 -3 49 -47 2 38 -21 -30 50 13 -13 -19 9 -2 29 22 27 20 -34 6 -3 -28 4 26 -5 34 25 16 14 -3 65 -16 0 6 -17 42
3872 42 0 37 30 -75 29 54 14 -18 -29 1 -6 20 -5 22 11 7 -33 13 28 -32 40 22 15 -3 -16 -17 11 -4 -29 4 -59 -13
3904 -13 34 -36 36 9 -8 17 0 -8 -46 7 12 -27 3 -22 4 -17 27 -4 6 -36 -41 17 -27 27 -40 -6 19 -2 -5 -2 -45 -48 -9
3937 -9 -13 -5 -1 14 65 -55 -32 -18 3 29 -8 2 -60 -29 22 17 -25 -65 16 32 -74 32 4 11 54 -9 -27 16 -14 -28 33 37
3969 37 -7 -31 -25 -27 10 -13 -31 61 -24 36 25 18 53 15 27 1 -15 21 12 27 -47 -8 -27 -4 -43 55 -41 -22 -15 5 -47 -32 -29
4002 -29 28 24 -40 -4 -17 -6 25 -14 -45 25 13 19 -20 56 -6 -13 -33 -19 -32 5 57 -2 1 -29 11 42 12 5 5 -5 -32 -15 -5
4035 -5 -39 -14 21 15 -6 79 63 24 9 12 -7 21 -25 39 -11 66 17 37 8 -18 10 -46 -4 25 -3 58 14 0 -18 3 -13 48
4067 48 27 18 19 12 38 10 1 0 33 -83 3 61 -14 26 -48 17 18 4 -56 23 -24 3 9 0 53 25 -12 0 33 22 38 -21 -65 50
$$ packed form
3837A7k0N2r6M9L6n9rQ0l7k6oK8j1L1pNpn4M0rk5L2K2l1L9rrkj7O8q1J6Ok3N9
3872D2m2L7pj05J04K5m0l2j1L0pK6k5K7j1mm0M6J5o0P2j8pj8j3jK8j5k5L3o3M6
3904a3M7p0P2k7j7K5j7ql8N3Nl9L0k5K6k1M4l1J0m2nN8m4N4o7L4K5k1lLm3lL9
3937imQMJ5N1j20K3J4K1K6l7J0o2L1N1nm2m0Q1J6j06J06k8PM3o3j8M3l0j4O1M
3969C7m4k4OkL7k3j8R2q5O0j1pL5l8J2k6j6L6rJ5p4L9j9K3l9R8r6J9PK0n2J5L
4002b9N7mo4L6j3J1L1l9l1P0j2Ol9P6o2pk0J4j3L7N2n9Ll0M0L1l0p%j0k7J7J0
4035el4K5L5ok1Q5j6l9j5Lj9K8m6O4n0P7m9K0k9k6K8n6M2K9k8O1m4j4j8K1j6O1
4067D8k1rJpK6k8rjL3j16Q6N8p5M0p4O5Jj4o0P9m7K7OrN3k8l7J2L3j1J6n9m4J15
$$ plain form
4101 50 -20 -23 8 -14 61 18 -16 5 -35 39 7 -1 -29 4 15 11 -11 9 -11 -3 14 -43 -21 -32 21 21 -54 -19 -21 3 12 22 31 11
4135 11 19 25 -19 -12 -26 7 37 92 -16 18 48 -6 -51 3 3 65 -23 7 -6 36 -44 -15 11 9 2 61 15 -6 -18 8 -10 12 -14
4168 -14 7 0 29 26 -4 32 -42 15 -66 33 25 72 -32 -21 39 35 -9 -44 8 22 7 -1 -14 -1 41 -15 81 7 -8 14 11 -10 -39
4201 -39 18 -28 48 14 -36 -5 4 -21 -21 -40 9 -35 -16 6 25 -26 -6 -13 -14 29 -42 -61 -8 -12 12 38 11 -1 4 -11 19 -34 51
4234 51 -6 -27 15 -31 -43 5 -7 -17 -9 5 15 3 23 2 -39 -45 8 -6 -6 36 -8 -54 10 -21 -56 -13 -26 -21 -16 -49 51 14
4266 14 64 -22 54 -75 -39 -27 -15 -6 51 17 11 -37 24 5 -14 -25 4 18 -30 -22 15 -6 12 -31 26 52 -37 -7 -35 -10 -19 -17
4298 -17 24 10 -2 -26 -9 -18 27 38 -39 19 77 -33 11 38 -63 -45 -32 15 62 52 31 -28 80 21 -26 6 -10 -31 24
4327 24 -2 36 30 -24 -58 18 29 4 22 -89 -37 12 2 -19 -8 35 44 14 -5 49 27 18 -50 -54 0 17 -1 28 35 -12 -42 -1
$$ packed form
4101E0p0lL1k2P5m3l4K1m0P4l2qk8L3J1mk2K0k0QJ7n7K2j1N3%p5L5kK4RJ0Rk0
4135A1QOm4Pj4L3L0N5j08L4L0n4m5N4%O2q8L0j3M2q0K9K6kpN9m6k1j2K6j8K2k6
4168a4K1pK9ll0L6p4N7q1R9qM7j04J1O0mm4l5N2J4j5qj3J3M2n6R6p4j5K2lk1k9
4201c9N7m6P6l4n0L1Rk5%j9M9m4J9K2J9n1K0pjM3p1j9N3mK4K6k7j2Nj5L0n3Q5
4234E1n7k1M2m6j2M8j2j0QJ4J0j2K0k1m1oN3j4%M2m4m6O4l1l5M3j3NNl3J00l7
4266A4N0q6P6j29L6J2J2RN7l4om8O1j9j9j1K9J4m8QL7k1J8m3N7K6q9L0k8K5rK
4298a7M1j4j2k4J7rM5J1p7N8N8j10M4K7j01J8J3M7M7j0k1n9J08n9m7L2j6k1N5
4327B4k6L8on4l4P6J1k5J8j11N2M9j0k1J1M3Rl0j9N4k2ro8mN4J7j8K9Pm7l0M1
$$ plain form
4359 -1 41 51 -36 16 -23 -1 -55 -19 21 8 47 34 68 -54 2 -33 10 -17 37 28 12 31 -32 12 -10 9 -43 -48 -14 36 5
4390 5 112 -15 -26 -10 28 37 -49 38 15 33 -14 65 18 53 28 2 -6 -12 11 -3 -3 19 11 39 6 -28 33 -27 16 -6 -27 -88
4422 -88 33 -40 1 -6 -69 -32 3 8 48 18 -9 34 1 30 33 20 22 -3 10 -38 28 19 -17 26 -71 -21 -66 2 17 25 29 72 -32
4455 -32 0 6 24 -23 31 -64 -14 5 -18 -39 12 6 14 16 -33 27 8 -8 -3 -15 13 10 -38 -55 23 -4 -7 2 43 42 -3 -29 5 10 69
4490 69 40 -22 2 15 -16 7 0 20 18 25 -29 31 -12 -2 -25 33 -4 -9 -9 28 4 -15 3 49 -26 -13 68 -8 -38 -17 30 -23 26
4523 26 -17 -5 -5 40 67 0 56 -23 6 -15 39 -43 58 -15 -62 0 -67 4 -20 35 -17 42 -6 -60 24 -17 -27 19 -45 -41 -10
4554 -10 -10 5 -7 7 13 -15 1 -27 57 13 -64 -13 23 -67 25 -41 2 -13 -94 -43 56 0 -11 60 -17 -25 13 -1 37 -26 63 -16
4586 -16 -51 7 40 -7 -2 -47 -43 76 -22 1 9 9 -34 -7 -40 -29 0 8 22 49 -21 21 -108 10 43 16 50 -40 -17 25 1
$$ packed form
4359aM2J0q7N2l9K2n4L6M0j3L9j3L4j22N6l5M3k7N4rj6J9o3M4k2J9n2nL4N0l1
4390EJ07j27j1J6L8Rq6Q7k3J8m7P9m7L5k5k6qoK3j4%K2qK8l3l4O1o0M3k2k1o1
4422h8J21p3M1po3L7L5NM0l0k7M3l3K9Lj3Kk5J3m8O6rl6M3r7N0m5O8J5QMM3j04
4455c2L2OJ8m7N4r5N0J9k3k1N1oQKm9O0j9j6Nj2K8lm8j7P8k7lRM1jm5k6L4NN9
4490F9k9o2K4J3l1K3pK0kPn4O0m3J0k3N8l7n%L7k4j9J8M6p5J3Q1p6l0K1M7n3M9
4523B6m3J2%M5K7o7N6p9K9k1N4q2J01p3m7O2o7P1k4N5n2N9m8n4Q4m1j0M6o4ML1
4554a0%J5j2J4Ok8J6k8Q4m4p7N1L6r0R2o6M3j5q1N1R9n6j1P1p7qL8j4L8o3Q9p9
4586a6l5N8L3m7Nm5MJ19r8K3Q%m3K7l3J1K9QJ4K7p0M2j29J18L3k7L4r0K3M2k4
$$ plain form
4617 1 2 29 1 -40 -20 -41 4 21 35 21 14 44 10 -8 32 -24 1 -23 -4 -56 3 -22 27 -2 -34 6 -82 23 -24 16 -10
4648 -10 24 12 33 44 -7 27 -15 -4 46 50 1 -13 -30 21 -24 8 40 -45 24 -52 12 15 -27 -27 -20 8 -17 26 44 -5 -12 7 18
4681 18 2 2 -3 18 10 -47 17 0 -47 27 -42 -10 36 26 12 5 -32 -87 29 29 -21 39 -25 -2 13 20 -15 -24 -22 -33 -22 -10 10 66
4715 66 6 -29 20 -11 30 3 5 -18 -3 84 -29 31 -37 -51 -68 -16 -23 0 20 27 -13 -52 -26 -28 -19 4 -17 40 97 -2 59 -61
4747 -61 0 30 11 9 1 -12 -22 -11 -3 22 -12 -58 -34 -19 -27 -32 9 -39 9 55 11 25 -44 -38 -44 46 -36 21 11 5 65 -38 17 -27
4781 -27 27 -44 -14 -10 29 35 60 20 38 -44 15 71 20 4 -12 -21 34 -10 -13 53 4 8 19 -21 2 27 -2 -11 -27 11 20 42 -22 11
4815 11 -24 26 73 32 36 -20 21 13 -43 13 17 3 -32 13 -28 34 -9 38 -26 6 15 22 -9 -43 15 -18 38 -22 41 -13 -27 -7 -40
4848 -40 6 21 10 -38 -38 -21 -35 -10 -16 26 14 13 -6 19 27 35 -18 -36 77 18 -43 -43 -6 6 27 -12 45 -35 -19 -22 -4 -21 -53
$$ packed form
4617AJK7k8m1K0k1M5J7J4j4pL0l4j8M0n6K5k4J9n2N9k5M9k9l2M0q8J05m7M0k6
4648a0L4j2K1J1n1L4m2J1N0Mm9j4j7N1m5L2L2q5O9p6O4Lm2%PK8k5M3J8m9pJ9J1
4681A8j6%nK1qn7O4j7m7P4o9L2M6j0j4pl7n5J16%n0O0o4K3J5Pl5rKj1J1J2K0N6
4715F6o0l5M9l1M1k7Kk3J5Q7j13O0o8j4j7N2pK3K0Pm0l9K6kRK3k1N7N7r9O1j20
4747f1O1L0j9kqj3j0J1QK5l4m6K4J5qnM1m8M8M6m4J4o9OoR0q2N7j0oO0j03N5m4
4781b7N4p1L0ML9OK5m0J8q2N9N6n1j6j6rN5m4lO6m9MJ1m0K3K5k9rj6L8RK2o4L3
4815A1l5N0M7m1Mn6M1qn6N6Mj4l5M5m1O2m3M7o4L2RPl1l4N8l3N6o0O3n4j4K0l3
4848d0M6J5j1m8%J7j4K5oM2j2jj9K5QQn3j8J13n9o1%L7J2K1l9N7q0J6lJ8j7l2
$$ plain form
4881 -53 45 33 -18 -9 8 -29 22 -19 -36 -60 21 27 35 -17 22 6 41 -19 11 -35 13 31 37 24 5 78 -40 -18 -31 7 47 17
4913 17 31 2 47 19 -23 -13 69 -34 5 34 9 21 -35 16 34 0 -20 -19 -19 -15 -52 43 -25 62 3 -25 -2 -60 -41 -33 -7 -21
4945 -21 -20 83 -41 5 10 23 -16 -41 -44 23 57 3 2 24 -6 24 -16 -16 -20 -16 7 20 -2 -41 -24 57 -11 7 -11 -39 -16 0 57
4978 57 29 -6 -8 7 24 45 34 34 -30 59 59 -15 37 73 9 27 -6 2 26 34 -25 -5 62 -19 -40 -16 49 7 45 2 5 -2 17 -9
5012 -9 -16 -15 33 -5 51 13 -37 27 -65 30 -19 -39 -18 -20 26 -4 -33 13 -58 -25 24 -36 -4 51 -25 7 42 21 25 47 -8 6 12
5045 12 16 14 13 29 25 28 30 -35 13 39 -44 -10 37 -14 -7 23 4 -1 3 6 52 28 -53 24 -36 15 26 -23 30 -54 9 -35 19 76 11
5080 11 -6 -27 -15 45 62 15 -4 -3 -13 32 -52 -38 -7 27 30 32 -56 24 -13 31 -50 -3 17 1 -33 -51 14 45 13 5 -13 10
5112 10 28 19 -37 -67 11 -34 17 25 14 0 6 -49 -4 -6 -19 -51 40 2 34 -26 -19 -52 -6 -23 29 -6 -3 27 9 -21 9 -5 -11 41
$$ packed form
4881e3R8j2n1RJ7l7N1m1j7k4Q1OQn2L9j6L5o0L0m6M8J8Oj3j9P3j18K2j3L8M0l0
4913A7J4k9M5k8m2J0Q2j03L9K9k5J2n6N1J8l4k0J%Ml7R5o8Q7n9k8K3n8J9QK6j4
4945b1JJ03j24M6NJ3l9k5lO7L4n4jK2l0L0m0%mMK3J3k2l9J7Q1o8J8j8k8K3J6N7
4978E7k8l5kJ5J7K1j1%o4Q9%p4N2L6o4J8l3QK4Qn9K0O7q1k1K4O5m2L8m3LpJ9k6
5012ipJM8l8N6l8n0O4r2R5m9k0K1kM6l0k9M6p1L3M9o0L2N5p6L2L5k1MK2n5J4O
5045A2MkjJ6mLKo5M8K6q3L4M7n1PL0j9nMLM6k4q1P7o0N1J1m9N3q4O3m4N4N7o5
5080A1j7k1J2O0J7m7j9Jj0M5q4J4L1L4LKq8Q0l7M4q1M7K0j6l4j8O5L1l2qj8K3
5112A0J8rn6l0P8m5N1Qj1j4On5M5kj3l2R1l8L2o0Pl3M6j7N2l5LL0j8l0L0j4oN2
$$ plain form
5146 41 12 33 42 -4 27 -55 56 24 9 15 20 -39 -20 69 27 0 4 -43 12 12 -38 7 32 -14 -23 0 64 24 13 -13 -6 24 34
5179 34 30 24 -27 -23 -77 -10 17 -42 -35 -10 22 16 -12 16 34 0 19 45 -17 -37 24 -47 6 -2 -3 87 0 -22 30 -43 -18 -36 -22 25
5213 25 -34 19 11 -7 21 -95 16 -60 16 -44 -24 40 1 37 -106 1 -26 12 1 -12 17 37 -32 -13 4 -24 -7 98
5241 98 4 -12 -50 7 -41 -44 2 5 -62 1 17 -7 15 48 62 -27 -31 10 -51 5 12 15 -7 9 -69 -34 -14 31 29 7 -53 -23 -36
5274 -36 -36 6 -4 68 -46 2 21 36 -52 48 -7 41 12 62 -4 8 -18 -54 -12 1 -17 33 50 27 -7 7 18 6 -51 2
5304 2 33 30 -39 -42 -10 -31 8 -26 -25 -15 -10 -7 -40 23 23 24 17 10 32 -35 -4 15 43 -9 15 15 13 1 -25 35 26 58 -10 13 -11 3 -53
5341 -53 43 9 -63 -25 -38 19 -32 21 9 -35 3 -57 -7 -23 -52 -37 -6 -22 -6 -6 -42 9 16 29 20 27 -60 7 -17 14 8 22 8
5374 8 33 -56 -19 43 34 7 48 -3 -9 0 24 15 -33 5 13 -32 9 -64 7 21 -21 2 22 -18 51 24 -27 -16 38 27 -21 -3 -9 -22
$$ packed form
5146D1k9K1Rm6L1q2J11l2j5ONn9J9Q9m2k7Mm7N5%n0M5K5m6rK3O4m0j1k6PL0J0
5179C4mon1Mn4O7K7n9PK5L2ok8K8J8l4J9K6o2k0O1p1N3qjR0q7k2N2p3K5j8J4M7
5213B5n9N3qj8K8j16J11p6P6o0K0O4l9L6j43J07k7L8j1j3K9K0o9J9J7k8J7J05
5241I8r4j6l8N7m8lM6Lo7O3J6k4K2L3J4q9mM1o1N6PLk2J6p8L5K0M5kk2o0L0j3
5274c6%M2j0P2j14M8J9J5q8J00n5M8k9N0o6J2k6l6M2J3j8N0J7k3l4J4J1j2n7N3
5304BL1lo9lL2k1L9l4JJ0NLl3O3%JppK2o7L1J9K8n2K4%kj2k6O0rL2o8K3k4J4n6
5341e3R6l4p2L8j3N7n1N3j2m4L8o0N0j6k9J5L1j6J6%l6N1PJ3rPq7O7k4L1oJ4j4
5374HK5q9L7O2rk7M1n1oRK4rm8L8Qm5M1p3P1J4m2K3K0m0O9k7n1J1N4j1m8J8oj3
$$ plain form
5408 -22 -24 14 -43 16 -34 25 59 5 41 -7 -34 57 -17 -49 34 10 -1 -14 -14 -25 15 30 -1 -11 -30 4 34 -30 6 11 -27 -63
5440 -63 59 3 42 -5 45 37 36 -5 -26 8 9 15 -9 24 37 18 -24 -35 44 19 -1 11 -7 18 10 -14 -23 19 -21 -13 4 12 -15 12
5474 12 8 -5 42 -65 -9 -21 -67 21 14 10 24 -15 -35 -26 10 28 -32 6 23 -8 -46 -29 -48 13 14 -11 -37 -8 32 -34 -21 27
5506 27 33 4 29 13 35 13 -19 46 -1 25 45 -13 -18 76 9 3 -12 24 -38 -40 -12 15 15 -56 -5 17 22 12 -41 -3 24 38 -2
5539 -2 21 11 -3 6 28 67 43 -17 7 8 6 -5 -5 -16 -28 -18 -23 29 -23 6 13 -40 -12 18 8 3 0 18 20 -30 0 -23 -18 -31 1 1
5575 1 -5 -26 -10 -28 36 7 -34 -20 6 66 14 -28 -15 9 9 -31 39 19 9 28 5 -14 30 -13 52 -30 -66 -15 2 14 -8 7
5607 7 0 -10 -29 -1 63 37 27 9 48 35 -27 -17 -14 -11 -34 38 -10 14 57 -27 38 21 33 45 -13 -21 38 -19 11 -4 -16 14 11
5640 11 16 27 -25 38 -5 4 56 30 -28 3 17 12 28 24 -15 -14 -10 10 61 -63 39 -15 -9 -34 -14 0 -30 15 -10 52 11 3 -22
$$ packed form
5408b2kL8n7N9n0N9L4n4L6m8k7R1p4l2Q3k4j1j3%j1M0J5l1j0j9L4L0o4L6Nl8l6
5440f3J22n6L9m7N0qjm1k1L4JOk4L3J3j9m2j1P9k5k0J2j8K5qk4rM2m0QJ7Qk7K7
5474A2mj3M7j07N6j2m6Q8pmJ4l9k0RL6J8o0L8J7l1l8J7j9O1Jk5k6K9M0o6J3M8
5506B7Ok9K5j6K2k2l2O5m7K6K0n8nR4o7oj5L6o2kK8K7%p1N1K2Nj0n3L8K7J4m0
5539bK3j0j4RK2L9k4o0K4Jkj1%j1j2J0nN2n2K9Pn3K8L0j0nlJ8Kn0L0k3Nj3L2%
5575Aok1J6j8O4k9m1J4K6O0n2m2J3K4%m0P0k0j0J9k3j9M4m3O5q2l6N1J7J2k2J5
5607Gpj0j9K8O4k6j0j8L9j3o2J0LLk3P2m8K4M3q4O5j7J2J2n8qN9n7L0j5j2L0l
5640A1NJ1n2O3m3RN2k6n8L1J4nJ6ml9JMK0N1j24J02n4Ok5K0J4l0M5k5O2m1qk5
$$ plain form
5673 -22 12 8 4 -26 -11 -24 57 -1 14 26 -54 10 14 -7 -8 -26 -8 -8 -6 19 -17 -17 -22 -37 4 -30 46 31 1 29 14 -11 -32 -6
5707 -6 -21 39 44 12 -26 -16 8 -19 7 30 -30 -17 22 -38 13 24 5 -25 9 -14 -43 -33 8 -17 8 -76 39 -11 -35 -57 7
5738 7 4 -16 -21 8 7 31 1 5 -17 -33 45 13 -45 47 32 16 59 -26 17 -51 -9 5 -14 2 -8 13 -8 9 -25 -16 1 25 29 48
5772 48 7 -65 -35 -27 -14 49 26 -13 4 -35 -16 24 40 20 -45 -5 8 0 -3 20 57 -18 26 6 83 -63 -22 13 71 -37 19
5803 19 15 -9 32 -22 26 13 6 7 54 38 39 -23 20 22 19 -29 -2 4 -6 -35 4 -24 32 0 39 68 11 -15 23 20 54 2 -21 -9
5837 -9 8 -14 -16 20 9 2 45 -22 9 -26 -13 56 -11 5 -15 -50 29 -18 -63 0 -10 -26 94 11 -57 14 -59 36 35 40 -15 12
5869 12 17 3 25 29 4 24 7 3 23 44 -35 17 33 16 5 63 49 24 15 -53 11 -20 1 -15 25 4 -5 -16 61 -11 -41 18 -20
5902 -20 22 -6 -4 -45 9 -12 -3 -21 -16 -23 45 -20 36 50 23 -68 3 3 1 65 47 21 37 15 47 -8 -29 19 30 21 24 5 -53 -45 7
$$ packed form
5673b2L4mml0J5j3Q1n8J5J2q0O4Mk1jj8J8%KK5l6%nj5M1l4P6j5l0K8j5k5k1K6
5707fj5O0Nl2l8J0K4k7K6K3o0J3L9o0N1J1j9l0L4k3k9J0M1k5K5q4J15n0k4k2O4
5738Glk0nK9jK4l0Mk2j6P8l2n8R2j5j6M3q5M3o8M2J4j9J6j0K1k1J7l4RJ7K4MJ9
5772D8m1p2L0QJ3O3k3l9J7l9J9M0J6k0o5M0J3qlK3L7p5M4k0P7j46M1L5N8j08N6
5803A9mk4M1n4M8j3pJM7j6Jo2M3Klm8K7Oj0k9L9k8N6l2L9K9n7k6L8lL4n2k3J2
5837iJ7k2kL6j1pM3o7L1l5J3O9o7J6k0l5P9m7m5O3j0j6J20q3o8P1p3R5jNn5K7
5869A2Nj4K2Mk5K0j7mK0K1p9N2J6j7j1N8j4k5ro8O4l1K1j6M0k1rj1P7p2l0N9l8
5902b0M2k8Km1N4k1Rj8NpO8o5N6J4k7r1P1%kO4j8k6J6k2L2n5k1M8J1rLj9n8QN2
$$ plain form
5937 7 -18 -32 26 -16 28 -13 -38 24 15 -16 -44 15 4 16 -15 44 38 -63 -26 -30 -8 -16 -48 26 57 21 24 22 -22 -10 22 -24 57
5970 57 -9 -2 4 6 45 0 18 3 -1 6 -44 53 22 -9 16 -5 -65 11 35 -67 -52 48 56 -51 2 20 4 9 -4 25 23 8 -74
6003 -74 25 58 25 21 41 -20 0 43 -16 -23 36 31 17 28 -26 -30 -19 3 -14 53 1 -4 -2 -6 -18 -7 -32 -29 20 -37 11 -26 -54 29
6037 29 -13 -7 33 32 -48 67 -18 1 50 6 26 -9 20 -14 -33 -33 -7 9 30 35 41 22 -25 17 10 -4 8 32 -37 5 1 9 17 13 -36
6072 -36 -48 5 19 7 -6 42 -26 -13 24 16 25 -45 -20 11 10 -16 -8 37 -10 49 33 30 -6 2 24 2 -27 -12 10 -17 -12 17 25 26 -35
6107 -35 -64 -51 -12 -8 -4 -80 0 -21 -12 40 -10 12 22 9 -25 -42 -12 26 -7 34 34 -31 12 -50 -39 -8 16 28 -26 61 -6 -24
$$ packed form
5937Gk5j4N8m2M4m1k5O2rl1k8N9j1J2l1N9oj01L7mK2ql2P4L1l6Lkm4J2L2m6Q1
5970E7o6POKL9m5J8j5mPn0R7l1l1K5k1o0P6K4j02J5J00Qj07N3J8j6Nj3K9kj5q2
6003g4R9L3l3mK0o1K0M3n9pN9nj4J1n4mJ1K2j7O7n2nKmj2J1k5LM9n7M8l7k8Q3
6037B9m2OM0jq0J15q5J9M9m4K0l5K9l4j9%K6J6K1NOj9m7M2pj4J2K4o9M2mQQmm9
6072c6j2N3J4j2j3M8o8J3L7qRp0K5L1jk6QM5m7N9j6ll6QK2k2k9J5K2k7NK9QJo1
6107c5k9J3L9MMp6Q0k1RN2n0K2J0j3l4j7L0L8l3M1%o5M3o2J1L1K4J2n4Q7o7j8
$$ [...]
8191a1
##END NTUPLES=NMR FID
##END=
