##TITLE=1H_Pr BuCl-2
 CDCl3, 8 sc, 
 1.07.2021
##JCAMPDX= 6.0         $$ Bruker NMR JCAMP-DX V2.0
##DATA TYPE= NMR FID
##DATA CLASS= NTUPLES
##ORIGIN= UXNMR, Bruker Analytische Messtechnik GmbH
##OWNER= root
$$ XWIN-NMR		Version 3.5
$$ Thu Jul  1 13:36:46 2021 Russian Standard Time (UT+4h)  she@DPX200
##.OBSERVE FREQUENCY= 200.131506
##.OBSERVE NUCLEUS= ^1H
##.DELAY= (6, 6)
##.ACQUISITION MODE= SIMULTANEOUS
##.ACQUISITION SCHEME= undefined
##.AVERAGES= 8
##.DIGITISER RES= 18
##SPECTROMETER/DATA SYSTEM= spect
##.PULSE SEQUENCE= zg30
##.SOLVENT NAME= CDCl3
##.SHIFT REFERENCE= (INTERNAL, CDCl3, 0, 15.7039)
##AUDIT TRAIL= $$ (NUMBER, WHEN, WHO, WHERE, WHAT)
$$ ##TITLE= Audit trail, XWIN-NMR		Version 3.5
$$ ##JCAMPDX= 5.01
$$ ##ORIGIN= Bruker BioSpin GmbH
$$ ##OWNER= she
$$ F:/spectra/data/she/nmr/H-F/1/audita.txt
$$ ##AUDIT TRAIL=  $$ (NUMBER, WHEN, WHO, WHERE, WHAT)
(   1,<2021-07-01 13:35:33.71 +0400>,<she>,<DPX200>,
      <created by zg, POWCHK disabled, PULCHK disabled
       configuration hash MD5:
       00 E9 B6 7A A2 85 ED C7 34 08 36 98 17 FE 4E 26
       data hash MD5: 16K
       B9 24 82 C8 67 BC B4 C8 D0 22 65 5C A3 D6 69 CD>)
$$ ##END=
$$ 
$$ hash MD5
$$ 64 40 DE DE 29 1F 4F 6E 01 40 B1 90 AF 7C 57 9D
##$RELAX= 
##$RELAX= 
##$RELAX= 
##$RELAX= 
##$RELAX= 
##$RELAX= 
$$ Bruker specific parameters
$$ --------------------------
##$DU= <F:/spectra>
##$EXPNO= 1
##$NAME= <H-F>
##$PROCNO= 1
##$TYPE= <nmr>
##$USER= <she>
##$AMP= (0..31)
100 100 100 100 100 100 100 100 100 100 100 100 100 100 100 100 100 100 
100 100 100 100 100 100 100 100 100 100 100 100 100 100 
##$AQSEQ= 0
##$AQ_mod= 1
##$AUNM= <au_zg>
##$AUTOPOS= <>
##$BF1= 200.13
##$BF2= 200.13
##$BF3= 200.13
##$BF4= 200.13
##$BF5= 200.13
##$BF6= 200.13
##$BF7= 200.13
##$BF8= 200.13
##$BYTORDA= 1
##$CFDGTYP= 0
##$CFRGTYP= 5
##$CHEMSTR= <none>
##$CNST= (0..31)
1 1 145 1 1 1 1 1 1 1 1 1 1 1 1 1 1 1 1 1 1 1 1 1 1 1 1 1 1 1 1 1 
##$CPDPRG= <>
##$CPDPRG1= <>
##$CPDPRG2= <>
##$CPDPRG3= <>
##$CPDPRG4= <mlev>
##$CPDPRG5= <mlev>
##$CPDPRG6= <mlev>
##$CPDPRG7= <mlev>
##$CPDPRG8= <mlev>
##$CPDPRGB= <>
##$CPDPRGT= <>
##$D= (0..31)
0 1.2 0 0 0 0 0 0 0 0.06 0 0.03 0 0 0 0 0.0002 0 0 0 0 0 0 0 0 0 0 0 0 
0 0 0 
##$DATE= 1625132133
##$DBL= (0..7)
120 120 120 120 120 120 120 120 
##$DBP= (0..7)
150 150 150 150 150 150 150 150 
##$DBP07= 0
##$DBPNAM0= <>
##$DBPNAM1= <>
##$DBPNAM2= <>
##$DBPNAM3= <>
##$DBPNAM4= <>
##$DBPNAM5= <>
##$DBPNAM6= <>
##$DBPNAM7= <>
##$DBPOAL= (0..7)
0.5 0.5 0.5 0.5 0.5 0.5 0.5 0.5 
##$DBPOFFS= (0..7)
0 0 0 0 0 0 0 0 
##$DE= 6
##$DECBNUC= <off>
##$DECIM= 32
##$DECNUC= <off>
##$DECSTAT= 4
##$DIGMOD= 1
##$DIGTYP= 9
##$DL= (0..7)
0 120 120 120 120 120 120 120 
##$DP= (0..7)
150 150 150 150 150 150 150 150 
##$DP07= 0
##$DPNAME0= <>
##$DPNAME1= <>
##$DPNAME2= <>
##$DPNAME3= <>
##$DPNAME4= <>
##$DPNAME5= <>
##$DPNAME6= <>
##$DPNAME7= <>
##$DPOAL= (0..7)
0.5 0.5 0.5 0.5 0.5 0.5 0.5 0.5 
##$DPOFFS= (0..7)
0 0 0 0 0 0 0 0 
##$DQDMODE= 0
##$DR= 18
##$DS= 0
##$DSLIST= <SSSSSSSSSSSSSSS>
$$ [...]
##$SUBNAM2= <"">
##$SUBNAM3= <"">
##$SUBNAM4= <"">
##$SUBNAM5= <"">
##$SUBNAM6= <"">
##$SUBNAM7= <"">
##$SUBNAM8= <"">
##$SUBNAM9= <"">
##$SW= 20.0188882624521
##$SWIBOX= (0..15)
0 0 2 0 0 0 0 0 0 0 0 0 0 0 0 0 
##$SW_h= 4006.41025641026
##$TD= 16384
##$TD0= 1
##$TE= 0
##$TE2= 300
##$TE3= 300
##$TEG= 300
##$TL= (0..7)
0 120 120 120 120 120 120 120 
##$TP= (0..7)
150 150 150 150 150 150 150 150 
##$TP07= 0
##$TPNAME0= <>
##$TPNAME1= <>
##$TPNAME2= <>
##$TPNAME3= <>
##$TPNAME4= <>
##$TPNAME5= <>
##$TPNAME6= <>
##$TPNAME7= <>
##$TPOAL= (0..7)
0.5 0.5 0.5 0.5 0.5 0.5 0.5 0.5 
##$TPOFFS= (0..7)
0 0 0 0 0 0 0 0 
##$TUNHIN= 0
##$TUNHOUT= 0
##$TUNXOUT= 0
##$USERA1= <user>
##$USERA2= <user>
##$USERA3= <user>
##$USERA4= <user>
##$USERA5= <user>
##$V9= 5
##$VALIST= <valist>
##$VCLIST= <CCCCCCCCCCCCCCC>
##$VD= 0
##$VDLIST= <DDDDDDDDDDDDDDD>
##$VPLIST= <PPPPPPPPPPPPPPP>
##$VTLIST= <TTTTTTTTTTTTTTT>
##$WBST= 1024
##$WBSW= 4
##$XGAIN= (0..3)
0 0 0 0 
##$XL= 0
##$YL= 0
##$YMAX_a= 353310
##$YMIN_a= -416628
##$ZGOPTNS= <>
##$ZL1= 120
##$ZL2= 120
##$ZL3= 120
##$ZL4= 120
##$ABSF1= 10
##$ABSF2= 0
##$ABSG= 5
##$ABSL= 3
##$ALPHA= 0
##$AQORDER= 0
##$ASSFAC= 0
##$ASSFACI= 0
##$ASSFACX= 0
##$ASSWID= 0
##$AUNMP= <proc_1d>
##$AZFE= 0.1
##$AZFW= 0.1
##$BCFW= 1
##$BC_mod= 2
##$BYTORDP= 1
##$COROFFS= 0
##$CY= 11.3945322036743
##$DATMOD= 1
##$DC= 2
##$DFILT= <>
##$DTYPP= 0
##$F1P= 15.9154993809931
##$F2P= -4.1035820241983
##$FCOR= 0.5
##$FTSIZE= 0
##$FT_mod= 4
##$GAMMA= 1
##$GB= 0.15
##$INTBC= 1
##$INTSCL= 1
##$ISEN= 128
##$LB= 0.24
##$LEV0= 0
##$LPBIN= 0
##$MAXI= 10000
##$MC2= 0
##$MEAN= 0
##$ME_mod= 0
##$MI= 1.114404
##$NCOEF= 0
##$NC_proc= 0
##$NLEV= 6
##$NOISF1= 3.799351
##$NOISF2= 2.8
##$NSP= 1
##$NTH_PI= 0
##$NZP= 0
##$OFFSET= 15.70392
##$PC= 1
##$PHC0= -11912.17
##$PHC1= 9.00099
##$PH_mod= 1
##$PKNL= yes
##$PPARMOD= 0
##$PSCAL= 0
##$PSIGN= 0
##$REVERSE= no
##$SF= 200.130013532006
##$SI= 16384
##$SIGF1= 3
##$SIGF2= 2
##$SINO= 400
##$SIOLD= 16384
##$SREGLST= <1H.CDCl3>
##$SSB= 0
##$STSI= 0
##$STSR= 0
##$SW_p= 3612.71676300578
##$SYMM= 0
##$S_DEV= 0
##$TDeff= 0
##$TDoff= 0
##$TI= <>
##$TILT= no
##$TM1= 0
##$TM2= 0
##$TOPLEV= 0
##$USERP1= <user>
##$USERP2= <user>
##$USERP3= <user>
##$USERP4= <user>
##$USERP5= <user>
##$WDW= 1
##$XDIM= 8192
##$YMAX_p= 0
##$YMIN_p= 0
$$ End of Bruker specific parameters
$$ ---------------------------------
##NTUPLES= NMR FID
##VAR_NAME=  TIME,          FID/REAL,        FID/IMAG
##SYMBOL=    X,             R,               I
##VAR_TYPE=  INDEPENDENT,   DEPENDENT,       DEPENDENT
##VAR_FORM=  AFFN,          ASDF,            ASDF
##VAR_DIM=   8192,          8192,            8192
##UNITS=     SECONDS,       ARBITRARY UNITS, ARBITRARY UNITS
##FACTOR=    0.0002496,     1,               1
##FIRST=     0,             0,               0
##LAST=      2.0444736,     0,               0
##MIN=       0,             -416628,         0
##MAX=       2.0444736,     353310,          0
$$ Real data points
##PAGE= N=1
##DATA TABLE= (X++(R..R)), XYDATA
$$ [...]
$$ plain form
2472 2307 1029 -2097 -2132 951 2207 -392 -1852 -1051 829 1893 305 -2349 -1680 1641 2666 -425
2488 -425 -3372 -653 3398 1765 -2025 -2763 799 2775 228 -1837 -1380 465 1782 799 -1184 -1742
2504 -1742 219 2014 739 -2027 -1140 1115 1683 35 -1393 -281 562 189 235 -110 -969 -684 1036
2521 1036 1603 -417 -1739 -67 1566 748 -530 -1278 -58 1012 1062 -336 -1869 -881 1739 1921 -1025
2538 -1025 -2917 -144 3070 1173 -2407 -2411 388 2412 699 -2131 -1440 453 2103 1000 -1973 -2207
2554 -2207 528 2688 747 -2880 -1770 1633 2100 -153 -1898 -1241 1014 1744 430 -1393 -1834 670
2570 670 2357 363 -1790 -1750 1277 2136 -70 -2023 -1015 997 1963 474 -1523 -1146 517 2051
2586 2051 671 -2073 -1723 1221 2448 457 -2652 -1407 1676 1898 -88 -1865 -911 1360 2126 161
$$ packed form
2472B307j278l126l5L083J256k599j460Q01J880J064j588k654O69L321J025l091
2488d25k947K719M051j633l790p38L562J976k547k065M57J845J317r83j983n58
2504a742J961J795j275k766Q87K255N68j648j428J112Q43l73M6l45q59K85J720
2521A036N67k020j322J672J633q18j278p48J220J070N0j398j533R88K620J82k946
2538a025j892K773L214j897l580mK799K024j713k830O91J893J650j103k973k34
2554b207K735K160j941l627J110L403M67k253j745O57K255P30j314j823m41K504
2570F70J687j994k153M0L027Q59k206j953J008K012R66j489j997L77J663J534
2586B051j380k744L50K944J227j991l109J245L083K22j986j777R54K271P66j965
$$ plain form
2602 161 -1954 -1457 1629 2497 -216 -2310 -1141 1698 2364 -630 -2140 -802 1540 1887 -299 -2086
2618 -2086 -1219 1340 2021 -327 -2404 -798 1405 1983 -440 -2523 -728 2054 1508 -230 -2208 -1091
2634 -1091 1496 1749 -245 -2310 -1020 2001 1874 -803 -2310 -617 2003 1817 -1193 -1762 -749 1861
2650 1861 1743 -774 -2445 -533 1803 1682 -1318 -2477 -113 1677 1471 -888 -2016 1 1715 1371
2666 1371 -903 -2186 -436 1868 1243 -1077 -2058 -322 2061 1433 -782 -1736 -279 1978 1121 -1095
2682 -1095 -1675 -204 2136 1205 -1257 -1666 243 1767 714 -1220 -1509 239 1832 1057 -993 -1558
2698 -1558 438 1607 832 -1002 -1451 420 1450 382 -860 -1107 287 1066 546 -475 -1505 -182
2714 -182 1739 1057 -1176 -1560 187 1874 475 -1262 -1152 79 1493 920 -1066 -1694 37 1843
$$ packed form
2602A61k115M97L086Q68k713k094J169K839O66k994j510J338K342L47k186j787
2618b086Q67K559O81k348k077J606K203N78k423k083J795K782n46j738j978J117
2634a091K587K53j994k065J290L021j27k677j507J693K620j86l010n69J013K610
2650A861j18k517j671J912K336j21l000j159K364J790k06k359j128K017J714l44
2666A371k274j283J750K304o25k320r81J736K383o28k215r54J457K257q57k216
2682a095n80J471K340r31k462m09J909J524j053j934k89J748J593p75k050n65
2698a558J996J169p75j834m49J871J030j068j242k47J394P79n20j021j030J323
2714a82J921o82k233l84J747J687j399j737J10J231J414n73j986o28J731J806
$$ plain form
2730 1843 1006 -1773 -1475 651 1646 470 -2034 -1231 1209 1371 -312 -1180 -938 688 1303 -45 -1258
2747 -1258 -978 1184 1322 -918 -1566 -276 895 563 -790 -415 631 4 110 84 -141 -118 -426 636
2765 636 411 -456 -166 368 327 325 -100 -443 -473 267 1391 310 -1163 -396 1280 1105 -925 -1635 545
2784 545 1517 542 -915 -1184 446 1624 150 -1216 -946 742 1775 19 -1964 -448 1742 1289
2800 1289 -1169 -1299 847 1529 148 -1220 -685 985 1008 -660 -682 35 930 183 -784 -834 405 800
2818 800 -139 -1306 -348 1641 87 -1498 -1216 675 1289 -682 -1614 -14 1046 576 -1047 -1333 452
2835 452 1628 87 -1288 -1079 1310 1586 -804 -1879 227 1670 504 -1271 -947 889 1244 -193
2851 -193 -1512 -351 1269 731 -994 -1250 247 1933 32 -1699 -751 1268 1449 -1119 -1706 638
$$ packed form
2730A843q37k779K98K126R95j176k504Q03K440J62j683q68K42J626O15j348j213
2747a258K80K162J38k240o48J290J171l32j353L75J046o27J06k6k25K3l08J062
2765F36k25q67K90N34m1km25l43l0P40J124j081j473P67J676j75k030p10K180
2784E45R72r75j457k69J630J178j474j366K70J688J033j756j983J516K190m53
2800A289k458j30K146O82j381j368N35J670K3j668k2P17Q95p47r67n0J239L95
2818H00r39j167R58J989j554j585K82J891O14j971r32J600J060m70j623k86J785
2835D52J176j541j375K09K389K76k390j075K106J443j166j775L24J836L55j437
2851a93j319J161J620n38j725k56J497J686j901j731R48K019J81k568n87K344
$$ plain form
2867 638 1254 -57 -1520 -953 1187 1514 -795 -1745 -107 1940 1235 -1746 -1771 1054 2193 240 -2414
2884 -2414 -911 2166 1453 -1366 -1676 374 2326 613 -1421 -1425 655 2058 105 -2354 -945 1596
2900 1596 1570 -1297 -2188 341 2061 -18 -1998 -915 1313 974 -1158 -1321 39 1130 108 -954
2916 -954 -1156 851 1122 -726 -1542 -580 1985 762 -1862 -1005 930 1769 -819 -2183 374 1924 784
2933 784 -1853 -1192 1346 1752 -268 -1597 -1020 1765 2148 -1158 -2565 -56 2578 1335 -2149 -1957
2949 -1957 1580 2273 -426 -2433 -785 1949 1424 -977 -1579 173 1756 1147 -1330 -1398 702 2067
2965 2067 -78 -2074 -258 1858 856 -785 -1347 939 1329 -480 -1396 342 716 489 -645 -823
2981 -823 663 983 228 -998 -887 1052 1381 -802 -1517 391 1960 12 -1942 -905 1194 1043 -814
$$ packed form
2867F38O16j311j463N67K140L27k309r50J638K047p05k981k5K825J139j953k654
2884b414J503L077p13k819l10K050J952j713k034mK080J403j953k459J409K541
2900A596k6k867q91K529J720k079j980J083K228l39k132j63J360J091j022j062
2916i54k02K007K71j848q16R62K565j223k624Q57J935Q39k588j364K557J550j140
2933G84k637O61K538M06k020j329N77K785L83l306j407K509K634j243l484J92
2949a957L537O93k699k007J648K734n25k401o02J752J583o09k477o8K100J365
2965B067k145j996J816K116j002j641n62K286L90j809r16J738L74k27j134j78
2981h23J486L20p55j226J11J939L29k183p15J908J569j948j954J037K099j51j857
$$ plain form
2998 -814 -1630 44 1540 643 -1196 -1427 551 1533 -45 -1765 -816 1211 1417 -1166 -2145 257 1536
3015 1536 284 -1692 -1380 1071 1103 -783 -1129 -343 1012 845 -883 -1298 113 931 548 -1485 -1072
3032 -1072 1161 993 -745 -1538 18 1186 235 -1100 -369 741 1129 -178 -774 -266 727 574 -83
3049 -83 -511 239 1230 251 -702 -387 812 770 -915 -511 600 509 -41 -475 107 429 185 -208 -198 419
3069 419 821 -97 -637 -183 493 665 -358 -1117 232 1435 237 -1307 -630 1018 974 -736 -1036 -129
3087 -129 699 578 -441 -1126 -227 935 670 -772 -1450 281 1160 -22 -928 -770 796 704 -525 -828
3105 -828 -462 628 394 -110 -634 -789 299 1115 56 -680 -454 532 812 -182 -435 -30 -105 302 283 -379
3125 -379 -575 243 709 769 -978 -907 556 1017 205 -1040 -894 538 867 357 -619 -972 237 1300 602
$$ packed form
2998h14q16J674J496q97j839k31J978R82j578j720R49K027K06k583r79K402J279
3015A536j252j976L12K451L2j886l46P86J355j67j728m15J411Q18l83k033M13
3032a072K233j68j738p93J556J168r51j335P31J110L88j307n96N08R93j53o57
3049h3m28P50R91r79r53L15J199m2j685M04J111r1n50m34N82L22k44l93J0O17
3069D19M02r18n40M54O76J72j023p59J349J203j198j544O77J648m4j710l00R07
3087a29Q28j21j019o85Q99J162k65j442o78J731Q79j182r06J58J566r2j229l03
3105h28L66J090k34n04n24j55J088Q16j059p36K26R86K80r94k53M05p5M07j9o62
3125c79j96Q18M66O0j747P1J463M61q12j245J46J432L29n10r76l53J209J063o98
$$ plain form
3144 602 -960 -1261 970 1639 33 -1225 -728 914 1283 -90 -940 -361 523 1253 131 -1199 -693
3161 -693 677 1509 -8 -1523 -850 1298 867 -230 -1244 -356 749 854 -280 -1316 -923 1019 1204
3178 1204 -480 -1630 -895 1159 1058 -613 -1582 -449 1153 1274 -623 -1300 -431 814 1176 -578 -1738
3195 -1738 -479 1439 1280 -648 -1862 60 1444 825 -658 -1406 -176 1127 616 -457 -1628 -329
3211 -329 1295 915 -455 -1565 -66 1488 878 -585 -1254 -344 1526 1148 -605 -1063 -162 1312 1275
3228 1275 -812 -1444 -183 1487 1263 -791 -1553 334 1773 1173 -763 -1665 62 1563 901 -900
3244 -900 -1617 409 1766 837 -823 -1212 203 1752 912 -1212 -1338 228 1742 593 -1392 -1366 201
3261 201 1569 796 -1195 -1380 275 1299 689 -1246 -1556 305 1502 629 -1242 -1459 663 1604 183
$$ packed form
3144F02j562l01K231O69j606j258M97J642L69j373q50N79Q84P30j122j330N06
3161f93J370Q32j517j515O73K148m31j097j014Q88J105J05j134j036L93J942J85
3178A204j684j150P35K054j01j671r69J133J602J21j897o77Q69J245L62j754j160
3195a738J259J918j59j928j214J922J384o19j483p48J230J303n11j073j171J299
3211c29J624l80j370j110J499J554o10j463o69R10J870l78j753m58R01J474l7
3228A275k087o32J261J670k24k054p62J887J439o00j936r02J727J501o62j801
3244i00p17K026J357r29j660l89J415J549q40k124j26J566J514j149j985K6J567
3261B01J368p73j991j85J655J024o10j935l10J861J197q73j871k17K122R41j421
$$ plain form
3278 183 -1201 -1181 770 1372 234 -1245 -1258 463 1681 325 -1982 -1410 1062 1599 -312 -1665 -812
3295 -812 790 989 -186 -1250 -931 533 1219 261 -1187 -755 1145 1300 -76 -1055 -209 736 528 381
3313 381 -614 -838 253 1175 516 -1048 -1300 544 1729 202 -1167 -1104 962 1419 -211 -1083 -962 541
3331 541 1655 500 -1270 -1054 891 2542 -185 -1883 -320 1658 1238 -705 -1837 138 1221 715
3347 715 -498 -1351 -401 1138 904 -682 -1474 -118 1497 152 -1363 -633 593 572 -410 -440 225 -137
3365 -137 -251 585 138 -640 -867 238 648 -66 -602 -4 -326 238 433 -356 -698 -263 834 717 -1401
3384 -1401 -1300 705 1670 -156 -1750 -629 1425 1042 -577 -1213 -426 1194 867 -448 -1575 -600 1908
3401 1908 970 -1192 -1365 542 1714 188 -1821 -14 1422 689 -449 -878 255 996 307 -573 -632
$$ packed form
3278A83j384K0J951O02j138j479j3J721J218j356k307N72K472N37j911j353Q53
3295h12J602J99j175j064L19J464O86r58j448M32J900J55j376r79Q46R45k08j47
3313C81r95k24J091R22o59j564k52J844J185j527j369O3K066M57j630q72J21J503
3331E41J114j155j770K16J945J651k727j698J563J978m20j943j132J975J083n06
3347G15j213q53R50J539k34j586p92J356J615j345j515P30J226k1r82l0O65l62
3365a37j14Q36m47p78k27J105M10p14n36N98l22N64J95p89l42M35J097j17k118
3384a401J01K005R65j826j594J121K054l83j619o36P87J620l27j315j127R75K508
3401A908r38k162j73J907J172j526k009J807J436p33j138m29J133P41o89q80n9
$$ plain form
3418 -632 194 1337 15 -910 -480 790 801 -660 -837 925 908 -334 -997 95 1138 341 -1246 -340
3436 -340 833 895 -153 -1179 -335 1144 808 -622 -1200 -7 1945 161 -1195 -872 1094 1140 -781
3453 -781 -1696 231 1348 431 -1008 -1232 929 1074 -94 -1179 -652 1180 1036 -848 -1078 407 1214
3470 1214 190 -1381 -706 868 580 -522 -1233 169 1514 136 -1473 -928 833 1522 -148 -1500
3486 -1500 103 1731 708 -1305 -1542 677 1515 -85 -1382 -873 1309 1434 -621 -1167 -4 1384
3502 1384 1023 -1122 -1047 883 1332 -190 -1479 -476 1450 910 -709 -764 342 980 398 -612 -94
3519 -94 775 676 -368 -1016 45 964 359 -653 -879 631 899 -891 -904 456 1093 340 -1410 -544 1220
3538 1220 673 -513 -1198 -402 1429 631 -1465 -1521 86 1545 30 -1956 -1089 1299 1564 -687 -2038
$$ packed form
3418f32Q26J143j322r25M30J270J1j461j77J762j7j242o63J092J043p97j587R06
3436c40J173O2j048j026Q44J479l36j430n78J193J952j784j356L23J966M6j921
3453g81r15J927J117r17j439k24K161J45j168j085N27J832j44j884k30J485Q07
3470A214j024j571O75J574k88j102p11J402J345j378j609N45J761O89j670j352
3486a500J603J628j023k013k37K219Q38j600j297N09K182J25k055n46J163J388
3502A384l61k145P5J930M49j522j289J003J926n40j619n5J106O38n82j010N18
3519i4Q69r9j044o48J061R19o05j012k26J510K68j790j3J360O37p53j750Q66J764
3538A220n47j186o85P96J831p98k096n6J607J459j515j986Q67K388K65k251j351
$$ plain form
3555 -2038 193 1856 488 -902 -1404 331 1540 68 -767 -839 481 1246 -199 -1649 -375 1176
3571 1176 713 -878 -917 1033 1056 -278 -624 36 843 16 -679 127 -214 20 42 -474 -192 594 356 -185
3591 -185 -800 585 967 -205 -1072 -185 1332 592 -1002 -910 895 913 -166 -901 -140 1052 543 -159
3609 -159 -859 -198 1160 1248 -825 -1383 10 1487 362 -1636 -620 1129 826 -404 -791 -133 861
3626 861 54 -292 -438 -481 461 325 -540 -559 343 706 -263 -1008 78 670 5 -493 -348 499 19 -612
3646 -612 89 207 -144 -317 -98 -79 377 4 -20 -139 -270 541 175 -467 -386 320 732 -829 -912 510 682
3667 682 -391 -470 -118 678 54 -293 -6 -161 364 372 -42 -257 -181 498 150 -507 -467 627 721 -128 -319
3688 -319 66 668 27 -182 264 -93 222 147 32 -253 -72 436 384 -411 -408 327 519 -98 -498 114 287
$$ packed form
3555b038K231J663j368j390n02J735J209j472q35p2J320P65j445j450J274J551
3571A176m63j591l9J950K3j334l46O60Q07q27o95Q06l41K34K2n16K82P86k38n41
3591a85o15J385L82j172q67Q87J517p40j594R2J805J8j079p35P61J192n09p02
3609a59p00O61J358Q8k073n58J393J477j125j998J016J749l03j230l87O58R94
3626H61q07l46j46m3R42j36q65j9R02L63r69p45J086N92o65m98J45Q47m80o31
3646f12P01J18l51j73K19J9M56l73k4j19j31Q11l66o42Q1P06M12j561q3J422J72
3667F82j073p9L52P96o24l47K87j55N25Qm14k15P6O79l48o57M0J094R4q49j91
3688c19L85O02o41k09M46l57L15p5j15k85J81N08n2p95LP35J92o17m00O12J73
$$ plain form
3709 287 -10 36 -7 -189 -193 352 155 -123 -518 405 411 -246 -512 -364 373 283 -297 -143 -640 -137 429 194
3731 194 -400 -509 56 745 -42 -960 199 343 306 -303 -851 -13 436 63 -44 -599 -596 544 424 192
3751 192 -798 -319 670 485 -425 -342 -104 724 154 -412 -25 -268 466 808 -143 -588 -356 567 963 -441
3771 -441 -438 393 767 469 -474 -526 24 784 348 -211 -914 30 1031 495 -311 -857 436 1021 85 -443
3791 -443 -387 129 1000 173 -780 -496 -98 752 301 -907 -599 341 625 104 -928 -329 402 365 113 -641
3811 -641 -693 182 459 381 -818 -937 189 775 127 -505 -798 278 753 -44 -718 -708 130 922 116 -807
3831 -807 -666 482 1036 -222 -903 -478 605 939 263 -1201 -259 360 801 -21 -1402 -466 942 863
3849 863 -27 -947 -246 861 486 45 -672 -612 751 964 236 -1043 -673 964 967 -2 -746 -455 618
$$ packed form
3709B87k97M6m3j82mN45j97k78l95R23Oo57k66J48P37r0n80J54m97N03N66k35
3731A94n94j09N65O89p87r18J159J44l7o09n48Q38M49l73j07n55LJ140j20k32
3751A92r90M79R89j85r10Q3K38Q28n70n66L87k43P34L42r51m45K32R23L96j404
3771d41LQ31L74k98r43n2N50P60m36n59p03R44J001n36q06n46J293N85r36n28
3791d43N6N16Q71q27r53K84L98Q50m51j208L08R40K84n21j032N99P31l7k52p54
3811f41n2Q75K77p8j199j19J126N86o48o32k93J076M75p97o74J0Q38P92q06r23
3831h07J41J148N54j258o81M25J083L34o76j464R42O19M41q22j381R36J408p9
3849H63q90r20P01J107l75m41p17O0J363K13p28j279L70J637Lr69p44K91J073
$$ plain form
3868 618 605 -19 -772 -546 576 1352 130 -1641 -306 1050 1141 -362 -1433 -172 949 903 -361 -939
3886 -939 -177 807 859 -263 -1283 -462 1321 902 -993 -1207 182 1466 197 -1086 -498 278 305 282
3904 282 -566 -724 -317 520 689 -670 -911 -93 792 63 -487 -449 247 132 439 -125 -598 -587 562 1228
3924 1228 -125 -1528 -412 1293 1023 -705 -1066 -313 866 562 -497 -1149 -392 1011 1071 -843 -1574
3941 -1574 52 1936 813 -1677 -914 1180 1273 -130 -1256 -490 743 888 255 -1115 -671 736 1200
3958 1200 -90 -1004 -509 1309 625 -821 -500 459 538 -134 -1 374 -56 -474 61 299 -292 -513 -218
3977 -218 468 94 -115 -275 -156 -62 791 257 -938 -755 853 1342 -415 -1413 -1 1269 592 -1241
3995 -1241 -1035 550 898 125 -895 -1003 658 1021 215 -1314 -1190 971 1364 -587 -1365 -75 1166
$$ packed form
3868F18j3o24p53K26J122P76j222j771J335J356R1j503j071J261J121m6j264n78
3886i39P62R84N2j122j020Q21J783m19j895k14J389J284j269j283N88P76K7k3
3904B82q48j58M07Q37J69j359k41Q18Q85p29n50L8O96j15L07n64m73J1J149O66
3924A228j353j403J116J705k70j728l61P53J179l04j059o52P57J403O0j914p31
3941a574J626J884j123k490P63K094R3j403j126P66J233J45o33j370M44J407M64
3958A200j290r14M95J818o84j446L21R59P9o72J33L75m30m18N35K38n91k21K95
3977b18O86l74k09j60J19R4Q53n34j195J83J608M89j757r98J412J270o77j833
3995a241K06J585L48p73j020j08J661L63q06j529J24K161L93j951p78J290J241
$$ plain form
4012 1166 647 -1300 -790 436 830 -1 -886 -384 621 393 -213 -531 -265 556 268 -636 -360 352 711
4031 711 -178 -920 435 645 -319 -668 320 1035 643 -1063 -185 779 579 50 -1089 -261 671 746 -221
4050 -221 -1016 -401 1382 830 -912 -1073 743 1450 -73 -1430 -242 906 583 -401 -897 -13 778 351
4068 351 -437 -594 231 824 -27 -692 -430 699 819 -572 -608 328 804 -385 -961 -125 872 348 -819
4087 -819 -526 -47 691 -73 -1018 -284 800 557 -619 -1139 90 1122 236 -745 -1073 346 1181 -91
4105 -91 -957 -155 903 643 -484 -993 326 925 429 -724 -729 637 434 -344 -716 -391 799 637 -358
4124 -358 -628 15 506 50 -476 -36 698 448 -445 -138 293 505 -226 -553 266 682 542 -356 -370 788
4144 788 684 -230 -575 -477 788 690 -278 -944 -187 1259 674 -1159 -874 616 1116 -373 -1385 -335
$$ packed form
4012A166n19j947N10J226L94q31q85N02J005k28o06l18K66Q21k88r04K76P12L59
4031G11q89p42J355K10r64l49R88P15l92j706Q78R64k00n29j139Q28R32P5r67
4050b21p95O15J783n52j742j61J816P07j523j357J188J148l23r84m96Q84P91m27
4068C51p88j57Q25N93q51o65K62J129J20j391l6R36M76j189n76Q36R97n24j167
4087h19K93M79P38p64r45P34J084k43j176n20J229J032q86r81l28J419Q35j272
4105i1q66Q02J058k60j127n09J319N99m96j153nJ366k03p78l72L25J190j62r95
4124c58k70O43M91m56n26M40P34k50q93L07M31K12p31l27Q19M16j40q98j4J158
4144G88j04r14l45R8J265r8r68o66P57J446n85j833K85J490N00j489j012J050
$$ plain form
4162 -335 863 483 -217 -872 -87 638 329 -446 -752 -212 1060 292 -961 -318 706 531 -286 -748 -64
4181 -64 -38 -204 122 -186 -348 -98 109 334 -18 -263 -95 3 -169 36 -85 32 -344 225 607 -299 -625
4202 -625 70 844 58 -799 -451 435 544 -38 -222 -407 430 579 283 -391 -326 848 1210 -194 -763 15
4222 15 810 461 -923 -679 402 340 226 102 -168 293 570 373 -83 -623 463 763 -85 -206 2 634
4242 634 306 -139 -95 147 -89 -26 -45 -101 -98 -76 516 252 -290 -784 -28 277 196 -385 -3 -192 25 212 -56
4265 -56 -523 -132 306 328 -228 -668 184 329 40 -385 -179 199 112 49 -201 -354 -152 272 -27 -559 -605 -31
4287 -31 665 -229 -487 142 153 172 151 -68 -21 207 246 330 -288 -346 298 207 43 -473 -59 543 364 -255 75
4310 75 -89 72 10 138 -60 -386 434 611 -414 -387 127 722 327 -267 -136 444 357 44 25 -61 12 87
$$ packed form
4162c35J198l80p00o55P85P25l09p75l06N40J272p68j253O43J024j75q17m62O84
4181f4K6j66L26l08j62K50K07K25l52k45J68R8j72K05j21J17l76N69L82r06l26
4202f25O95P74p86q57L48Q86J09n82j84j85Q37J49k96o74O5J174L62j404n69P78
4222A5P95l49j384K44J081o2j14j24k70M61K77j97m56n40J086L00q48j21K08O32
4242F34l28m45M4K42k36O3j9n6LK2N92k64n42m94P56L05q1n81L82j89K17J87k68
4265e6m67L91M38K2n56m40Q52J45k89m25K06L78q7o3k50j53K02M24k99n32m6N74
4287c1O96q94k58O29J1J9k1k19M7K28L9Q4o18n8O44r1j64n16M14O02j79o19L30
4310G5j64J61o2J28j98l26Q20J77j025K7N14N95l95n94J31N80q7l13j9q6P3P5
$$ plain form
4332 87 167 220 -16 137 528 -132 -224 -176 244 40 -315 -92 234 -57 -232 11 157 59 -53 167 -132 -539
4354 -539 -172 44 -71 -240 -168 235 -71 -178 -37 -133 -193 -58 -56 -96 -271 -408 389 232 -278 -266 -52 481
4376 481 -21 -164 -262 -132 238 157 -259 -291 -61 393 64 -419 -215 355 659 149 -217 -242 455 277 76
4397 76 -220 -42 438 347 3 -247 -217 145 417 -221 -60 -128 335 452 -77 -704 21 429 547 66 -784
4418 -784 -21 38 344 -81 -357 65 274 339 -136 -395 -53 573 349 -457 -471 -188 720 6 -484 -418 -81
4439 -81 368 322 -775 -336 -179 217 199 -363 -553 -113 588 217 -641 -697 348 347 -40 -475 -596 31 248
4460 248 430 -362 -544 98 556 223 -431 -495 167 509 -151 -287 -370 -39 324 578 -203 -721 -249 945
4480 945 746 -830 -834 330 952 152 -739 -659 519 597 200 -660 -710 654 1070 293 -631 -856 857 1030
$$ packed form
4332H7Q0N3k36J53L91o60r2M8M20k04l55K23L26k91j75K43J46r8j12K20k99m07
4354e39L67K16j15j69P2M03l06j07J41r6o0J35Km0j75j37P97j57n10J2K14N33
4376D81n02j43r8J30L70q1m16l2K30M54l29m83K04N70L04n10l66k5O97j78k01
4397G6k96J78M80r1l44k50L0L62K72o38J61o8M63J17n29o27P25M08J18m81q50
4418g84P63N9L06m25k76M22K09O5m75k59L42O26k24q06j4K83R08p14m90O6L37
4439h1M49m6j097M39J57L96j8n62j90M40P01l71q58n6J045jl87m35j21O27K17
4460B48J82p92j82O42M58l33o54o4O62L42o60j36q3L31L63K54p81n18M72J194
4480I45j99j576mJ164O22q00q91Q0J178P8l97q60n0J364M16p77r24k25J713J73
$$ plain form
4500 1030 -352 -668 -140 906 406 -253 -237 -51 151 447 -148 -466 -178 156 655 -198 -248 69 365 44
4520 44 99 -165 -294 20 292 520 -293 -848 -71 728 509 -817 -937 325 711 -38 -404 -646 287 738
4540 738 195 -612 -1068 407 1415 -23 -1280 -482 737 1160 -493 -1317 340 969 345 -824 -617
4557 -617 -190 502 521 -340 -988 181 987 112 -559 -688 576 789 -469 -49 170 -14 -217 -50 69
4576 69 313 -431 290 805 -248 -242 -17 124 104 166 25 -322 -55 600 301 -407 -849 95 1297 267 -1224
4597 -1224 -292 1089 812 -450 -766 -22 827 405 -352 -723 -264 805 877 -673 -1269 -33 1085 213
4615 213 -1102 -486 609 591 -272 -953 7 392 65 -199 -356 -244 118 339 -226 -342 80 308 -35 -355
4635 -355 -48 309 -103 -415 181 596 -113 -567 209 288 397 -690 -290 235 359 -72 -300 -451 116 512
$$ packed form
4500A030j382l16N28J046n00o59J6J86K02K96n95l18K88L34M99q53n0L17K96l21
4520D4N5k64j29L14K72K28q13n55P77P99k19j326j20J262L86p49l66k42R33M51
4540G38n43q07m56J475J008j438j257P98J219M23j653q24J657O29o24j169K07
4557f17M27O92J9q61o48J169Q06q75o71j29J264K13j258M20K19j84k03J67J19
4576F9K44p44P21N15j053OK25J41k0O2j41l47K67O55k99p08m42R44J202j030j491
4597a224R32J381k77j262l16P44Q49m22p57l71M59J069P2j550n96J236J118q72
4615B13j315O16J095j8q63o81R60L85l27k64j57J12L62K21n65j16M22K28l43l20
4635c55L07L57m12l12N96M15p09m54P76P9J09j087M00N25J24m31k28j51N67L96
$$ plain form
4655 512 -51 -316 -540 609 738 -433 -803 -260 997 492 -676 -560 387 682 42 -475 -252 321 447
4674 447 345 -371 -207 462 431 -267 -396 354 646 118 -352 -8 553 53 128 33 592 323 -312 -11 153
4695 153 143 -103 -225 -206 2 115 187 -639 -270 515 397 -362 -536 -201 401 -77 -739 -616 269 449 -239
4716 -239 -659 -330 364 140 -98 -399 -291 596 148 -275 -548 50 522 -112 -556 -227 160 121 -80 -259
4736 -259 0 -65 -183 -208 -88 -247 -314 -11 233 299 -101 -87 -293 -139 182 84 30 -444 218 407 -186 -364
4758 -364 49 584 413 -313 -458 177 531 302 -92 -444 487 281 300 -144 -418 115 750 66 -429 -104
4778 -104 152 239 -99 -363 289 26 86 -118 -82 -143 -135 153 98 -424 -281 66 453 389 -360 17 364 -200 32
4801 32 -259 -387 -160 124 133 -68 -425 138 247 370 -126 -408 287 251 23 -130 -448 -124 320 14 -171
$$ packed form
4655E12n63k65k24J149J29j171l70N43J257n05j168J16R47K95o40n17K23N73J26
4674D47j02p16J64O69l1o98j29P50K92n28m70L44N61n00P5r5N59k69o35L01J64
4695A53j0k46j22J9K08J13P2q26L69P85j18p59j74L35O02m78o62J23Q85J80o88
4716b39m20L29O94k24k38l01J08Q87m48m23k73N98M72o34m44L29L87l9k01j79
4736b59K59o5j18k5J20j59o7L03K44O6m00J4k06J54L21r8n4m74O62J89n93j78
4758c64M13N35j71p26j45O35L54k29l94l52R31k06J9m44k74N33O35o84m95L25
4778a04K56Q7l38k64O52k63O0k04L6o1QK88n5n22J43L47L87o4p49L77L47n64K32
4801C2k91j28K27K84Rk01l57N63J09J23m96k82O95l6k28j53l18L24M44l06j85
$$ plain form
4822 -171 -713 346 525 147 -430 -258 467 553 4 -581 -8 153 118 6 -21 -237 16 331 123 -638 -113
4843 -113 548 256 -11 -281 -308 188 -77 -139 -61 -167 215 395 383 -228 -105 495 713 -320 -402 102 248
4864 248 430 -139 -479 60 -28 329 294 -438 143 372 457 -85 -329 66 269 159 27 63 107 293 266 167
4886 167 -187 -294 296 167 -77 -220 -317 203 63 -178 -455 -199 104 330 -136 -68 -532 168 247 -268 -133
4907 -133 -153 321 107 -304 -618 140 190 -316 108 -173 -82 316 109 165 -215 128 442 -66 -417 80 144 230
4929 230 94 -252 80 349 231 132 -291 -105 -236 433 66 -30 -194 209 117 92 -74 -12 94 212 -102 -97
4951 -97 236 -55 401 393 -64 -110 165 215 -146 -178 28 245 309 36 -252 -186 24 142 -176 -441 55 5 243
4974 243 49 -443 -60 169 -19 -339 -220 187 275 -205 -125 -332 -213 208 19 -227 -69 -186 -121 -17 -533
$$ packed form
4822a71n42J059J79l78n77J72P25Q6n49n85N73J61l5j12k7k16K53L15k08p61N25
4843a13O61k92k67k70k7M96k65o2P8j06L82J80j2o11J23O00K18j033q2N04J46
4864B48J82n69l40N39q8L57l5p32N81K29Q5n42k44L95K03j10j32L6M4J86k7r9
4886A67l54j07N90j29k44j43r7N20j40k41k77K56L03K26m66O8m64P00P9n15J35
4907a33k0M74k14m11l14P58N0n06M24k81R1L98k07N6l80L43L14n08l51M97O4Q6
4929B30j36l46L32K69j18r9m23J86j31O69l67r6j64M03r2k5j66O2J06J18l14N
4951i7L33k91M56qm57m6K75N0l61l2K06K17O4k73k88O6K10J18l18k65M96n0K38
4974B43j94m92L83K29j88l20J19M07Q8m80Q0k07J19M21j89k46J58j17O5J04n16
$$ plain form
4995 -533 40 21 -153 158 -59 -317 122 228 63 -137 -199 123 283 -102 -178 -54 166 -98 -40 -1 -165 -14
5017 -14 166 237 -213 -142 179 134 -61 -331 -61 180 338 21 -151 -218 138 332 34 -187 178 443 256 -222
5039 -222 -189 39 354 192 -199 -143 32 240 113 -342 -137 71 426 -165 -7 -83 123 233 185 -220 -42
5060 -42 63 190 89 167 -215 63 203 137 -143 -385 -9 89 -101 -108 -529 46 319 180 -3 -384 -75 418
5082 418 256 -463 -471 294 709 -280 -518 -60 230 226 -362 -531 -56 263 276 89 -368 58 210 178 -271 -468
5104 -468 317 320 -67 -408 16 27 386 -74 -253 -84 -167 209 21 -117 65 76 282 223 -501 -238 39 162
5126 162 224 -114 4 -62 -136 639 172 -534 -181 259 392 -179 -490 -12 465 271 85 -477 -162 384 364
5147 364 125 -944 -314 702 247 -297 -662 122 679 278 -820 -462 306 298 -121 -712 -268 148 306 -83
$$ packed form
4995e33N73j9j74L11k17k58M39J06j65k00o2L22J60l85p6J24K20k64N8L9j64J51
5017a4J80P1m50P1L21m5j95k70K70K41J58l17j72o7L56J94k98k21L65K65j87m78
5039b22L3K28L15j62l91N6J75K08j27m55K05K08L55n91J58p6K06J10m8m05J78
5060d2J05J27j01P8l82K78J40o6k80k42L76R8j90pm21N75K73j39j83l81L09M93
5082D18j62p19qP65M15r89k38M58K90mn88j69M75L19J3j87m57M26J52l2m49j97
5104d68P85Ll87l41M24J1L59m60j79J69q3L76j88j38J82J1K06n9p24K63K77J23
5126A62O2l38J18o6p4P75m67p06L53M40J33n71l11M78M77j94j86n62L15N46k0
5147C64k39j069O30J016m55n44l65P84N57m01j098L58P68qm19n91M44M16J58l89
$$ plain form
5167 -83 -467 -145 182 443 -125 -578 186 225 -151 -340 22 209 -185 249 237 87 -420 -141 36 -167 71
5188 71 -506 -392 247 113 -6 -167 -154 106 538 -115 -441 -152 549 312 -351 -390 490 393 56 -156 -403
5209 -403 166 297 80 -328 -469 36 610 341 -674 -423 574 402 -303 -552 31 625 193 -521 -322 -185
5229 -185 42 178 57 -232 -111 227 53 -285 -271 242 -31 -51 65 -183 37 -282 8 337 273 -471 -172
5250 -172 133 261 -352 -445 119 136 -14 -42 -445 45 300 -41 -38 -297 -81 509 33 -504 -329 310 423 -171
5272 -171 -388 -154 406 37 29 -255 -49 232 120 -122 -293 -144 242 87 -213 -142 220 532 -282 -278 178 142
5294 142 -214 -155 -51 -126 -57 -292 362 -25 188 119 -107 -188 296 188 -47 -8 231 345 105 -374 -208 142
5316 142 300 -145 -1 364 140 -29 -242 -24 129 238 209 -104 -339 387 538 -125 -375 -49 152 -65
$$ packed form
5167h3l84L22L27K61n68m53P64L9l76j89L62J87l94M34j2j50n07K79J77k03K38
5188G1n77J14O39j34j19j61J3K60M32o53l26K89P01k37o63l9Q80r7l37k12k47
5209d03N69J31k17m08j41N05N74k69j015K51R97j72p05k49N83N94m32p14J99J37
5229a85K27J36j21k89J21L38j74l38J4N13k73k0J16k48K20l19K90L29o4p44K99
5250a72L05J28o13r3N64J7j50k8m03M90K55l41Lk59K16N90m76n37J75O39J13n94
5272a71k17K34N60l69qk84K06K81j12k42j71J49L86j55l00P1L62L12q14MM56l6
5294A42l56N9J04p5O9k35O54l87K13o9k26q1M84j08k35L9K39J14k40m79J66L50
5316A42J58m45J44L65k24j69k13K18J53J09k9l13k35P26J51o63k50L26K01k17
$$ plain form
5336 -65 -6 -253 -2 248 147 -78 -120 138 -40 -48 118 -312 -52 -182 -35 -137 -212 240 -80 64 -38 271
5358 271 -46 -128 -15 445 -225 -58 247 125 43 21 -349 -152 371 -94 324 -170 -205 275 123 -117 -238
5379 -238 -216 231 -137 -153 -83 -174 240 14 169 92 49 76 623 16 -60 0 45 205 -162 -144 201 169 -99 41
5403 41 -153 32 -111 321 72 -36 -81 290 460 65 -259 -145 457 43 -132 -71 -78 29 -127 -290 -143 -3
5425 -3 117 180 122 -275 9 479 167 -332 -209 -47 134 33 16 -46 -330 47 95 -65 -482 -4 274 174
5447 174 -315 -238 151 305 -74 -272 -233 -90 266 164 166 -468 -247 368 230 -505 -144 351 104 119 -58 -5
5469 -5 -155 122 253 61 -348 -144 384 163 -391 -292 223 277 253 -26 -267 278 95 99 -31 -8 59 377 6
5492 6 -208 -109 -361 323 87 -218 -216 9 491 -80 35 10 -258 655 150 -138 -103 -111 398 280 -429 -325 132
$$ packed form
5336f5N9k47K51K50j01k25m2K58j78qJ66m30K60j30J47j02p5M52l20J44j02L09
5358B71l17q2J13M60o70J67L05j22q2k2l70J97N23m65M18m94l5M80j52k40j21
5379b38K2M47l68j6P0r1M14k26J55p7m3K7N47o07p6O0M5J60l67J8L45l2k68J40
5403D1j94J85j43M32k49j08m5L71J70l95l24J14O02m14j75O1pJ07j56j63J47J40
5425cJ20O3n8l97K84M70l12m99J23J62J81j01j7o2k84L77M8j60m17M78K78j00
5447A74m89P7L89J54l79j98L9J43L56j02Ko34K21O15j38p35L61M95k47J5j77N3
5469ej50K77J31j92m09K04N28k21n54R9N15N4k4k79k41N45j83Mj30K3O7L18l71
5492Fk14R9k52O84k36l05KK25M82n71J15k5k68R13n05k88L5qN09j18p09J04M57
$$ plain form
5515 132 9 -125 -301 144 -34 363 288 -253 -509 116 252 60 -245 -131 109 86 -235 -325 65 35 204
5536 204 -85 -239 -242 -58 180 123 -270 -220 85 76 -205 -77 -215 -81 175 -17 -182 -4 -19 210 90 -298
5558 -298 -41 263 169 81 -417 -108 297 77 -159 -203 -132 111 299 -12 2 46 110 284 -134 -129 121 239 172
5581 172 -80 -127 325 205 11 -115 84 266 157 -16 83 63 71 281 -152 75 -147 85 89 48 -111 37 0
5604 0 42 186 -68 -255 -103 -24 224 -243 -45 122 141 299 45 -119 25 107 72 -303 -178 -76 38 -21 -81
5627 -81 169 316 43 -242 170 -99 56 255 -37 -146 89 343 101 -11 -471 -43 151 123 -141 -218 186
5648 186 149 78 -238 -136 48 35 83 -122 133 75 219 -79 -60 39 -62 168 214 -187 307 -9 -146 204 6
5671 6 -58 -9 187 252 63 -147 -6 111 -142 -68 -296 103 180 222 -53 -319 58 102 309 46 -357 105 611
$$ packed form
5515A32j23j34j76M45j78L97p5n41k56O25J36j92l05J14K40k3l21r0L90l0J69
5536B04k89j54lJ84K38n7l93N0L05rk81J28j38J34K56j92j65J78j5K29j20l88
5558b98K57L04r4q8m98L09M05k20k36m4P1K43J88l11J4M4O4J74m18NK50J18o7
5581A72k52m7M52j20j94j26J99J82j09j73R9k0QK10m33K27k22K32Mm1j59J48l7
5604@M2J44k54j87J52P9K48m67J98J67J9J58k54j64J44Q2l5l75J25J02J14n9o0
5627h1K50J47k73k85M12k69J55J99k92j09K35K54k42j12m60M28J94k8k64p7M04
5648A86l7p1l16J02J84j3M8k05K55n8J44k98J9R9j01K30M6m01M94l16j37L50j98
5671Fo4M9J96O5j89k10J41J17k53P4k28L99P7M2k75k66L77M4K07k63m03M62N06
$$ plain form
5694 611 41 -6 -23 419 145 -103 -52 -252 257 57 111 22 100 314 107 66 -402 -87 167 -37 112 -202
5716 -202 17 80 -285 40 -360 -92 216 80 -127 162 -229 -12 121 -71 -128 -536 -101 220 -57 -7 -303
5737 -303 252 319 -155 -224 -103 26 368 76 -288 22 41 161 -209 -224 -48 31 224 -6 -474 326 677 23
5759 23 -394 -224 4 293 139 -157 14 -22 267 -249 -252 -82 111 252 81 -223 276 -172 163 -166 -181 122
5781 122 329 -22 121 -105 50 128 30 72 -123 -142 21 491 -173 164 98 -351 66 154 -16 -329 -281 16
5803 16 209 -109 -114 148 -53 135 -52 -210 156 294 -91 -164 -191 223 457 79 -381 -428 67 -40 52 -193
5825 -193 66 446 33 -333 -458 104 308 196 -49 -270 -146 109 162 -113 -218 217 89 195 -157 -166 17
5846 17 116 193 -46 103 -395 -46 11 13 36 -20 122 -38 170 -105 -109 300 95 165 23 -145 35 107 32 -224
$$ packed form
5694F11n70m7j7M42k74k48N1k00N09k00N4q9P8K14k07m1m68L15K54k04J49l14
5716b02K19O3l65L25m00K68L08j36k07K89l91K17J33j92n7m08M35L21k77N0k96
5737c03N55O7m74o9J21J29L42k92l64L10J9J20l70j5J76P9J93k30m68Q00L51o54
5759B3m17J70K28K89j54k96J71l6K89n16lJ70J93J41j71l04M99m48L35l29j5L03
5781A22K07l51J43k26J55P8r8M2j95j9J63M70o64L37o6m49M17Q8j70l13M8K97
5803A6J93l18nK62k01J88j87j58L66J38l85p3k7M14K34l78m60m7M95j07R2k45
5825a93K59L80m13l66j25N62K04j12k45k21J24K55N3k75j05M35j28J06l52rJ83
5846A7R9P7k39J49m98L49N7KK3n6J42j60K08k75mM09k05P0j42j68J80P2p5k56
$$ plain form
5870 -224 -83 135 324 -231 -229 12 17 105 -234 -164 56 53 56 -68 -134 -255 -126 157 105 -205 279 385 166 -191
5894 -191 -272 3 -13 -94 19 149 -281 -70 -41 -139 -306 -180 -97 119 -71 -46 153 -9 -136 161 182 -113 88
5917 88 305 151 -176 -202 -57 186 -34 -425 153 -40 243 -6 -74 -229 45 136 42 22 -231 199 222 32
5939 32 258 145 222 -7 100 -44 255 -66 172 92 95 1 105 372 -19 -365 -22 -40 42 -82 -185 47 90
5962 90 46 187 94 -103 126 -97 27 -263 -150 -65 53 -159 -152 224 -25 -298 231 -266 19 56 38 115 46
5985 46 -394 70 74 -216 -61 19 75 214 -25 44 8 -100 -194 161 -320 -332 -88 124 38 -180 -85 11 -2 -43 174
6010 174 -115 -20 -102 55 51 -22 168 50 52 2 -74 140 193 90 295 200 66 206 348 56 165 139 109 45 86
6035 86 77 134 89 -264 296 163 -159 -106 239 -116 -107 -250 243 258 -42 -25 138 484 274 -263 -161 175 197 27
$$ packed form
5870b24J41K18J89n55KK41NQ8l39P0K20lLj24o6j21J29K83n2l10M84J06k19l57
5894a91q1K75j6q1J13J30m30K11K9r8j67J26Q3K16j90K5J99j62j27K97K1k95K01
5917H8K17j54l27k6J45K43k20l91N78j93K83k49o8j55K74R1r4k0k53M30K3j90
5939C2K26j13P7k29J07j44K99l21K38q0Lr4J04K67l91l46L43j8Q2j24j03K32M3
5962I0m4J41r3j97K29k23J24k90J13Q5J18k12PL76k49k73N29m97K85L7j8P7o9
5985D6m40M64Mk90J55Q0N6J39k39O9l6j08r4L55m81j2K44K12q6k18R5R6j3m1K17
6010A74k89R5q2J57mp3J90j18Kn0p6K14N3j03K05r5j34J40J42k92J09k6l0o4M1
6035H6rN7m5l53N60j33l22N3L45l55Rj43M93J5l00J7J63L46k10n37J02L36K2j70
$$ plain form
6059 27 39 -183 -188 106 -91 -134 -292 141 264 93 -279 58 243 292 -272 22 53 7 301 176 -285 -29 -86
6082 -86 68 234 -123 26 -33 -42 -58 -71 -196 -326 -113 -53 -1 -227 -106 121 234 -91 -224 81 261 -95 -116
6105 -116 -157 -64 -57 208 120 -183 -28 260 -237 -203 -83 24 -233 -16 -275 65 96 53 -71 -320 -216 23 171
6128 171 -147 47 -105 -43 86 -59 -34 145 122 192 -102 -133 -272 232 145 76 -181 -12 204 171 -78 -10 259
6151 259 5 324 14 -104 -180 -125 109 34 -133 -223 20 113 135 -331 -11 10 225 126 -321 22 239 260 -246
6174 -246 142 -73 82 -104 -255 15 -9 -101 222 -199 -96 -67 22 8 -142 18 -7 152 -308 -228 -72 152
6196 152 113 124 114 -240 -69 266 90 -240 19 -84 219 90 -202 -9 33 216 -80 -6 -87 -236 40 288
6218 288 37 -86 30 221 58 24 44 51 263 33 38 -400 253 186 124 -142 -174 -26 139 90 -70 58 17 399
$$ packed form
6059B7J2k22nK94j97m3j58M33J23j71l72L37J85M9n64K94L1m6K94j25m61K56n7
6082h6J54J66l57J49n9rj6j3j25j30K13O0N2k26J21K27J13l25j33L05J80l56k1
6105a16m1R3PK65q8l03J55K88m97L4J20J07k57K17k59L40L1m3j24k49J04K39J48
6128A71l18J94j52O2J29j45K5J79k3P0k94l1j39N04q7o9k57J69K16l3k49O8K69
6151B59k54L19l10j18p6N5K34p5j67r0K43R3K2m66L20K1K15r9m47L43K17K1n06
6174b46L88k15J55j86j51K70k4r2L23m21J03K9Q9j4j50J60k5J59m60Q0J56K24
6196A52l9J1j0l54J71L35j76l30K59j03L03j29k92J93M2J83k96P4q1j49K76K48
6218B88k51j23J16J91j63l4K0PK12k30Nm38O53o7o2k66l2J48J65m9j60J28m1L82
$$ plain form
6242 399 -179 -174 123 270 -100 -125 -13 -68 -2 90 -166 454 262 60 42 -424 -250 116 105 -187 142 66 147
6265 147 -10 132 142 -74 84 -2 -99 156 -162 22 48 76 -219 -199 -84 7 214 -30 -20 -10 -113 -17 -357
6288 -357 -66 274 -3 89 -343 -318 -35 208 188 108 -49 192 -43 -4 5 24 26 170 -173 -60 -89 -187 68 -94
6312 -94 11 194 161 -71 146 -140 62 33 81 -44 -235 -102 -168 -138 62 28 238 108 51 438 -59 -270 169
6335 169 -374 47 128 -271 -24 90 -254 -30 -186 -82 174 -96 -196 -116 36 215 -45 -507 279 28 313
6356 313 -42 -264 -40 85 216 -1 59 22 49 48 -312 -89 8 293 248 -119 -188 105 51 -180 -70 -10 -10 114
6380 114 171 138 67 -57 25 -381 -139 -33 127 -73 -40 -206 64 53 48 185 -1 -104 114 41 196 74 -326
6403 -326 14 102 136 18 -90 125 296 285 35 -19 194 215 154 -241 -271 115 -70 -70 -204 -240 185 20 29 143
$$ packed form
6242C99n78NK97J47l70k5J12n5O6R2k56O20j92k02j8m66J74L66j1k92L29p6Q1
6265A47j57J42J0k16J58q6r7K55l18J84K6K8k95K0J15R1K07k44J0J0j03R6l40
6288c57K91L40k77R2m32K5K83K43k0q0j57K41k35L9RJ9KJ44l43J13k9r8K55j62
6312i4J05J83l3k32K17k86K02k9M8j25j91J33o6L0K00l4K10j30n7L87m97k11M39
6335A69n43M21Q1l99K47J14l44K24j56J04K56k70j00Q0J52J79k60m62P86k51K85
6356C13l55k22K24J25J31k17O0l7K7jl60K23R7K85m5l67o9K93n4k31J10O0%J24
6380A14N7l3p1j24Q2m06K42J06J60k00L3j66K70j1nJ37j86j03K18p3J55j22m00
6403c26L40Q8L4j18j08K15J71j1k50n4K13K1o1l95l0L86j85%j34l6M25j65RJ14
$$ plain form
6427 143 -247 35 180 -230 -349 -71 124 166 -88 -133 202 56 38 50 -322 -280 150 191 -105 141 -81 17
6449 17 23 2 -96 117 -54 59 -18 -90 115 179 -46 3 -101 33 22 85 -15 -178 -190 -16 -24 170 -84 -23 202
6474 202 117 110 -200 100 247 -3 4 27 -34 200 198 -264 -91 141 222 4 69 -153 -25 115 -8 -137 -72 -49
6498 -49 164 269 -83 33 -337 24 231 28 -177 -98 191 149 42 -21 -172 188 196 -34 155 63 -186 166
6520 166 69 -280 -203 134 283 194 -244 -219 225 -51 -139 97 135 10 223 -254 -49 -109 84 288 171 -170
6542 -170 -127 155 283 -100 -20 -33 158 -227 42 -210 -213 -174 -231 15 -135 27 471 177 5 -27 153 252 18
6565 18 -54 110 101 -229 -55 31 -46 -355 212 119 246 -288 37 111 -105 -1 97 59 -27 -139 275 56 -173 149
6589 149 -15 -92 -385 -75 159 -36 -193 -33 -27 267 118 87 -96 -96 -162 156 118 -31 -130 331 123 -175 -33
$$ packed form
6427A43l90K82J45m10j19K78J95M2k54m5L35j46j8J2l72M2M30M1k96K46k22R8
6449A7Ok1r8K13j71J13p7p2K05O4k25M9j04J34j1O3j00j63j2J74qJ94k54O1K25
6474B02q5pl10L00J47k50PK3o1K34km62J73K32Q1k18O5k22J28J40j23j29O5K3
6498d9K13J05l52J16l70L61K07k03k05P9K89m2j07o3j51L60Qk30J89r2k49L52
6520A66r7l49P7L37J49q9m38K5M44k76q8K36L8j25K13m77K05o0J93K04j17l41
6542a70M3K82J28l83Q0j3J91l85K69k52lL9n7K46j50J62M44k94j72l2J80R9k34
6565A8p2J64rl30J74Q6p7l09N67r3J27n34L25P4k16J04R8l8q6j12M14k19k29L22
6589A49j64p7k93L10K34j95j57J60OK94j49l1j83%o6L18l8j49r9M61k08k98J42
$$ plain form
6612 -33 60 162 -15 180 -184 -112 -122 177 -70 -206 88 -202 -88 -136 -189 -38 107 24 -229 -42 152 -141
6634 -141 119 128 -78 -111 201 200 171 -55 106 13 -19 187 141 -127 -240 -99 146 296 -257 112 246 58 -63
6657 -63 -60 89 200 -128 -93 -332 240 234 -76 -281 -237 -60 139 -7 -266 61 30 47 330 -332 -202 27 46
6680 46 -144 127 -431 -76 43 149 -57 -57 204 234 -241 101 -153 -105 102 5 -19 -59 -2 -98 299 -110 -313
6703 -313 -17 122 -109 -145 -152 238 193 -82 -64 -24 -73 97 7 84 -34 23 74 -142 -299 -81 91 126 -136 -266
6727 -266 -38 145 121 -227 -85 70 76 303 -110 86 348 -226 181 98 -259 85 140 3 16 -249 -107 28
6749 28 -111 -6 -142 22 159 230 161 -266 -159 -109 55 128 -20 -158 261 339 149 -183 -78 -5 -97 223 -206
6772 -206 5 193 329 -160 -303 157 183 -10 121 -5 139 227 -70 -147 -99 -122 245 -43 -234 149 -91 70
$$ packed form
6612c3R3J02j77J95l64P2j0K99k47j36K94k90J14m8n3J51J45q3k53J87J94k93
6634a41K60Rk06l3L12jk9k26J61r3l2K06m6k68j13J41K45J50n53L69J34j88j21
6657f3LJ49J11l28L5k39N72ol10k05M4J77J99j46k59L27l1J7K83o62J30K29J9
6680D6j90K71n58L55J19J06k06%K61L0m75L42k54M8K07r7k4m0N7r6L97m09k03
6703c13K96J39k31l6pL90m5k75J8M0m9J70r0P7j18N7N1k16j57K18J72L5k62j30
6727b66K28J83k4l48J42J55OK27m13J96K62n74M07q3l57L44N5j37J3k65J42J35
6749B8j39J05j36J64J37P1o9m27J07N0J64P3j48j38M19P8j90l32J05P3r2L20m29
6772b06K11J88J36m89j43M60K6j93J31j26J44Q8k97p7M8k3L67k88j91L83k40J61
$$ plain form
6794 70 -26 -77 -231 122 -10 -68 -38 57 217 -2 -158 -25 -321 -197 185 -29 -129 -54 213 -215 -43 32 23
6817 23 185 177 300 10 -85 30 421 187 -475 -70 136 -32 -76 91 -169 -55 170 -118 -231 2 -11 50
6839 50 358 -198 -184 257 217 -141 -52 -136 215 -329 259 85 -49 229 1 184 -63 50 9 -22 19 111 -332
6862 -332 7 137 22 4 106 -128 381 207 107 -134 -300 40 5 -12 -64 228 -175 -200 60 135 -1 214
6884 214 -128 -51 -85 89 221 -361 -366 109 100 191 -266 -146 43 98 37 -213 -225 -209 -155 -89 -200 92 -93 423
6908 423 -41 -244 49 29 -120 -119 -303 -31 -2 135 -40 -179 193 73 -32 -9 -116 35 -5 -309 -168 21
6930 21 228 -159 -35 126 7 52 -3 -6 -59 -185 -26 68 195 -136 33 -16 133 -65 -1 61 -224 144 68 -7
6954 -7 -142 108 265 -102 54 7 9 331 119 -408 -148 175 65 -34 -188 97 94 144 143 -222 -94 27 -39 -25
$$ packed form
6794G0r6n1j54L53j32n8L0R5J60k19j56J33k96J24L82k14j00P5K67m28J72P5r
6817B3J62qJ23k90r5J15L91k34o62M05K06j68m4J67k60J14K25k88j13K33j3O1
6839E0L08n56J4M41m0l58Q9q4L51n44N88j74j34K78k28J83k47J13m1l1M1R2m43
6862c32L39J30j15j8J02k34N09j74j00k41j66L40l5j7n2K92m03k5K60P5j36K15
6884B14l42P7l4J74J32n82nM75rR1m57J20J89N5o1k50j2J6N4O6j11K92j85N16
6908D23m64k03K93k0j49Jj84K72K9J37j75j39L72j20j05K3j07J51m0l04J41J89
6930B1K07l87J24J61j19M5n5ln3j26J59R4J27l31J69m9J49j98O4O2k85L68p6p5
6954gj35K50J57l67J56m7KL22k12n27K60L23j10r9j54K85lN0jl65J28J21o6J4
$$ plain form
6978 -25 -98 91 96 408 -271 -146 -45 -42 -45 -100 -258 -255 -102 -6 -66 99 -178 -53 237 -359 -303 -31 -9 253 -41
7003 -41 -187 67 222 197 -328 124 103 83 -443 -175 9 175 -77 126 -28 -181 -148 -93 277 56 -27 -335
7025 -335 22 345 -62 -131 175 153 95 -138 -225 28 -153 302 -89 -26 434 120 -104 -269 -163 2 35 -188
7047 -188 341 -109 -42 20 -59 -121 -149 43 285 -26 -207 -157 20 262 78 -106 -150 -143 257 218 -46 -268 58
7070 58 64 80 -260 -68 204 196 -159 -111 -96 -204 83 228 286 -242 -20 122 -51 -63 -105 -150 139 -52 -214 -88
7094 -88 -154 263 -36 -312 -198 -121 150 7 -26 169 -12 425 -96 -105 244 -77 175 308 178 150 -201 84
7116 84 111 -9 -65 83 -150 4 195 189 208 93 50 -50 109 42 125 47 28 62 272 241 -151 63 -43 -146
7140 -146 189 184 118 16 4 245 168 58 -246 102 -167 117 -361 24 202 630 188 -114 -38 -7 -141 144
$$ packed form
6978b5p3J89NL12o79J25J01Lln5j58LJ53R6o0J65k77J25K90n96N6K72K2K62k94
7003d1j46K54J55k5n25M52k1k0n26K68J84J66k52K03j54j53L3N5L70k21q3l08
7025c35L57L23m07o9L06k2n8k33q7K53j81M55l91O3M60l14k24j65J06J65L3k23
7047a88N29m50O7O2p9o2k8J92K42l11j81N0J77K42j84j84m4PM00l9k64k22L26
7070E8OJ6l40J92K72ql55M8J5j08K87J45N8n28K22J42j73j2m2m5K89j91j62J26
7094h8o6M17k99k76J14P7K71j43l3J95j81M37n21rL49l21K52J33j30k8l51K85
7116H4K7j20n6J48k33J54J91oJ9j15m3j00J59o7Q3p8j9L4K10l1l92K14j06j03
7140a46L35no6j02j2K41p7j10l04L48k69K84m78L85J78M28m42l02P6L1j34K85
$$ plain form
7162 144 -72 -332 -313 -14 -66 -303 -71 -128 9 -42 186 -82 -53 -67 304 -441 -61 146 75 190 -83 15 122
7185 122 172 -30 51 -118 37 58 342 225 102 -49 119 11 -26 -126 -59 -122 134 153 270 -58 -68 170 115
7208 115 107 -296 137 -174 -391 50 -55 49 -75 68 121 54 151 173 -202 -29 36 74 31 18 -39 228 23 81
7232 81 -115 31 73 246 64 41 99 228 -44 256 83 -182 -30 -121 24 -14 41 -109 287 -17 -129 0
7254 0 -566 101 112 -89 -9 -30 36 72 -85 -250 -165 -24 -118 -168 -227 -142 -170 88 -11 -95 272 372 56 -55 -67
7279 -67 45 47 -176 -29 184 -43 64 -214 -107 -183 6 151 44 184 199 44 210 -31 -197 -9 -131 147
7301 147 -1 -25 194 -12 -25 31 53 -173 114 292 236 -25 -240 1 -8 229 -238 -99 -186 164 179 -49 -96
7324 -96 -213 -44 -38 82 46 168 94 125 -310 -70 -9 159 151 52 147 0 -227 -287 183 203 125 2 -17 -48 -85 244
$$ packed form
7162A44k16k60J9K99n2k37K32n7J37n1K28k68K9j4L71p45L80K07p1J15k73R8J07
7185A22N0k02Q1j69J55K1K84j17j23j51J68j08l7j00O7o3K56J9J17l28j0K38n5
7208A15qm03M33l11k17M41j05J04j24J43N3o7R7K2l75J73O5L8m3j3n7K67k05N8
7232H1j96J46M2J73j82k3N8J29k72L00j73k65J52r1J45l8N5j50L96l04j12J29
7254@n66O67J1k01Q0k1O6L6j57j65Q5J41r4n0n9Q5k8K58r9q4L67J00l16j11j2
7279f7J12Kk23J47K13k27J07k78J07p6J89J45j07J40J5j55J66k41j66J88j22K78
7301A47j48k4K19k06j3N6K2k26K87J78n6k61k15K41rK37m67J39q7L50J5k28m7
7324i6j17J69OJ20l6J22p4L1m35K40O1J68qr9R5j47k27o0M70K0p8j23j9l1l7L29
$$ plain form
7350 244 114 -254 -222 -242 -19 73 -246 15 -70 129 -79 -11 -219 -8 138 167 -268 -258 -151 381 -19 60 -104
7373 -104 -8 13 345 249 -215 -232 -97 197 99 -98 -136 -53 200 205 29 -207 7 140 218 -71 -135 181 526 19
7397 19 46 261 84 -84 -312 -40 -58 152 57 -228 49 283 59 128 5 -247 -212 -98 -170 89 26 7 -62
7420 -62 216 66 -151 -334 191 -292 31 -2 -109 220 57 -123 -329 -133 158 100 172 -39 159 -13 136
7441 136 -49 38 -162 -63 -126 -89 -50 197 -161 -58 -145 -196 248 -58 -110 -21 25 262 -10 72 -545 -218 288 -76
7465 -76 -208 -168 -29 -33 58 -196 124 99 -222 -74 444 -154 -69 -75 -13 -38 18 172 92 -8 206 -40 -129 212 159
7490 159 57 66 -139 -106 224 -237 -101 87 79 56 44 -106 5 102 231 62 3 -36 71 119 -244 -313 279 134
7514 134 0 44 -243 126 2 -101 20 -92 54 27 -144 -289 -70 -289 -108 64 63 54 -76 -58 -259 185
$$ packed form
7350B44j30l68L2k0K23R2l19K61q5J99k08O8k08K11J46K9m35J0J07N32m00P9j64
7373a04R6K1L32r6m64j7J35K94r8j97l8Q3K53Nj76k36K14J33P8k89o4L16L45n07
7397A9K7K15j77j68k28K72j8K10r5k85K77K34k24O9j23k52L5J14p2K59o3j9o9
7420f2K78j50k17j83N25m83L23l3j07L29j63j80k06J96K91n8P2k11J98j72J49
7441A36j85Q7k00R9o3L7L9K47l58J03q7n1M44l06n2Q9M6K37k72Q2o17L27N06l64
7465g6j32M0J39mR1k54L20k5l21J48N18n98Q5oO2k5N6J54q0j00K14k46q9L41n3
7490A59j02Rk05L3L30m61J36J88qk3j2j50J11R7J29j69n9l9J07M8l63o9N92j45
7514A34j34M4k87L69j24j03J21j12J46k7j71j45K19k19J81J72jrj30J8k01M44
$$ plain form
7536 185 146 41 -175 -32 350 -1 65 224 33 -265 67 -144 -133 -101 -87 75 -66 82 -144 55 -117 20
7558 20 34 -13 -302 -171 -14 19 221 -43 100 84 127 16 213 -71 162 292 237 16 -8 9 -157 30 -223
7581 -223 -108 412 47 -46 -188 38 -93 42 -156 72 241 -67 51 135 -82 117 213 184 2 206 -102
7602 -102 36 196 -127 -29 -166 73 28 31 -79 119 -48 137 -340 90 -116 -64 -42 196 44 -133 -35 5 47
7625 47 -170 -141 260 -94 -185 -102 52 129 -91 -111 -115 10 -161 145 -83 44 60 -124 210 -307 -121 113 -90
7648 -90 -14 100 -322 304 94 49 67 -97 80 -206 208 148 231 20 -4 -234 -211 -215 -13 122 -156 -29 92
7671 92 -73 -62 -33 18 26 -39 116 -91 52 123 318 43 315 -130 -20 88 76 112 -254 -235 -16 29 -124 103
7695 103 -189 149 199 250 -125 -30 -5 123 190 -47 82 49 147 53 -250 100 44 -127 -70 -154 -19 226 341 -72
$$ packed form
7536A85l9j05k16J43L82l51O6J59j91k98L32k11J1L2J4J62j41J48k26J99j72J37
7558B0J4m7k89J31J57L3K02k64J43j6M3j11J97k84K33J30n5k21k4J7j66J87k53
7581b23J15N20l65r3j42K26j31J35j98K28J69l08J18Q4k17J99R6k9j82K04l08
7602a02J38J60l23R8j37K39m5Lj10J98j67J85m77M30k06N2K2K38j52j77R8M0M2
7625D7k17K9M01l54r1Q3J54P7k20k0mJ25j71L06k28J27J6j84L34n17J86K34k03
7648i0P6J14m22O26k10m5J8j64J77k86M14o0Q3k11k4k30K3mK02J35k78J27J21
7671I2j65J1K9N1Qo5J55k07J43P1J95k75K72m45J10J08j2L6l66J9K19M5j53K27
7695A03k92L38N0N1l75R5K5J28O7k37J29l3R8r4l03L50n6j71N7q4J35K45J15m13
$$ plain form
7719 -72 -22 74 70 -94 -163 20 65 15 30 78 43 -38 -28 -50 38 -174 -70 27 -97 -53 214 -93 -175 224 171 -63
7745 -63 226 -25 32 288 -267 -148 -139 211 -362 -185 136 151 119 155 71 5 130 174 106 -115 146 175 70 -228
7769 -228 39 292 13 39 -43 -23 132 58 43 119 126 -163 106 86 35 135 -24 73 -80 -61 -36 -99 -41 38 -33 -11
7795 -11 442 -31 -46 261 -170 -209 70 87 68 -174 -123 396 55 -99 -171 -322 246 -116 74 155 -175 433 144
7818 144 26 -50 -46 172 -21 116 -170 272 283 -79 80 82 110 97 203 -262 -193 186 -29 -141 46 -102 58
7841 58 -14 -90 111 -87 -123 291 -32 -30 -135 31 -96 -39 203 -3 -59 -382 -89 96 -260 -84 3 -156 -286
7864 -286 29 256 52 64 -49 7 6 -202 -32 275 -52 -167 41 41 121 145 113 143 85 -64 -127 -117 113 187 77
7889 77 245 -142 57 179 -161 30 73 33 12 -62 29 142 -164 98 -163 -203 37 -131 126 216 11 13 157
$$ packed form
7719g2N0R6mj64o9J83M5n0J5M8l5q1J0k2Q8k12J04R7j24M4K67l07q2L99n3k34
7745f3K89k51N7K56n55J19RL50n73J77L21J5l2L6q4o6J25M4o8k21K61K9j05k98
7769b28K67K53k79K6q2K0J55p4j5P6Pk89K69k0n1J00j59R7j53J9K5o3N8P9p1K2
7795a1M53m73j5L07m31l9K79J7j9k42N1N19l41j54p2j51N68l62J90Q1l30O08k89
7818A44j18p6MK18j93J37k86M42J1l62J59KK8j3J06m65O9L79k15j12J87j48J60
7841E8p2p6K01j98l6M14l23Kj05J66j27N7K42k06n6l23K93J85l56J76Q7j59j30
7864b86L15K27k04J2j13N6jk08J70L07l27j15K08%Q0K4l2L0n8j49o3J0K30P4j10
7889G7J68l87J99J22l40J91M3m0k1p4R1J13l06K62k61m0K40j68K57R0k05KJ44
$$ plain form
7912 157 5 203 -247 -106 -183 232 -64 -133 -7 45 33 -93 14 103 115 108 45 -181 -189 219 -16 -102 -337 -23
7936 -23 69 126 -128 -314 164 -44 180 -347 -183 20 108 122 80 -271 38 -55 -43 -22 15 39 70 120 31 33 -33 -3
7962 -3 216 239 -187 73 -191 -46 -140 59 81 29 -4 -248 -185 159 195 192 -307 -374 111 19 23 -123 -14 21 139
7987 139 100 -245 3 -244 -59 -25 -206 -227 53 10 254 -150 54 -20 86 -82 -185 -207 223 -182 85 56
8009 56 -13 -16 79 64 -161 -45 -38 -63 160 -105 79 122 -60 -109 -152 -104 28 249 131 -52 -188 54 -34 172 303
8034 303 -133 -208 -62 -121 -178 -379 -193 184 254 -74 119 42 144 141 -88 -244 -122 155 -44 -62 218 66 283
8057 283 -94 -267 -178 -174 72 -79 -189 -189 10 -24 -252 -7 -165 108 19 -306 -102 -76 -20 -211 -153 247 67
8080 67 137 85 -15 -196 -235 26 159 27 -244 -103 -223 34 121 -76 -141 31 -178 87 -327 -55 156 78
$$ packed form
7912A57j52J98m50J41p7M15k96o9J26N2j2j26J07Q9J2po3k26qM08k35q6k35L14
7936b3R2N7k54j86M78k08K24n27J64K03Q8J4m2l51L09r3J2K1L7K4L1N0q9Ko6L0
7962cK19K3m26K60k64J45r4J99K2n2l3k44O3L44L6lm99o7M85r2Mj46J09L5J18
7987A39l9l45K48k47J85L4j81k1K80m3K44m04K04p4J06j68j03k2M30m05K67k9
8009E6o9lR5j5k25J16Pk5K23k65J84M3j82m9m3M8J32K21j18j83j36K42q8K06J31
8034C03m36p5J46n9n7k01J86L77P0l28J93p7J02lk29j56J22K77j99j8K80j52K17
8057B83l77j73Q9MK46j51j10%J99l4k28K45j58K73q9l25K04K6N6j91N8M00j80
8080F7P0n2j00j81l9K61J33j32k71J41j20K57Q7j97o5J72k09K65m14K72K11p8
$$ plain form
8102 78 67 198 50 -234 133 212 1 -102 202 167 -197 16 111 9 227 -347 5 189 -147 171 -141 -83
8124 -83 -87 53 106 -101 -204 132 18 230 -66 52 27 132 -155 85 -81 13 -81 444 57 -232 -80 91
8146 91 140 -135 122 -46 270 231 122 66 -138 -341 -142 -233 -226 -93 127 -153 -109 -275 -15 234 -39 2 65
8169 65 35 234 -128 -348 -92 -226 98 12 -271 -107 -73 -90 -32 -165 147 95 -167 -18 314 188 183 -49
$$ packed form
8102G8j1J31j48k84L67P9k11j03L04l5l64K13R5j02K18n74L52J84l36L18l12N8
8124h3mJ40N3k07j03L36j14K12k96J18k5J05k87K40j66R4r4N25l87k89J52J71
8146I1M9k75K57j68L16l9j09n6k04k03J99r1PJ33K20k80M4j66K60K49k73M1O3
8169F5l0J99l62k20K56j34L24q6k83J64L4j7N8j33L12n2k62J49L32j26nk32
8191d9
$$ Imaginary data points
##PAGE= N=2
##DATA TABLE= (X++(I..I)), XYDATA
$$ plain form
0 0 0 0 0 0 0 0 0 0 0 0 0 0 0 -8 8 -8 8 -11 16 -16 24 -24 32 -35 40 -48 56 -64 72 -83 93 -107 123 -138 155
35 155 -175 194 -216 241 -272 299 -333 369 -408 453 -499 549 -604 666 -734 809 -890 984
53 984 -1088 1201 -1334 1484 -1658 1863 -2108 2407 -2777 3260 -3901 4813 -6196 8532 -13207
68 -13207 26126 -134100 -416628 47359 353310 69260 -264036 -132842 117278 125126 13688
79 13688 -66134 -135044 -28834 171495 124873 -166513 -217891 110599 254113 -65261 -246068
90 -246068 8394 193304 5531 -146198 6547 93593 -59166 -62897 93616 48051 -114994
101 -114994 -61642 107194 62434 -84882 -38627 39550 -12419 -1242 75530 -3053 -143295
112 -143295 -32875 204757 95573 -222044 -159006 190576 220307 -112321 -238794 32567
$$ packed form
0@%%%%%%%%%%%%%qJ6j6J6j9K7l2M0m8N6o7P5q8J04j20J36j55J76k00K30k61K93
35A55l30L69m10M57n13N71o32P02p77Q61r52J048j153J270j400J543j699J874
53I84k072K289k535K818l142L521l971M515n184O037p161Q714j1009J4728k1739
68a3207L9333j60226k82528M63987L05951k84050l33296J31194K50120P848j11438
79A3688p9822o8910J06210K00329m6622k91386n1378L28490J43514l19374j80807
90b46068K54462J84910j87773j51729J52745Q7046j52759l731J56513m5565j63045
101a14994N3352J68836m4760j47316M6255P8177n1969J1177P6772p8583j40242
112a43295J10420K37632j09184l17617O3038L49582K9731l32628j26473K71361
$$ plain form
122 32567 206873 49878 -109820 -96080 295 104789 116878 -43875 -198727 -35715 248281
133 248281 126726 -223910 -185144 161591 223413 -72207 -202887 5775 145831 48222
143 48222 -59007 -59620 -9503 38200 64002 15802 -91603 -62190 95314 90599 -72171 -98560
155 -98560 47483 87865 -41600 -61245 50241 25371 -68516 -12935 82327 17071 -99879
166 -99879 -37892 89835 47255 -60349 -59483 6652 45739 30018 -14617 -60425 -49113 60055
178 60055 100518 -42073 -142597 -15603 150593 69739 -141157 -114849 91094 121861 -29184
189 -29184 -110013 -32769 64111 63811 -2434 -75173 -63872 60627 103841 -24730 -116640 -23991
201 -23991 107309 61371 -78300 -72981 38502 70053 1463 -50313 -15382 24906 16384 10233
$$ packed form
122C2567J74306j56995j59698J3740R6375J04494J2089j60753j54852J63012K83996
133B48281j21555l50636L8766L46735O1822k95620j30680K08662J40056r7609
143D8222j07229o13N0117M7703K5802m8200j07405K9413J57504m715j62770k6389
155i8560J46043M0382j29465j9645J11486k4870r3887N5581R5262o5256j16950
166i9879O1987J27727m2580j07604Q66O6135L9087j5721m4635m5808J1312J09168
178F0055M0463j42591j00524J26994J66196q0854k10896K6308K05943L0767j51045
189b9184q0829P7244R6880l00o6245p2739J1301J24499M3214j28571r1910R2649
201b3991J31300m5938j39671N319J11483L1551o8590n1776L4931M0288q522o151
$$ plain form
213 10233 -2796 -25613 -6080 30858 25070 -19268 -26366 18215 19841 -8889 5458 11303 -16041
226 -16041 -15381 25881 38679 -19565 -48831 12194 52712 15618 -39727 -36907 26631 48921 345
239 345 -38997 -27324 22856 46228 2597 -44544 -33772 30997 59616 -13673 -67826 -9920
251 -9920 54050 30995 -36448 -44206 10832 34753 12076 -23536 -35461 4696 34574 6628
263 6628 -27323 -25797 9577 27510 -1489 -24445 -15459 9345 19237 -7248 -19602 -865 3620
276 3620 1861 1727 -4669 -7599 -6069 7243 9742 -9574 -9114 769 2194 8068 467 -11661 -5879
291 -5879 7243 13864 -1863 -16164 -607 11245 9433 -12 -15402 -3337 17720 10003 -7953
304 -7953 -12264 4776 16339 2912 -5174 -4836 -94 14644 7459 -10002 -4599 7315 10649 995
$$ packed form
213A0233j3029k2817J9533L6938n788m4338p098M4581J626k8730J4347N845k7344
226a6041O60M1262J2798n8244k9266O1025M0518l7094n5345K820O3538K2290m8576
239C45l9342J1673N0180K3372m3631m7141J0772O4769K8619p3289n4153N7906
251i920O3970k3055o7443p758N5038K3921k2677l5612j1925M0157K9878k7946
263F628l3951J526L5374J7933k8999k2956Q986K4804R892k6485j2354J8737M485
276C620j759j34o396k930J530J3312K499j9316M60R883J425N874p601j2128N782
291e879J3122O621j5727j4301J5557J1852j812r445j5390J2065K1057p717j7956
304g953m311J7040J1563j3427q086L38M742J4738p185j7461N403J1914L334r654
$$ plain form
318 995 -6777 1462 3858 5127 6006 -6381 -3344 8371 3354 -558 -1884 -395 2782 514 2648
333 2648 -431 -6072 4273 3824 -3975 -544 -884 -1108 1284 -877 -905 -4099 -921 4583 -4854 -4385
349 -4385 2100 -2770 -1778 -462 -3151 -1271 -2280 -141 -2275 -5912 2762 -137 -6843 576 -208 -2714
365 -2714 -792 -2625 -1079 -1446 -332 1161 -5839 -1151 4416 -3719 -2022 1107 -1726 244 582 339
381 339 -878 -2360 3935 786 -3261 3445 -528 -1558 4968 1242 -1802 -639 3088 5496 -1592
396 -1592 -1161 3202 936 4989 2669 -5093 1988 6828 3261 -1729 -3052 5753 5400 -846 627 -1954
412 -1954 2706 8352 -2120 -5360 2483 6761 2923 -6483 -2100 6906 2317 -575 -4214 -3455 8047
427 8047 4489 -8270 -6109 3789 8730 -2414 -10906 -165 5380 3413 -3021 -11980 -1162 11041
$$ packed form
318I95p772Q239K396J269Q79j2387L037J1715n017l912j326J489L177k268K134
333B648l079n641J0345m49p799L431l40k24K392k161k8l194L178N504r437M69
349d385O485m870R92J316k689J880j009K139k134l637Q674k899o706P419p84k506
365b714J922j833J546l67J114J493p000M688N567q135J697L129k833J970L38k43
381C39j217j482O295l149m047O706l973j030O526l726l044J163L727K408p088
396a592M31M363k266M053k320p762P081M840l567m990j323Q805l53o246J473k581
412a954M660N646j0472l240P843M278l838r406M383R006m589k892l639P59J1502
427H047l558j2759K161R898M941j1144q492J0741N545j967o434q959J0818J2203
$$ plain form
441 11041 1231 -10857 -9236 6508 9570 -6927 -10811 -1581 5647 6123 -8165 -11912 4397 8177
455 8177 -2106 -10588 -4371 8271 2208 -7144 -4620 -539 6862 2241 -11283 -3803 9443 6771
469 6771 -9052 -12904 8722 15385 -5603 -14582 -1991 15294 11968 -13414 -15728 8385 20310
482 20310 4624 -19725 -12328 17335 20871 -2305 -22968 -10638 27262 25212 -18153 -30045 7267
495 7267 37362 8031 -31527 -14470 21295 23883 -2625 -23973 -8257 20617 19479 -6178 -24338
508 -24338 -4293 26206 14116 -17810 -20411 8893 26067 -2756 -24759 -84 19534 2218
520 2218 -16466 -3898 14694 -50 -13678 3 7629 1831 -4282 -8613 -2937 7328 10532
533 10532 -6976 -25918 -54 33105 7790 -37752 -26202 31378 40019 -24313 -50805 4507
$$ packed form
441A1041r810j2088J621J5744L062j6497l884R230P228M76j4288l747J6309L780
455H177j0283q482O217J2642o063r352K524M081P401m621j3524P480J3246k672
469F771j5823l852K1626O663k0988q979J2591J7285l326k5382k314K4113J1925
482B0310j5686k4349P397K9663L536k3176k0663J2330L7900k050m3365j1892L7312
495G267L0095k9331l9558J7057L5765K588k6508k1348J5716K8874j138k5657j8160
508b4338K0045L0499j2090l1926k601K9304J7174k8823k2003K4675J9618j7316
520B218j8684J2568J8592j4744j3628J3681P626n798o113m331N676J0265L204
533A0532j7508j8942K5864L3159k5315m5542J1550N7580Q641o4332k6492N5312
$$ plain form
545 4507 46532 13979 -38306 -31041 17387 32928 8070 -28613 -36042 13064 50995 8061 -55843
558 -55843 -33762 49638 51767 -34711 -56907 13164 52201 8602 -38763 -18993 20470 20467 2283
571 2283 -13034 -16113 3837 24477 11968 -23559 -21371 24798 27502 -20220 -22048 20514 21219
584 21219 -20674 -17258 30135 18716 -32740 -18040 32775 25976 -22876 -28749 12589 26543 4634
597 4634 -10689 -19083 -8246 27154 32603 -19034 -56592 1977 73989 20734 -76120 -44745 61541
610 61541 63055 -38328 -67790 10183 52395 15386 -26261 -34074 -7081 33372 37149 -21204
622 -21204 -64434 -1574 73119 21564 -68713 -42340 50030 49933 -33964 -47563 14896 29351 -4747
635 -4747 -13141 639 -4422 -9643 14201 16501 -22538 -21259 20768 17681 -18486 -12479 19354 1773
$$ packed form
545D507M2025l2553n2285P265M8428J5541k4858l6683p429M9106L7931m2934o3904
558e5843K2081Q3400K129q6478k2196P0071L9037m3599m7365J9770L9463lj8184
571B283j5317l079J9950K0640j2509l5527K188M6169K704m7722j828M2562P05
584B1219m1893L416M7393j1419n1456J4700N0815o799m8852n873M1338J3954k1909
597D634j5323q394J0837L5400N449n1637l7558N8569P2012n3255r6854L1375J06286
610F1541J514j01383k9462P7973M2212l7009m1647p813K6993M0453L777n8353
622b1204m3230O2860P4693n1555r0277K6373R2370r7q3897j3599O2459J4455l4098
635d747q394J3780n061n221K3844K300l9039J279M2027l087l6167O007L1833j7581
$$ plain form
649 1773 -28340 9327 40070 -14000 -51190 8027 61359 6425 -62219 -20357 51281 32427
661 32427 -25923 -34514 205 25627 24442 1297 -38175 -31908 42741 63079 -27159 -81073 4188
674 4188 90024 23244 -78034 -39300 54324 48363 -20041 -40475 -5787 21080 24837 9725
686 9725 -30040 -34500 24851 52875 -7101 -58535 -10324 56628 20740 -43400 -21007 27750
698 27750 15039 -17428 -3624 14120 -10790 -17814 19799 20822 -20512 -25260 12738 22454 -7058
711 -7058 -13509 845 -5766 -3055 21540 9711 -34292 -28723 35323 45862 -30235 -59716 11844
724 11844 58729 8190 -50628 -26830 28824 30288 -2154 -25001 -25956 7591 41136 15899 -44999
737 -44999 -42191 36392 58538 -19830 -61708 -1658 52602 19573 -34843 -25485 13135 20860 8478
$$ packed form
649A773l0113L7667L0743n4070l7190N9217N3332n4934o8644M1862P1638j8854
661C2427n8350q591L4719K5422j185k3145l9472O267P4649K0338r0238n3914Q5261
674D188Q5836o6780j01278L8734R3624n961o8404k0434L4688K6867L757j5112
686I725l9765m460N9351K8024n9976n1434M8211O6952l5888o4140K2393M8757
698B7750j2711l2467J3804J7744k4910p024L7613J023m1334m748L7998R716k9512
711g058o451J4354o611K711K4595j1829m4003N569O4046J0539p6097k9481P1560
724A1844M6885n0539n8818K3798N5654J464l2442k2847r55L3547L3545k5237o0898
737d4999K808P8583K2146p8368m1878O0050N4260l3029n4416R358L8620P725j2382
$$ plain form
750 8478 -7611 -19121 -7029 20029 23742 -11925 -31525 4956 32373 5038 -22485 -7520
762 -7520 14563 5739 -5461 6605 2759 -16015 -2795 23230 12156 -21577 -19461 17723 24286
775 24286 -5318 -18581 -7120 9815 16302 5055 -14278 -20314 6041 33001 7501 -35220
787 -35220 -22220 27555 34762 -14831 -38939 -493 31336 14200 -16981 -23243 -886 20236
799 20236 15684 -10285 -28600 -4588 29343 15604 -23284 -26206 8978 27007 945 -22270
811 -22270 -10938 8711 12391 589 -10540 -8966 -212 10548 9069 -10134 -14835 2578 13918
824 13918 4797 -11447 -9004 3697 6379 4459 -1647 -10455 -4956 9342 12287 -3531 -17332 -3048
838 -3048 16577 10175 -8730 -15403 777 16526 7616 -8854 -12284 153 15471 8914 -9669
$$ packed form
750H478j6089j1510J2092K7058L713l5667j9600L6481K7417k7335k7523J4965
762g520K2083q824j1200J2066l846j8774J3220K6025j1074l3733K116L7184O563
775B4286k9604j3263J1461J6935O487j1247j9333o036K6355K6960k5500m2721
787c5220J3000M9775P207m9593k4108L8446L1829j7136l1181o262K2357K1122
799B0236m552k5969j8315K4012L3931j3739l8888k922L5184J8029k6062k3215
811b2270J1332J9649L680j1802j1129J574Q754J0760j479j9203m701J7413J1340
824A3918r121j6244K443J2701K682j920o106q808N499J4298K945j5818j3801J4284
838c048J9625o402j8905o673J6180J5749q910j6470l430J2437J5318o557j8583
$$ plain form
851 -9669 -13680 1604 18185 8243 -14535 -11794 7741 15342 2678 -12175 -7720 7197 11506
864 11506 3374 -9872 -8371 6963 11139 1536 -8909 -7336 6339 9827 357 -8184 -6261 5037
878 5037 8652 -940 -6355 -5127 2316 8128 1074 -7516 -5900 2509 8329 296 -8703 -4462 3151
893 3151 6449 780 -8310 -5170 3599 5912 165 -7867 -4556 4064 4612 -370 -6738 -4963 4497
908 4497 4788 -1881 -6100 -3421 3813 4021 -1729 -3925 -3297 2822 4544 -1607 -4289 -1634 2403 3812
924 3812 -848 -4091 -1297 1937 4533 129 -4654 -416 3103 3087 397 -3464 -799 3043 2727 618
940 618 -3204 -495 4141 1772 -37 -1534 -905 3553 2311 -549 -1107 -303 3148 1547 -1516 49
956 49 240 845 2048 -563 -805 113 871 1821 -760 -992 446 99 1424 425 -2388 -414 760 669
$$ packed form
851i669m011J5284J6581r942k2778K741J9535P601j2664j4853M455J4917M309
864A1506q132j3246J501J5334M176r603j0445J573J3675L488r470q541J923J1298
878E037L615r592n415J228P443N812p054q590J616Q409N820q033q999M241P613
893C151L298n669r090L140Q769K313n747q032L311Q620N48m982o368J775R460
908D497K91o669m219K679P234K08n750k196O28O119J722o151k682K655M037J409
924C812m660l243K794L234K596m404m783M238L519j6k690l861K665L842l16k109
940F18l822K709M636k369j809j497O29M458j242k860n58Q04L451j601l063J565
956D9J91O05J203k611k42R18P58R50k581k32J438l47J325r99k813J974J174r1
$$ plain form
974 669 -368 -2447 -314 1234 -151 -464 -2652 -867 2469 -413 -2418 -1298 160 1463 -1287 -2890
990 -2890 -78 605 1018 -1402 -3549 715 2041 -1103 -2344 -1893 1944 1819 -2636 -2460 -143 2343
1006 2343 1486 -4315 -2392 2688 2141 -877 -3796 -514 3980 1157 -2580 -2895 874 4954 654 -4576
1022 -4576 -1157 3788 3628 -1638 -4425 2257 4608 914 -2592 -2469 3678 4841 -1890 -3383 663
1037 663 4873 2965 -4222 -2856 3568 4700 88 -5215 -1738 6635 3511 -4350 -4740 2514 7184
1052 7184 -165 -6951 -1826 5026 4950 -2792 -7185 1288 6905 1606 -5911 -5238 4329 6657 -2939 -7146
1068 -7146 -1456 6149 4805 -6383 -7543 3490 7438 -584 -9113 -3652 7994 4314 -6331 -7749
1082 -7749 1106 8958 785 -9693 -4889 5783 7487 -3326 -10886 -884 9848 4681 -8097
$$ packed form
974F69j037k079K133J548j385l13k188J785L336k882k005J120J458J303k750j603
990b890K812O83M13k420k147M264J326l144j241M51L837j25m455J76K317K486
1006B343q57n801J923N080n47l018k919L282M494k823l737l15L769M080m300n230
1022d576L419M945j60n266k787O682K351l694l506J23O147J163o731j493M046
1037F63M210j908p187J366O424J132m612n303L477Q373l124p861l90P254M670
1052G184p349o786N125O852p6p742m393Q473N617n299p517O73R567K328r596m207
1068g146N690P605j344j1188j160J1033L948q022q529N461J1646l680j0645j418
1082g749Q855P852q173j0478M804J0672J704j0813p560J0002J0732n167j2778
$$ plain form
1095 -8097 -10207 4548 12475 -1335 -12559 -4197 10345 9010 -7774 -11045 3124 10249 3394
1108 3394 -8670 -7863 6325 9782 -577 -9704 -4324 10090 8346 -6417 -9483 3130 11722 1658
1122 1658 -11245 -2773 10228 5323 -6216 -6599 4951 8221 -1737 -6140 -1276 5468 6176 -3298
1136 -3298 -8128 1308 10151 4394 -11061 -9051 11005 13403 -6816 -15906 1096 17964 4724
1149 4724 -16315 -9556 10656 13013 -2725 -14748 -4680 10546 11198 -3657 -16934 -4667 17707
1162 17707 11303 -14914 -18418 7717 21322 -2314 -21384 -4871 15346 9015 -9386 -11698 2390
1175 2390 8162 3047 -4602 -8307 -232 8320 3728 -8566 -8566 7393 10002 -7746 -10882 6647 10300
1190 10300 -6105 -11947 5563 13035 -5278 -12501 2319 11336 2199 -8519 -5373 4100 7271
$$ packed form
1095h097k110J4755P927j3810j1224Q362J4542j335j6784l271J4169P125o855
1108C394j2064Q07J4188L457j0359r127N380J4414j744j4763l066J2613Q592j0064
1122A658j2903Q472J3001m905j1539l83J1550L270r958m403M864O744P08r474
1136c298m830R436Q843n757j5455K010K0056K398k0219r090J7002J6868j3240
1149D724k1039O759K0212K357j5738j2023J0068J5226O52j4855j3277J2267K2374
1162A7707o404k6217l504K6135J3605k3636j9070J6513K0217o331j8401k312J4088
1175B390N772n115p649l705Q075Q552m592j2294%J5959K609j7748l136J7529L653
1190A0300j6405n842J7510P472j8313p223J4820R017r137j0718L146R473L171
$$ plain form
1203 7271 4329 -6711 -11781 4452 18420 3563 -20802 -12149 21273 20313 -15913 -24018 7741
1216 7741 25279 2711 -20261 -8872 11988 13015 901 -11961 -10813 7419 18747 2030
1228 2030 -21295 -11013 20940 17483 -15099 -19814 8108 19529 -2002 -15406 -628 8603 1240
1241 1240 -2406 -99 -1477 -3238 2648 5679 -4184 -6623 4595 4679 -5539 -3436 6746 1537 -12014
1256 -12014 -2513 15641 3213 -18827 -8080 16833 12306 -13970 -16509 6931 14111 868 -9808
1269 -9808 -9283 1446 11230 8637 -10374 -19742 4178 26151 3239 -27335 -13187 22745 20217
1282 20217 -15307 -21651 5317 17414 4031 -9641 -9201 104 9102 10164 -4725 -16668 -651
1295 -651 19014 7097 -15787 -11190 12326 12700 -7357 -8479 4138 4448 -2308 552 5340 -2707
$$ packed form
1203G271k942j1040n070J6233J3968j4857k4365Q653L3422r60l6226q105L1759
1216G741J7538k2568k2972J1389K0860J027j2114j2862J148J8232J1328j6717
1228B030k3325J0282L1953l457l2582m715K7922J1421k1531j3404J4778R231p363
1241A240l646K307j378j761N886L031r863k439J1218Q4j0218K103J0182n209j3551
1256a2014R501J8154j2428k2040J0747K4913m527k6276k539K3440P180j3243j0676
1269i808N25J0729R784k593j9011r368K3920K1973k2912l0574J4148L5932k528
1282B0217l5524o344K6968J2097j3383j3672M40R305Q998J062j4889j1943J6017
1295f51J9665j1917k2884M597K3516L74k0057j122J2617L10o756K860M788q047
$$ plain form
1309 -2707 -7767 4384 10358 -2063 -8803 4 7080 2747 -1909 -1042 -3468 -2723 8673 8498 -9291
1324 -9291 -14293 6180 19838 -756 -21319 -5867 16944 11739 -9476 -14580 1033 11288 6732
1337 6732 -3814 -13217 -5524 13344 13261 -9559 -19806 1282 21212 4874 -18248 -10561 9990
1350 9990 12075 -3032 -10240 -3780 3321 6255 3295 -6979 -8975 2391 10627 2330 -11377 -6540
1364 -6540 7550 6458 -3221 -5210 -1096 1385 1356 3528 588 -7739 -3245 8401 7315 -5642 -10231
1379 -10231 1519 10447 2855 -6110 -6071 652 7798 5497 -3994 -9261 -1601 11607 8168 -9041
1393 -9041 -11395 4277 14195 2832 -11741 -6911 7166 9368 772 -8087 -5913 4541 9308 2258
1407 2258 -8784 -7357 6596 10596 -1154 -9836 -3925 7540 7036 -2938 -6812 -2408 4133 5584
$$ packed form
1309b707n060J2151N974j2421o740Q807P076m333m656Q67k426P45J1396j75j7789
1324i291n002K0473J3658k0594k0563J5452K2811n205k1215n104J5613J0255m556
1337F732j0546r403P693J8868q3k2820j0247K1088J9930j6338k3122P687K0551
1350I990K085j5107p208O460P101K934k960j0274j996J1366Q236q297j3707M837
1364f540J4090j092r679j989M114K481k9K172k940q327M494J1646j086j2957m589
1379a0231J1750Q928p592q965L9O723P146k301r491n267P660J3208l439j7209
1393i041k354J5672R918j1363j4573M830J4077K202q596q859K174J0454M767p050
1407B258j1042J427J3953M000j1750q682N911J1465n04r974l874M404O541J451
$$ plain form
1421 5584 -270 -6085 -4046 3215 7028 90 -7525 -3679 4319 5815 -1170 -6867 -2741 3392 4996
1436 4996 683 -5899 -4644 3197 6120 535 -7382 -4853 4714 6024 -1195 -7307 -4042 4581 5284
1451 5284 -2026 -6370 -3332 4356 5848 -1234 -6500 -3115 4403 6031 -2251 -6538 -1410 4761 4783
1466 4783 -1863 -5490 -883 4115 4175 -1112 -5504 -1175 4336 4093 -1082 -4754 -968 4998 3701 -1280
1482 -1280 -4527 -904 4735 3475 -1645 -3864 -872 4294 3906 -2229 -3917 -695 4056 3542 -2579
1497 -2579 -3604 172 3551 3145 -1961 -3826 245 3126 2559 -1968 -3848 317 3036 1864 -1417
1512 -1417 -3555 52 2941 1500 -1592 -3187 40 3084 1104 -1763 -3069 -552 2972 1200 -2531
1527 -2531 -2432 -190 2349 898 -2367 -1991 217 2175 1096 -2582 -2108 888 1778 635 -2100 -2071 1012
$$ packed form
1421E584n854n815K039P261L813o938p615L846P998J496o985n697M126O133J604
1436D996m313o582J255P841K923n585p917K529R567J310p219o112L265Q623P03
1451E284p310m344L038P688J492p082n266L385P518J628q282m287N128O171K2
1466D783o646l627M607M998O0n287m392M329N511k43n175l672L786N966j297m981
1482a280l247L623N639j260n120k219K992N166l88o135j688L222M751n14o121
1497b579j025L776L379m06n106j865M071K881n67m527j880M165K719j172l281
1512a417k138L607K889j441l092j595L227L044j980k867j306K517L524j772l731
1527b531R9K242K539j451l265L76K208J958j079l678M74K996Q90j143k735K9L083
$$ plain form
1544 1012 1214 400 -1471 -1488 631 866 -74 -784 -1262 153 936 139 -529 -1007 128 1093 -41 -131 -540
1563 -540 -870 1035 1626 -17 -602 -723 1436 1807 -745 -1141 -39 1499 1641 -836 -1054 390 1867
1580 1867 1298 -1219 -1451 1114 2000 681 -1484 -1203 2269 1972 -1061 -1697 466 2223 912 -2029
1596 -2029 -894 1340 1247 40 -2368 -275 1990 953 -1467 -2093 400 2254 -352 -2575 -619 1588
1612 1588 2036 -1632 -2918 774 1934 257 -2411 -2282 1561 2121 -1181 -2647 -1153 2396 1923 -2838
1628 -2838 -2702 1128 2711 -125 -3211 -1407 2701 1567 -1529 -2741 227 3064 289 -2816 -1585
1643 -1585 1782 2638 -1605 -3173 154 3054 1239 -2339 -2698 2531 3512 -1423 -3394 -519 3810 2091
1659 2091 -3031 -3008 2003 4027 653 -4147 -1667 4110 3456 -1812 -4114 50 5378 1732 -3980 -3123
$$ packed form
1544A012K02q14j871j7K119K35r40p10m78J415P83p97o68m78J135R65j134r0m09
1563e40l30J905N91j643n85j21K159L71k552l96J102J538J42k477k18J444J477
1580A867n69k517k32K565Q86j319k165K81L472k97l033o36K163J757j311k941
1596b029J135K234r3j207k408K093K265j037k420o26K493J854k606k223J956K207
1612A588M48l668j286L692J160j677k668J29L843N60l302j466J494L549m73m761
1628b838J36L830J583k836l086J804M108j134l096j212K968K837k775l105J231
1643a585L367Q56m243j568L327K900j815l578l59N229R81m935j971K875M329j719
1659B091n122K3N011K024l374m800K480N777o54n268k302M164N328l646n712Q57
$$ plain form
1675 -3123 3064 5044 -770 -5243 -1029 4499 2960 -2806 -4389 1684 4924 556 -4082 -2543 3343
1690 3343 4288 -2237 -4846 152 4747 2069 -4650 -3653 2953 4275 -1180 -5078 -1257 4709 2508
1705 2508 -4158 -4249 1680 4919 -346 -5840 -2011 3749 3503 -2484 -5327 449 5196 1698 -4633 -3984
1721 -3984 2938 5036 -1746 -5703 -705 4798 2484 -4365 -4419 2552 4524 -872 -5012 -1622 4842
1736 4842 3152 -2846 -4165 912 4883 1489 -4891 -2825 3683 5114 -1843 -6222 305 6838 1805
1751 1805 -5193 -3873 4266 6082 -2116 -5949 -357 5644 3656 -3573 -5333 1470 6149 2299 -5119
1766 -5119 -4776 4417 6714 -1657 -7375 -942 7333 3764 -5589 -4848 3264 5291 -239 -4850 -1373
1781 -1373 3348 2656 -1049 -3846 -992 4018 2160 -3061 -4060 2058 4792 -1236 -5608 590 4847
$$ packed form
1675c123O187J980n814m473M214N528j539n766j583O073L240m368m638J539N886
1690C343R45o525k609M998M595k678o719R97O606J322n455l898L821N966k201
1705B508o666r1N929L239n265n494L829N760k46n987k843N776M747l498o331O49
1721c984O922K098o782l957M998N503k314o849n4O971J972n396m140L390O464
1736D842j690n998j319N077L971l394o380K066O508J431o957m379O527O533n033
1751A805o998J320Q139J816q198l833N592O001j988p229j760O803M679l850p418
1766e119L43R193K297q371n718O433Q275l569r353P41Q112K027n530m611L477
1781a373M721o92l705k797K854N010j858n221r99O118K734o028m372O198M257
$$ plain form
1796 4847 367 -5180 -1793 4691 2405 -4043 -3130 1901 3401 17 -3744 -2384 2086 4053 -32
1811 -32 -5989 -2832 5821 5350 -4758 -8333 1990 9374 57 -8923 -3364 6554 5631 -3484 -6171
1826 -6171 -155 4578 3901 -1942 -6063 -910 6590 4337 -4978 -6806 3217 8129 -651 -7311 -1203
1841 -1203 5562 3119 -3430 -2169 2017 1196 87 -38 -472 -698 544 1544 -208 -1742 928 1716
1857 1716 -1440 -1233 2608 2003 -3320 -3176 4330 4882 -4112 -5294 2371 6269 -46 -5817 -1946 3811
1873 3811 3706 -480 -4251 -3304 2605 5731 78 -7580 -3950 7270 6445 -5556 -8461 1682 8494
1888 8494 999 -7077 -3623 3100 4067 92 -3437 -3627 871 4466 1734 -5426 -4588 3695 5150 -1812
1904 -1812 -5444 -260 3896 756 -2325 -605 229 -475 341 2033 -62 -3191 -554 3845 1735 -2074
$$ packed form
1796D847m480n547L387O484k286o448R13N031J500l384l761J360M470J967m085
1811c2n957L157Q653m71j0108l575J0323P384r317q980N559R918r23r115k687
1826f171O016M733o77n843m121N153P500k253r315j828J0023M912q780o660O108
1841a203O765k443o549J261M186q21j109j25m34k26J242J000j752j534K670P88
1857A716l156K07L841o05n323J44P506N52q994j182P665L898o315n771L871N757
1873C811j05m186l771R47N909L126n653p658L630J1220q25j2001k905J0143O812
1888H494p495q076L454O723R67l975l529j90M498L595k732p160Q38Q283J455o962
1904a812l632N184M156l140l081J720Q34p04Q16J692k095l129K637M399k110l809
$$ plain form
1920 -2074 -2247 402 2231 1097 -610 -1926 -2080 1905 4654 -726 -5662 -1639 6352 4497 -4472
1935 -4472 -5601 2097 5733 1519 -4138 -3493 2043 4300 2038 -3140 -4770 1665 6373 1861 -5669
1950 -5669 -4272 4281 5918 -1395 -5109 -1209 3398 3300 -1038 -3192 -1576 1713 3614 327 -3975
1965 -3975 -2362 2431 3934 -551 -4138 -1056 2544 2040 -510 -2598 -1570 882 2265 1375 -2852
1980 -2852 -3508 1419 4177 237 -4083 -3028 2273 3731 -433 -3699 -2404 1775 3620 274 -3649
1995 -3649 -3098 1783 4481 -162 -4619 -2118 3082 4109 -1188 -4756 -1323 3023 2972 -744 -3771 -1418
2011 -1418 2894 3228 -521 -3975 -1559 3558 2987 -1287 -3705 -676 3375 2623 -978 -2911 -855 2833
2027 2833 3050 -1127 -3001 -1230 2887 3337 -1246 -3469 -791 3033 3031 -1367 -3457 -233 2681 2341
$$ packed form
1920b074j73K649J829j134j707j316j54L985K749n380m936M023P991j855q969
1935d472j129P698L636m214n657O45N536K257k262n178j630O435M708m512p530
1950e669J397Q553J637p313l714L900M607r8m338k154J616L289J901l287m302
1965c975J613M793J503m485l587L082L600n04k550k088J028K452J383q90m227
1980b852o56M927K758l940m320J055N301J458m164l266J295M179J845l346l923
1995c649N51M881K698m643m457K501N200J027n297l568L433M346n1l716l027K353
2011a418M312L34l749l454K416N117n71m274k418L029M051p52l601j933K056L688
2027B833K17m177j874J771M117M50m583k223K678L824km398k090L224K914l40
$$ plain form
2043 2341 -1024 -3501 -462 2856 2302 -1167 -3462 -296 2991 1867 -1490 -3043 -300 2962 1759
2058 1759 -1811 -2957 -543 2633 1656 -1567 -2547 -360 2409 1781 -1829 -2773 55 2342 1845 -1813
2074 -1813 -2570 -146 1980 1855 -1446 -2879 -28 1907 1236 -1686 -2724 -83 2280 1326 -1569 -2660
2090 -2660 396 2540 980 -1353 -2179 178 2298 963 -1797 -1816 111 2098 927 -1555 -1562 210
2106 210 2117 1407 -1661 -1608 440 1836 914 -1771 -1589 741 2096 1061 -1029 -1711 211 1751 1017
2123 1017 -882 -1807 599 2071 627 -1247 -1698 1035 2195 286 -1637 -959 787 1896 153 -1213
2139 -1213 -893 705 1799 78 -1610 -545 1127 884 -457 -1299 116 659 171 20 -769 -137 353
2156 353 -198 331 -352 -634 110 160 -31 -276 -690 -93 92 60 85 -921 -730 969 691 -551 -1440 -639
$$ packed form
2043B341l365k477L039L318n54l469k295L166L287j124l357j553K743L262j203
2058A759l570j146K414L176r77l223r80K187K769o28l610r44K828K287m97l658
2074a813p57K424K126j25l301j433K851J935o71k922j038K641K363r54k895j091
2090b660L056K144j560k333q26K357K120j335k760j9J927J987j171k482pJ772
2106B10J907p10l068N3K048J396r22k685J82K330J355j035k090o82J922J540p34
2123A017j899r25K406J472j444j874m51K733J160j909j923O78J746J109j743j366
2139a213L20J598J094j721j688J065J672k43j341q42J415N43m88j51p89O32M90
2156C53n51N29o83k82P44N0j91k45m14N97J85l2K5j006J91J699k78j242q89Q01
$$ plain form
2176 -639 1478 554 -1036 -1283 87 1169 303 -1413 -1079 482 1379 280 -1862 -1203 1034 1547 -170
2193 -170 -1784 -145 1984 435 -1287 -1096 722 1431 -226 -1086 48 1111 787 -237 -1124 589
2209 589 1520 322 -1054 -929 1575 1512 -973 -1217 615 1701 660 -1571 -839 1426 1383 -370 -1688
2226 -1688 -336 1830 1032 -1184 -1339 409 2073 22 -1853 -1033 1555 1566 -974 -1947 270 1803
2242 1803 174 -1385 -1038 1081 1472 -361 -1595 -582 1378 1174 -1771 -1709 1094 1522 -223 -2225
2258 -2225 -642 2203 727 -1917 -1553 702 1863 -110 -2424 -1268 1539 1776 -1046 -2803 -51
2273 -51 2903 861 -2435 -2582 1703 3134 -795 -2759 -598 2584 1688 -1733 -2111 648 2465 905
2289 905 -1988 -1820 1806 2614 -394 -2797 -605 2866 1943 -2103 -1755 1154 2611 -107 -2548 -369
$$ packed form
2176f39K117r24j590k47J370J082q66j716L34J561Q97j099k142O59K237N13j717
2193a70j614J639K129j549j722J91J818P09j657q60J134J063l24j024q87J713
2209E89R31j198j376J25K504o3k485k44J832J086j041k231P32K265m3j753j318
2226a688J352K166p98k216j55J748J664k051j875Q20K588J1k540r73K217J533
2242A803j629j559L47K119L91j833j234J013J960k04k945O2K803M28j745k002
2258b225J583K845j476k644L64K255J161j973k314J156K807K37k822j757K752
2273e1K954k042l296j47M285J431l929j964K161L182q96l421l78K759J817j560
2289I05k893J68L626Q08l008k403K192L471r23m046L48K909J457k718k441K179
$$ plain form
2305 -369 2308 1520 -1173 -1960 483 2199 -82 -1870 -927 1614 2060 -1271 -2511 532 2669 1018
2321 1018 -2486 -1614 2193 2316 -1309 -2600 173 3057 1323 -2542 -1853 853 2557 -171 -3095 -1277
2337 -1277 2239 2311 -1050 -3298 228 3249 916 -2943 -2128 1585 2865 -1066 -3178 -470 2544 1653
2353 1653 -1935 -2503 1035 2660 285 -2762 -1680 1929 2337 -1612 -2557 -91 2695 877 -2681 -1595
2369 -1595 1629 2427 -521 -2680 -560 2782 1498 -1562 -1985 895 2707 38 -2752 -858 1947
2384 1947 1898 -1353 -2275 671 2455 488 -1594 -1449 1488 2030 -682 -2163 -211 2248 1495 -1916
2400 -1916 -1977 1417 2404 -413 -2333 -458 2821 1118 -1761 -1583 956 2557 -60 -2266 -1090 1886
2416 1886 2185 -545 -3037 -176 3030 1230 -2482 -2444 1757 2965 -903 -2795 -719 2192 1603 -1688
$$ packed form
2305c69K677p88k693p87K443J716k281j788R43K541M46l331j240L043K137j651
2321A018l504Q72L807J23l625j291K773K884j734l865O89K706J704k728k924J818
2337a277L516P2l361k248L526L021k333l859Q15L713J280l931k112K708L014q91
2353A653l588n68L538J625k375l047J082L609M08l949r45K466K786j818l558J086
2369a595L224P98k948k159K120L342j284l060m23K880J812k669k790J894K805
2384A947m9l251r22K946J784j967k082J45K937N42k712j481J952K459p53l411
2400a916o1L394R87k817j920J875L279j703k879J78K539J601k617k206J176K976
2416A886K99k730k492K861L206j800l712L8M201J208l868j892K076K911n89l291
$$ plain form
2432 -1688 -2295 110 2038 1047 -1805 -2332 982 2450 178 -2909 -1435 2192 1833 -1714 -2025 267
2448 267 1658 27 -1514 -516 904 231 -105 -533 -169 403 184 -93 -533 -1 704 -568 -1042 697
2466 697 1631 -285 -2111 -261 2296 960 -2222 -1216 1294 2269 -483 -2220 -325 1712 1603 -191
2482 -191 -1952 -553 2216 2279 -1083 -3164 185 3802 1092 -2686 -2199 1658 3107 -179 -2325 -832
2498 -832 1225 1692 -127 -1734 -1212 799 1968 -55 -2252 -796 1816 1345 -772 -1836 64 1219
2514 1219 55 184 -157 -851 -557 928 887 -983 -1926 279 1920 333 -1356 -1449 325 1285 457 -663
2532 -663 -1393 -332 1914 1488 -1770 -2221 400 2912 603 -2984 -1856 1420 2352 133 -2355 -1480
2548 -1480 1203 1820 442 -2089 -1737 1310 2465 -218 -2715 -1271 2219 2260 -879 -2126 -625 1741
$$ packed form
2432a688o07K405J928r91k852n27L314J468k272l087J474L627l59l547l11K292
2448B67J391j631j541R98J420o73l36m28L64N72k19k77m40N32P05j272m74J739
2466F97R34j916j826J850K557j336l182J006K510R75k752j737J895K037j09j794
2482a91j761J399K769O3l362k081L349L617k710l778M87L857J449l286k146J493
2498h32K057M67j819j607N22K011J169k023k197J456K612m71k117j064J900J155
2514A219j164J29l41o94K94J485m1j870r43K205J641j587j689r3J774R60q28j120
2532f63p30J061K246m26l258m51K621K512k309l587J128L276R32k219k488Q75
2548a480K683O17j378k531L52L047J155k683k497J444L490M1l139j247J501K366
$$ plain form
2564 1741 1570 -338 -1592 -881 1445 2412 121 -1860 -1207 1709 2232 -359 -2611 -393 1358 1551
2580 1551 51 -1978 -711 1282 1620 -123 -2213 -1124 1655 2214 -429 -2384 -724 1997 1730 -618
2596 -618 -2211 -930 1875 1672 -718 -2147 -1077 1912 2076 -989 -2360 -602 1956 1704 -1272 -2296
2612 -2296 -39 1767 1362 -585 -2425 -468 2055 1771 -933 -2551 -512 1989 1318 -1221 -2503 -511
2628 -511 1915 1162 -1197 -2241 -328 1653 1135 -1236 -2247 -390 2191 1516 -1456 -2140 26 2197
2644 2197 1234 -1676 -2012 351 1829 1060 -1328 -1930 272 1857 1120 -1599 -2009 554 1900 854
2660 854 -1382 -1814 503 2043 844 -1138 -1617 299 2182 938 -1435 -1580 437 2526 749 -1572
2676 -1572 -1324 520 2245 668 -1399 -1476 483 1766 615 -1852 -1364 925 1550 347 -1716 -1174
$$ packed form
2564A741j71j908j254P11K326R67k291j981O53K916N23k591k252K218J751J93
2580A551j500k029J267J993L38j743k090J089K779N59k643j955J660K721k67k348
2596f18j593J281K805k03k390j429J070K989J64l065j371J758K558k52k976j024
2612b296K257J806m05j947j840J957K523k84k704j618K039K501o71k539j282J992
2628e11K426p53k359j044J913J981n18k371j011J857K581o75k972o84K166K171
2644B197r63k910l36K363J478p69k388o02K202J585p37k719m10K563J346j046
2660H54k236m32K317J540j199j982m79J916J883j244k373j45K017K089j777k321
2676a572K48J844J725j577k067p7J959J283j151k467M88K289O25j203k063N42
$$ plain form
2692 -1174 528 1618 595 -1265 -1504 515 1584 47 -1474 -1125 792 1670 -259 -1094 -858 513
2708 513 1201 177 -1286 -1012 329 1334 698 -1351 -1359 383 1813 167 -1642 -856 224 1223 573
2725 573 -1283 -1309 536 1331 348 -1644 -1581 1333 1901 -173 -1900 -917 1815 1165 -623 -1290 -452 1380
2743 1380 1239 -540 -1385 -343 1263 1257 -849 -1358 285 1248 476 -730 -563 924 345 -8 152 30
2761 30 -215 266 761 543 -472 -284 596 385 472 -339 -213 -5 381 868 -202 -1352 -95 1714 1021
2780 1021 -1180 -1542 914 1744 -133 -1690 -418 779 1271 -554 -1458 -638 865 1371 -415 -2090
2796 -2090 -302 1810 486 -1535 -1700 1176 1547 -632 -1528 -285 1052 851 -771 -955 -100 848 489
2813 489 -825 -965 780 753 -401 -1310 -141 1581 239 -1220 -401 918 810 -821 -1287 262 1210
$$ packed form
2692a174J702J090j023j860k39K019J069j537j521L49J917Q78j929q35K36J371
2708E13O88j024j463K74J341J005o36k049qJ742J430j646j809P86J080R99o50
2725E73j856k6J845P95r83j992O3K914N68k074j727R83K732o50j788o67Q38J832
2743A380j41j779q45J042J606ok106n09J643R63p72j206J67J487n79l53J60j22
2761C0k45M81M95k18j015J88Q80k11Q7q11J26K08L86M87j070j150J257J809o93
2780A021k201l62K456Q30j877j557J272J197M92j825r04Q20J503N06j786j675
2796b090J788K112j324k021j65K876L71k179q96J243J337k01j622j84Q55R48l59
2813D89j314j40J745k7j154r09J169J722j342j459Q19J319j08j631m66J549R48
$$ plain form
2830 1210 388 -1164 -741 712 1363 -48 -1605 -708 1358 1234 -1044 -1365 395 1840 420 -1419
2846 -1419 -640 1264 1374 -629 -1288 0 1792 790 -922 -1310 752 1612 -44 -1484 -351 1569
2862 1569 950 -1165 -1614 802 1693 -443 -1460 -430 1479 1287 -1282 -1496 139 1895 695 -1812
2878 -1812 -1342 1580 2094 -719 -2470 -828 2308 1220 -1978 -1984 656 2264 97 -2498 -943 1220
2894 1220 1585 -483 -2465 -320 2091 1240 -1666 -2114 756 2283 -380 -1816 -322 1536 785 -1177
2910 -1177 -1252 575 1122 253 -1188 -675 778 1005 -692 -1183 139 1370 579 -1819 -982 1470 1339
2927 1339 -848 -1911 609 2290 130 -1795 -1094 1358 1764 -605 -1571 -171 1523 1740 -1063 -2300
2943 -2300 656 2589 987 -2231 -1644 2127 2365 -855 -2217 81 2111 1098 -1525 -1162 621 1764
$$ packed form
2830A210q22j552M23J453O51j411j557Q97K066j24k278l21J760J445j420j839
2846a419P79J904J10k003o59J288J792j002j712l88K062Q60j656j440J133J920
2862A569o19k115m49K416Q91k136j017J030J909j92k569k14J635J756j200k507
2878a812M70K922N14k813j751J642L136j088l198oK640J608k167k595J555K163
2894A220L65k068j982K145K411q51k906m48K870J527k663j436J494J858p51j962
2910a177p5J827N47q69j441N13J453K27j697m91J322J231p91k398Q37K452j31
2927A339k187j063K520J681k160j925P01K452M06k369r66J400J694K17k803j237
2943b300K956J933j602l218N87L771K38l220j362K298K030j013k623L63J783J143
$$ plain form
2959 1764 429 -1686 -1144 1187 1374 -284 -1815 -260 1950 623 -1402 -1010 802 1560 -564 -1677
2975 -1677 6 1348 280 -727 -1100 686 901 -224 -1028 -639 974 1163 -1092 -1479 630 1615 -96
2992 -96 -2232 -691 1657 935 -1117 -1494 394 1566 -112 -1534 -708 731 1485 -112 -2015 -169
3008 -169 1715 1015 -974 -1752 349 1984 133 -1807 -815 1488 1123 -718 -1007 -29 1269 810 -947
3025 -947 -850 933 1059 275 -1303 -816 1329 1330 -785 -1129 379 1629 236 -1030 -137 1042 680 -376
3043 -376 -943 -125 1187 432 -464 -261 206 1147 -285 -805 -469 651 622 -909 -640 388 548 -252 -567
3062 -567 63 755 -43 -829 -327 40 352 -318 -688 -205 333 544 -230 -841 209 1355 -173 -1049 -547
3081 -547 1042 784 -789 -1167 274 806 426 -899 -953 42 826 509 -672 -1215 427 1336 -141 -1060
$$ packed form
2959A764j335k115N42K331J87j658j531J555K210j327k025L92J812P58k124j113
2975a677J683J342j068j007l73J786K15j125q04L89J613J89k255l87K109R85j711
2992i6k136J541K348p22k052l77J888J172j678j422Q26J439P54j597j903J846
3008a69J884p00j989p78K101J635j851j940R92K303l65j841k89R78J298m59j757
3025i47R7J783J26p84j578M87K145Jk115l44J508J250j393j266Q93J179l62j056
3043c76n67Q18J312p55q96K03M67R41j432n20L36J120k9j531K69J028J60q00l15
3062e67O30O92p98p86N02L67L12o70l70M83N38K11p74o11J050J146j528q76N02
3081e47J589k58j573l78J441N32l80j325n4R95P84l17j181n43J642R09j477r19
$$ plain form
3099 -1060 -595 1083 895 -582 -884 153 558 454 -138 -586 -526 365 998 -205 -1078 -72 619 689 -133
3118 -133 -459 171 501 422 208 -465 -469 178 760 603 -993 -666 839 1104 -217 -874 -382 806 856 101
3138 101 -605 -461 578 1403 61 -1018 -688 921 1662 -759 -1393 -519 1225 972 -734 -1393 -276
3155 -276 685 576 -237 -1285 -325 1025 1052 -429 -1631 -545 1240 789 -807 -1296 -288 1078 637
3172 637 -554 -1269 -486 1037 1188 -595 -1516 -523 1499 1158 -1094 -1565 177 1300 887 -1049 -1366
3189 -1366 -56 1172 979 -810 -1720 -58 1733 957 -1256 -1637 461 1575 615 -968 -1123 208
3205 208 1542 624 -801 -1147 234 1653 801 -1009 -926 526 1567 692 -1086 -1028 214 1856 630
3222 630 -1006 -1241 117 1553 996 -1310 -1512 604 1467 756 -1197 -1283 813 1904 550 -1188 -1463
$$ packed form
3099a060M65J678j88j477l02J037M05j04n92m48O0Q91O33j203q73J006O91P0q22
3118a33l26O30L30p9k14o73mO47N82j57j596L27J505K65j321o57M92J188N0p55
3138A01p06J44J039Q25j342j079L30J609P41k421o34Q74J744k53j706o59J117
3155b76R61j09q13j048R60J350K7j481j202J086J785m51j596m89J008J366m41
3172F37j191p15P83J523J51j783r21R93K022l41k252m71J742J123m13j936l17
3189a366J310J228j93j789r10J662J791p76k213l81K098J114r60j583j55J331
3205B08J334r18j425l46J381J419q52j810Q3J452J041q75j778N8J242J642j226
3222F30j636k35J358J436n57k306k02K116Q63p11j953q6K096J091j354j738k75
$$ plain form
3239 -1463 589 1897 344 -1517 -1651 768 1637 226 -1757 -1159 614 1742 223 -1570 -1113 313
3255 313 1349 108 -1408 -824 664 1188 325 -1533 -1131 642 1240 58 -1522 -1261 672 1378 148
3272 148 -1575 -1135 964 1430 -83 -1383 -981 958 1327 -52 -1546 -1010 927 1661 -156 -1782 -1053
3289 -1053 1439 1457 -252 -1628 -202 1241 1280 -129 -1310 -83 1317 1121 -254 -1409 -775 1275
3305 1275 1029 -123 -1160 -187 1208 585 -222 -794 -535 707 1129 148 -1055 -897 814 1718 -232
3322 -232 -1477 -558 1191 1142 -490 -1223 -455 549 1428 -205 -1561 -1090 1299 1774 -733 -2157 -293
3339 -293 1741 859 -997 -1573 331 1382 204 -1269 -1097 100 1391 602 -1015 -1135 170 1284
3355 1284 99 -1463 -569 929 539 -241 -677 314 286 13 228 148 -243 -483 -254 333 -393 -608 -48
$$ packed form
3239a463K052J308j553j861j34K419Q69j411j983N98J773J128j519j793M57J426
3255C13J036j241j516N84J488N24q63j858M02J773N98j182j580K61J933P06j230
3272A48j723M40K099M66j513j300M02J939L69j379j494N36J937P34j817j626P29
3289a053K492J8j709j376J426J443L9j409j181J227J400j96j375j155O34K050
3305A275k46j152j037R73J395o23q07n72K59J242M22r81j203J58J711R04j950
3322b32j245R19J749m9j632p33P68J004Q79j633j356M71K389M75k507j424J864
3339b93K034q82j856n76J904J051j178j473J72J197J291p89j617j20J305J114
3355A284j185j562Q94J498l90p80m36R91k8k73K15q0l91k40K29N87p26k15N60
$$ plain form
3374 -48 113 132 289 -109 -603 0 987 608 -1240 -1238 1160 1752 -191 -1662 -333 1900 1107 -976 -979 39
3394 39 1124 756 -1097 -1054 134 1824 695 -1457 -1355 1079 1755 -82 -1696 -181 1727 576 -894
3411 -894 -526 165 1231 214 -701 -480 22 1091 -53 -807 -195 835 293 -670 -740 879 798 -687
3429 -687 -660 254 829 -248 -1439 -348 823 542 -719 -1174 -31 1110 415 -807 -1055 250 1676
3446 1676 -143 -1749 -572 1093 931 -1069 -1617 595 1189 188 -1400 -1140 980 1112 -491 -1152
3462 -1152 -406 978 1048 -870 -1139 581 1386 -49 -1212 -297 1514 816 -993 -899 418 1277 -233
3479 -233 -1291 -351 1006 889 -424 -1439 499 1619 799 -1254 -901 1173 1813 -228 -1366 -342
3495 -342 1359 1271 -812 -1233 463 1394 683 -1186 -1209 1260 1313 -265 -1501 -444 1738 635 -1196
$$ packed form
3374d8J61J9J57l98m94O03R87l79j848KK398N92j943j471J329K233p93k083lJ018
3394C9J085l68j853M3J188J690j129k152J02K434O76j837j614J515J908j151j470
3411h94L68O91J066j017r15K21N02J069j144p54O12J030n42r63p0J619q1j485
3429f87K7R14N75j077j191J091J171k81j261m55J143J141o95j222k48J305J426
3446A676j819j606J177J665j62k000n48K212N94j001j588K60K120J32j603o61
3462a152P46J384P0j918k69J720Q05j435j163R15J811o98j809R4J317Q59j510
3479b33j058R40J357j17j313j015J938J120q20k053L53K074O40k041j138J024
3495c42J701q8k083m21J696R31p11j869k3K469N3j578j236J057K182j103j831
$$ plain form
3512 -1196 -786 410 891 -49 -1057 -333 584 280 -206 -791 83 684 -70 -1083 -819 543 1054 -1077
3530 -1077 -1008 604 1417 -163 -1391 -662 1351 462 -990 -1141 127 1081 599 -1160 -804 740 1668
3547 1668 37 -1984 -546 1482 957 -1096 -1571 216 1986 86 -1415 -641 773 1402 -89 -1040
3563 -1040 -422 829 1151 -98 -1309 -116 1518 678 -810 -605 921 1068 -402 -530 127 912 149
3580 149 -428 203 530 224 -43 94 3 130 33 -334 -269 207 950 -709 -1035 341 1205 427 -1048 -892
3600 -892 919 680 -668 -857 -278 802 460 -939 -815 -211 727 518 -1217 -1228 608 1347 -134 -1529
3618 -1529 -305 1424 284 -609 -926 33 684 -137 -663 -559 166 458 268 -805 -237 481 562 -11 -843
3637 -843 66 706 -27 -695 -43 453 103 -710 88 508 -98 -17 16 315 183 -172 -29 -13 -34 321 151
$$ packed form
3512a196M10J196M81r40j008P24R17l04m86n85Q74O01p54j013K64J362N11k131
3530a077O9J612Q13j580j228P29K013q89j452j51J268R54m82j759L56J544R28
3547A668j631k021J438K028n25k053m75J787J770j900j501P74J414O29j491r51
3563a040O18J251L22j249j211J193J634q40j488K05J526J47j470j28O57P85p63
3580A49n77O31L27l06k67J37r1J27r7l67O5M76P43j659l26J376Q64p78j475J56
3600h92J811k39j348j89N79J080l42j399J24O04R38k09j735j1J836P39j481j395
3618a529J224J729j140q93l17R59O51q21n26J04P25K92j90j073N68P18Q1n73q32
3637h43R09O40p33o68O52M96l50q13P98M20o06Q1L3K99j32l55J43J6k1L55j70
$$ plain form
3658 151 -136 -332 443 571 -393 -572 758 667 -82 -445 -211 656 90 -276 -48 -147 369 207 -279 -452
3678 -452 266 624 401 -624 -447 572 380 -418 -636 142 801 -195 -462 260 106 -30 29 -305 -171 -432
3698 -432 63 257 -482 -471 227 314 -160 -690 56 410 -38 -238 101 -200 -27 158 -119 -362 -674 433
3718 433 454 -276 -252 -20 428 10 -91 -192 108 -119 345 5 -502 -281 328 464 -116 -773 354 700
3738 700 -106 -530 -474 419 469 171 50 121 -2 623 606 -116 -428 -135 796 309 -777 -262 212 578 266
3759 266 -278 -19 26 162 406 -247 -473 134 763 314 -634 -741 474 439 -35 -471 -612 288 746 486
3779 486 -477 -687 71 1023 81 -769 -515 484 1083 -196 -794 -399 517 501 -11 -923 -472 253 547 181
3799 181 -1082 -722 452 631 -216 -1137 -181 140 312 226 -521 -480 651 717 -320 -654 -560 551 759 -373
$$ packed form
3658A51k87j96P75J28r64j79J330r1p49l63K34Q67n66l66K28r9N16j62m86j73
3678d52P18L58k23j025J77J019j92p98k18P78O59r96k67P22j54j36N9l34J34k61
3698d32M95J94p39J1O98Q7m74n30P46L54m48k00L39l01J73J85k77k43l12J107
3718D33K1p30K4K32M48m18j01j01L00k27M64l40n07K21O09J36n80o57J127L46
3738G00q06m24N6Q93N0k98j21P1j23O25j7p22l12K93R31m87j086N15M74L66l12
3759B66n44K59M5J36K44o53k26O07O29m49r48j07J215l5m74m36j41R00M58k60
3779D86r63k10P58R52r42q50K54R99N99j279n98L95R16j6n12r12M51P25K94l66
3799A81j263L60J174J79q47r21R56L21J72q6p47M1J131O6j037l34R4J111K08j132
$$ plain form
3819 -373 -767 -523 640 1040 -277 -823 -717 553 1281 -90 -910 -227 854 932 -288 -1092 -481 871
3837 871 1030 -256 -1020 -318 1084 798 -36 -1125 -115 979 737 -201 -616 -359 866 573 -181 -661
3855 -661 -210 883 616 -144 -1108 -241 857 830 -466 -1055 -18 636 789 -851 -1207 -18 704 1037
3873 1037 -176 -1568 -183 1327 875 -928 -1524 109 1597 486 -1103 -929 333 691 287 -822
3889 -822 -1099 92 1273 470 -1390 -899 313 1307 -278 -1238 -161 677 586 189 -859 -646 352 651
3907 651 590 -669 -894 310 944 -48 -480 -372 566 447 84 -293 -419 -367 732 1039 -348 -1007 -302
3926 -302 1311 442 -840 -826 446 1317 109 -558 -843 98 1189 798 -1032 -1237 373 1588 613 -1541
3944 -1541 -860 1343 1234 -399 -1112 -405 1062 555 -228 -745 -482 547 1040 -308 -1232 101 1247
$$ packed form
3819c73l94K44J163M00j317n46J06J270P28j371q20O83J081P8j220q04O11J352
3837H71J59j286p64P02J402k86q34j089J010J094k42r38m15K57J225k93p54m80
3855f61M51J093k67p60r64Q67J098k7j296n89J037O54J53j640l56J189P22L33
3873A037j213j392J385J510m52j803n96J633J488j111j589J74J262L58m04j109
3889h22k77J191J181q03j860M91J212R94j585r60J077Q38r1l97j048K13R98K99
3907F51o1j259k25J204O34r92m32J08R38j19l63l77j26N2J099L07j387o59P05
3926c02J613q69j282J4J272Q71j208o67k85R41J091l91j830k05J610J215r75k154
3944a541O81K203j09j633p13P07J467n07p83n17K63J029M93j348r24J333J146
$$ plain form
3961 1247 604 -1327 -644 804 495 -536 -322 280 -177 -198 301 251 -42 -481 13 621 41 -591 -260
3980 -260 1 -255 389 -26 -1041 -486 1000 1301 -627 -1474 65 1478 253 -1263 -970 886 1002
3997 1002 -396 -798 -435 776 1227 -201 -1269 -337 1047 1566 -844 -1446 608 1848 574 -1301
4013 -1301 -942 1145 818 -311 -647 -118 554 202 -4 -479 162 629 551 -386 -180 672 267 -498 -569 460
4033 460 941 -412 -715 344 1061 224 -732 -478 581 839 -239 -650 -85 953 598 -498 -719 -7
4051 -7 1466 697 -1137 -831 716 1331 -314 -1513 -141 1186 409 -661 -1106 128 790 -214 -649
4068 -649 -566 302 688 -327 -972 67 1020 301 -792 -741 491 404 -313 -993 37 639 172 -773 -382
4087 -382 425 823 248 -676 109 1035 571 -732 -799 349 1030 122 -939 -453 660 1101 -252 -1090 5
$$ packed form
3961A247o43j931O83J448l09j031K14O02m57k1M99n0k93m39M94O08n80o32L31
3980b60K61k56O44m15j015N55J486L01j928q47J539J413j225j516K93J856J16
3997A002j398m02L63J211M51j428j068R32J384N19k410o02K054J240j274j875
4013a301L59K087l27j129l36N29O72l52k06m75O41M67p8r37K06Q52m05p65p1J029
4033D60M81j353l03J059P17q37r56K54J059K58j078m11N65J038l55j096k21P12
4051gJ473p69j834L06J547O15j645j199J372J327p77j070m45J234O62j004m35
4068f49Q3Q68L86j015o45J039R53p19j093N1J232q7p17o80J030O02m67r45L91
4087c82Q07L98n75r24P85R26m64j303o7J148O81r08j061M86J113M41j353q38J095
$$ plain form
4106 5 1096 264 -604 -902 552 856 3 -713 -358 737 655 -146 -759 57 586 488 -494 -602 381 505
4126 505 148 -536 127 511 310 -714 -285 504 647 -434 -576 367 550 -133 -389 -281 483 618 -372
4145 -372 -452 -243 549 456 -741 -867 114 749 201 -1119 -706 763 905 -589 -1077 -148 769 416 -522
4164 -522 -688 -191 663 161 -800 -678 51 875 214 -1105 -195 775 445 -426 -947 120 641 -27 -325
4183 -325 106 -47 -56 142 88 24 -306 89 107 -123 314 85 -319 -28 404 498 -240 -708 168 589 72 -790
4205 -790 -242 632 721 -309 -280 15 454 586 -10 -414 -236 519 454 -570 -822 106 959 252 -1034 -582
4225 -582 334 663 -198 -529 -372 511 400 -16 -75 -409 302 485 -46 -687 -228 265 343 -452 -517 189 206
4246 206 -189 24 -125 -403 -107 244 408 -521 -302 262 124 -232 -524 53 -21 -130 130 206 -420 -255 408
$$ packed form
4106EJ091q32q68k98J454L04q53p16L55J095q2q01o13Q16N29r8r82j08R83J24
4126E05l57o84O63L84k01j024M29P89J43j081j42R43J83o83k56J08P64J35r90
4145c72q0K09P92r3j197j26R81O35n48j320M13J469J42j494m88R29R17l53r38
4164e22j66M97Q54n02r61J22P29Q24o61j319R10R70l30q71n21J067N21o68k98
4183c25M31j53rJ98n4o4l30L95J8k30M37k29m04K91M32R4p38m68Q76M21n17q62
4205g90N48Q74Q9j030K9K95M39J32n96m04J78P55o5j024k52R28Q53p07j286M52
4225e82R16L29q61l31J57Q83j11m16n9l34P11J83n31o41M59M93P8p95o5P06J7
4246B06l95K13j49k78K96L51J64r29K19N64j38l56k92N77p4j09K60P6o26J65O63
$$ plain form
4267 408 282 -293 -639 38 315 -325 -364 -268 376 552 -175 -69 -208 -252 574 275 -177 -391 217 587 -239
4288 -239 -445 81 267 260 -240 -34 284 207 194 236 -27 -197 449 354 161 -319 -74 755 232 -584 -144 179
4310 179 405 251 -238 243 -207 170 532 -153 -320 54 537 78 -416 -188 439 -24 -251 -327 -216 295
4330 295 -64 -194 -179 -270 -64 422 -344 -389 152 14 80 -305 -454 103 96 -202 -33 44 116 74 169 168 -306 167
4354 167 -64 302 -212 -70 61 297 -55 171 135 -290 256 91 93 -180 -133 360 295 -161 -141 372 283 104
4376 104 -234 13 74 516 46 -195 -152 78 308 218 -439 -217 611 425 48 -360 163 213 331 -298 -236 -18
4398 -18 355 445 -143 -510 -183 223 386 -346 -252 -39 155 303 -206 -401 -386 363 128 -258 -335 -134 300 432
4420 432 -283 -357 -281 539 314 -275 -381 2 637 -36 -351 -513 -43 584 -18 -772 -615 105 377 -161 -374
$$ packed form
4267D08j26n75l46O77K77o40l9R6O44J76p27J06j39m4Q26k99m52k14O08L70q26
4288b39k06N26J86pn00K06L18p7j3M2k63j70O46r5j93m80K45Q29n23q16M40L23
4310A79K26j54m89M81m50L77L62o85j67L74M83m59m94K28O27m63k27p6J11N11
4330B95l59j30J5r1K06M86p66m5N41j38O6l85j49N57pk98J69P7P2m2R5jm74M73
4354A67k31L66n14J42J31K36l52K26l6m25N46j65Kk73M7M93o5m56K0N13q9j79
4376A04l38K47O1M42m70k41M3K30K30r0o57K22Q28j86l77m08N23N0J18o29O2K18
4398a8L73R0n88l67L27M06J63p32R4K13J94J48n09j95J5P49k35l86p7K01M34J32
4420D32p15p4P6Q20k25n89j06L83O35o73l15j62M70O27o02p54J57P20K72n38k13
$$ plain form
4441 -374 -456 266 330 133 -483 -426 135 622 58 -818 -500 573 232 56 -443 -346 325 177 41 -34 -449
4462 -449 153 918 47 -415 -440 384 662 317 -366 -140 -22 572 305 -444 -450 222 855 268 -1019 -913 517
4483 517 877 -300 -960 -311 798 395 65 -474 -529 597 683 -135 -848 -511 911 645 -601 -711 -140
4502 -140 748 91 -648 -358 196 518 358 -289 -426 -33 367 441 -272 -935 166 445 202 -371 -95 -61
4522 -61 82 -83 549 -393 -419 58 614 61 -927 -869 647 351 -200 -553 -464 407 688 53 -647 -417 786
4543 786 879 -129 -1312 -319 1192 439 -901 -1377 403 829 -16 -876 -378 415 448 344 -319 -686 277
4562 277 1048 221 -921 -653 483 516 -124 -458 313 509 225 -283 -14 -145 -361 163 430 -13 -632 -25
4582 -25 106 432 69 -74 -305 -86 545 559 -563 -708 128 989 236 -1415 -256 1075 558 -660 -891
$$ packed form
4441c74q2P22O4j97o16N7N61M87n64q76L18J073l41j76m99R7O71j48j36p5m15
4462d49O02P65q71m62k5Q24K78l45o83K26J18N94k67p49oO72O33n87j287J06J430
4483E17L60j177o60O49J109m03l30n39n5J126Q6q18p13L37J422k66j246j10N71
4502a40Q88o57p39K90N54L22j60o47j37L93M00P4p13o63J101K79k43n73K76L4
4522f1J43j65O32r42k6M77N56n53r88N8J516k96n51l53Q9Q71K81o35p00K30J203
4543G86R3j008j183R93J511p53j340m76J780M26q45q60M98P93L3j04o63l67R63
4562B77P71q27j142K68J136L3o40l34P71J96k84n08K69j31k16N24K67m43o19O07
4582b5J31L26l63j43k31K19O31J4j122j45Q36Q61p53j651J159J331n17j218k31
$$ plain form
4601 -891 157 1052 194 -540 -688 -2 803 470 -812 -888 345 957 160 -1055 -686 658 533 -545
4619 -545 -655 93 415 -24 -56 -326 -13 492 162 -172 -571 18 648 -260 -389 154 200 -36 -222 -27 655
4640 655 73 -510 289 563 157 -356 -404 425 405 -144 -82 55 136 342 -24 -563 -183 627 891 -304 -624
4661 -624 127 1175 413 -812 -420 433 510 -443 -162 -238 457 330 -152 -131 -38 157 263 -586 -286 64 367
4682 367 174 -545 -272 236 -60 -146 -64 -40 318 -377 75 332 -174 -126 -451 -162 208 212 -152 -543 -141 450
4704 450 141 -636 -584 84 378 173 -609 -135 594 271 -321 -410 299 687 194 -328 -330 -47 715 53 -579
4725 -579 -90 -1 460 -75 -279 199 441 85 -292 -95 300 -54 -11 199 -26 368 -3 14 334 178 128
4746 128 -203 17 286 566 -17 -98 -291 33 538 -216 -589 30 563 55 -218 -534 590 251 33 -415
$$ packed form
4601h91J048Q95q58p34j48O86Q05l33j282p6J233O12p97j215L69J344j25j078
4619e45j10P48L22m39l2k70L13N05l30l34l99N89O30r08j29N43M6k36j86J95O82
4640F55n82n83P99K74m06n13m8Q29k0n49O2J37Q1K06l66n39L80Q10K64j195l20
4661f24P51J048p62j225L92Q53P7r53K81p6O95j27m82K1R3J95J06q49L00L50L03
4682C67j93p19K73N08k96q6Q2K4L58o95M52K57n06M8l25K89L70Ml64l91M02N91
4704D50l09p77N2O68K94k05p82M74P29l23n92q9P09L88m93n22kK83P62o62o32
4725e79M89Q9M61n35k04M78K42l56l77J97L95l54M3K10k25L94l71J7L20j56n0
4746A28l31K20K69K80n83q1j93L24N05p54l73O19N33n08k73l16J124l39k18m48
$$ plain form
4766 -415 -336 563 490 -75 -466 -555 489 402 -123 -405 -27 545 174 -792 -720 127 230 48 327 -173 81
4787 81 89 134 -25 -374 -75 145 19 -151 -296 64 252 140 164 95 -192 -71 27 137 -254 -701 291 204 -200
4810 -200 -495 1 430 344 113 -251 -111 109 478 74 -43 -314 283 619 173 -490 196 441 512 -158 -407
$$ packed form
4766d15P9Q99p3n65l91q9J044q7n25k82L78N72l71r66P2Q47J03j82K79n00K54
4787H1QM5j59l49K99K20j26j70j45L60J88j12K4o9k87J21R8J10l91m47R92q7m04
4810b00k95M96M29q6k31l64J40K20L69m04j17k71N97L36m46o63O86K45P1o70k49
$$ [...]
8191A01
##END NTUPLES=NMR FID
##END=
