##TITLE=1H_Pr Bu
 CDCl3, 8 sc, 
 6.07.2021
##JCAMPDX= 6.0         $$ Bruker NMR JCAMP-DX V2.0
##DATA TYPE= NMR FID
##DATA CLASS= NTUPLES
##ORIGIN= UXNMR, Bruker Analytische Messtechnik GmbH
##OWNER= root
$$ XWIN-NMR		Version 3.5
$$ Tue Jul  6 13:05:19 2021 Russian Standard Time (UT+4h)  she@DPX200
##.OBSERVE FREQUENCY= 200.131506
##.OBSERVE NUCLEUS= ^1H
##.DELAY= (6, 6)
##.ACQUISITION MODE= SIMULTANEOUS
##.ACQUISITION SCHEME= undefined
##.AVERAGES= 8
##.DIGITISER RES= 18
##SPECTROMETER/DATA SYSTEM= spect
##.PULSE SEQUENCE= zg30
##.SOLVENT NAME= CDCl3
##.SHIFT REFERENCE= (INTERNAL, CDCl3, 0, 15.7039)
##AUDIT TRAIL= $$ (NUMBER, WHEN, WHO, WHERE, WHAT)
$$ ##TITLE= Audit trail, XWIN-NMR		Version 3.5
$$ ##JCAMPDX= 5.01
$$ ##ORIGIN= Bruker BioSpin GmbH
$$ ##OWNER= she
$$ F:/spectra/data/she/nmr/H-F/1/audita.txt
$$ ##AUDIT TRAIL=  $$ (NUMBER, WHEN, WHO, WHERE, WHAT)
(   1,<2021-07-06 13:04:03.65 +0400>,<she>,<DPX200>,
      <created by zg, POWCHK disabled, PULCHK disabled
       configuration hash MD5:
       00 E9 B6 7A A2 85 ED C7 34 08 36 98 17 FE 4E 26
       data hash MD5: 16K
       2E 71 39 76 2C 43 2C B9 1E AF 0D 3F EC F2 0A 8C>)
$$ ##END=
$$ 
$$ hash MD5
$$ 9A DE 08 01 39 D9 9D DB E1 A7 10 D9 97 B9 65 CF
##$RELAX= 
##$RELAX= 
##$RELAX= 
##$RELAX= 
##$RELAX= 
##$RELAX= 
$$ Bruker specific parameters
$$ --------------------------
##$DU= <F:/spectra>
##$EXPNO= 1
##$NAME= <H-F>
##$PROCNO= 1
##$TYPE= <nmr>
##$USER= <she>
##$AMP= (0..31)
100 100 100 100 100 100 100 100 100 100 100 100 100 100 100 100 100 100 
100 100 100 100 100 100 100 100 100 100 100 100 100 100 
##$AQSEQ= 0
##$AQ_mod= 1
##$AUNM= <au_zg>
##$AUTOPOS= <>
##$BF1= 200.13
##$BF2= 200.13
##$BF3= 200.13
##$BF4= 200.13
##$BF5= 200.13
##$BF6= 200.13
##$BF7= 200.13
##$BF8= 200.13
##$BYTORDA= 1
##$CFDGTYP= 0
##$CFRGTYP= 5
##$CHEMSTR= <none>
##$CNST= (0..31)
1 1 145 1 1 1 1 1 1 1 1 1 1 1 1 1 1 1 1 1 1 1 1 1 1 1 1 1 1 1 1 1 
##$CPDPRG= <>
##$CPDPRG1= <>
##$CPDPRG2= <>
##$CPDPRG3= <>
##$CPDPRG4= <mlev>
##$CPDPRG5= <mlev>
##$CPDPRG6= <mlev>
##$CPDPRG7= <mlev>
##$CPDPRG8= <mlev>
##$CPDPRGB= <>
##$CPDPRGT= <>
##$D= (0..31)
0 1.2 0 0 0 0 0 0 0 0.06 0 0.03 0 0 0 0 0.0002 0 0 0 0 0 0 0 0 0 0 0 0 
0 0 0 
##$DATE= 1625562243
##$DBL= (0..7)
120 120 120 120 120 120 120 120 
##$DBP= (0..7)
150 150 150 150 150 150 150 150 
##$DBP07= 0
##$DBPNAM0= <>
##$DBPNAM1= <>
##$DBPNAM2= <>
##$DBPNAM3= <>
##$DBPNAM4= <>
##$DBPNAM5= <>
##$DBPNAM6= <>
##$DBPNAM7= <>
##$DBPOAL= (0..7)
0.5 0.5 0.5 0.5 0.5 0.5 0.5 0.5 
##$DBPOFFS= (0..7)
0 0 0 0 0 0 0 0 
##$DE= 6
##$DECBNUC= <off>
##$DECIM= 32
##$DECNUC= <off>
##$DECSTAT= 4
##$DIGMOD= 1
##$DIGTYP= 9
##$DL= (0..7)
0 120 120 120 120 120 120 120 
##$DP= (0..7)
150 150 150 150 150 150 150 150 
##$DP07= 0
##$DPNAME0= <>
##$DPNAME1= <>
##$DPNAME2= <>
##$DPNAME3= <>
##$DPNAME4= <>
##$DPNAME5= <>
##$DPNAME6= <>
##$DPNAME7= <>
##$DPOAL= (0..7)
0.5 0.5 0.5 0.5 0.5 0.5 0.5 0.5 
##$DPOFFS= (0..7)
0 0 0 0 0 0 0 0 
##$DQDMODE= 0
##$DR= 18
##$DS= 0
##$DSLIST= <SSSSSSSSSSSSSSS>
$$ [...]
##$SUBNAM2= <"">
##$SUBNAM3= <"">
##$SUBNAM4= <"">
##$SUBNAM5= <"">
##$SUBNAM6= <"">
##$SUBNAM7= <"">
##$SUBNAM8= <"">
##$SUBNAM9= <"">
##$SW= 20.0188882624521
##$SWIBOX= (0..15)
0 0 2 0 0 0 0 0 0 0 0 0 0 0 0 0 
##$SW_h= 4006.41025641026
##$TD= 16384
##$TD0= 1
##$TE= 0
##$TE2= 300
##$TE3= 300
##$TEG= 300
##$TL= (0..7)
0 120 120 120 120 120 120 120 
##$TP= (0..7)
150 150 150 150 150 150 150 150 
##$TP07= 0
##$TPNAME0= <>
##$TPNAME1= <>
##$TPNAME2= <>
##$TPNAME3= <>
##$TPNAME4= <>
##$TPNAME5= <>
##$TPNAME6= <>
##$TPNAME7= <>
##$TPOAL= (0..7)
0.5 0.5 0.5 0.5 0.5 0.5 0.5 0.5 
##$TPOFFS= (0..7)
0 0 0 0 0 0 0 0 
##$TUNHIN= 0
##$TUNHOUT= 0
##$TUNXOUT= 0
##$USERA1= <user>
##$USERA2= <user>
##$USERA3= <user>
##$USERA4= <user>
##$USERA5= <user>
##$V9= 5
##$VALIST= <valist>
##$VCLIST= <CCCCCCCCCCCCCCC>
##$VD= 0
##$VDLIST= <DDDDDDDDDDDDDDD>
##$VPLIST= <PPPPPPPPPPPPPPP>
##$VTLIST= <TTTTTTTTTTTTTTT>
##$WBST= 1024
##$WBSW= 4
##$XGAIN= (0..3)
0 0 0 0 
##$XL= 0
##$YL= 0
##$YMAX_a= 456796
##$YMIN_a= -612313
##$ZGOPTNS= <>
##$ZL1= 120
##$ZL2= 120
##$ZL3= 120
##$ZL4= 120
##$ABSF1= 10
##$ABSF2= 0
##$ABSG= 5
##$ABSL= 3
##$ALPHA= 0
##$AQORDER= 0
##$ASSFAC= 0
##$ASSFACI= 0
##$ASSFACX= 0
##$ASSWID= 0
##$AUNMP= <proc_1d>
##$AZFE= 0.1
##$AZFW= 0.1
##$BCFW= 1
##$BC_mod= 2
##$BYTORDP= 1
##$COROFFS= 0
##$CY= 11.3945322036743
##$DATMOD= 1
##$DC= 2
##$DFILT= <>
##$DTYPP= 0
##$F1P= 15.9154993809931
##$F2P= -4.1035820241983
##$FCOR= 0.5
##$FTSIZE= 0
##$FT_mod= 4
##$GAMMA= 1
##$GB= 0.15
##$INTBC= 1
##$INTSCL= 1
##$ISEN= 128
##$LB= 0.24
##$LEV0= 0
##$LPBIN= 0
##$MAXI= 10000
##$MC2= 0
##$MEAN= 0
##$ME_mod= 0
##$MI= 1.114404
##$NCOEF= 0
##$NC_proc= 0
##$NLEV= 6
##$NOISF1= 3.799351
##$NOISF2= 2.8
##$NSP= 1
##$NTH_PI= 0
##$NZP= 0
##$OFFSET= 15.70392
##$PC= 1
##$PHC0= -11915.91
##$PHC1= 12.40099
##$PH_mod= 1
##$PKNL= yes
##$PPARMOD= 0
##$PSCAL= 0
##$PSIGN= 0
##$REVERSE= no
##$SF= 200.130013532006
##$SI= 16384
##$SIGF1= 3
##$SIGF2= 2
##$SINO= 400
##$SIOLD= 16384
##$SREGLST= <1H.CDCl3>
##$SSB= 0
##$STSI= 0
##$STSR= 0
##$SW_p= 3612.71676300578
##$SYMM= 0
##$S_DEV= 0
##$TDeff= 0
##$TDoff= 0
##$TI= <>
##$TILT= no
##$TM1= 0
##$TM2= 0
##$TOPLEV= 0
##$USERP1= <user>
##$USERP2= <user>
##$USERP3= <user>
##$USERP4= <user>
##$USERP5= <user>
##$WDW= 1
##$XDIM= 8192
##$YMAX_p= 0
##$YMIN_p= 0
$$ End of Bruker specific parameters
$$ ---------------------------------
##NTUPLES= NMR FID
##VAR_NAME=  TIME,          FID/REAL,        FID/IMAG
##SYMBOL=    X,             R,               I
##VAR_TYPE=  INDEPENDENT,   DEPENDENT,       DEPENDENT
##VAR_FORM=  AFFN,          ASDF,            ASDF
##VAR_DIM=   8192,          8192,            8192
##UNITS=     SECONDS,       ARBITRARY UNITS, ARBITRARY UNITS
##FACTOR=    0.0002496,     1,               1
##FIRST=     0,             0,               0
##LAST=      2.0444736,     0,               0
##MIN=       0,             -612313,         0
##MAX=       2.0444736,     456796,          0
$$ Real data points
##PAGE= N=1
##DATA TABLE= (X++(R..R)), XYDATA
0@%%%%%%%Qj6J6j6J6k4L2m0N6o7Q3j04J22j46J76k11K51k96L47m03M69n45O26
30C34p16Q18r33J060j197J349j518J705j911K136k380K646k939L260l609L988
46B093m403M859n358N904o504P162p891Q705r610J0625j1773J3079j4587J6351
60H652j8442K0966k4087K8067l3339M0691n1728P0357j09712L33413m44139l57640
72e36941Q42569j52142l17981K10200l5778j78822M49658j16275o05789L25776
82a15525N72321m43116k50677K96504p0203m1041K88033k87493k96261N06769
92A59311J68741n91366N9763M62282k20008j79651K22491j65437l7041M10037
102B89122k04017m82123L89293L48682m38853j04686L28451j30325o0285K28491
$$ plain form
0 0 0 0 0 0 0 0 0 8 -8 8 -8 8 -16 16 -24 32 -35 48 -56 66 -80 96 -115 136 -160 187 -216 253 -292 334
30 334 -382 436 -497 563 -634 715 -803 902 -1009 1127 -1253 1393 -1546 1714 -1895 2093
46 2093 -2310 2549 -2809 3095 -3409 3753 -4138 4567 -5043 5582 -6191 6888 -7699 8652
60 8652 -9790 11176 -12911 15156 -18183 22508 -29220 41137 -68575 264838 -179301 -536941
72 -536941 305628 153486 -164495 45705 9927 -168895 280763 164488 -441301 -115525
82 -115525 456796 13680 -236997 59507 -10696 -51737 236296 -51197 -347458 159311
92 159311 328052 -263314 -203551 258731 38723 -140928 81563 -83874 -120915 289122
102 289122 85105 -397018 -7725 340957 -97896 -202582 125869 -4456 -64741 163750
112A63750k60675j49248M92179k9789n22019J86585L57308k49380p7762J88465
122I9414k12199j0499L92598k17903l83789L83652K34271l96771n0381K58264
132I6657p9539k3557J20553k26582o1647L86378p1134l75111J93279K13265k14698
143d2136K510J19939j71393N2482K44617k33862k09137L43221Q1111l14379O4876
154f2151J47488j40039P4906J10163k49214l930L19045j22049k76362K11474J37300
165A46631k10260L4659R6347j55835P7457J71269k17940j01481K68405n839k20196
176a16783J03392R0005j43494P5700Q8543k01993L1737K29372j43099j67438J84926
187C0868O2828j47148M1319M6001j06165Q6468R6406j93428j9084K17966p1633
$$ plain form
112 163750 -96925 -246173 246006 216217 -305802 -119217 238091 -11289 -89051 99414
122 99414 -112785 -123284 269314 51411 -332378 51274 285545 -111226 -161607 96657
132 96657 17118 -6439 114114 -112468 -174115 212263 141129 -233982 -40703 172562 -42136
143 -42136 -39626 80313 -91080 -38598 206019 -27843 -236980 106241 187352 -127027 -62151
154 -62151 85337 -54702 20204 130367 -118847 -122777 196268 74219 -202143 9331 146631
165 146631 -63629 -28970 67377 -88458 -11001 160268 -57672 -159153 109252 103413 -116783
176 -116783 -13391 76614 -66880 8820 97363 -104630 -72893 156479 13380 -154058 30868
187 30868 93696 -53452 -12133 33868 -72297 14171 110577 -82851 -101935 116031 44398
198D4398j55563J16406M7702j01030O2860L9335j40050M9240J54231j29107r3754
209a05332J50523j141r7016P0852K962q7645Q6045O2019j43212m766J49520o0370
221B2439r2570R3680J855o8939P0668O702r3172N3455P5989r3057l1078J03147
233D9119k6921p0799P0750O035p0014N5053L1471q1417J3768P3472m6296m3219
245c8998O1419k696m8286M6514L395n9581M8258L5068p2150M91O2761k7034l5003
258b5842L9727k104l6950L9409R597n5574K7668L8079m6666n501L7039j8987j6420
271a6525L0483n404l4279K8203K1719m3053N030L3714k5169q925K4404j0680j3852
284a4334J9216M288k4489P920K1863k2502l969K2486j4637o521J7705p919r957
$$ plain form
198 44398 -111165 5241 52943 -48087 14773 54108 -85942 -36702 117529 -11578 -105332
209 -105332 45191 44050 -52966 17886 20848 -66797 19248 81267 -61945 -66711 82809 22439
221 22439 -70131 23549 25404 -43535 27133 33835 -59337 -5882 70107 -22950 -54028 49119
233 49119 22198 -48601 22149 28184 -41830 13223 44694 -36723 -22955 50517 4221 -38998
245 -38998 22421 19725 -28561 17953 21348 -38233 10025 45093 -27057 -26566 36195 9161 -25842
258 -25842 13885 11781 -25169 14240 23837 -31737 -4069 34010 -12656 -18157 18882 -105 -16525
271 -16525 13958 8554 -25725 2478 24197 -18856 -13826 19888 -5281 -14206 10198 -482 -14334
284 -14334 4882 9170 -15319 -7399 14464 -8038 -12007 10479 -4158 -10679 7026 -893 -10850
297a0850J1802M171j1492J104J0914j0064j578J3334j1688k277J4539j0293m533
310f911J1078k349o209M231N357p652k254J1890o940n490J2083n823m627P712
324D096j534k410K66L007k79n729O327M34o958O653L07m584J782J24K119k031
340A590j816M804l896M2K491m062L627m4m384M753k167j365K714k365J168p15
356C75k01J257m396M206J446o945N097O95m844L227l81l45j064M64K934n837J665
373b647O417q171R57N586n088j12K172l57j848R27L938o327M3Q989q276j038Q599
390C764p000p72O884m878k703N625K382q074J259R794r751j357J2428j0385k514
405e298J2234o334p494J0020L648j1228J472J2590j1948m064J7649j0661r992
$$ plain form
297 -10850 952 5123 -6369 -5265 5649 -4415 -5993 7341 -4347 -6624 7915 -2378 -6911
310 -6911 4167 1818 -4391 -160 5197 -2455 -4709 7181 241 -5249 6834 1011 -3616 4096
324 4096 2562 152 418 3425 3146 -2583 3744 4178 -2780 3873 4180 -404 1378 1502 3621 1590
340 1590 -226 4578 682 724 3215 -847 2780 2736 -1648 3105 938 -427 2287 -78 1090 375
356 375 174 1431 -2965 1241 2687 -4258 839 1534 -3310 -83 -464 -809 -1873 -1409 1525 -4312 -2647
373 -2647 3770 -4401 -3444 2142 -2946 -3058 -886 -1243 -3091 -2164 1774 -4553 -4510 4479 -3797 -4835 3764
390 3764 -3236 -4008 2876 -2002 -4705 920 3302 -4772 -3513 6281 -3470 -4827 7601 -2784 -5298
405 -5298 6936 602 -6892 3128 6776 -4452 -2980 9610 -2338 -6402 11247 586 -9406
418i406J9151l427j5534J1587P689j3982Q97J4394j3314o497K3272j1321j8059
431a4550K5165N83k3792J3991J1455j9659J954J9578j6612j1805K8233p510k4736
444a7705K5339N338k8365J6110J5034k7794K347K8837j9092k0964L2439M95l3136
457b1117K4231J3114l4340J4170K3310l1994k975L5376j8101k6572L5623M111
469A4836m0490K5692K2818m3446Q358L6372l2666j2582L9494j3593l0459L4891
481I225Q454m4346K4238L0187m8121L935M7068l6219k3085M9857p508m2921L3785
494D549K0332m7604J4892L7733m5936l428N2589l5278k9041N5020p077m9645L9026
507F132K6258n7601J0552N2185m5797j8765N8135k5370l7904N4181l53n5536L5691
$$ plain form
418 -9406 9745 6318 -9216 2371 10060 -3922 -3025 11369 -1945 -8442 14830 3509 -14550
431 -14550 10615 11198 -12594 1397 12852 -6807 -4853 14725 -1887 -13692 14541 7031 -17705
444 -17705 7634 12972 -15393 717 15751 -12043 -9696 19141 49 -20915 11524 12019 -21117
457 -21117 3114 16228 -18112 -3942 19368 -12626 -15601 19775 1674 -24898 10725 14836
469 14836 -25654 38 22856 -20590 -12232 24140 -8526 -21108 18386 4793 -25666 9225
481 9225 17679 -26667 -2429 27758 -20363 -16428 30640 -5579 -28664 21193 13685 -29236 4549
494 4549 24881 -22723 -7831 29902 -16034 -19462 33127 -2151 -31192 23828 16751 -32894 6132
507 6132 32390 -25211 -14659 37526 -8271 -27036 31099 5729 -32175 22006 21653 -33883 1808
520A808L3663n5675K221N4199m2307k4820O3876k0067n2234N3829J5613n8907
532b8801K3513L6525m9352J895N3799m4955l2157P3232j1294o6783N0535K7922
544C4079o3353J9046M6879n3807j2299O4482k8100m7038N7414M862n6809M0375
556E731K2101o1513K5810M9859o3026j6590P6173k4429o0766N8081J9068o5239
568c4740L1862L6715o2885J1880O0131n4389l0070P2676r829o2000M5839K4230
580B9420o0041K7102M1830o5565J113O9386m0983m2245N9526N96n0169L9956J6105
593B6031o3339L3096N6119p4633j8865Q3695k3187n8754M9084J4924m9834L0719
605E056K6680o2169J3831O3584n2065l1785O4776j5160m2735M9797o39n8531M4750
$$ plain form
520 1808 35471 -20204 -17983 36216 -6091 -30911 32965 12898 -39336 14493 30106 -28801
532 -28801 -5288 31237 -18115 -16220 37579 -7376 -39533 33699 22405 -44378 6157 34079
544 34079 -29274 -10228 36651 -17156 -29455 35027 6927 -40111 17303 22165 -34644 5731
556 5731 27832 -33681 -7871 41988 -21038 -37628 38545 14116 -46650 11431 30499 -34740
568 -34740 -2878 33837 -29048 -17168 42963 -11426 -41496 31180 21351 -40649 5190 29420
580 29420 -30621 -3519 38311 -27254 -26141 43245 2262 -39983 19543 20139 -30030 9926 26031
593 26031 -37308 -4212 51907 -22726 -41591 42104 18917 -39837 9247 24171 -25663 5056
605 5056 31736 -30433 -16602 46982 -5083 -36868 27908 12748 -29987 19810 19171 -39360 5390
618E390M2295p4972p217P7335l2727m4547N2351p941m0007N1975L934o8995L4943
631h183N6954o1837k3538O5753j9590l9895M9653o928m9257M9621K0610o6768
643c3405J5359N5139m2778k2148N0829k0992l3004N5576o897o2691M8692L8964
655D2644o8267l894O0038k5102l0302L8434j0877k9745M8689R5o3073L4860M6483
668C9983n2460j1802M4421k2017j6702M3791j9166m6081N1167K6990o3619M972
680b0523M6426k8499q197L1029k9876j5031N3877r435n7510L3995L8901m6378
692a1221m465L6108k7011o339L7856k4644k8160M3872O851m7071J8587L1590l5937
705i984k220L5120k8963j3293M3928j4932l8361L3623K0423l8043J607K6913k0594
$$ plain form
618 5390 47685 -27287 -34504 42831 10104 -34443 17908 9967 -30040 21935 25869 -43126 -8183
631 -8183 48771 -13066 -36604 29149 9559 -30336 19317 12389 -36868 12753 33363 -33405
643 -33405 -18046 37093 -5685 -27833 22996 2004 -31000 24576 17679 -45012 3680 42644
655 42644 -25623 -29517 30521 5419 -24883 13551 2674 -27071 21618 21713 -41360 -6500 39983
668 39983 -12477 -24279 20142 -1875 -18577 25214 6048 -40033 11134 38124 -25495 -20523
680 -20523 25903 -2596 -10793 20236 -9640 -24671 29206 19771 -37739 -3744 35157 -11221
692 -11221 -15686 20422 -6589 -12928 24928 284 -27876 15996 22847 -24224 -5637 25953 -9984
705 -9984 -12204 22916 -6047 -19340 24588 9656 -28705 4918 25341 -12702 -11095 15818 -4776
718d776k173K5678k7212j2385M3895r632m1173K6197K2622k9373J39K1101k1772
731h864l211L3608j9972k7627L4254Q359l1512J0618J4150j9173O739J8107k5391
744i915q249L6472q945l1987K3138J2862k3304Q759J0073k0786O812K2383k1279
757c966j4798K9907k31k6589J5497J1044k1201R213J3652k1165j002K2369q851
770C879j6494J5832M333j5461R662O147j7658R410J3425j8912k852J9549o388
783D472j4146J2779N389j5114O115R615j4738K845J4017j3128o402J5477j812
796E369j1567P414M511j0032M709Q299j4415j75J5463p452r148R317M95n419N236
811B605L89r743N207J0629j0839o053J2480k637o155O742j960n767N652L931p178
$$ plain form
718 -4776 -6949 18729 -8483 -20868 23027 13395 -27778 -1581 21041 -8332 -8193 12908 -8864
731 -8864 -12075 21533 1561 -26066 8188 16547 -14965 -4347 9803 -9370 -2631 15476 -9915
744 -9915 -18164 18308 9363 -22624 514 13376 -9928 -1169 8904 -11882 -5070 17313 -3966
757 -3966 -18764 11143 10912 -15677 -180 10864 -10337 -1124 12528 -8637 -9639 12730 3879
770 3879 -12615 3217 7550 -7911 1751 7898 -9760 -350 13075 -5837 -8689 10860 4472
783 4472 -9674 3105 8494 -6620 -505 9110 -5628 -2783 11234 -1894 -8296 7181 5369
796 5369 -6198 1216 5727 -4305 404 8703 -5712 -5887 9576 2124 -7024 2293 2788 -2631 2605
811 2605 2994 -6749 -1542 9087 -1752 -7805 4675 2038 -4117 2625 665 -5102 550 4481 -2697
826b697k175P790k886m050O738l417m685P584l04o599L546L375m233q15N349k553
842c2n203O691L42n709M031O76l927L298K090l809j264M449N7m323K482J375l726
859b502L446J519m805J695K723j837j133J420P69k314K099J174m363K355K823
874C069l888O26K088j559k0Q64L66j748J68K823l234L42K576l007L89K303k080
891G8n90J426K46j585j41K354j970q44L424l167l61K879j801n35Q16j9n54j32
909d76J160j393q69L604k667j469L187j192j796J978n73n35J83J499j421j496
925b276L176j026k542L535j205j944L337j219j835J592J291j625j325L132p51
940C15k941L880q71l312M018J28l393J734J994j731j534L169m35l234M078l31
$$ plain form
826 -2697 -4872 2918 32 -4018 2720 -697 -5382 2202 1898 -4701 -1155 2220 -2013 -2828 2521 -32
842 -32 -5235 1456 1798 -3911 120 796 -3131 167 2257 -1552 -2816 1633 1690 -2633 -151 1224 -2502
859 -2502 944 2463 -2342 -647 2076 239 -894 526 1295 -1019 1080 2254 -2109 246 3069
874 3069 -819 -193 1895 336 316 1180 1546 -202 -34 2789 -445 -103 2473 -534 -145 2158 78
891 78 -512 914 1160 -425 -566 1788 -182 -1026 2398 -769 -1130 1749 -52 -587 229 210 -344 -476
909 -476 684 -709 -1578 2026 -641 -2110 1077 -115 -1911 67 -506 -1041 -858 641 -780 -2276
925 -2276 900 -126 -2668 867 -338 -2282 1055 -164 -1999 -407 884 -741 -2066 1066 315
940 315 -2626 1254 383 -2929 1089 1217 -2176 -442 1552 -179 -1713 1456 1021 -2213 1865 1534
956A534m937M824J594m936J457K809k071j579L401q50l568M799O13o810M439L554
972D273o121J284L483l225q44M541k071n215O082K752q792K691N674o123P54M318
988C461m929r87O276j861p130N932M223q386J410O237p048K70P694o520m058Q871
1004C455n6q518L216O207p278P99O612q401l68J0888p274p135J0595J757r383
1019d884K692O115p144P29Q241q983l033J2528m557r088Q654K554q102L817M643
1034D182q688R93J1327q729q046J3928J63j1127O426L139p478M894M836j0997
1048e177J70J4102p101j1220J3170J899j1299P069L408j0841N621R026j1477m604
1062g254J4726l077j1510J0219J327j0750R776M184j5659M508J4398j0610r494
$$ plain form
956 1534 -3403 1421 3015 -1921 -464 2345 274 -1305 2096 1246 -2322 2477 3090 -3720 719 4273
972 4273 -1848 -564 2919 -306 -1150 3391 1320 -3895 2187 4939 -3853 -1162 4512 -1611 -857 3461
988 3461 -1468 -2455 3821 1960 -5170 762 4985 -3401 -1991 4246 -2802 -2532 5162 -1358 -5416 3455
1004 3455 3399 -5119 -1903 4304 -2974 -2175 4437 -3964 -4332 6556 -718 -7853 2742 4499 -4884
1019 -4884 -2192 3923 -3221 -2492 5749 -3234 -6267 6261 1704 -7384 1270 3824 -4278 -461 4182
1034 4182 -4506 -3513 7814 -915 -8961 4967 5130 -5997 429 3568 -3910 984 5820 -5177
1048 -5177 -5007 9095 1994 -9226 3944 5843 -5456 1613 5021 -5820 -199 8827 -2650 -7254
1062 -7254 7472 4395 -7115 3104 4431 -6319 3457 7641 -8018 -3510 10888 278 -9216
1075i216J3821J097j1719P823K947j2386R170P748j6452R93J5959q786r222J2139
1089C916k77j1459J0729M116j7056P134J4406j5477m840J5311m901p830R629j729
1103A672j0858J2611N722j9625L862J8372j2726q333J3980l298p721J0995j265
1116C388j4000J1159J0342j7675n65J6443r997o346J4529p196j0620J6589K359
1129H410j8301N961J4531j2470m798J3483p511n570J4110o251j1709J4884M077
1142H846j6994M540J3692j1104n345J3691o222r130J4995j476j5356J1134Q353
1155I624j4149J63J1822q157m635J3391p038j1616J7070K394j8805P122J1728
1168H914j1081j504R179p619l287J3694n494j4036J4383N650j6731N556J0151
$$ plain form
1075 -9216 4605 5702 -6017 1806 4753 -7633 1537 9285 -7167 -6174 9785 999 -8223 3916
1089 3916 3639 -7820 2909 7025 -10031 -2897 11509 -3968 -8808 6503 1602 -6228 3401 1672
1103 1672 -9186 3425 9147 -10478 -6616 11756 -970 -9303 4677 1379 -6342 4653 3388
1116 3388 -10612 547 10889 -6786 -7351 9092 -905 -7251 7278 82 -10538 6051 8410
1129 8410 -9891 -3930 10601 -1869 -6667 6816 -695 -6265 7845 1594 -10115 4769 8846
1142 8846 -8148 -3608 10084 -1020 -6365 7326 1104 -8026 6969 5493 -9863 1271 9624
1155 9624 -4525 -4362 7460 -697 -5332 8059 1021 -10595 6475 8869 -9936 -2814 8914
1168 8914 -2167 -3671 5508 -2111 -5398 8296 2802 -11234 3149 8799 -7932 -2376 7775
1181G775j2201k92J2619q466q715J4501Q80j4935P942P943j2616L187R423j2102
1195e057p90J4403q437j0027J3672K862j5054O642R901j3226O70J1866j0329l919
1209f823J3370m862r802J0529L060j2077N501Q660j2770M84J3371r825o441J3126
1223E501k057j0489Q072M453j0006L482P789j0601o80J3351q718q062J2955p8
1237D912j0964O621N178r365J727Q577q540l332J1792m952p720J0066p00q980
1251e680P982L526j0850K051J0627p327o582J0398j278q313P983J372r033M720
1265d04N548p711m72P306m396m616Q415p50r570P627M275r560K441N968n951n80
1281b430O003l911m986P868R15q837M855M650q411K125P255o698l058P007j55
$$ plain form
1181 7775 -4426 -4718 7901 -565 -9280 5221 6101 -8834 -892 7051 -5565 -2378 7045 -5057
1195 -5057 -5847 8556 119 -9908 3764 6626 -8428 -1786 8115 -5111 -4441 7425 -2904 -6823
1209 -6823 6547 1685 -8117 2412 5472 -6605 -1104 7556 -5214 -4730 8641 -1184 -7625 5501
1223 5501 3444 -7045 1027 5480 -4526 -1044 6745 -3856 -4536 8815 97 -7965 4990 4912
1237 4912 -6052 569 5747 -3618 -1891 6686 -1854 -5186 6606 1654 -6066 4000 3300 -5680
1251 -5680 2302 5828 -5022 -2971 7656 329 -6253 4145 2867 -5446 2537 3909 -5124 -404
1265 -404 5144 -2567 -3039 4267 -129 -4745 3670 2920 -6650 977 5252 -4308 -1867 4101 -1850 -2430
1281 -2430 3573 -338 -5324 2544 3459 -5378 -523 4127 -4284 -2159 5096 -1602 -4660 2347 2192
1296B192n799L251K678n691K949L951o739J033O238m960k295N842j838m760N162
1311A214K390p243J678O273n341j605N916l500k731N629q47m701K755L397m447
1326a163j02M430l820j562N905k676l927M631L02l120J685J324l383P10M545m133
1342c54k780N993j387m193L996O24l691J589K592k632j752L853r86k500K911o92
1358E91k617L299k62l044J611K221k480r96K953m77k983K752O16l345K212J327
1374A378k864P29J689j608m90J786j34k499J846J840l344J075J682k273Q66Q82
1390E61j046n14J259M42k144R73J528j902N19J807k743K9K534q92j352P95P20
1407E74r11Q9J421j939J8K401j844n68J710q41n10J451m47j247M35J870j159j515
$$ plain form
1296 2192 -3607 -356 2322 -3369 -420 3531 -3208 -2175 4063 -897 -3192 2650 812 -3948 1214
1311 1214 3604 -3639 -1961 4312 -1029 -2634 3282 -218 -2949 2680 1833 -2868 -113 3284 -1163
1326 -1163 -1265 3165 -655 -2217 3688 1012 -2915 1716 2018 -1102 583 1907 -1476 -766 3779 -354
1342 -354 -3134 2859 1472 -2721 1275 1899 -1792 -203 2389 -243 -1995 1858 872 -1628 1283 591
1358 591 -2026 1273 1011 -2033 -422 1799 -681 -1677 1276 799 -2184 568 1184 -2161 51 1378
1374 1378 -1486 -757 932 -676 -1166 620 486 -2013 -167 1673 -1671 -596 1086 -1187 -321 561
1390 561 -485 -999 260 702 -1442 -469 1059 -843 -324 1483 -1260 -1231 1303 411 -941 -146 574
1407 574 -337 -248 1173 -766 -748 1653 -191 -759 951 110 -400 1051 604 -643 -208 1662 503 -1012
1425a012K066p83p93J933j310r16J251L62l17r45J056k34p60J711j022j666K510
1442A131l41j520Q67k5l27J85P67q98j298K243O9j961J479Nj331J547l29j283
1460a020K81J147l61r65R93n1j050J330J08j916J405L25r68L65N52m02j000J434
1478B07P21k770J477J272j904P82J217k077P21Q93n00r06P78R37j733R97J060
1495A172k480J136J407j800J99J306n02o03M25O33j703J044J525k409J0K399j624
1512A35m90J524p40r63J217N91k057R68J803k405m31K462j518o44J984j095j279
1529i38J968K68k106L62K140j763r54K402j344j426K823q43k253J854J197k355
1545i68r7K417j384j242K330r37k252L320m25k797K217J151k419r8K258j541j412
$$ plain form
1425 -1012 1054 271 -522 1411 101 -815 436 798 481 -464 592 358 -402 1309 287 -1379 1131
1442 1131 790 -730 137 112 -215 -30 737 -161 -1459 784 853 -1108 371 376 -955 592 263 -1020
1460 -1020 -739 408 47 -918 75 24 -1026 304 412 -1504 -99 226 -742 -377 175 -227 -1227 207
1478 207 928 -1842 -365 907 -997 -215 1002 -1075 -354 539 39 -867 -89 848 -885 112 1172
1495 1172 -1308 -172 1235 -565 -366 940 438 -165 260 893 -810 234 1759 -650 -640 1759 135
1512 135 -355 1169 429 -534 683 1274 -783 185 1988 -417 -848 1614 96 -548 1436 341 -938
1529 -938 1030 1298 -808 -446 1694 -69 -1023 1379 35 -1391 1432 589 -1664 190 1387 -968
1545 -968 -1065 1352 -32 -1274 1056 119 -2133 1187 762 -2035 182 1333 -1086 -1184 1074 -467 -1879
1562a879L319j088l473M211M27l682K026J626k522K22J867j885q74L361j064l500
1578b908L533J343l392J129J663k435L34K273j922j561L402M26l865J930K100
1593B050l387J061K228l343K68L557k093k868L632J434m196J520K351l355J178
1608C7K623m051j55M181j645l135K914J146l374J637J853l762Q06M114l969j732
1624b512M235P8l147J418J269k642J356K422m548j14N420k704l770M014M47k899
1640a677J873J001k968J027L227l766j776N219j116l888L490R5l040L377R01m833
1656b854R96N252l182l659M571L60l358K721k21l277L264J936m622j83M912j839
1672H17l693M040j55l423L501R23m804K454L701m220j373M024j093k150K989l68
$$ plain form
1562 -1879 1440 352 -3121 1090 1517 -2165 -139 1487 -1035 -813 1054 -831 -1705 1656 592 -2908
1578 -2908 625 1968 -1424 -295 1368 -1067 -733 1540 -382 -1943 1459 1885 -1980 -50 2050
1593 2050 -1337 -276 1952 -1391 -1123 2434 341 -2527 1105 2539 -1657 -137 2214 -1141 37
1608 37 2660 -1391 -1546 2635 990 -2145 769 1915 -1459 178 2031 -1731 -925 3189 -780 -2512
1624 -2512 1723 1801 -1346 72 1341 -1301 55 2477 -2071 -2185 3235 531 -3239 775 1222 -1677
1640 -1677 196 1197 -1771 -744 2483 -1283 -3059 2160 1044 -2844 646 741 -2299 1078 1979 -2854
1656 -2854 -1858 3394 212 -3447 1124 1484 -1874 847 626 -2651 613 2549 -2073 -2256 2656 817
1672 817 -2876 1164 1009 -2414 1087 2010 -2794 -340 3361 -859 -2232 1792 699 -1451 1538 1170
1688A170m207M584J709o113J654M416l179j944L118n53k272L327m19m377L492
1703D06L178n473J88M083k309j667L513j692k521L748R80n035J293M456l587q90
1719a329K719j664r00L489k082l249L948J976m780j69M443k684j238L282k344
1734e82j604L971n21l766J933K701l122p01L362k361j218M288k439l075M310P80
1750A956m399R88L104k078r56K822j997j312L967j838l626M221J655m365N37K914
1766A593j996o58K546j554k365M162J67l770J805J723k428R12J229k387lL431
1782B407j606l753L682J930m080R96K132k650R43J930k436j027L070m14k984K473
1798F13R80k891J085J995k908N70K675k394j227K557j7k443J526J106k616J359
$$ plain form
1688 1170 -3037 1547 3256 -2857 -1203 3213 34 -1910 1208 655 -1617 1710 1291 -3086 406
1703 406 3584 -1889 -1701 2382 73 -1594 1919 227 -2294 1454 2434 -2601 -1308 3148 -439 -1329
1719 -1329 1390 -274 -1174 2315 233 -3016 932 2908 -1872 -2041 2402 -282 -1520 1762 -582
1734 -582 -2186 1785 1264 -2502 -569 2132 -990 -1691 1671 -690 -1908 2380 -59 -3134 1176 1956
1750 1956 -2443 -1455 1649 -429 -1385 1437 -560 -1872 2095 257 -3369 852 2507 -1858 -1321 1593
1766 1593 -403 -1061 1485 -69 -2434 1728 1895 -1875 -70 1653 -775 137 1366 -1021 -1024 2407
1782 2407 801 -2952 730 2660 -1420 -424 1708 -942 1 1931 -505 -1532 1538 1124 -1860 613
1798 613 1593 -1298 -213 1782 -1126 -556 2119 -275 -1502 1055 1038 -1405 121 1227 -1389 -30
1814c0J827k926j10K712j352j892J970J141k351M05J430j508M1J866k056l41K741
1831A567j557j548J715K87j511Q74J248j990k95K740j679j868K623J70j786P51
1847b59M81r82J084P71j939m88K542o02k033J872N2j683J646P98k217M61J606
1864A110r87q54J434k25j536K156j91j972J065J362j747l40J262j14j157J394
1880F60K69j973J212Q27j565P09P58j597Q91J027r42j368J454N51j626Q26Q85
1897I98j948J019J241j746k71Q39K29l66K74m1q55P38J001j858k02J841o30m99
1915b36O17p48q1N87M82j347p5J448j026p7J030j205q3J319l43j087N36P02n81
1934a68J48K15m34l42J397m54r90P30j55l97N77J60o27k24J492j010q22J172Q1
$$ plain form
1814 -30 1797 -1129 -1239 1473 121 -1771 199 1340 -1011 -606 824 -684 -643 1223 -833 -1174 1567
1831 1567 10 -1538 177 464 -1047 -173 1075 -915 -1210 1530 -149 -2017 606 776 -1010 -259
1847 -259 222 -760 324 1095 -844 -1332 1210 608 -1425 447 499 -1184 462 1260 -957 -496 1110
1864 1110 123 -731 703 478 -1058 1098 907 -1065 0 1362 -385 -725 537 423 -734 660
1880 660 929 -1044 168 995 -570 139 897 -700 191 1218 276 -1092 362 913 -713 113 998
1897 998 -950 69 1310 -436 -707 132 361 -5 269 228 -627 111 1112 -746 -948 893 263 -236
1915 -236 381 -367 -448 139 621 -726 -801 647 -379 -456 574 -631 -714 605 262 -825 -289 413 -168
1934 -168 -20 195 -239 -581 816 362 -628 102 -53 -450 127 287 -340 -564 928 -82 -904 268 349
1953C49o26N39km88L34K75k11l82M05j48k31L77J81q91R43J66p04j0P61k69m73
1974a05M10o4p07N92N98j191M02Q66r11K02K67l52j3K52Q3r16P44Q40j253L53
1994I7L61n95K10J65l82l97Q91P9o64Q5M03n25RO31r89j22J158l34n74K24j29
2015c98K28r3O40r56O0R69m49l71P09q37J49O19m61p74J74J313n24k52O08n64
2035b10k4P21k26p47N30N55p73J37K46l01k96J092n85r48J307k87m04O55k06m78
2055b42M80K89k14p82Q82k0p46Q58k08q78Q09N14j104J83M39j69j62M37k41p16
2075e91J113K47j090J43P99r52N06J00r5n04Q73o6q49M73M03q21O6J033j228M
2095d36P06m66n75Q24N6o65M52N87r27J91J007j064l70J235o36m27O83r7p21L82
$$ plain form
1953 349 -277 262 260 -228 106 381 170 -212 193 45 -186 191 372 -519 424 590 -114 -124 637 368 -105
1974 -105 305 241 -466 126 724 -467 -65 801 -110 92 359 7 -6 246 329 -587 157 997 -256 97
1994 97 458 -137 73 238 -144 -541 350 429 -235 -150 253 -272 -263 368 -621 -743 415 81 -493 -269 -398
2015 -398 -170 -263 377 -579 -519 450 1 -370 339 -498 -349 270 -191 -965 -791 522 -2 -254 354 -210
2035 -210 -234 487 261 -486 44 599 -174 -37 209 -92 -388 704 119 -829 478 191 -213 442 236 -242
2055 -242 238 527 313 -469 413 393 -353 505 297 -581 228 742 -362 -179 260 91 -71 366 125 -591
2075 -591 522 769 -321 -178 621 -331 175 275 180 -324 549 483 -366 107 510 -311 -245 788 -440 -436
2095 -436 270 -196 -771 53 109 -556 -104 483 -444 -253 754 -310 -680 555 -81 -508 175 78 -643 -261
2115b61R19j085j7R95r21m72J308o46o33Q66K75r21M93J200j236n57J724j306
2133b75l45J373m62q07P25L08q69M32L68n44k44J008p94n40J106q2j077J284m7
2152E18j100Q02N47p74n22J597j016r12J694k33j601J139M53q84J46R10p72k72
2170b80Q28k67j163J370J56j443P59M91j106K36J077j021n37J345O1j577J185
2187A14J142j959O37P69j171R5R51q13q50J244K61j233Q85M59j068K34J432j732
2205f03j04J464r64p88J113J80j026L36J036j377K30J524j257m85J546o13j016
2222h04R65L26j184K97J107j105J1J660j443p74J738l83j317J204L64r63J3J269
2240I81j155q65K154j084p56R98p2p05P93L26j305M38J204j170l04J433n12j079
$$ plain form
2115 -261 658 -427 -444 551 -370 -842 466 -180 -813 53 328 -593 -100 1100 -136 -693 1031 -275
2133 -275 -620 753 291 -516 209 517 -352 80 448 -96 -340 668 -126 -666 440 358 -719 565 518
2152 518 -582 220 767 -7 -529 1068 52 -860 834 601 -1000 139 592 -292 -146 764 -8 -280
2170 -280 548 281 -882 488 644 -799 -40 451 -655 -419 658 -363 -900 445 506 -1071 114
2187 114 1256 -703 -66 703 -468 -373 578 -235 -1085 159 420 -813 72 531 -537 -303 1129 -603
2205 -603 -707 757 -207 -995 118 298 -728 -392 644 -733 -503 1021 -236 -721 825 212 -804
2222 -804 161 487 -697 -400 707 -398 -387 1273 -170 -944 794 411 -906 298 662 -301 -288 981
2240 981 -174 -1039 1115 31 -725 273 201 -504 289 615 -690 -252 952 -218 -522 911 399 -680
2258f80J133N4j071Q39M73j504M59R60p25n05R86M8j069J043O5j340J022M35j067
2277d44j68J282p40p29J170j57j013R00O48j844J120O60j447K98R97n85n81P57
2295A24K42j429Q66J017j511JJ313j032Q5O53n23m53P83K26j209O54Q84j400J
2314g08J460p65n49Q42k96n23J081q4j076M05Q21q17k06J164q02o08J297j16q38
2333c18K34P79p98m81J284p17j94Q31m01p76J400k27j141O93P61q78k95P31k64
2352B23o34R76l11j093J137J15o78L64M38o30l43Q48n48o05J318j09j499R23O74
2371E66r14K96L80m99q3N61m57o58J192K44j374P50M87j015K64M26o41j58Q76
2390B43j70n80M37K95n13K67L76p97K82N52o71j71O17N8n82O1Q90q93n4Q99n14
$$ plain form
2258 -680 453 507 -564 275 748 -756 -297 663 -62 -567 419 467 -602 441 506 -834 188 623 -444
2277 -444 -612 670 -70 -799 371 214 -799 101 749 -1095 25 685 -762 -464 533 -52 -633 124
2295 124 366 -1063 -197 820 -691 -690 623 -409 -324 329 -194 -647 136 362 -847 -193 691 -709 -708
2314 -708 752 -13 -562 280 -16 -539 542 458 -618 -213 608 -209 -415 749 -53 -661 636 520 -318
2333 -318 -84 695 -103 -584 700 -17 -211 620 219 -557 843 616 -525 168 929 51 -244 487 223
2352 223 -411 565 254 -839 298 413 -265 99 537 -93 -436 412 -136 -741 577 468 -1031 -108 566
2371 566 -348 -52 328 -171 -254 307 -150 -808 384 628 -746 4 491 -524 -260 166 -475 -633 243
2390 243 73 -507 -70 225 -288 -21 355 -442 -160 392 -279 -450 167 225 -357 -296 594 -299 -353 546 32
2411C2k27L69k16O2K23o9n37L15Q09r85k60J040o69r1P28n19j64L53J43l90p6
2432a29M22j78m29O56m76l84J199o66n14N56L84m08k03J80j5k59N73l14n20Q77
2452C52N7n59K11M5k21J8M01l25n97N74M69p70M53K8p08Q34k45m29K91O4K37m04
2474b24K71q6m25M65L56q82M76L11n86J46p5K64p4K64pp35K77N64p06M13J14n05
2496c84K39L73j10m92P8P76l62r9K70o74J58M20q7j76L59l65K33J08J1m24K24
2517G6M69o82j36N75jj53K24m33R9p6L72m29k38N05q6k98M78k58n37J014k74j29
2539H2k86K65J13MN1m32k05Q75r0j154J059m14j82L87K04m78J68M45n6j007N46
2560a05O3j60L30l8n39M21j13r0J84R1l4k45K56K54o41L96K27p83M97O6j99k27
$$ plain form
2411 32 -195 174 -42 20 243 174 -363 -48 761 -224 -484 556 -113 -204 524 5 -159 194 337 -53 -129
2432 -129 293 115 -314 342 -134 -518 681 15 -499 57 441 33 -170 10 -5 -264 309 -5 -525 352
2452 352 409 -150 61 106 -115 -97 304 -21 -618 -44 425 -345 108 136 -572 262 17 -412 -121 -57 180 -224
2474 -224 47 -39 -464 1 357 -525 -49 262 -324 -178 -253 11 -63 201 194 -541 -264 300 -406 7 121 -384
2496 -384 -145 228 118 -374 -296 480 118 19 289 -385 -227 193 106 -70 289 -76 157 265 276 -148 76
2517 76 545 -137 -273 302 301 148 372 -61 38 -38 334 -95 -333 172 86 -212 266 8 -529 485 211 82
2539 82 -204 61 174 178 229 -203 -408 467 377 -777 282 -132 -314 73 277 -201 -33 412 356 -651 -105
2560 -105 -42 -202 128 90 -449 -28 -141 -231 -47 44 10 -235 21 275 -366 30 257 -526 -29 37 -162 -389
2582c89M25j64l04L48M33p80M03L29m50J70o7j35K3J25J36j85J6K59o5j01M04
2603D31l48j27M80n87L89N5k42j12K35J48m29pO13k64p45R86k66l94N25O9o00
2624a90M61j34l36N5O15m37k06N69o05J2J027n41n35K47K02j65l28K76l40n1R10
2645E06m61n68P32M5o54M57m11j9K30P24p02j95L76k38J2M10J00p88O12jk12k52
2667b97J73m6p9L85M2j110J080q8m53L06Nr7J26K74k42n31O88L72q91K14O61r06
2689d14L52N76p43Q8L25K32o23j5O09q32K94M06n34M13L66o43k5N43j91l60M16
2710B40M34q06MM18m77K9P07p60k04O24K52q53M22J88n08J32N94m37m30Q42k80
2731A31n78L62J72n07M80K9J2m48Q72n51k69O78k15p09N88j30k27j7N39n02m3
$$ plain form
2582 -389 36 -128 -432 -84 349 -431 -28 301 -149 21 -46 -181 -158 -33 103 -82 -66 193 128 27 431
2603 431 83 -44 436 -151 238 293 51 -61 174 322 -107 -114 499 235 -510 476 210 -184 341 410 -190
2624 -190 271 137 -199 -144 471 34 -172 397 -208 -196 831 290 -245 2 204 39 -289 -13 -353 -404 506
2645 506 45 -523 209 254 -400 57 -354 -373 -143 581 -121 -316 60 -178 -166 244 344 -444 168 167 -45 -297
2667 -297 -124 -170 -249 136 178 -932 148 60 -393 -87 -82 -179 -53 221 -21 -552 136 508 -383 -169 492 -414
2689 -414 -62 514 -229 -141 184 416 -207 -222 387 -445 -151 255 -279 134 500 -143 -168 375 184 -176 240
2710 240 674 -132 -128 290 -187 -158 549 -211 -415 209 461 -392 30 218 -290 -158 436 -1 -431 411 131
2731 131 -447 -85 87 -420 60 89 101 -347 525 -26 -295 383 168 -541 47 -83 -310 -327 212 -290 -333
2752c33J003p78l47Q12j64q31Q57Q1m56R8M51m68k75P84k08p70O47nn43M21L76
2773C52q37M02K85m6m63L86j5o44P68K9o31N05N17q20J31O00l61m82N85Q3o82
2794c38N82J80j004L61P23n45l8N21n73j23O42P5p11L92K80o82N8P39l67n09R04
2815E67k82o44O99j92l19J84L24o38K7O79k84o71J043l07p25P39j65k46O5L68
2835B22m50j21O40m61l25P34q0n69N71Q1l21m08O12k92k27P19n19k02N48r5n35
2856d78P52j20m39N9L21J89o24L67J53l83L27m0o41Q56l0m07K71J80k97j06M93
2877D03o6n24N36L9p92K94M88k64r8L08l26j87L84r9j96R7N12p40J24J39k62K4
2899b06K34K53n67K98J89j72j08M04n89J95O30o96Q6L41r1j1l21J08J29l65P44
$$ plain form
2752 -333 670 -108 -455 357 193 -638 219 300 -156 -58 393 -75 -350 434 226 -544 103 98 -445 -24 352
2773 352 -485 -83 202 156 -307 79 64 -580 188 217 -414 91 608 -212 -81 519 158 -324 261 344 -338
2794 -338 244 424 -580 -219 504 -41 -79 442 -131 -254 388 463 -248 144 424 -258 -200 539 172 -337 567
2815 567 285 -359 340 148 -171 13 337 -301 -274 405 121 -550 493 186 -539 200 35 -211 -146 222
2835 222 -228 -349 291 -170 -495 239 159 -410 161 242 -79 -487 125 -167 -394 325 -194 -396 152 57 -478
2856 -478 274 154 -285 -226 95 284 -340 27 180 -203 124 84 -557 299 269 -138 133 313 16 -90 403
2877 403 337 -187 349 388 -404 -110 378 114 16 324 -2 -189 195 96 -100 -3 509 -231 -107 32 -230 -206
2899 -206 28 281 -286 12 201 29 -79 325 -264 -69 561 -135 -49 292 201 190 -131 -23 106 -259 485
2920D85r54K58M43r7k98J85o6k56N10K3n99K93M02n55m18Q97l95l29Q33m98j32
2941b68l0M00l01q2L59k71j2N74l69j67M65l02n16P45J09l93j15K21Q8k95j42
2962c02M75n29O22K3m62N38k18k99J18J46P9k01K00J52l86O6M38n42J74M12o12
2983a08r8K49K29l62J24K83k28j09K41m40K88K35n27J49j5L16l00M6L96l39j1
3004A9J87o9n48N43j18m8j53J05O4k78L96l99L71J84n3l91K72k33Nj8J43j5k08
3027b42O54o73K9L18l69L01J51n07R0M16j49j60J53J3M2l67M10M2n15M58J30o79
3049d54M70k33K33j7j39K7L9L18r6m80O33k64l67M22j6j05K45kj10OkJ94n48L28
3073H2J09l69L40J32j87J63j05j62q4K64k05R0j5J93m60K31J85k47L2o4R2K5q8
$$ plain form
2920 485 -469 -211 232 135 -163 22 -44 -300 210 233 -366 -73 329 -226 -644 253 -142 -471 362 -136 -268
2941 -268 -298 102 -199 -281 78 -193 -205 369 0 -167 298 -4 -520 225 334 -59 -174 47 135 -160 -302
2962 -302 173 -356 266 289 -173 365 147 -152 -34 112 191 -10 190 342 -44 22 460 -82 92 504 -108
2983 -108 -206 43 272 -90 34 317 89 -20 221 -219 69 304 -223 -74 -89 227 -73 -27 369 30 19
3004 19 206 137 -411 132 14 -34 -187 -82 -18 -296 100 -299 72 256 203 -188 84 -149 -144 -162 -19 -34 -242
3027 -242 412 -261 -232 86 -283 18 169 -338 -248 168 19 -141 12 25 67 -300 110 152 -363 95 225 -454
3049 -454 16 -217 16 -1 -140 -113 -74 244 148 -332 301 37 -330 92 76 -29 216 214 104 110 108 302 -246 82
3073 82 191 -178 162 294 107 270 165 3 -81 183 -22 68 53 246 -214 17 202 -45 -13 -77 15 40 -48
3096d8K49j45l73O42q12M61L15o3l03L29m66R2K8p3O4M04j32n9l85N46m90j51
3118c70M18k04L05j97k09O8K24P2l82J87M01k90l26L46j46q6J19J69k10k55L40
3139b6p9j39L74p4j49N46k51k34j21L36j63jpM1j53N63l90j64J39O4l41K44j01
3162h6L5L4K06j73p9M7l6j89M35P5n21K11J35j54k21K58q4j40M19K87o39J72L70
3185C62n37K41J17m02J73K16j80m65N77J92o24J59L37o84M39M01p27N10j69j08
3205a72J47r9Q2k53K14J92m05l47R86p26J22L96j45r0J57J10o34L78K07j49j95
3226b24J11J10o6N9l94L50L01l1m02Q8L04j85j99N56k78k73O37k84k87L3K46j39
3248C3J30O9k60l7K15j07k98L71m58M2N14o5k38L32K1k10p1J31j59k31N21k29
$$ plain form
3096 -48 201 56 -317 325 -487 -26 289 226 -77 252 -214 -122 -94 -167 -103 301 169 110 -275 271 -219 -370
3118 -370 48 -156 149 -48 -257 -189 35 107 -275 -88 313 23 -303 43 -103 -189 -70 99 -111 -366 -26
3139 -26 -105 -244 130 56 -93 453 202 -32 -153 183 20 19 12 53 -100 463 73 -91 48 112 -229 15 -86
3162 -86 -51 -17 189 16 -63 -16 -52 -241 194 269 -252 -41 94 -60 -281 -23 -107 -247 172 459 -180 -8 362
3185 362 -175 66 183 -219 -46 170 -10 -475 102 294 -330 -171 166 -518 -79 322 -405 105 -64 -172
3205 -172 -25 -124 -42 -295 -81 111 -294 -641 345 -381 -259 137 -8 -98 59 169 -465 -87 120 -29 -224
3226 -224 -113 -3 -69 -10 -404 -54 247 216 -186 -98 206 21 -178 378 100 -173 464 180 -107 -74 172 33
3248 33 163 232 -28 -65 150 43 -255 116 -342 -300 214 149 -89 243 264 54 -17 114 -45 -276 245 16
3270A6n11N81j55J36n5R6j1l0K52k34k61J64M94p05k3J38l4K50K31p00kL01K79
3293B17o43L67J59j65LM15k22l24K04j27j55o0L80j46K04J00m39N3O05r35N48
3314C9K3k53m5K1N32m92J14K61m79P4L97m17K8L53k96PJ66K69m08k3M90n13J13
3337c9N41m05N7m6J26j59K4K3j09k03J48p2PL45j23k03K56j8l99K44J56l83J92
3360d0K08j24j75L07k29l14M71j9m89O46K9o29L8J20Q5q6L5K00l70J75L60m09
3382b10J45n8j5J37j56R4j69J48M29o50J68K92j90r7J68n1J49l81J08j10J31J42
3404B4k83J83L55n49M29j43o4n2J34P4m86L52J51l33K10J42k65K46j37l6R3K55
3426C00m23j19K02K73j89q2K39j07k18O23p25L41j50J65j50J73m3k58P4J01k39
$$ plain form
3270 16 -495 86 -69 67 12 108 97 67 319 85 -176 -12 482 -223 -246 -108 -142 108 339 -361 -363 -62 217
3293 217 -426 -59 100 -65 -62 353 131 -193 11 -116 -271 -331 49 -97 107 207 -232 -179 426 -509 39
3314 39 62 -191 -236 -215 317 -175 -61 200 -279 -205 192 -225 -197 156 -140 -133 33 302 -106 -129 361 -152 -39
3337 -39 502 97 154 108 234 75 99 122 13 -190 -42 -114 -107 238 115 -88 168 150 -249 -5 151 -232 -40
3360 -40 168 44 -131 176 -53 -367 104 85 -404 242 271 -358 -320 -200 -115 -201 -166 34 -336 -161 199 -210
3382 -210 -65 -123 -138 -1 -157 -63 -232 -84 345 -305 -137 155 -35 -132 36 -15 134 -247 -139 -249 -118 24
3404 24 -259 -76 279 -270 159 16 -48 -100 34 108 -378 -26 125 -208 2 144 -121 125 -12 -48 45 300
3426 300 -123 -242 -40 233 44 -38 201 94 -124 499 -226 115 -35 130 -20 153 110 -148 -74 27 -212
3447b12J81L05r3l67J66m5J37j87L24L1k79N4j97k46O81O4p95P28l03m72L91p4
3469b08M73o88N87L2q57N68J41j70M15n51K19j2P0l09K75r9Q4k82K44K75m19J18
3491i4j18J35j78J85L3p9L69k92j59QM63m73L37J29l79J56j29j92K24lK29k33
3513f1J63L34l75k03L88l87L9K85l55j04O08m8m51J38J03j05J2P9P5j2J13l34
3535i8l6N83p40L52q4J52P7k25J03k48J63K82j75j59J34p3j43J32K43m19L60J60
3557C41l61k18L03j14L11k21j84J36o3J65r5r0K9K38m24L26j24J93q9k99Q4J10
3579d6J16Oj50K15O6m86J90L26j76j16K06l01K32K2k77o0L6M34k58J08l0O5J35
3602B57l29LK58L6k74K4O2K68l30j4L79m77j07J41K41j19N6k24q8L61J64j98j22
$$ plain form
3447 -212 -31 274 181 -186 -20 -65 72 -115 209 240 -39 15 -182 -428 253 317 -478 250 -53 -525 -134 -208
3469 -208 265 -423 164 196 -661 -93 48 -122 293 -258 -39 -51 19 -290 -15 -114 -30 -312 -68 207 -212 -94
3491 -94 -212 -77 -255 -70 -37 -116 253 -39 -198 -190 273 -200 137 266 -113 43 -86 -278 -54 -57 172 -61
3513 -61 102 436 61 -142 246 -141 -102 183 -172 -276 332 284 -167 -29 74 -31 -19 60 135 123 236 -98
3535 -98 -134 449 -291 61 -23 129 206 -19 84 -164 -1 281 106 -53 81 8 -135 -3 240 -179 181 341
3557 341 -20 -238 65 -49 262 41 -143 -7 -70 95 0 -90 -61 177 -247 79 -45 148 59 -240 -156 -46
3579 -46 70 76 -74 141 207 -279 -89 237 61 -55 151 -150 82 104 -173 -233 -197 237 -21 87 57 122 257
3602 257 -72 -69 189 225 -49 -25 37 305 -25 -39 340 -137 -244 -103 138 19 75 -149 -237 124 288 90 -32
3625c2J37r1k22M79k89K9J02ml16K31k78N59j99M7m3j01M28n72k7J83j95J64j83
3648a93O0J72j83J09j45N1J43j23j04J92k63J1N88j92o1m81L33P3m03O17k18q9
3670a06J41j69J32J56j44J79p7m62L65k21J82k6n6K47j6Q9oj70O5j81O4rJ7J58
3694A52r7k18K13M0l07M50J9l61M38k15l19M85l65K12j07J46K75m64J61J18j28
3715A28K8OJ62l08mJ39o41L44N55m80J03L7j20j08L03k49j05J86J52k78J08R8
3737E6k12PR4N0j67K17P2j77j61J49j4k5K56l40l7N16j8m51J66k48j21J81K63
3760E6J70l88K72j9j13J03j70j63N08m65R0K05j35J31j8j52L66n06K96k21q0L69
3782A36j89k28M02j86r6L77j76L5Kq0M62j98j05j54k61N18k12j83r0L54l7L1j58
$$ plain form
3625 -32 105 14 -208 271 -18 11 113 109 -207 24 -254 305 106 153 110 9 437 -135 -162 21 -174 -10 -193
3648 -193 -133 39 -144 -35 -180 -129 14 -109 -213 -21 -284 -273 315 123 62 -419 -86 -13 -416 201 -17 -106
3670 -106 35 -134 -2 154 10 189 112 -350 15 -206 -24 -50 -106 141 125 214 208 38 103 -78 -14 -23 -6 152
3694 152 55 -163 50 90 -217 233 252 -109 329 114 -205 280 -85 127 20 166 441 -23 138 256 128
3715 128 156 162 324 16 12 151 -490 -146 409 -71 32 69 -51 -159 144 -105 -210 -24 128 -150 -42 56
3737 56 -156 -149 -55 -5 -172 45 117 -60 -221 -72 -86 -111 145 -195 -232 284 266 -185 -19 -267 -388 -207 56
3760 56 226 -162 110 91 -22 81 -89 -252 256 -209 -119 86 -49 82 64 -88 278 -228 68 -153 -233 136
3782 136 -53 -281 121 -65 -161 216 40 75 77 -3 459 261 156 2 -259 259 47 -136 -226 128 91 122 -36
3805c6J42k55M08j11k81J01Oj22J44R3j40J68J49K2m56J28J7m9J95J1l85K97j17
3828g1Oj14J10K12r3j76L68k36l3K28k61k33N06k50J07p6n2j88J86K38k17pM6
3851@l69K15K11R1k76q0K35R7l31L07j34j38M46l70j28M28l34J64p9K73l23k8
3873a23J99p1j73K41p6j84K33J04j56j0J4J35j7K31k17k25L42J76n87L52Rj41
3895E6P8J41m06J15P5K01k65N1n7p9L56m50n7L60j09j08K70k07q1M3j18M08m17
3918b00K45K70m94O98m48K4k17L04n0N8Q3j73j41M9R6l14K08J0k17Mn8M35q3l25
3942b36L24j14l65P36n15J21l3Q1m1K32m0r7q4P5k7l28K63J64m36K79Ro1J46n4
3966aNl61N24k85k0K18J11l20M78k65j87J21K02j85r8J74L5M0J31k44JJj33K36
$$ plain form
3805 -36 106 -149 259 148 -133 -32 -26 -148 -4 89 -51 117 266 288 -168 -40 -23 -72 123 134 -251 46 -71
3828 -71 -65 -179 -69 143 50 -126 242 6 -27 201 -60 -293 213 -37 70 -6 -58 -246 -60 178 -39 -46 0
3851 0 -369 -154 57 148 -128 -208 27 124 -207 100 -34 -172 274 -96 -224 204 -130 34 -45 228 -95 -123
3873 -123 76 5 -168 73 -3 -187 46 150 -6 -16 -2 133 116 347 130 -95 247 423 -164 188 197 56
3895 56 134 275 -131 -16 59 260 -5 46 -11 -90 266 -184 -241 119 10 -98 172 -35 -116 -73 -191 217 -200
3918 -200 45 315 -179 519 71 95 -122 182 132 190 273 100 -41 8 104 -210 -2 8 -209 -205 -263 172 89 -236
3942 -236 88 -26 -391 345 -170 -49 -82 -1 -42 190 150 53 -31 44 17 -311 -48 116 -320 -41 -32 -93 53 -1
3966 -1 4 -357 167 -118 -138 80 191 -129 349 84 -103 18 220 35 -63 111 146 186 317 73 74 75 -58 178
3990A78Q2k64J3q3J72kk66J27L40k65j29K59m59J90J07r4P7L02j98P7k78J22k04
4013a96R5L40m14K64l7L6R9j22j58j6j8P5j21j37K25J04m6L81m79n4k3m6J24r0
4037b14N4P2jK04m5l93L14O2l49K40J56j70K1j10K38Q6j90J93j52m9%j61K55o3
4061bJ63p5j21j72J39J1Q0O6r6K7RP2j35j59K11K23l85K81l1k84J46J50j97M3
4085c6J06J31l74J49j3j12K56q1q3q6k83O06j89J67l25K07n0j01J07j56k03L31
4107c2k00q5L31L7r5R0M9p7k2K6n6L04m7k10l89M33l68N06k8j43Oj90j42R4oJ31
4133h3J11l2l43O44l86K31k45Q2J66k60O9j1j90L11L6l45K30m8L36l01K56k09
4155A9P2r3J93k96l0L21Lj73l11M27j89k8K85k70jK58r9j2j28j64K41R6J56Q3
$$ plain form
3990 178 260 -4 9 -74 98 96 -170 -43 297 32 -97 162 -297 -107 0 -94 -17 285 87 164 -114 8 -196
4013 -196 -101 239 -175 89 52 88 187 65 -93 -109 -127 -52 -173 -310 -85 19 -27 354 -125 -179 -202 -248 -124 -214
4037 -214 -160 -88 -89 115 70 -323 -9 53 -296 -56 100 -70 -49 -159 79 165 -25 168 16 -33 -33 -194 61 -2
4061 -2 161 86 -35 -207 -68 -57 23 89 -7 20 29 101 -34 -193 18 241 -144 137 106 -178 -32 118 -79 -36
4085 -36 70 201 -173 -24 -37 -149 107 26 -57 -143 -426 180 -9 158 -167 40 -10 -111 -4 -160 -363 -32
4107 -32 -232 -317 14 51 -44 46 95 18 -4 22 -34 270 223 13 -376 57 -311 195 167 24 30 -160 -302 -208 -214 -83
4133 -83 28 -4 -347 297 -89 142 -103 -21 145 -115 -46 -57 -247 64 100 -245 -15 -63 273 -28 228 19
4155 19 91 -2 191 -105 -135 186 189 16 -295 132 -57 -85 200 -70 -71 187 88 76 -52 -216 25 121 277 360
4179C60m23pQ6j76K23jk03L52k85J66kO1l07O1J73k0k03P7K32j15j75L2j03J57
4203d0Q3j4k09J08M6Rp1K87k95k4K59m32L59j15j56L8M00l16K42k46R7j3o3m9
4227a15K97l14J34K88k73p5K42J62o55K66N9n5Q9j68QP5J23Q4j05l35J07K49k6
4250F2l24L41j01m0K85k47K04k81N9J5J95l04p6J11P4j0J30j27M4J37q8j30K46
4273A75k17j46K97k50J27J80l89j31N36J31n57J79j22K69o5J24j88k33J14M17
4293B51n41R3K12k58M09j18j21m2L02K6j37j73P2N5k9J09k27J64j23J8J14j72
4315a16J41J55q9j44j97N69l63n0r0L04m7J14m56J27K1J42J12j6l65K04j41M69
4337B84j28l41K26j6o6R9P1l14K43j64K74p7k11K57p5r3L54j34o5j8n6r6j51L65
$$ plain form
4179 360 -63 -70 16 -160 63 62 -141 211 -74 92 90 151 -156 -95 78 58 -145 -68 164 49 -126 -94 -197 -40
4203 -40 43 29 -180 -72 -26 -17 -88 199 -96 -120 139 -293 66 -49 -205 -167 233 -83 159 -87 10 -3 -66 -115
4227 -115 182 -132 2 290 17 -58 184 346 -309 -43 16 -39 50 -118 -110 -35 88 172 67 -268 -161 88 62
4250 62 -262 79 -22 -62 223 -24 180 -101 -42 -27 168 -136 -212 -101 -27 -37 93 -34 10 147 59 -71 175
4273 175 -42 -188 109 -141 -14 166 -223 -354 182 313 -244 -65 -187 82 17 141 -47 -280 -166 251
4293 251 -290 -197 15 -243 166 48 -73 -115 187 213 76 -97 -25 30 1 110 -117 47 -76 -58 56 -116
4315 -116 25 180 91 -53 -250 319 -44 -94 -184 120 73 187 -269 -142 -121 21 133 117 -248 -44 -185 284
4337 284 156 -185 41 25 -41 58 129 -185 58 -106 168 91 -120 137 62 -31 323 189 124 106 50 -46 -197 168
4361A68k5m30J83J22k33J68J74l59m4M40j67k5pN2m04M77Oj08j3LO8K07k06p5
4385b8J16j24K00l69L37Nl82J24J49p1J94J12l13j42O1K52m09L87l7O5J48l42
4407f7r9K88p4o0J15k66M2J01J6J51l04K57Pj61L23l05J06k15J08K56l00k9J55
4430D5L3r8p3O0L48k90p1r0J08P8j27J03N0J78r2k00k72L58K55l42Q3L0j54O8
4454a2p7K12k41K4K65l04j03K53q3J36n35L89L00m71K20N7QN7k69K21L2l6M2O6
4478A51j44L6j21j70K08j73L20q3j8K70o06K01M4k44N64j93j91R7j82qJ56q7L36
4501A63l85J94P0j34L09j01q5k2J0J27j62K42j83n1j31R5J44l27P9n8J00J35J7
4524D6K00l34M1L16m51J46J33j08m1M8P7K4J65j84jm1K00l10L7L76o56K25K64
$$ plain form
4361 168 143 -287 -104 18 -215 -47 127 -232 -276 164 -3 -28 -35 17 -387 90 96 -12 -25 -22 46 253 47 -28
4385 -28 88 -36 164 -205 132 137 -245 -121 28 -43 151 263 -50 -192 -131 121 -288 99 62 127 275 -67
4407 -67 -166 122 48 -12 103 -163 -121 -20 -4 147 -157 100 107 -54 269 -36 70 -145 -37 219 -81 -110 45
4430 45 78 -20 -93 -33 315 25 -46 -136 -28 50 -77 26 76 254 162 -38 -310 48 303 -39 44 74 -80 -12
4454 -12 -89 123 -118 -94 171 -133 -236 17 -66 70 -465 -76 224 -247 -27 30 38 95 -174 47 79 43 85 151
4478 151 7 43 -78 -248 -40 -213 107 24 6 276 -330 -129 -85 -329 235 42 -149 -52 -234 -242 -86 -173 163
4501 163 -222 -28 42 -92 217 116 31 9 19 146 -16 226 43 -8 -139 -44 100 -227 -148 -206 -106 29 46
4524 46 246 -88 -47 269 -182 -36 97 -11 -52 -4 73 97 262 78 77 36 236 -74 -37 339 -317 -92 172
4547A72l69J90q3K15k73J02Ok75L29J83k97J41l55K94l9J96j09k51J14N0J8J21
4569H0mk06J41J01j67K7n8L69o0k61J3p4R4j20n9Q2M33o31J91R2J25j32O7l7j1
4594ek09K22k4M8J28p6L0Nr6KQ8J64j09l67J89J21K0J96m70L8J44k3J8K23j64
4619I3k88O9J95L27l48p8j60J21K39j78nl4j13K27l47M33q2j94N6K09j83J00j0
4642D9k1p4j18p5J70l2J06%l32M69j45k14J33j46M53j37k92L9l8J71P4k24J36
4665d8j18K63j08n0L5LJ26j86J68k15L60l52J04L7l27N16k8l72K16k31J88r3M0
4688g2J64m4l7K01k70Q5k47n6L99j47J28j9K7k10j1L64q4k12J26P3j72j80J03
4711i1pJ33k08M9J62n6k4p0M01nk88P1J6j11j11o0L07q3j07K17k08j57K80J32
$$ plain form
4547 172 -197 -7 -90 125 -148 -46 -40 -315 14 197 -100 41 -314 -20 -59 137 28 -223 -109 -59 -41 80
4569 80 76 -130 11 112 -55 -28 -86 283 223 -38 -25 -99 -5 -125 -184 -102 331 -300 -109 -17 108 -24 43 6 -5
4594 -5 -214 8 -16 32 160 84 114 119 23 25 113 277 168 -199 -10 111 131 327 -143 -105 39 16 34 257 93
4619 93 -195 -126 69 396 48 -30 -190 -69 170 -8 -13 -47 -160 67 -280 153 71 -123 -67 142 -41 59 49
4642 49 28 -46 -164 -239 -69 -101 5 5 -327 142 -3 -217 -84 -230 223 86 -206 -167 -205 -34 40 -184 -48
4665 -48 -166 97 -11 -61 -26 -23 103 -83 85 -130 230 -122 -18 19 -308 208 180 -192 24 -207 -19 -112 -72
4688 -72 92 48 11 212 -58 27 -220 -276 123 -24 104 85 112 -98 -109 255 171 -41 85 158 -14 -194 -91
4711 -91 -98 35 -173 -124 38 -18 -42 -112 289 284 -4 67 83 -28 -139 -199 108 25 -82 135 -73 -230 50 182
4735A82m15J63K23j62J66k97L41j69k97p9K36O0j13K31pp8P9J30n0l43Q8K20m9
4758F0l25J74j19P4L23k4k94K94k0k58J26q4L20m03N7K00j16K47k52K5J70k18
4780d3M7q0K33P8r5j49j33K94N5k55k8l0K3J75J25n35J72L15J76n87N16k64L30
4803C40m85J09J45k30N3l6J40j06L7J62k63K63j15k65N88k70k42P0L67j63Mm7
4825E6L3Jq8q8J33k26P1J68k21O19n65J29K50k74J45l6m2j15L4j33pK27j99j46
4849b74L71k97J41j9J57Kk15q8M10j99k2l38L42n1J47k57K33j07K71k35o3J33
4871D2J17m16L00j74Q3R0k06K04j24J25K4j22j2L38l38K74q8j03K71k75P4n6O3
4894I1J74j1j94k33Q4m2K68J25P5l85K04O9k67oJ62k43l9J62L5p1r4P7J93j39
$$ plain form
4735 182 -233 -70 153 -9 157 -140 201 32 -265 -344 -108 -48 -161 70 63 -15 64 194 144 -199 -111 109 60
4758 60 -265 -91 -210 -136 187 163 -131 163 143 -115 11 -73 247 -156 -99 101 -15 232 -20 5 175 -43
4780 -43 4 -76 157 235 140 -9 -142 152 207 -48 -76 -106 -83 92 217 -318 -146 169 345 -242 274 10 340
4803 340 -145 -36 109 -121 -68 -104 36 -70 -33 129 -134 129 14 -251 337 67 -175 -105 262 99 103 56
4825 56 89 90 2 -86 47 -179 -108 60 -161 458 -107 22 272 -2 143 107 65 -50 -16 -149 -156 71 -128 -274
4849 -274 97 -200 -59 -78 79 81 -134 -222 188 -11 -33 -371 -29 -80 67 -190 43 -64 207 -28 -91 42
4871 42 159 -257 43 -131 -48 42 -164 40 -84 41 65 -57 -69 269 -69 205 117 14 285 10 84 28 91
4894 91 265 254 60 -173 -89 -131 137 262 337 -48 156 225 -42 -48 114 -129 -168 -6 29 -42 -136 -59 134 -5
4918eqk20J14l5K98l12K64j53K75m63J68m1J41J14j25j09j52J16K03j58p3J18
4940d3l00J81M3K56l45O7RJ31J97l18J42J54k36K22k86J35j35L6l8J58j21L4m9
4963a06J9K43j48J06m7J08k75L3K50l19K29N4l80N7K98k53L22k82m3J60L8q6J36
4986A14m44K77L21j46L0P2l01Oq8K53m21J34M41r1k51J15Q9r3j94L80j69r1L28
5009B71m76M00k72K79j97j48K66r8J93r8l00O1J94k68K8K11j72J84k92M65r1j03
5031C7J06N1j79K48k57o1J86j02l01J59K10J44l13K03k49M4J51J94k52m5k60J44
5053a42J81j73J50J02j15j10O1N5j03k9K60l50J43L79Om76L82l82J09J76j80R1
5075C5k1R1k41l1j1K80j89j01J38Q8q7K51m33K30J41k62J53m4J65pO9j96n9L4
$$ plain form
4918 -5 -13 -233 -119 -154 144 -168 96 -57 218 -245 -77 -118 23 137 12 -97 -249 -133 70 -88 -161 -43
4940 -43 -343 -162 -119 137 -208 -141 -132 -1 196 -122 20 174 -62 160 -126 9 -126 -90 -128 30 -91 -57 -106
4963 -106 -87 156 8 114 67 175 -100 -67 183 -136 93 147 -233 -176 122 -131 191 -91 -134 26 64 -22 114
4986 114 -330 -53 268 122 152 224 -77 -71 -159 94 -327 -193 248 157 -94 21 110 17 -177 203 34 -57 271
5009 271 -205 195 -77 202 5 -143 123 25 218 120 -180 -119 75 -193 -165 46 -126 58 -234 231 140 37
5031 37 143 194 15 263 6 -55 131 29 -272 -113 97 241 -72 131 -118 -74 77 271 19 -26 -286 -142
5053 -142 39 -134 16 118 3 -107 -46 9 -94 -123 137 -213 -70 309 315 -161 221 -161 -52 124 -56 35
5075 35 14 105 -136 -167 -178 102 -87 -188 -50 38 -49 202 -231 -1 140 -122 31 -13 152 145 214 18 -41 -7
5099gJ5j7m2N3k9J41Q3k52j23J11K22j93j4r3K9K42o3k26j37L61j29J7k28l6K3
5124b92K73J78l14M33k32k81JK0K88P5j61Q7o8l47K98Q7J96j85q3P3J0J2J65p18
5148d85O06k21j8J88k30K99J1J77j79R1k42L28n08J02j5p7K70j33J44N9m14J01
5170a46L53m1k25J73k09J5k06M11p5k9Q5k62K17J39l77P6J58l8j01MJ07j32J85
5193H2K0Q3j05r3L00m13m2N0K5J93j96N0l0J94k10J16N6l63J81J11o3p3L60l29
5217i6J18j47K65j5K9j45J24J04n03J79j13K41k25j7J52O5J8J59j88J74l89L87
5239A77n01N08K0j82KJ92k31J62r4n6j4J03j12OQ8j07j26J25l3J25J20k38L49
5262B83l44L0N6J77Kk87m4K54k0j15K14q0j44k10L49l52l3M39j64J37l06Qn2L99
$$ plain form
5099 -7 8 -9 -51 2 -27 114 197 -55 -178 -67 155 -38 -52 -145 -116 126 63 -163 -300 61 -68 -51 -279 -315 -292
5124 -292 -19 159 -155 278 46 -235 -234 -214 74 149 -12 75 7 -340 -42 45 241 56 -27 46 56 68 233 -485
5148 -485 121 -100 -118 70 -160 139 150 327 148 239 -3 325 -183 -81 -96 -173 97 -36 108 167 -247 -146
5170 -146 207 166 -59 114 -95 -80 -286 125 50 21 106 -156 61 200 -177 -101 57 19 -82 -78 29 -103 82
5193 82 102 185 80 -13 287 -126 -168 -118 -93 100 -96 -46 -76 118 -92 24 80 -283 -102 9 -54 -127 233 -96
5217 -96 22 -125 140 125 154 9 133 237 -266 -87 -200 41 -184 -201 -49 16 34 193 5 179 -210 177
5239 177 -324 184 204 22 24 216 -15 147 53 -3 -17 86 -26 -20 68 -39 -165 -40 -73 52 172 -66 283
5262 283 -61 -31 25 202 204 -83 -127 127 107 -8 206 126 -18 -228 121 -231 -264 175 11 148 -158 -150 -202 197
5286A97k59k03M19j57j06k2L33m34M79j90j00K42j24j50L65l03j34j8J94LM2p2
5308BJ45r4j79j21L21j31j58J91L7L9j54l0K37j62j22L75l01J32n30L44J06L6
5330a7J77j86J0J81j73j03J32J31j05r3j17K55K13o9l17P8J76l08J53m9O4j06
5352g3j27K58q8J28q4n7j39J95K8K92l21j80P4K21j81K0j73rL41k15J37j24M0
5375c7qn1J18nJj76J52K12k57N8J21mj95pJ43n9p6K9R6j3j19L8J78l51K76j82
5401a18J63k05K58q6o7O4k28K54k8J98l59N7J79J06j31j23p9M04j45n1j91J75
5423D7n5K50J5l74J70k49K40J89m1l71J68J08o7k2j20J71P8k67K52k74O1J91k79
5446a79k4L24J17l71P5J34J1k85M03m94M25L4k51N3j6j06J26J22j15K58j97L92
$$ plain form
5286 197 -62 -265 154 -3 -109 -131 202 -232 247 57 -43 199 75 -75 290 -13 -147 -165 29 32 74 2
5308 2 147 53 -126 -247 74 -57 -215 -24 13 52 -102 -132 105 -57 -179 196 -105 27 -503 -159 -53 -17
5330 -17 160 -26 -16 165 -8 -111 21 152 47 -46 -163 92 305 236 -81 -3 173 -135 18 -31 33 -73
5352 -73 -200 58 -30 98 14 -43 -182 13 41 333 12 -168 -94 127 -54 -34 -207 -216 125 -90 47 -77 -37
5375 -37 -45 -96 22 17 18 -158 -6 206 -51 7 128 124 -71 -78 65 6 -70 -41 55 42 -77 -39 139 -212 64 -118
5401 -118 45 -160 98 12 -55 9 -219 35 7 205 -154 -97 82 188 57 -66 -145 259 114 63 -128 47
5423 47 -8 242 257 -117 53 -196 44 233 192 -179 -11 97 30 8 -112 59 137 -130 122 -152 -91 100 -179
5446 -179 -203 121 238 -133 -58 76 87 -198 205 -289 136 170 -81 -28 -44 -150 -24 98 -17 241 44 436
5468D36m02Q7N7l06K2j07pR7J79j83M5J85m6j52K9Q5o7J61K04n05K83j41j16N66
5492D04m48M63m47o9J09k7R1n6J00j08N0j29j07K23k90M54k11o0J53J07k49K25
5514A78l69KK59k8j30K19J76j83m36M64j77j73J36R3J03k9l44K28lm3qk2J31J47
5538A91J02m18r9j1K72j76L7K90k37P4k14L06r5j00L52l15J23j85q2M46l07N9
5560A3j35j46J72K27j43j16J02p7j06ln1K58k35L61M2l14K51M0j55J40l62n1K3
5583b65M23q9K7j43Q5j00J39J93l39J52k60l7K0K85k41L04j27K58l32j04K20N2
5605A21l4l28L17K8K5q1J4j64j36M0J11N3J69K6jj54K55k38K74l00J69j78%O8
5629E6o4j25K73j62K46j22J71m47L18p7jO1r7QJ54k37k32L09j61J63N9j52J9K39
$$ plain form
5468 436 34 121 178 -128 -106 -213 -220 -123 56 -127 -82 103 57 -95 -66 19 -48 113 317 -188 95 -46 -162 404
5492 404 -44 419 -28 -97 12 -15 76 20 120 12 62 -67 -174 49 -241 213 2 -58 95 202 -47 178
5514 178 -191 -189 70 42 -88 131 307 124 -312 152 -25 -198 -62 31 134 105 -239 -11 -14 -57 -65 -87 44 191
5538 191 293 -125 -224 -235 37 -139 -102 188 -49 25 -189 117 22 -78 274 -41 82 -103 -185 261 -46 13
5560 13 -122 -268 -96 131 -12 -128 -26 -103 -209 -212 -263 -5 -240 121 163 -151 100 140 -15 125 -237 -288 -265
5583 -265 158 69 96 -47 38 -62 77 270 -69 83 -177 -214 -194 91 -150 154 27 285 -47 -151 69 121
5605 121 87 -241 76 104 129 48 62 -102 -238 -198 -87 -34 135 161 160 6 261 23 297 -3 166 -12 -12 56
5629 56 -8 -133 140 -22 224 102 273 -174 144 67 66 127 30 38 192 -45 -277 32 -129 34 93 -59 -40 199
5653A99m65M00nO1k37K85k00p5n1J92l2m7R3r7K1J64j02j32NO9J72j53k01J62
5677B6N7k70J54j43K40j39J1M8Jk65M72k02j26O0Om6Q2P2k26M73k80k2p4K14j53
5702c0k37N11k95j46M04o0n5J14l73K57k48O0L46l70K15l57J58J17J17K5k72p
5724a26JL44J9j63j33P7k4P1O9k9j51J91m2J39pl01K26l79L41q0k67L65j58j29
5748a46J63K0K07q6m4j35j66K90j01k8j7l1K11m42J92k05L36Q9j41l2j22K98k44
5771a34K32j50j30l5L43k59L05j63k5K56m4k48q2J18j97N60l45k31K61q0J88k03
5793f3J27j64J98n2j35J7O2J19O2k0j25Ll0pL55l93J05q1k30O01l29m1Q8j33J60
5818I4k01L00l10J70o3J16j38K84m39k17J79P3L85l11N3k2l2J52k7J20J14k58
$$ plain form
5653 199 -266 134 129 190 -47 238 38 -37 -88 104 72 25 118 21 42 206 104 -28 -23 46 218 65 -136 26
5677 26 83 -187 -33 -176 64 -75 -64 -16 -15 -280 192 -10 -136 -76 -70 -116 -34 38 -188 285 5 -17 -91 123 -30
5702 -30 -267 244 -51 -197 207 147 92 206 -167 90 -158 -98 248 -122 93 -264 -106 11 128 153 -119 -126
5724 -126 -125 219 238 75 -58 19 -5 66 135 106 -45 146 104 243 236 -65 161 -218 123 43 -224 141 -17 -146
5748 -146 17 37 244 158 114 -21 -187 103 2 -26 -43 -74 137 -305 -113 -318 18 107 -34 -66 -188 110 -134
5771 -134 98 -52 -182 -217 126 -133 172 9 -16 240 196 -52 -134 -16 -213 347 2 -229 32 -48 140 -63
5793 -63 64 -100 98 46 -89 -72 -10 109 171 151 26 29 -1 -8 347 -46 59 -22 -252 349 20 -21 67 -66 94
5818 94 -107 193 -117 53 -10 106 -32 252 -187 -404 -225 -152 233 -78 -25 -47 -79 73 46 166 280 22
5840B2j77J84L6K16l25m2N2P8j50J85m5k22L2K23j75lK38j68J76j85m6J48k60
5863b08K46j28K87r3k00j28J38L81j92Q2p6j32L2m7p0L98l29L9q8J28J91j28j50
5886d7J6P6J83j70Nk26pK61R9O1k16J38r6q2r3J83l5K59o2k14j49J29J34N4l45
5911a44P5O2j10J50J55m7j77k8o0N00k61p2l10K6j16J26K57K7r5j06K89R7m34
5934a96O6K14k20J76k63J78N7j27k59N36j73J09o6J58j65K50o2m69L02O7k03n
5956i5R6R4k19K39M5k20K28k84j37N50m00R6m1P8o9N4P1j41P4q6K10k21q1K0K13
5981G4l1k2Q8k14K81l46m6M01j50j23K86j57J96k58J59k77J61Q5j76K13j84J12
6003G2k0q7J87j98r2J90k92M8M1J89J36j29oj12QJ19j08L37j82r4j4m1J16l3k07
$$ plain form
5840 22 -155 29 65 281 -44 -86 -34 44 -106 79 34 -188 -156 67 -108 -111 127 -41 135 -50 -96 52 -208
5863 -208 38 -90 197 104 -96 -224 -86 295 103 185 109 -23 9 -38 -108 290 -39 0 -88 40 231 103 -47
5886 -47 -31 45 228 58 63 -163 -170 91 190 251 35 173 77 -5 -98 85 50 309 247 33 -116 13 147 201 -144
5911 -144 -69 -7 -117 33 188 141 -36 -64 -124 376 115 43 -267 -241 -357 -231 26 53 -42 -148 141 238 -196
5934 -196 -130 84 -136 40 -223 -45 12 -115 -374 162 -11 98 32 190 25 275 213 -256 46 113 -90 -95
5956 -95 1 95 -124 115 160 -60 168 -116 -253 297 -103 -7 -48 30 -39 15 86 -55 19 -67 143 -78 -159 -139 74
5981 74 43 21 109 -105 176 -170 -216 185 35 -88 198 41 237 -21 138 -139 22 107 -69 144 -40 72
6003 72 52 -35 152 -46 -138 52 -240 -192 -151 38 174 45 39 -73 -65 54 -54 283 101 7 -7 -48 68 35 -172
6028a72k2O6L37l04l3N0J14k28M04j48j18o8K2J08j88J91O1o6j6m0j95J52K67
6051A74r2m20M19j20N2J14j00p3Q2K96k94J41p7N3k04L01l84J63j84J84j67j07
6073b43M34j47j63J37J13j35k9K20l6p0K96k96jj07J20MJ18k95K14r4K1j4k30
6096a83K06M5o8L4j31o2O6J29j22P7J00j37pj15j69N50k18j10J47p6J70j22R5
6119I9k08K15k77M1J72rmL8j97L40m24J78J01k32L87k63L1l00M56m25Q1L40j20
6142B0j10K32p1R7q1k77m3L64k88Q1J41m5K8J28n14M58j2p2p8J0K4P2j44lM99
6167D16n15L8R0L1J2k51K84J55k86q9J10j48M17k59J21n9K2J71j63k07L0p5K73
6190A18q2J28P4m36J23J72k0r1n6j4L11l05O2M3m82L08m3M15j55j4MJ27N4l0j4
$$ plain form
6028 -172 -194 -128 209 -95 -128 -78 36 -192 212 64 -54 -122 -100 8 -180 11 72 6 -10 -50 -245 -93 174
6051 174 82 -338 81 -39 13 127 27 -46 36 332 38 179 102 155 -49 252 -132 31 -153 31 -136 -243
6073 -243 191 44 -119 18 131 -4 -33 187 151 81 377 81 80 -27 93 97 215 -80 134 40 61 47 -183
6096 -183 23 68 0 34 -97 -159 -93 36 -86 -9 91 -46 -53 -168 -337 213 -5 -115 32 -44 126 4 99
6119 99 -109 106 -171 -130 42 33 29 67 -130 210 -214 -36 65 -167 220 -43 -12 -312 144 -281 -200 140 20
6142 20 -90 142 71 168 87 -190 -233 131 -157 -76 65 20 48 176 -338 120 108 36 -42 -32 -8 64 -80 -83 416
6167 416 -99 -61 29 60 72 -179 105 260 -26 -115 -5 -153 264 5 126 67 89 260 97 -110 -80 -155 118
6190 118 36 164 238 -198 -75 97 77 -14 -70 -84 227 -78 -16 27 -455 -147 -190 225 70 56 60 187 241 211 197
6215A97k47K3n5q7K21O4j18J67l25P6J79l11K05J63j02P1k92L19k36K6o6J65J03
6238A40L4l30K60j34j65L76o2N8o2j59j71J63pj01P9m9J85K4N3k70jP0QJ72O7
6263A78k97R4J05j46p5K48L4rp6l2n1L92l54J06R4k44l31N17K2m9j59J96k1j66
6287b4J37j74J88j77l09L37j21O9m6K84n0j28k15R9L33O3j98r5J51l91JJ69K33
6310A36m0j68R5k5j64m0J95J00j92K45q5j42q1Q7M6k24L17J1JN7k72K22M6k82
6334a57k9K21j03Qj77J34K50k09q6K54j17p3Q6J93L7k01K73m2l27K11j13O8j17
6357a6k0j18P0n0K48L1j61J13j46j15l9L14J9l68L01k20J37K66j57j2p5J22j46
6380b2k31j37M85j72j99K00Q7j54P1j08M08J06k34k06J49k55L13N0j43j12J23
$$ plain form
6215 197 -50 -27 -82 -169 52 116 -2 165 -160 -84 95 -216 -11 152 50 121 -171 148 -88 -62 -128 37 140
6238 140 174 -156 104 -30 -195 181 119 177 115 -44 -215 -52 -59 -160 -81 -130 55 79 132 -138 -139 -69 -61 111 178
6263 178 -119 -25 80 -66 -141 107 141 132 56 24 -27 365 11 117 211 -33 -364 153 175 126 -33 163 142 -24
6287 -24 113 -61 127 -50 -359 -22 -143 -74 -120 164 114 -14 -229 -130 203 266 68 -27 124 -267 -266 -97 136
6310 136 96 -72 23 -2 -166 -206 -11 89 -103 142 57 -85 -166 -79 -33 -257 60 71 72 129 -143 79 125 -157
6334 -157 -186 35 -68 -60 -237 -103 147 -62 -148 106 -11 -84 2 195 232 31 304 262 -65 146 33 101 -16
6357 -16 -36 -154 -84 -134 114 145 -16 97 -49 -164 -203 111 130 -238 63 -157 -20 246 89 77 2 124 -22
6380 -22 -253 -390 95 -77 -276 -76 11 -143 -72 -180 228 334 100 -106 43 -212 101 151 8 -104 19
6401A9O3k08Q5K2Lj99P7K00j56L41J0l31P0K95n31K22P8L8m7PO7J39l03N6r1l46
6427d20L22K06j3k9K9j29K23j78J00J26l75K52k60J61r3o1J55n1J57m24M36j48
6449a4j17J68L13m65p4L45k09m2K41p6r8J42%K16l99k06J18R2R7J70k72r8M2J25
6473aj72J47k03L26J18Q0k68M7l16K14J54k10L23l60j3Q1J28P7l70L99j98j06
6495a23J9L70j66j35k8M22k95N0k7N2j00q7O5k30K01N0k3K60k32p2J43M7m22Q3
6519a78M02l51J49k13K15J7J70l69J10l5Q7J9K89m28O6M8Q8p7p8j22K53J98m99
6542b39K86j97K16P1J8j12k35LJ09j1J42m09K75k4rj8k20L67o1N7J18k0j71J46
6566H2Mq8r9J60J77m90K88J11J43j31j80K98l13J92Oj39j34N1j92K78J51k12J09
$$ plain form
6401 19 82 -126 -41 -19 -16 -215 -138 62 -94 247 257 -74 -4 291 -240 -18 60 98 51 58 125 264 -39 17 -74 -420
6427 -420 -98 108 95 66 95 -34 189 11 111 237 -138 114 -146 15 -78 -139 16 -35 122 -302 134 -14
6449 -14 -131 37 350 -115 -189 156 -53 -95 146 70 -28 114 114 330 -69 -275 -157 -65 32 202 -70 -168 -126 -1
6473 -1 -173 -26 -229 97 215 295 27 74 -242 -28 126 -84 239 -121 -134 -53 75 152 -218 181 -17 -123
6495 -123 -104 266 100 -35 -63 359 64 114 87 139 39 -48 17 -213 -12 38 15 275 43 -29 114 161 -261 -178
6519 -178 224 -127 22 -191 24 41 211 -158 -48 -83 4 23 312 -116 -50 -2 86 9 -69 -191 62 260 -239
6542 -239 47 -150 66 137 155 43 -192 -189 -80 -91 51 -358 -83 -107 -116 -134 -354 13 -48 9 127 107 -64 82
6566 82 86 -2 -101 59 236 -254 34 145 288 157 -23 275 -38 154 160 21 -113 -62 -254 24 175 -37 72
6589G2j89qQ2o1p2J13K7P9J18m7o5k85J03K13Nl9k34K26J4o1K29j41J14J27m35
6614a15j22J9K83r0m1m75O26j03N8L1k50qj82J96K66Oj54q7K46j35L60n06N35
6637C58l07o1mK21j50r1L7K85r0m18K62l7N0J19j00R3l06O7j04K13K02j97j80
6660a38J55j24j02J82K3K7J47j84j20R0K03j00k5R3k05J55l65J98p4K74n0p1j16
6683a27J47J9j4j82R4J98J04k87L0j41k1J76mO7q5J51p2p6q9r5L18j31o7K93k1
6708A85k96M8rj86R1J23Q6j0r1j20L53k96K12k93L44l26R4L31k56J79p3k57J16
6731e1l54N54m2j40J23m7r2k13K57K17l01Q4o6M41n36j12L41k85P8J58J46l87
6753b27K9M9K66q9o8kj8PL11m51K27R9J21k09o9O5k18J93k86K61p0M8R8k27M81
$$ plain form
6589 72 -117 -125 -43 -104 -176 -63 -36 43 161 114 49 -236 -133 80 85 46 -188 38 52 -9 220 79 193 320 -115
6614 -115 -237 -218 65 -25 -66 -541 85 -18 40 71 -179 -187 -369 -173 93 99 -55 -142 104 -31 329 -177 358
6637 358 51 -10 -14 207 57 -34 3 288 198 -220 42 5 55 174 74 167 -139 -72 -176 37 239 42 -138
6660 -138 17 -107 -209 -27 -4 23 170 -14 -134 -44 159 59 34 127 -78 77 -288 -90 -164 110 60 -11 -127
6683 -127 20 39 25 -157 -63 135 239 -48 -18 -159 -180 -4 -8 59 -26 125 53 -23 -112 -207 111 -20 -87 206 185
6708 185 -111 -63 -72 -258 -167 -44 42 32 -59 -179 174 -122 90 -203 141 -185 -91 240 -16 163 90 -167 -51
6731 -51 -405 149 107 -33 90 43 -49 -262 -5 212 -89 -5 -71 370 -166 -278 63 -222 -144 14 160 -227
6753 -227 -198 -149 117 28 -40 -42 -60 -53 258 -193 34 133 254 45 -24 41 -177 16 -270 -9 -79 -31 67 -160 321
6778C21j81k83N5J78j21m6j54Q1J6kQ7N0kk8L3o7J31J86m43K99j08k6o9K5J75
6803A07k73k16K89J06P1m1%q2K89n09J35L23k24OkK95j58l1k21K87N3l67L26j67
6827drk9nJ14j67M5J49J75m30J40j32q8L15o6K83k05k28K14k7J74j68k12L05J31
6851B75j35k32j6K43r9Q1k36N4q1J9K0k1j0J12N8O6Pk72J19Q3M9j64k4n7K19n5
6877CK52j09q6j21J72l70K32J60m07J87qK19j09K4q9L85m68M7n8q2K90m53O13
6900B24l83K44j02k23O08k69j74K33l46J67R7m43J97l0J17J15K4j59N3J20n7l22
6922c09K46j98J92J7j26J25Q3l67K45K00k02p8L9K26r5j31J25j21J74k17M67k52
6944D3j05K30l01kJ05K45j18l48K45j89K8J72L0j4j41J28j41J66Mp4J12N5k9P0
$$ plain form
6778 321 140 -143 -88 90 -31 -77 -231 -150 -134 -136 -49 1 -1 -29 4 -63 68 254 -189 110 2 -24 -93 -68 107
6803 107 -166 -382 -93 13 84 43 43 -39 250 -259 -124 199 -25 -19 -21 274 116 85 -136 151 204 -163 163 -4
6827 -4 -13 -42 -47 67 -100 -55 94 269 -161 -21 -153 -241 74 8 291 86 -142 72 45 219 51 -161 144 275
6851 275 140 -92 -108 135 36 117 -119 -65 -146 -127 -107 -128 -138 -26 32 98 105 -167 -48 35 84 -80 -104 -161 58 3
6877 3 255 146 60 -61 111 -259 -27 133 -274 -87 -95 124 15 39 -50 335 -133 -86 -144 -226 64 -389 224
6900 224 -159 85 -17 -240 368 99 -75 158 -188 -21 76 -367 -170 -200 -83 32 56 -103 -50 70 13 -309
6922 -309 -63 -261 -69 -52 -178 -53 30 -337 -92 108 -94 -172 -133 93 -2 -133 -8 -129 45 -172 295 43
6944 43 -62 168 -133 -135 -30 215 97 -251 -6 -195 -167 5 35 21 -120 8 -133 33 37 -37 75 130 101 171
6968A71j08k55N32j76j46rN3J41l5k19J75j14N8M7j30O7m1o3l5K16o4J33k40J84
6992A42k41l2J68j57M60l34j09Q4j25o5J9K9J96L32m66rJ04J68l32J48M9m1K02
7015A90J19n27J00J83k13M03j65j85j38M52l93K23p3K55l87K67j45l9J89l52J75
7036f1J26l3k45J38j7p2K27p7n0L35l44R7J24k66p9M79k04o2j72r0N20o1J72j46
7060B39l19P8L41l44k5o0j22J48p1L85k4k02J12L2j62Mk30O5Q2k72K65mJ33k45
7084a96K16p4K5Oj0j9J6K6r4K05Rk25P3K97l52j5K78j81q2J02k29J05J62K50k86
7109GJ71L25o11K11j35K04l60M5QK97k20k1L8j62J45L47m09M29l62K36j37Q6j94
7132f2k02M42j66k5oP0N6q7J77J6m73M78j94R7k95J36p4J67O4j85J6L0N2k97L84
$$ plain form
6968 171 63 -192 340 164 18 9 62 203 168 -51 124 10 68 115 -15 52 11 -52 -87 129 65 198 -42 142
6992 142 -99 -131 37 -120 340 6 -103 -19 -144 -209 -190 -161 35 367 -99 -108 -4 164 -168 -20 29 -12 190
7015 190 309 -218 -118 65 -148 255 90 -95 -233 219 -174 49 -24 231 -156 111 -34 -73 116 -236 -61
7036 -61 65 32 -213 -75 -92 -164 63 -14 -64 271 -73 24 148 -118 -197 282 78 16 -156 -246 274 213 385 239
7060 239 -80 -2 339 -5 -30 -90 -212 -64 -135 250 226 24 136 168 6 10 -220 -155 -73 -345 -80 -84 49 -196
7084 -196 20 -54 -29 -23 -33 -52 -36 -10 -104 101 110 -115 -42 255 -97 -112 166 -15 -97 5 -224 -119 43 293 7
7109 7 178 503 -108 103 -32 172 -188 -143 -135 162 -58 -79 -41 -203 -58 289 -120 309 -53 183 46 132 -62
7132 -62 -264 178 12 -13 -19 51 107 20 197 213 -260 218 24 121 -174 -38 -112 55 119 -66 -50 -20 32 -265 119
7157A19J58m58K80P3j34Nr8j33L21M4j98J2K8o4J59K3o7j59k00L41O8k42nJ16
7181a1J46N9k66K02r8K25j81lj49RJ46j69j06L05k90J99Qj8L7J51k69K72k14R3
7205G8P4j59o3K7Jp0K53l99L04k41R4J78q9n8L15j03l98L16m8k7k32L52k65k5
7229a85J37K4O2j51L4L15m59K81m1o0M3Q8l60K26K11N3k21K34j81j32j7k6K99
7252A74l5j57J97j63K1j66L64j71l37Q8O7o0M0L07j37j64N8J76K76l90O7k22Q5
7275h2l2J60q1k59N19o6j38j8j8k51L03p5J55LK3J7k28q0L90p3k26L12k32J39
7299A62q5K2k56K41k31K49k14R4m8k8J01n1j75K61k05lK07M4k07J91j09p3j03
7322b16J80J47k32K87k15j85K38Q5J8j88j39J26J64j06J69j88j22K60j32j7j03
$$ plain form
7157 119 277 -181 99 172 38 43 -55 -188 133 177 -21 -9 19 -45 114 137 70 -89 -289 52 120 -122 -127 -11
7181 -11 135 194 -72 130 32 257 76 73 -76 -67 79 -90 -196 109 -181 18 26 8 45 196 -73 199 -15 78
7205 78 152 -7 -70 -43 -42 -112 141 -258 46 -195 -101 77 -12 -70 245 142 -256 60 12 -15 -247 105 -160 -185
7229 -185 -48 -24 38 -113 -79 236 -223 58 17 -43 0 88 -272 -46 165 218 -3 231 50 -82 -99 -125 174
7252 174 139 -18 179 16 37 -129 235 64 -273 -185 -118 -178 -138 169 32 -132 -74 102 378 -12 55 -167 -82
7275 -82 -114 46 -35 -294 225 159 21 3 -15 -266 37 -38 117 120 143 160 -68 -148 242 169 -57 255 23 162
7299 162 77 99 -157 84 -147 102 -112 -18 -66 -94 7 -44 -219 42 -163 -166 41 85 -122 69 -40 -113 -216
7322 -216 -36 111 -121 166 -49 -234 4 89 107 -81 -220 -94 70 -36 133 -55 -177 83 -49 -66 -169
7343a69K66j5l79J16J69R9j07p1p9K98j64J18k72N3J81q8q6r0M40j73j85o1L53
7366A54j41J19l24J92j80J29L2K89j07J22m93L01l01J92l03L26R4M4l7k52L07
7387A63j90j25L24n5J14j85q3m6j20K16J5j43M92k52n3N1l41M4K82j51j47M69
7409B79m63L27l52J43K47k01n9K47j92p8q5N07k32O3l94L61k6%J33k37j00m6L39
7432A81j69j16L71n36P4K18P4j85K52m10N56k74J47J1n5k77L03r9l30J23J09K13
7454A81k1r3o6L8J24k99L53k01P9N4J4l83J85K8j1J46j02J0J54p4q0Mj22J04K40
7479B62n41L45j06j40l4P0Q0J17k43K14L2r9J64j31j18O7q2J61j41K48j45ln9
7502h2J57k36R0L58j66j22j81N0Q3n0J14j93J73l23K76K3K9K00j90j6mj17mL14
$$ plain form
7343 -169 97 82 -297 -181 -12 87 -20 -91 -170 128 -36 82 -190 -137 44 -44 -130 -220 220 47 -138 -199 154
7366 154 13 132 -192 0 -180 -51 -19 270 163 285 -208 93 -208 -16 -319 7 101 145 108 -144 163
7387 163 -27 -152 172 117 231 46 -37 -83 -203 13 28 -115 377 125 72 123 -218 -174 108 -43 -190 279
7409 279 -184 143 -209 -66 181 -20 -79 168 -24 -102 -187 320 88 151 -243 118 92 92 225 -12 -112 -158 181
7432 181 12 -104 267 -269 -195 23 97 -88 164 -246 310 36 183 194 139 -138 165 66 -264 -141 -32 181
7454 181 160 67 1 39 163 -136 217 16 95 149 163 -220 -35 -7 -18 128 26 36 190 116 36 40 -82 22 262
7479 262 -279 66 -40 -180 -214 -144 -64 53 -190 24 56 -43 121 -10 -128 -61 -143 18 -123 125 -20 -23 -82
7502 -82 75 -161 -71 287 121 -1 -182 -132 -49 -99 15 -178 -5 -328 -52 -29 0 200 10 -6 -10 -127 -131 183
7526A83j42j57N8p1J20J11q0j44L04N9k80K7OL27l66K1M3L8j16J20M0l71O0K26
7550A6JM1L07k22J3k07j08M00l72J6J57J85n58K82J32P7k24K76j05k09o8K69l15
7573b16K80p1j44N43n62K29NK8J12l45J37J05j25J2jj40J51j19K58J7k1j20L9
7596E2K18l72J30j57K36k16J98j27j07J27L17k53Q5P8j42j64J64l16K61J28l50
7617b10J45K5m4R3q1j29L88j95J97j71r5J17j73l2J43m9j83J96K43k08Lj23M20
7640B77l13J49k1r4J02j01J20J18n00M28l43K10j21J50k77K60k7j15J96O1j65
7661fm2P9k34M74m33M4K16j50k3N4k38J22K7N6j51K16J82p0l4l4Qj7j64O0j5Q3
7687A0m4j36J31p1k23M17r4MK03k3j00j42j17J01M30K9l58l05J17L61J1n02M18
$$ plain form
7526 183 41 -116 -58 -129 -9 102 22 -122 182 241 -39 -12 -6 321 -45 -24 19 57 -59 61 101 -270 -210 16
7550 16 17 58 365 143 156 -51 -159 241 -131 -115 42 227 -331 -49 83 160 -64 212 107 -102 -170 99 -216
7573 -216 64 -7 -151 392 -170 59 64 92 204 -141 -4 101 -24 -12 -13 -153 -2 -121 137 154 133 13 52
7596 52 270 -102 28 -129 107 -109 89 -38 -145 -18 299 46 131 209 67 -97 67 -249 12 140 -210
7617 -210 -65 -40 -84 9 -72 -201 187 -8 189 18 -77 40 -133 -165 -22 -71 -254 -58 185 -23 -20 -143 277
7640 277 -36 113 92 -2 100 -1 119 237 -263 165 -178 32 -89 61 -216 44 17 -98 98 159 -6
7661 -6 -48 31 -203 271 -162 -118 98 -52 -75 -21 -259 -137 -110 -54 -205 11 193 123 89 55 63 46 -118 -58 -73 10
7687 10 -34 -170 -39 -110 -333 84 -10 -6 197 174 74 -68 -185 -84 346 375 17 -288 -171 190 201 -301 117
7710A17j19L6Rk31K32M7m8j63K06M1n8p7j4J45N7m12J75P2j76j07L13l78K80J03
7734E0j15J0j24O7l4L13k84k5L8l8L0M0K13k65K61l76L70jj46Kj42QN60l42m0
7759C0m5J21k18J95L9k81J34K6m5J10j86K76m03L32j97L6j2K36o8k75K76l7j94
7782a50J45k0o6r4L50j41q9n8m9K05k57L35n8r8n6m5m4K42J23j64J07o9N6m3l7
7807B5J04j84k59J79L20l9l45L17j83J60o1k29M84l22o7N8j29j59L47k09M13l62
7829a41N19k78J26j5k72J38m8k3J58r8j36R5k67K7M76l47K30l04R9M6L3k4k0L12
7853B86j11r9J14j34J6J1r6N5o0j03rp9J68j1k7J46O3k73K81k49O1J58K17k13
7877A12j22J67j05M7j72L42l91J62j40k2L6K51m9r4K20k05N0l79J56j53M66n14
$$ plain form
7710 117 -2 34 43 -188 44 91 43 -120 86 127 69 -8 -22 123 180 -232 -57 15 -161 -268 45 -333 -53 50
7734 50 -65 -55 -179 -112 -146 167 -117 -142 -104 -142 -112 -72 141 -124 137 -239 131 130 -16 -14 -156 -148 412 70 30
7759 30 -15 106 -112 83 122 -159 -25 1 -44 66 -120 156 -247 85 -112 -76 -88 148 80 -195 81 44 -150
7782 -150 -5 -25 -91 -185 165 24 -65 -123 -172 33 -224 111 53 -45 -101 -146 -190 52 175 11 118 49 105 62 25
7807 25 129 -55 -314 -135 185 146 -199 118 -65 95 34 -195 289 -33 -100 -42 -171 -330 17 -192 221 -141
7829 -141 378 100 226 211 -61 77 29 6 164 66 -70 25 -242 -215 261 -86 144 -160 -61 -15 18 -6 -26 286
7853 286 175 76 190 56 72 83 -13 42 -18 -121 -130 -209 -41 -52 -79 67 130 -143 138 -111 -50 108 325 112
7877 112 -10 157 52 99 -73 269 -122 40 -100 -122 -86 165 116 22 242 37 87 -292 -136 -289 177 -337
7899c37N04j8m3J10m3R9n5k58J38J19k74J23K5m3J14M9n35N86k34k5o8R5J81k80
7923g0L15m04K40n9J70k40j72M44m24K2J32j07m8K52l95J72K9J27K7O5j54O0J9
7946AJ33j44j56j7K68j55j2J34m54L78J73k54j67O08n97N43j03n2j50R3l95L30
7968EK5l2K7KJ3k26K39kk16R8Mk6%J31O6M2J0l46J56L3K00k39l19N19j00Q1k88
7995a43O7L0J02l16K21J37k12L06m31K13L8R5m09L67j02r5N0J89j05K2j1jO5l43
8019b66M1L00Q2j55P8JQ8k27PJ19j58K02Nj39LO6k7J44K19k95k63L34k88K01p8
8044fK8K13k34Q5j75M5K27j67j69K17k07J27O0l4Q7J10k20J66m3l09K38N6N9l56
8068b02K75K6l96K21K32m89K33R6Lm4j37O2L06j91K74j39K16l36Q0j67k18J91
$$ plain form
7899 -337 167 149 106 216 173 272 217 -41 97 216 -58 65 90 47 161 210 -325 261 27 2 -66 29 210 -70
7923 -70 245 -159 81 22 192 -48 -220 224 -200 -178 -46 -153 -201 51 -344 -172 -143 -16 11 76 -78 -18 1
7946 1 134 -10 -166 -183 85 -70 -82 52 -402 -24 149 -105 -272 336 -261 282 179 127 -23 70 -325 5
7968 5 30 -2 25 27 40 -186 53 51 -165 -67 -63 -89 -89 42 108 150 160 -186 -30 3 203 -36 -355 164 64 145 -143
7995 -143 -76 -46 56 -260 -39 98 -114 192 -239 -26 12 107 -302 65 -37 -132 -82 107 2 24 13 12 77 -266
8019 -266 -225 75 157 2 80 81 169 -58 -51 68 -90 112 117 -22 -19 47 20 164 383 88 -175 159 -129 72 -6
8044 -6 22 235 1 86 -89 -44 183 16 -153 64 -143 -16 44 10 97 207 -13 153 110 -199 39 95 154 -202
8068 -202 73 99 -297 -76 156 -333 -100 -4 -1 -45 -182 -120 186 -5 269 130 346 10 90 -77 -295 -104
8090a04K90Nj37k8J4O1j65J33j29K18l44L74j31l4j74p4M34m89K12np1K29J29
8113B14p9k78K03k42J75jK59k72j46N49n00q2L20k33J76jk2q5J29J0j52J59J82
8136B83k9m29J79j00Q0J10k84K70M5j54j33J41J11J24l81nK18j76O4o7n0P0K25
8159A12l3r9J37q1m9K20j64k8j14p6J50O7k43K60k02j97L76J01k79L67m18K65
8181G2k56o4K17J9k47J81P1O8j01Q7
$$ plain form
8090 -104 186 191 54 26 40 101 -64 69 -60 158 -186 188 57 23 -151 -225 209 -280 -68 -73 -144 85 214
8113 214 135 -143 60 -182 -7 -8 251 -21 -167 382 -118 -200 120 -113 63 62 40 -45 84 94 -58 101 283
8136 283 254 -175 4 -96 -16 94 -190 80 125 -29 -162 -21 90 214 -167 -172 46 -130 -66 -133 -183 -113 112
8159 112 79 -20 117 36 -13 207 43 15 -99 -175 -25 42 -201 59 -143 -340 36 137 -142 225 -193 72
8181 72 -184 -248 -31 -12 -259 -78 -7 61 -40 47
8191D7
$$ Imaginary data points
##PAGE= N=2
##DATA TABLE= (X++(I..I)), XYDATA
0@%%%%%%%%%%Qj6J6j6K4l2M0m8N6o5P4r2J12j33J54j78K08k41K77l16L61m12M68
33B49n28N94o68P50q41R40j047J161j288J429j580J747j931K129k346K588k851
50a493L138l458L814m210M653n155N730o393P166q082R188j0557J2297j4591J7757
65I804k2414K9935m3971P8391l02102l61956R54919J0817o14528J46477J72088
76E7460j76894L17884J0613n97784J87282O27006l70091l74961L87721M3823k27405
87a15346K01631j02324k66847M28379K17059o12861o4787N68037j17049l17095
97a81203K31668l6074j63547L23616n8751m50924L06538M03242m52733k25774
107c03942M32343m773k09347J81903j28876k07246M21118Q1127n30908J01480
$$ plain form
0 0 0 0 0 0 0 0 0 0 0 0 8 -8 8 -8 16 -16 24 -24 32 -33 41 -51 61 -72 82 -96 112 -129 148 -168 193 -219 249
33 249 -279 315 -353 397 -444 496 -551 610 -678 751 -829 918 -1013 1116 -1230 1358 -1493
50 -1493 1645 -1813 2001 -2209 2444 -2711 3019 -3374 3792 -4290 4898 -5659 6638 -7953 9804
65 9804 -12610 17325 -26646 51745 -250357 -612313 342606 353423 -261105 -114628 57460
76 57460 -119434 198450 209063 -388721 -201439 425567 55476 -319485 68236 112059 -115346
87 -115346 86285 -16039 -282886 145493 362552 -250309 -315096 252941 135892 -181203
97 -181203 50465 14391 -149156 174460 115709 -335215 -28677 374565 -78168 -303942
107 -303942 128401 123628 -85719 96184 -32692 -239938 181180 262307 -268601 -167121
117a67121M38289k39833k08259K57654p0399j20832L05533j16236m01442L36481
127A3835L29747m19623j55013L32844k3841j31485J26170j10704j15585L13741
137A60086j376l93254J53731L10463k31105j14413J77713r3195k7711K26530j53977
148A3492k50579K98867J56308l41734K891K42958j25551l9418J39814j68744n8299
159a29995K98338o6626l17224J76378K21049k22499m9210J61935j12026j1064
169e0944J82082j53405j45031K53995M5311k58526O2895J67803j33926r598J24416
180H5072j50988l0549K34446r1647k09254J71643J15226j75280l596J05946q2303
191c1284J6013J09608j48057o1698K22284k8391j98113R9647J03615j14378J1720
$$ plain form
117 -167121 271168 31335 -176924 80730 10331 -110501 195032 78796 -322646 13835
127 13835 343582 -76041 -231054 101790 77949 -53536 72634 -38070 -153655 160086
137 160086 158710 -234544 -80813 229650 -1455 -115868 61845 -31350 -59061 167469 13492
148 13492 -237087 61780 218088 -123646 -120755 122203 -3348 -42766 97048 -71696 -129995
159 -129995 168343 101717 -215507 -39129 181920 -40579 -89789 72146 -39880 -50944
169 -50944 131138 -22267 -167298 86697 132008 -126518 -63623 104180 -29746 -39344 85072
180 85072 -65916 -96465 137981 46334 -162920 8723 123949 -51331 -54927 51019 -31284
191 -31284 -15271 94337 -53720 -115418 106866 78475 -119638 -19991 83624 -30754 -19034
202a9034P7456j08328N15J56274r3908j30736J52206M6799j33518M0627N2643
213D0996q5384M5391Q0845j20924l7516J54285k8774j27895Q3861M8219q8777
224c5673L9320M0415q8017K4720Q9164p6998n6418J03100L107r3311N2353M0770
236D2532p7057K8019N4948p3983r051Q0338l2039o0473N7011K2416o0107K5337
248b109K8728n8265K4390N2062o4903j7979O9890j5770n0690L5919J8287m1817
260b2257K0969K6092n2065J0102N0878m0547k1708M3874q922k7288K5790O847
272A1765l3604J6684L0265l8640q928M2259j6942k2180K7479k896j9897J5991
284A356R844k1626J075K4646j5974j4522K5444o198j5231J8488j805j4012J0226
$$ plain form
202 -19034 58422 -49906 -49391 106883 12975 -117761 34445 81244 -52274 -11647 40996
213 40996 -44388 1003 81848 -39076 -76592 77693 48919 -78976 4885 53104 -35673
224 -35673 3647 44062 -43955 -19235 69929 -7069 -63487 39613 42720 -50591 1762 42532
236 42532 -34525 -6506 48442 -25541 -34592 45746 13707 -46766 10245 32661 -27446 -2109
248 -2109 26619 -31646 -7256 44806 -20097 -38076 31814 16044 -34646 1273 19560 -22257
260 -22257 -1288 24804 -27261 -17159 33719 -6828 -28536 15338 6416 -20872 4918 11765
272 11765 -21839 -5155 25110 -13530 -22458 19801 2859 -19321 8158 5262 -14635 1356
284 1356 11200 -10426 -9351 15295 -679 -15201 10243 4045 -11186 7302 5497 -8515 1711
297A711O515j0557j925J2155n479p931J3570n963q842J5715m593j0681J1698J70
311E563q231L648N960n419n532J0567k057j0422J1491m06r015P546L75n088J150
326A30J947J279m977K629L447p689L328M365o795J998J336n81j81l822M771l12
342H73m121M125k863K85K897n053L323R58l929K979j249n89J458j449J825k504
358c034O64L665o274K493M605o002J982J928k528O71k57L009l020j843P361n404
374a984k760P758l327k758M117n69j443ML423k627l209Q397m243n486R885l783
390A395m833Q258l047m702N303K481n883j519R766n686o630J2661n179p547J2777
405G615k808j0663Q963M681j0102j085J2128o518r780J5981l379j5404J6350L318
$$ plain form
297 1711 8226 -2331 -4256 7899 2420 -5511 8059 2096 -6746 8969 4376 -6305 5393 5563
311 5563 -2668 980 6940 1521 -4011 6556 4499 -5923 5568 5162 -3853 3693 4068 -1020 130
326 130 2077 3356 -1621 1008 4455 -3234 94 4459 -2336 -338 998 417 236 -3586 1185 873
342 873 -3248 877 -1986 -1701 1196 -3857 -534 424 -3505 -526 -1775 -2364 -906 -2355 -530 -3034
358 -3034 -2370 1295 -4979 -2486 2119 -3883 -1901 27 -2501 -1830 -2087 922 -2098 -3941 3420 -1984
374 -1984 -4744 3014 -313 -3071 1046 477 -966 -962 2461 -166 -3375 5022 779 -4707 5178 1395
390 1395 -3438 4820 1773 -2929 2374 4855 -1028 -2547 7219 1533 -5097 7564 2385 -5162 7615
405 7615 4807 -5856 3107 7788 -2314 -3399 8729 2211 -7569 8412 5033 -10371 5979 9297
419I297j8468P796J1354j2614l878J4870o832j2154J9239k282k2699K0096J0258
432A3983k6622P303J7708j7475n013K0319r057j6905K2997L200k9344J7638J7016
445A5748k9648O419K2753k3459o738K9254j0401k6096K6511J2469l5724J2252
457f660K5740l2127J498L1043k5259j3631L5587q032l2268K7935J7324m0552J0640
470h762L4465l7277p017M2901k2272k5898L8391r19l6356K5320K1486m2129P512
483a0555M0273l8191j4183N1101k1770l6744M5476P628m8406K1632L4127m3214
495a2826l770M6422l2644k3006N3612j7118m4165M8376J1650n5600K4450L9792
507C5173n0386r027N8057k9984l8180N6297m192n1353M2774J9858n8599J9074
$$ plain form
419 9297 -9171 -1375 9979 -2635 -6513 8357 1525 -10629 8610 6328 -16371 3725 13983
432 13983 -12639 -5336 12372 -5103 -10116 10203 1146 -15759 7238 10438 -18906 -1268 15748
445 15748 -13900 -7481 15272 -8187 -14925 14329 3928 -22168 4343 16812 -18912 -6660
457 -6660 19080 -13047 -11549 19494 -5765 -19396 16191 8159 -24109 3826 21150 -19402 -8762
470 -8762 25703 -11574 -18591 24310 2038 -23860 14531 13612 -22744 2576 24062 -18067 -10555
483 -10555 29718 -8473 -22656 28445 6675 -30069 15407 23035 -25371 -3739 30388 -12826
495 -12826 -16596 29826 -2818 -25824 27788 10670 -33495 14881 26531 -29069 -4619 35173
507 35173 -15213 -24240 33817 3833 -34347 21950 17758 -33595 9179 29037 -29562 -10488
519a0488M6988m8058j7306N8309k2863m3013N6076L173o2320L9812L6183o0652
531b4159M678N0155l8472j8857N4846k3697m7007O2952J1337p4827L3428N0601
543D0978o1402l759N8438l9329l0733O2335q133n8905M5089K7960o1707J9529
555i639M3298n5523K246N9499m6643l5252P2461l473p1844M3461M2307o5523O752
568a7873N5433n1150j3326O5698l4808m7556O6508J0620p0891K9641M6194n6520
580a8030R66N5096m9687k1331P1600k2830n9073N3855K2068n8184K0720L6091
592C1261n4575P469O3937n6425m0768Q4191k882p4600L8555L8195n2975Q905M0913
605C1201m9443p886O7276l4771n1238O2927Q227n7893L5241K2297n7614K3660
$$ plain form
519 -10488 36500 -11558 -28864 29445 6582 -36431 19645 22818 -39502 310 36493 -24159
531 -24159 -19481 30674 -7798 -26655 28191 4494 -42513 20439 31776 -43051 -9623 40978
543 40978 -20424 -24183 34255 -5074 -35807 26528 18395 -40510 4579 32539 -29168 -9639
555 -9639 33659 -21864 -19618 39881 -6762 -42014 30447 26974 -44870 -1409 40898 -24625 -17873
568 -17873 37560 -13590 -26916 38782 3974 -43582 22926 33546 -37345 -7704 38490 -18030
580 -18030 -17064 38032 -11655 -32986 38614 15784 -43289 10566 32634 -25550 -4830 31261
592 31261 -23314 -15845 48092 -8333 -49101 35090 32208 -42392 -3837 34358 -18617 -9712 31201
605 31201 -18242 -26128 41148 6377 -44861 18066 26293 -31600 3641 25938 -31676 -8016
617h016N3279o2538k6574Q0349j3684o5029M6477J8764n0158L2546K3513o4112
629c5183J6233O6237n0671m2532O7538J697n6574L7988J7459n3595L0344L8003
641C6944o2095k742O4215l0380m0901M9776Q27m5450M1326J4542o3104K9116N4360
654D6434o2166k1785O7273j2113m7381L4608J0302l6839L1833J6615n9541J8234
666a4526N8415m7010k9942N1557o491l1963L5135r13m7480L6785L8524o1174j0888
679b9971N8764j9241k8599L2854j2298k4570M3980L266n8372K2425N0834m2611
691c539k2529M3766j2840k2476L5256j0217l5413L6135J8574m7709N808M1846
703B6662k8957j8418L8203j4665k5953L9174j332m3719K6124L0693l8241r277
$$ plain form
617 -8016 45263 -17275 -43849 36500 22816 -42213 4264 23028 -27130 5416 28929 -35183
629 -35183 -18950 47287 -3384 -45916 21622 23319 -33255 4733 22192 -31403 -1059 36944
641 36944 -25151 -27893 36322 5942 -34959 14817 15644 -29806 11520 26062 -37042 -7926 46434
654 46434 -15732 -37517 29756 17643 -29738 4870 15172 -21667 10166 26781 -32760 -14526
666 -14526 43889 -3121 -33063 18494 12003 -19960 15175 14262 -33218 3567 42091 -19083 -29971
679 -29971 28793 9552 -19047 13807 1509 -23061 20919 24185 -34187 -11762 39072 -3539
691 -3539 -26068 17698 4858 -17618 17638 7421 -27992 8143 26717 -20992 -15184 26662
703 26662 -2295 -20713 17490 2825 -23128 16046 14714 -29005 -2881 27812 -10429 -19706
715a9706L4590j2244j6136K5219j2632k1472L8094J561m4723J9081L3083k9306
727d591j1785K7003j1388j3446K9599q594l2939K8999J9174l5267K318K3985j6476
740c408l947K0155j6380j4306L2122K07l6101J7173K3493k5044r68J7710j6401
753e695j458K3079j4952j9071K6364Q258l0300Q441K0157k0119j00J8756j6669
766c309p541K2822m443j9708J2362J1400j6707K500J1927j5305K064J7105j5123
779a956r136K0161k229j6816R619J0384j4813J3J3475j1278l943J6019r115j0632
793a0247J5378J378j3781M854Q294r181r9R867j0124m764J6271m635j2783R855
807B83L781p340K946K443p352K131J0661q291r259J2760J534r798N539K078p160
$$ plain form
715 -19706 14884 2640 -13496 11723 -909 -22381 15713 17274 -27449 -8368 24715 -4591
727 -4591 -16376 10627 -761 -14207 15392 6798 -26141 2858 22032 -13235 -10917 13068 -3408
740 -3408 -7355 12800 -3580 -17886 14236 14443 -21658 -4485 19008 -6036 -7004 10706 -5695
753 -5695 -7153 15926 974 -18097 8267 16525 -13775 -5334 14823 -5296 -5396 13360 -3309
766 -3309 -10850 11972 7529 -12179 183 11583 -5124 -2624 9303 -6002 -3938 13167 -1956
779 -1956 -11092 9069 6840 -9976 -357 10027 -4786 -4773 8702 -2576 -6519 9500 385 -10247
793 -10247 5131 6509 -7272 -2418 5876 -3305 -3404 6463 -3661 -8425 7846 3211 -9572 283
807 283 4064 -3276 -330 2113 -5239 -3108 7553 -738 -9997 2763 4297 -5501 38 2116 -5044
822e044M524M811o336l091P560m28n940N025N30o262O040K385p611K542M691l999
838f03j909N136r48n519M914L531p340K316L446m627J742L168l804j149L707J166
854C227m962J286L426m096J382L261n089N61L940k043j861J575J092j728R8K161
870B230l154J40M006l482j175L402j544j299J496K49j362m59K789k236j343L154
886A412k080j199L141j763q44J513o7q42o44K049j232j734L218j500k135L522
902H15r19j984J964j53o05k09J114m06j665K683l64k947L094O5k340J989k54p62
920h84M39Q91k70k086K795K77l252K466R35l232K672M53k706J514J712j554j347
937a177K283P40l478K576J504m358L034J574l924J048K818k139j486K135R10l528
$$ plain form
822 -5044 -520 4291 -2045 -5136 2424 1996 -3944 1081 1611 -4651 1389 3774 -3837 -1295 3396 -603
838 -603 -2512 2624 1676 -3843 1071 4602 -2738 -422 3024 -1603 139 3307 -497 -1646 2061 3227
854 3227 -1735 -449 2977 -1119 263 3524 -1565 -1004 2936 893 -968 607 1699 -29 69 2230
870 2230 -924 -784 3222 -260 -1435 1967 423 -876 620 869 -493 -952 1837 -399 -1742 1412
886 1412 -668 -1867 1274 -489 -1333 180 113 -729 -1373 676 -556 -2290 928 -572 -2707 815
902 815 -104 -2088 -124 -277 -882 -1091 23 -383 -2048 635 271 -2676 418 483 -1857 132 -122 -884
920 -884 -445 446 176 -1910 885 1162 -2090 376 1311 -1921 751 1204 -1502 12 1724 170 -1177
937 -1177 1106 1846 -1632 944 2448 -1910 1124 2698 -1226 -178 2640 501 -985 1150 2060 -1468
953a468K371J924m945K575L377n372N9M411k375j941K373Q63m055K836K751o546
969c162J670O240n810j707N326k554k139L913m94n441M201M482q051P8P500m886
985h34k700N999l339k919O267r16o948M439O199p861j961Q458m749l513Q230l939
1001h7n640Q082J544q569J605P761n627l165P565m379l917J0447m129r175R511
1016A827M367r969L05Q338m994l241Q111m873o188J1723q07j1796P473N951q762
1031b535P47O538o100k585J0956n145j0627J2499M216j3456L694P509p622Q80
1045a031O414p932k958J2989l053j3686J0604P027j3067K977P776r985J508J0445
1059H028r285p296J3520J180j3763O660O967j1172M297Q613j3853J90J5817q350
$$ plain form
953 -1468 903 2827 -2118 457 3834 -1538 -1479 2932 557 -1384 989 1852 -2203 633 3384 -3162
969 -3162 -1492 4748 -1062 -2769 2557 3 -2136 1777 1283 -4158 43 4525 -3526 -3448 4052 -834
985 -834 -3534 2465 -874 -3793 2474 1558 -5390 -951 5248 -2613 -4574 3884 -865 -4378 3852 -87
1001 -87 -5727 2355 3899 -4670 -3065 4696 -931 -4096 3469 -910 -4827 5620 1491 -7684 1827
1016 1827 6194 -3775 -3470 4868 -126 -3367 4744 -129 -6317 5406 4599 -7197 276 6227 -2535
1031 -2535 -1788 4750 -1350 -3935 7021 1876 -8751 3748 7964 -5492 -1798 5711 -1911 -1031
1045 -1031 5383 -2549 -5507 7482 4429 -9257 1347 8374 -4693 -1716 6060 -3925 -2417 8028
1059 8028 -1257 -8553 4967 6147 -7616 -956 6011 -5161 -864 7749 -6104 -5914 9903 1553
1073A553j2359J2812N795j3846L677P937j1180L454J1018j4225l248J7057n524
1086B921j2674J0893M432j2258N611Q569j4566J216J7149j2377r981J6460m14
1099D981j1901P633L180j0482O979R125j6762j128K0101q837j3997J4704J694
1112E290j1441Q273L738j3623N988J3093j4482o440J8528n118j2347J3475q92
1125D042j3051J2882O336j8233J962J7239r664j0178J3947j653j0562J1863l02
1138D628j4044J1782P753j6710M11J6202q093j0308J3472p11j2906J1975L743
1151G194j6058O837J2093j3239m318J3910m718q464J1206j130j3086J2425P318
1164I970j9206K828J6288j0582o438J1102l578p031J1631q75j4770J0362J0808
$$ plain form
1073 1553 -10806 2006 7801 -6045 -2368 5569 -5611 -2157 8861 -5364 -8612 8445 2921
1086 2921 -9753 1140 5572 -6686 -1075 7494 -7072 -5856 11293 -1084 -11065 5395 4981
1099 4981 -6920 713 3893 -6589 390 9515 -7247 -8375 11726 2889 -11108 3596 5290
1112 5290 -6151 2122 5860 -7763 -1775 11318 -3164 -9604 8924 3806 -8541 4934 4042
1125 4042 -9009 3873 10209 -8024 -6062 11177 1513 -8665 5282 3629 -6933 4930 4628
1138 4628 -9416 2366 10119 -6591 -6180 10022 1929 -8379 5093 4382 -8524 3451 7194
1151 7194 -8864 -2027 10066 -3173 -7491 6419 1701 -6763 4443 3313 -9773 2652 9970
1164 9970 -9236 -6408 9880 -702 -7140 3962 384 -6647 4984 4109 -10661 -299 10509
1177A0509j6842P3J4561j0029n421J3583m561j1217J1958N074j5007L055J2549
1190H285j1149k298J1757q351n033J3857m069j2762J1615O915j4870J550J3407
1203H854j0467m885J3658o398q001J2928j039j2018Q071O716j1292M92J1305r602
1217a678m687J4037n520j0317J2338J811j2470N480Q039r671o00R465p282n043
1231f098J3133m031j1580J1538M117j2921L766Q565q509j977R190m996o185J0459
1245D471p47j0628Q029L852j0176M313O789r812q37J1029m429r586R504K853j0205
1260e580N137N267r157J972P352o504l429Q072k040o370O936J981r354M306P352
1275E941q773p90P480m582k655O174j583o187O212L419q768J762P355p105j256
$$ plain form
1177 10509 -6333 -6260 8301 -1728 -7149 6434 1873 -9344 2614 7688 -7319 -4264 8285
1190 8285 -2864 -5162 6595 -1756 -6789 7068 2999 -9763 1852 8767 -6103 -4553 8854
1203 8854 -1613 -6498 7160 762 -7239 5689 4650 -7368 703 7419 -3873 -3381 7924 -1678
1217 -1678 -6365 7672 2152 -8165 4173 5984 -6486 -1006 7033 -2638 -3238 6227 -1055 -6098
1231 -6098 7035 3004 -8576 2962 7079 -5842 -2076 6489 -2020 -3997 5193 197 -5988 4471
1245 4471 3724 -6904 1125 4977 -5199 -886 5903 -3909 -4746 6283 1854 -7732 1772 4625 -5580
1260 -5580 -443 4824 -4333 -2361 4991 -1513 -4942 3130 1090 -5280 1656 3637 -5717 -1411 5941
1275 5941 -2832 -3622 3858 -724 -3379 2795 1212 -4975 1237 4656 -4112 -2350 5005 -2100 -3356
1290c356Q274m742n014P230J396o525J390M740n020N22N209n363j959P338l253
1305H67m442N737J15n419L703L655o570l79P591l746m644N797r29m262M931P23
1321B728n476K367L966l700k067M603j959l486N630o51n745M509J977m274R42
1336f36K282k456r01M299k534l952N179J283n707K756K425l895M92L073k267j793
1352b352L045M42l520K234J072l289K474J209l330R76K638k417r71K510N01l259
1368b037J926K207l910R79K853l032j58K325j234j278J988K12k223J245K150l001
1384i88j37K604j694l85J706r50o48J097L24j621K87J934j403p24K363j896r52
1401a083K785p63j548N42J304o82p74J193r03j038K791j161j713K163o76j055
$$ plain form
1290 -3356 4918 176 -4838 2392 3788 -2737 -1347 3393 -1627 -1105 4104 -1259 -3218 4120 867
1305 867 -3575 2162 2277 -3142 561 4216 -2354 -2733 4858 1112 -3532 2265 1336 -2926 2005 2728
1321 2728 -2748 -381 3585 -115 -2182 2421 462 -3024 2606 1955 -3790 719 2696 -1578 -636
1336 -636 1646 -810 -1711 2588 54 -3898 1281 2564 -3143 -387 2038 -1857 -1365 1708 -559 -2352
1352 -2352 693 1135 -2385 -151 921 -2368 106 1315 -2015 -1039 1599 -818 -1789 721 1222 -2037
1368 -2037 -111 2096 -1814 -835 2018 -1014 -1172 1153 -81 -1359 629 841 -1382 -137 2013 -988
1384 -988 -1125 1479 -215 -600 1106 156 -492 605 929 -692 -405 1529 126 -598 1765 -131 -1083
1401 -1083 1702 939 -609 -67 1237 555 -219 974 71 -967 1824 663 -1050 1113 437 -618
1417f18J282l4j386N33J639j314j560J767K84j337J421o14j125J111O25j235J
1434e60N68L13j336J497k10j905J776J014k547Q81P64r31L87M19l52j306J853
1451C25N23k357R01J243j766J028J026j854r6J159L80j310L48J097j320Q64P39
1468I30k190J030J085r23k5N99m71q12J072R73j918J92K212k042MJ343j254l11
1486e06J529n35j103R36J014j394k58J514j401k09K069j629r85J954k42j049M89
1503A94O61j029k34J720j506q58K278o88j733J930m10j260J122O38j377j8J988
1520A418j386j725K679k97k507K604m54j864J716P41j873n3K116j035j898K264
1536D46j27k127K402J31k816J860J483k126o71K221n27j922K212Q5k431K099J231
$$ plain form
1417 -618 664 630 -756 -223 1416 102 -1458 309 593 -744 677 63 -1062 49 674 -561 -560
1434 -560 8 321 -1015 482 272 -1633 143 1157 -1390 -509 255 -676 -289 130 -222 -1528 325
1451 325 848 -1509 -608 635 -1131 -103 923 -931 -1027 132 512 -798 -450 647 -673 191 930
1468 930 -1260 -230 855 -68 -93 506 35 -777 295 1268 -650 -458 1754 -288 -284 1059 -195 -506
1486 -506 1023 488 -615 321 1335 -59 -317 1197 -204 -413 1656 27 -958 996 754 -295 194
1503 194 855 -174 -408 1312 -194 -1052 1226 538 -1195 735 325 -935 187 825 -552 -570 1418
1520 1418 32 -1693 986 689 -1818 786 332 -1532 184 925 -948 -1001 1115 80 -1818 446
1536 446 319 -1808 594 725 -2091 -231 1252 -874 -1545 676 149 -1773 439 524 -1907 192 1423
1553A423l354J166K102k060n84K521q50j863K688r5l474K936K008m560J210L125
1569B339k685q19K447j132j385K553L9l598K431K345l661K67K663k228n79K651
1585A648j130k283K853J179l807O07L615l254k28K689k596n62L610j684l151L023
1601E29K492m205j26L421k315j113L640l113j508M139o89l815K664K205l521K76
1617a039K631k595n66M198k355l648M345R53l804J264J686j954Q0K564l013j498
1633b751N228j374m998M043J821l396O87K111k490Q8L630k955k980M885K64m603
1649b790K836J940l827J821K481m528k05N524k116m331L872J836m081J560J623
1664A615l499K153K897m515r63M894q43m558L242J888l955J951K363m753Q03M790
$$ plain form
1553 1423 -1931 -765 1337 -723 -1307 1214 364 -1499 1189 1094 -2380 556 2564 -1996 -786 2339
1569 2339 -346 -1165 1282 150 -1235 1318 1357 -2241 190 2535 -1126 -859 1804 -424 -1003 1648
1585 1648 518 -1765 1088 2267 -1540 -933 2682 -572 -800 1889 -707 -1269 2341 657 -2494 529
1601 529 3021 -1184 -1310 2111 -204 -1317 2323 -790 -2298 1841 1152 -2663 1 2206 -1315 -1039
1617 -1039 1592 -1003 -1569 2629 274 -3374 971 1924 -1880 -616 1070 -884 -804 1760 -1253 -2751
1633 -2751 2477 1103 -3895 148 1969 -1427 -740 1371 -1119 -1031 2599 -356 -3336 1549 1813 -2790
1649 -2790 46 1986 -1841 -20 2461 -2067 -2272 3252 1136 -3195 677 2513 -1568 -8 1615
1664 1615 -1884 269 3166 -1349 -2312 2582 1739 -2819 423 2311 -1644 307 2670 -2083 -1280 3510
1680C510l586k431M006L21l478K280P91l715L010K995n831k16N981l305k916L412
1696H28R79l334K063J267m226K035L809m629j651N182j684k938L054j97l212L129
1712D75K033m765J49M864k319l212L732q01j630K695r98l226L145K741m724r73
1728b814M966j294l593L507l24k807L251Q03m259J761L232k858j715L568r66k658
1744b200L695l71m131L754K049m433J65L829j773k209K884n62k524L400m9m048
1760b524K886K756m297n48L613j024j704J969m28k575K928J290m399J257K947
1775B147k731j90K244j824p33L190q37l902K753K628l804l64L224j746q99K396
1791A552j830j613L046L30l357J431K169k995Q7K784k396p23L270j613k207K864
$$ plain form
1680 3510 -76 -2507 1499 1820 -1658 622 1413 -2302 708 3703 -2128 -2344 3637 332 -2584 828
1696 828 1807 -1527 536 1803 -2423 -388 3421 -1208 -2859 2323 639 -2299 755 558 -2654 475
1712 475 2508 -2257 -2108 2756 437 -2775 957 156 -1474 1221 223 -3003 142 2883 -1841 -2814
1728 -2814 2152 858 -2735 772 448 -2359 892 1695 -2564 -803 2429 -429 -2144 1424 458 -2200
1744 -2200 1495 1124 -3007 747 2796 -1637 -1472 2357 584 -1625 1259 697 -1827 1573 1524 -2524
1760 -2524 362 3118 -1179 -1727 1886 862 -842 1127 699 -1876 1052 2342 -2057 -800 2147
1775 2147 -584 -774 1470 -354 -1087 2103 1266 -2636 117 2745 -1059 -1423 1801 55 -844 1552
1791 1552 -278 -1891 1155 1485 -1872 -441 1728 -1267 -1180 1604 -792 -1515 1755 142 -2065 799
1807G99M96k694O60J922k216k86L051k397j270L271q06k459J866J245k089j42
1823a049J801o84j017J920j178j147K571p11j919J551R28j753L62J524j762p90
1839a353L046r97k729K433J044k351N28R22p86J85R09p33j295K182L38k598J290
1856C5J148j684P90P90j855J67J740m58j273J026O34j839J167O93k461J344J619
1873A583j806o89J381J79j350R44O24j451K86J407j637K40Q83j267L40J299p24
1890B42j266Q90O94j094L3Q30q85N8J594j244j183J444K41o28j01K34l85K40J071
1909G85j024j164K222m04j111Q43l61n05J034M2q73k46J290oj266J399n05q28
1927f78J275J4j419P49P34k69q20O34j0n94O83L14j221R42M2o78M16M00o91J08
$$ plain form
1807 799 1295 -1399 -739 1183 -1033 -1319 1732 -665 -1935 1336 530 -1929 -63 1182 -907 -1049
1823 -1049 752 68 -949 971 -207 -1354 1217 506 -1413 138 1066 -687 -325 1199 -563 -1353
1839 -1353 1693 696 -2033 400 1444 -907 -379 543 -243 -58 851 118 -1177 1005 1343 -1255 35
1856 35 1183 -501 289 1079 -776 -609 1131 673 -600 426 1060 -779 388 1081 -1380 -36 1583
1873 1583 -223 -912 469 648 -702 242 866 -585 -299 1108 -529 -289 594 -673 -333 966 242
1890 242 -1024 -134 560 -534 -501 329 -556 -498 1096 -148 -1331 113 354 -274 -375 -141 -526 -286 785
1909 785 -239 -1403 819 415 -696 147 -214 -719 315 357 -516 -762 528 522 -744 655 150 -678
1927 -678 597 611 -808 -59 675 406 -414 220 210 -384 299 613 -608 334 376 -302 114 514 -177 -69
1947f9Q74l71r24O77P90j199L68K05o66L75K91k13o69N98L06q71M78N28r91L81
1967a02Q58j114J8Q03j83n84K88J0k58J67N55p80J48O85o30j33M40m75j15N43
1987A41K4m83j7Q66o01n10Q13q07M27P64o97l30O05p6j10j51N1J16l93J087r29
2008b10l83J101m74l18J82J55j08PR7k05l27J239n69p16P13l3n21O85po67M00
2029D1N82j8j009N68Po37Q94K2p85N86L13o45k2M43M3k61L90j35j076J014N46
2050H61j102L95Q0o76L94O33n66k88N57N58j329N19K10n61K58Q74j042l21J074
2069E28m39k89K90j53m05Q19K93j303L65R72r94k53Q02m76l31N67M14j111K32
2088d72J128r53m36J312j474M13Q51n33l49N78L29r06L03L97k53n89J340q67l29
$$ plain form
1947 -69 805 434 -490 187 977 -222 146 351 -315 60 351 138 -531 67 373 -498 -20 508 -483 -102
1967 -102 756 -358 -340 463 280 -304 -16 -6 -264 -97 458 -322 -174 511 -119 -252 188 -287 -402 141
1987 141 165 -318 -335 531 -70 -580 233 -574 -147 617 -80 -410 195 119 9 -142 -91 25 -368 719 -210
2008 -210 -593 508 34 -284 -102 53 -55 -48 49 -156 -483 756 187 -529 184 151 -370 315 308 -359 41
2029 41 623 605 -404 164 171 -466 428 450 -335 251 564 -81 -103 340 383 122 512 377 -699 315 861
2050 861 -241 154 234 -442 -48 585 19 -269 288 846 -483 36 246 -315 -57 817 -225 -546 528
2069 528 89 -200 90 -63 -468 351 644 -659 -294 678 -316 -569 233 -243 -574 -7 407 -704 -472
2088 -472 656 -297 -733 579 -895 -482 369 -164 -513 65 394 -512 -209 188 -65 -654 686 -181 -510
2107e10J115n63n55Q04j16p27L79J135j196k76J216o51n11Q54l03m84O38L99r36
2126b88lR30o32m17R39l9j020J194o1q73O05L97r65J10P12m13l72P87j16j216
2146g41J241L16j726R96P52j310K58N86l02n96R51n5j184J065O44j607O29P75
2164F92j404J26J073k02j130J170O9j345R77P03j446J68J263j430K52P88n23n55
2182g54J020J47j560J036J041j538j02J308r18j94J060m09r35J053M89j348K58
2199c46J118j070j30J611j122n99J617p51j321J154L25p15O1J128j202l22J580
2216A016p68j024J230M3j367R84Q30j183L4R17o82m01J227n47j339J838j45j360
2234f97P52N54r72O4J070p30r03J603K2j679J384J37j159M37Q19j099p8J226q44
$$ plain form
2107 -510 605 42 -513 291 175 -552 -173 962 -234 -510 706 55 -456 398 95 -389 249 648 -288
2126 -288 -291 639 7 -410 529 490 -530 664 603 -270 335 732 -233 -123 589 176 -196 591 475 -741
2146 -741 500 816 -910 86 838 -472 -214 372 70 -526 425 370 -814 251 895 -712 -83 692
2164 692 -712 -586 487 285 -845 325 394 -951 26 729 -717 -549 714 -716 -464 324 -199 -754
2182 -754 266 413 -1147 -111 930 -608 -710 598 -320 -514 546 137 -798 255 744 -604 -346
2199 -346 772 -298 -428 1183 61 -538 1079 328 -993 161 486 -229 -168 960 -242 -564 1016
2216 1016 248 -776 454 497 -870 114 944 -239 -205 712 30 -371 856 309 -1030 808 663 -697
2234 -697 55 609 -363 -299 771 41 -862 741 763 -916 468 605 -554 -117 702 -397 -475 751 -93
2253i3j062K121j64j974J184P46j346L02P97j249N8R94p5r95P74N11j182O63N22
2272E32j454N60J103j532j25J463j57j288P66O40j149M71Q93j537K74J575j457
2289d22m84J542k75r40N49P07j212K49J188j040m11J291m52p13R24l33o22N79
2307A25N82j335N12J360j339o94J587k50j228Q61Q7n60K70N67q58Q1R09l76j102
2326h01J380l17q23R04o2p18M54L84n28m71R95l8j187J195K3j122R85M56j123
2345d14M46O79p71o90J029j42q09Q55K75j492J173N07j073L10M86n00m21O25J4
2364H7n75O66L27j532P85Q79j171M2J178p91m20O39r3n64O23M24j283N52Q78p90
2384a39j09O64k99n67O04Rn92M51O76r59M3P91p26k46J059o08m92Q12j20m81J89
$$ plain form
2253 -93 -1155 966 802 -1172 12 758 -588 -286 511 -738 -680 314 239 -756 18 529 -653 10 532
2272 532 -922 -362 741 -791 -916 547 390 -898 -132 508 -641 -170 723 -814 -540 1035 -422
2289 -422 -906 636 361 -579 -30 677 -535 -286 902 -138 -549 742 290 -423 501 168 -454 125
2307 125 707 -628 -116 1244 -95 -789 798 548 -680 181 268 -292 -22 545 -313 -232 677 301 -801
2326 -801 579 262 -561 343 281 -437 17 401 -127 -598 397 359 -828 367 390 -732 253 709 -414
2345 -414 32 711 -60 -750 279 137 -672 183 458 -1034 139 646 -427 -117 369 -131 -552 73 87
2364 87 -488 178 505 -1027 -242 637 -534 -492 686 -105 -525 114 21 -543 80 504 -779 -227 651 -139
2384 -139 -248 416 117 -450 154 163 -429 22 698 -261 -218 573 -153 -399 660 52 -440 372 252 -229 -40
2405d0M48m19r7M54l22k99J014n60n90N32l4k9R4L16n12l30P26j14o80J013l05
2426B66o88N99M4l65l9L38j40m10N34k22l91Q07j12r14N96K22k90J1L18j94n50
2447e80O76J38j024P75L32q96N40k1k96M49K33l44m98N02K95q36K68Q30j113K82
2467b88O53n62P7L24p0k19J36Q9m35R0Q26q87pP79m40k77K74j76K2L03K06o41
2489b23j52R96o67m56R74o85j14R75o33j62K12O82n55k83M49l84j93P75n60k64
$$ plain form
2405 -40 408 -11 -108 346 24 -275 739 179 -411 121 87 58 152 468 -44 -374 352 238 -442 571 266
2426 266 -422 177 221 -144 -183 155 15 -395 139 -83 -474 333 221 -693 -97 125 -165 -154 164 -30 -580
2447 -580 96 234 -790 -15 317 -579 -39 -60 -356 93 326 -18 -516 -14 281 -555 -287 543 -570 -288
2467 -288 365 -197 -120 204 134 -85 51 140 -295 -205 621 -266 -273 506 66 -211 63 -113 -91 212 418 -223
2489 -223 -375 621 -46 -502 472 -213 -327 648 15 -147 65 747 192 -91 358 -26 -219 556 -4 -268
$$ [...]
8191d1
##END NTUPLES=NMR FID
##END=
