##TITLE=1H_Pr Bu-Q
 CDCl3
 8 sc, 
 13.3.2023
##JCAMPDX= 6.0         $$ Bruker NMR JCAMP-DX V2.0
##DATA TYPE= NMR FID
##DATA CLASS= NTUPLES
##ORIGIN= UXNMR, Bruker Analytische Messtechnik GmbH
##OWNER= root
$$ XWIN-NMR		Version 3.5
$$ Mon Mar 13 16:12:47 2023 Russian Standard Time (UT+4h)  she@DPX200
##.OBSERVE FREQUENCY= 200.13135
##.OBSERVE NUCLEUS= ^1H
##.DELAY= (6, 6)
##.ACQUISITION MODE= SIMULTANEOUS
##.ACQUISITION SCHEME= undefined
##.AVERAGES= 8
##.DIGITISER RES= 18
##SPECTROMETER/DATA SYSTEM= spect
##.PULSE SEQUENCE= zg30
##.SOLVENT NAME= CDCl3
##.SHIFT REFERENCE= (INTERNAL, CDCl3, 0, 15.7039)
##AUDIT TRAIL= $$ (NUMBER, WHEN, WHO, WHERE, WHAT)
$$ ##TITLE= Audit trail, XWIN-NMR		Version 3.5
$$ ##JCAMPDX= 5.01
$$ ##ORIGIN= Bruker BioSpin GmbH
$$ ##OWNER= she
$$ F:/spectra/data/she/nmr/H-F/1/audita.txt
$$ ##AUDIT TRAIL=  $$ (NUMBER, WHEN, WHO, WHERE, WHAT)
(   1,<2023-03-13 16:11:42.85 +0400>,<she>,<DPX200>,
      <created by zg, POWCHK disabled, PULCHK disabled
       configuration hash MD5:
       00 E9 B6 7A A2 85 ED C7 34 08 36 98 17 FE 4E 26
       data hash MD5: 16K
       9B C5 8F 47 66 A2 54 DF B9 97 23 20 EB 9D 13 64>)
$$ ##END=
$$ 
$$ hash MD5
$$ F8 52 FA 6B 3D FA 9A C3 7A 7A 0C 6E 66 4C 23 57
##$RELAX= 
##$RELAX= 
##$RELAX= 
##$RELAX= 
##$RELAX= 
##$RELAX= 
$$ Bruker specific parameters
$$ --------------------------
##$DU= <F:/spectra>
##$EXPNO= 1
##$NAME= <H-F>
##$PROCNO= 1
##$TYPE= <nmr>
##$USER= <she>
##$AMP= (0..31)
100 100 100 100 100 100 100 100 100 100 100 100 100 100 100 100 100 100 
100 100 100 100 100 100 100 100 100 100 100 100 100 100 
##$AQSEQ= 0
##$AQ_mod= 1
##$AUNM= <au_zg>
##$AUTOPOS= <>
##$BF1= 200.13
##$BF2= 200.13
##$BF3= 200.13
##$BF4= 200.13
##$BF5= 200.13
##$BF6= 200.13
##$BF7= 200.13
##$BF8= 200.13
##$BYTORDA= 1
##$CFDGTYP= 0
##$CFRGTYP= 5
##$CHEMSTR= <none>
##$CNST= (0..31)
1 1 145 1 1 1 1 1 1 1 1 1 1 1 1 1 1 1 1 1 1 1 1 1 1 1 1 1 1 1 1 1 
##$CPDPRG= <>
##$CPDPRG1= <>
##$CPDPRG2= <>
##$CPDPRG3= <>
##$CPDPRG4= <mlev>
##$CPDPRG5= <mlev>
##$CPDPRG6= <mlev>
##$CPDPRG7= <mlev>
##$CPDPRG8= <mlev>
##$CPDPRGB= <>
##$CPDPRGT= <>
##$D= (0..31)
0 1.2 0 0 0 0 0 0 0 0.06 0 0.03 0 0 0 0 0.0002 0 0 0 0 0 0 0 0 0 0 0 0 
0 0 0 
##$DATE= 1678709502
##$DBL= (0..7)
120 120 120 120 120 120 120 120 
##$DBP= (0..7)
150 150 150 150 150 150 150 150 
##$DBP07= 0
##$DBPNAM0= <>
##$DBPNAM1= <>
##$DBPNAM2= <>
##$DBPNAM3= <>
##$DBPNAM4= <>
##$DBPNAM5= <>
##$DBPNAM6= <>
##$DBPNAM7= <>
##$DBPOAL= (0..7)
0.5 0.5 0.5 0.5 0.5 0.5 0.5 0.5 
##$DBPOFFS= (0..7)
0 0 0 0 0 0 0 0 
##$DE= 6
##$DECBNUC= <off>
##$DECIM= 32
##$DECNUC= <off>
##$DECSTAT= 4
##$DIGMOD= 1
##$DIGTYP= 9
##$DL= (0..7)
0 120 120 120 120 120 120 120 
##$DP= (0..7)
150 150 150 150 150 150 150 150 
##$DP07= 0
##$DPNAME0= <>
##$DPNAME1= <>
##$DPNAME2= <>
##$DPNAME3= <>
##$DPNAME4= <>
##$DPNAME5= <>
##$DPNAME6= <>
##$DPNAME7= <>
##$DPOAL= (0..7)
0.5 0.5 0.5 0.5 0.5 0.5 0.5 0.5 
##$DPOFFS= (0..7)
0 0 0 0 0 0 0 0 
##$DQDMODE= 0
##$DR= 18
##$DS= 0
##$DSLIST= <SSSSSSSSSSSSSSS>
$$ [...]
##$SUBNAM2= <"">
##$SUBNAM3= <"">
##$SUBNAM4= <"">
##$SUBNAM5= <"">
##$SUBNAM6= <"">
##$SUBNAM7= <"">
##$SUBNAM8= <"">
##$SUBNAM9= <"">
##$SW= 18.05172834244
##$SWIBOX= (0..15)
0 0 2 0 0 0 0 0 0 0 0 0 0 0 0 0 
##$SW_h= 3612.71676300578
##$TD= 16384
##$TD0= 1
##$TE= 0
##$TE2= 300
##$TE3= 300
##$TEG= 300
##$TL= (0..7)
0 120 120 120 120 120 120 120 
##$TP= (0..7)
150 150 150 150 150 150 150 150 
##$TP07= 0
##$TPNAME0= <>
##$TPNAME1= <>
##$TPNAME2= <>
##$TPNAME3= <>
##$TPNAME4= <>
##$TPNAME5= <>
##$TPNAME6= <>
##$TPNAME7= <>
##$TPOAL= (0..7)
0.5 0.5 0.5 0.5 0.5 0.5 0.5 0.5 
##$TPOFFS= (0..7)
0 0 0 0 0 0 0 0 
##$TUNHIN= 0
##$TUNHOUT= 0
##$TUNXOUT= 0
##$USERA1= <user>
##$USERA2= <user>
##$USERA3= <user>
##$USERA4= <user>
##$USERA5= <user>
##$V9= 5
##$VALIST= <valist>
##$VCLIST= <CCCCCCCCCCCCCCC>
##$VD= 0
##$VDLIST= <DDDDDDDDDDDDDDD>
##$VPLIST= <PPPPPPPPPPPPPPP>
##$VTLIST= <TTTTTTTTTTTTTTT>
##$WBST= 1024
##$WBSW= 4
##$XGAIN= (0..3)
0 0 0 0 
##$XL= 0
##$YL= 0
##$YMAX_a= 299859
##$YMIN_a= -482644
##$ZGOPTNS= <>
##$ZL1= 120
##$ZL2= 120
##$ZL3= 120
##$ZL4= 120
##$ABSF1= 10
##$ABSF2= 0
##$ABSG= 5
##$ABSL= 3
##$ALPHA= 0
##$AQORDER= 0
##$ASSFAC= 0
##$ASSFACI= 0
##$ASSFACX= 0
##$ASSWID= 0
##$AUNMP= <proc_1d>
##$AZFE= 0.1
##$AZFW= 0.1
##$BCFW= 1
##$BC_mod= 2
##$BYTORDP= 1
##$COROFFS= 0
##$CY= 11.3945322036743
##$DATMOD= 1
##$DC= 2
##$DFILT= <>
##$DTYPP= 0
##$F1P= 2.36226072786647
##$F2P= -0.459571619588291
##$FCOR= 0.5
##$FTSIZE= 0
##$FT_mod= 4
##$GAMMA= 1
##$GB= 0.15
##$INTBC= 1
##$INTSCL= 1
##$ISEN= 128
##$LB= 0.24
##$LEV0= 0
##$LPBIN= 0
##$MAXI= 10000
##$MC2= 0
##$MEAN= 0
##$ME_mod= 0
##$MI= 1.114404
##$NCOEF= 0
##$NC_proc= 0
##$NLEV= 6
##$NOISF1= 3.799351
##$NOISF2= 2.8
##$NSP= 1
##$NTH_PI= 0
##$NZP= 0
##$OFFSET= 15.70392
##$PC= 1
##$PHC0= -19110.3
##$PHC1= 17.40074
##$PH_mod= 1
##$PKNL= yes
##$PPARMOD= 0
##$PSCAL= 0
##$PSIGN= 0
##$REVERSE= no
##$SF= 200.130013532006
##$SI= 16384
##$SIGF1= 3
##$SIGF2= 2
##$SINO= 400
##$SIOLD= 16384
##$SREGLST= <1H.CDCl3>
##$SSB= 0
##$STSI= 0
##$STSR= 0
##$SW_p= 3612.71676300578
##$SYMM= 0
##$S_DEV= 0
##$TDeff= 0
##$TDoff= 0
##$TI= <>
##$TILT= no
##$TM1= 0
##$TM2= 0
##$TOPLEV= 0
##$USERP1= <user>
##$USERP2= <user>
##$USERP3= <user>
##$USERP4= <user>
##$USERP5= <user>
##$WDW= 1
##$XDIM= 8192
##$YMAX_p= 0
##$YMIN_p= 0
$$ End of Bruker specific parameters
$$ ---------------------------------
##NTUPLES= NMR FID
##VAR_NAME=  TIME,          FID/REAL,        FID/IMAG
##SYMBOL=    X,             R,               I
##VAR_TYPE=  INDEPENDENT,   DEPENDENT,       DEPENDENT
##VAR_FORM=  AFFN,          ASDF,            ASDF
##VAR_DIM=   8192,          8192,            8192
##UNITS=     SECONDS,       ARBITRARY UNITS, ARBITRARY UNITS
##FACTOR=    0.0002768,     1,               1
##FIRST=     0,             0,               0
##LAST=      2.2672688,     0,               0
##MIN=       0,             -482644,         0
##MAX=       2.2672688,     299859,          0
$$ Real data points
##PAGE= N=1
##DATA TABLE= (X++(R..R)), XYDATA
0@%%%%%%%%%%qJ6j6K4l2L9m7N6p2Q8j04J20j43J68j94K30k70L13l61M16m77N43
$$ 0 0 0 0 0 0 0 0 0 0 0 -8 8 -8 16 -16 23 -24 32 -40 48 -56 64 -79 89 -105 125 -145 168 -193 223 -254 289
32B89o18P00p90Q94j006J127j264J412j572J748j941K154k384K633k907L209l539
$$ 289 -329 371 -419 475 -531 596 -668 744 -828 920 -1021 1133 -1251 1382 -1525 1684 -1855
49a855L899m295M730n212N748o348P022p783Q651r655J0831j2227J3924j6033
$$ -1855 2044 -2251 2479 -2733 3015 -3333 3689 -4094 4557 -5098 5733 -6494 7430 -8603
63h603J8733k2336K7411l5151M8538p8016K59344j81568m66510L86531K23092
$$ -8603 10130 -12206 15205 -19946 28592 -49424 209920 28352 -438158 -51627 171465
74A71465j18370r0071R4592l4541n8979p0725N9780J81916k491k92726J5113L03973
$$ 171465 53095 -36976 57616 23075 -35904 -106629 -46849 135067 132576 -160150 -145037 158936
86A58936k7331k73854M8326J30734m3530N9184R7832k09871j62285J96738J71237
$$ 158936 131605 -142249 -93923 36811 -6719 52465 150297 -59574 -221859 -25121 146116
97A46116p3647n8993l5734o1544L8939P2781o40N9641k672k14342l6012K86332
$$ 146116 72469 13476 -22258 -83802 -44863 27918 27278 86919 84247 -130095 -166107 120225
109A20225M0035k64427P256K03749o2838j29445P0705L8661n0359L6969L3828
$$ 120225 160260 -104167 -96911 106838 44000 -85445 -14740 23921 -26438 10531 44359
120D4359l8985j3043m2962l8069J38242R6946j71488r1939J51800M966j32204
$$ 44359 5374 -7669 -50631 -88700 49542 146488 -25000 -116939 34861 39827 -92377
131i2377R6544J34000j28423j14486Q6124N9770k6122j3444k5422K3581Q3834
$$ -92377 4167 138167 9744 -104742 -18618 41152 15030 1586 -23836 -255 83579
142H3579o9645j49177Q6290J67020o5139j02531M5827K30n4489N4919M9903l6338
$$ 83579 13934 -135243 -48953 118067 52928 -49603 -3776 -3546 -58035 -3116 46787 10449
154A0449O745o181r0113K6122J38052k4336j21503K2384P1499q253j4966l1124
$$ 10449 17194 11013 -79100 -52978 85074 60738 -60765 -38381 33118 24865 9899 -21225
166b1225m0472P6064Q7111r0212q9524P2553L2529o2566L7608P5760n5733q1295
$$ -21225 -61697 14367 101478 11266 -78258 -5705 26824 -35742 1866 77626 21893 -59402
178e9402L825L8570O5232L5101r8240q6876Q6948Q0474o0139l2329L9775j7058
$$ -59402 -55577 -17007 48225 83326 -14914 -101790 -14842 65632 5493 -26836 12939 -4119
190d119k2490M2682P025l6444N286M848j1398M2774K0476p6525l2595P0564L1791
$$ -4119 -26609 16073 23098 -13346 -8060 -3212 -14610 28164 48640 -27885 -60480 10084 41875
203D1875k6111l921k3502l9108L9191O1339k3121m1379j65p398P211M3519m056
$$ 41875 15764 11843 -11659 -50767 -11576 49763 26642 -14737 -14902 -22300 -15089 28430 24374
216B4374m5801O123K2645j7784N238K9304k3383l0185K9097K3700j7455r397o404
$$ 24374 -21427 -15304 7341 -10443 -5205 24099 716 -29469 -372 23328 5873 -3524 -9928
229i928r608L0769K8116l7517l3146K7241J8043j4260M746P413j6418n230P612
$$ -9928 -19536 11233 39349 1832 -31314 -4073 13970 -290 4456 11869 -4549 -9779 -2167
242b167k950R347J4114k3774k1182K8429J9499k6419j3276J8206Q038m260l671
$$ -2167 -5117 4230 18344 -5430 -26612 1817 21316 -5103 -18379 -173 7865 3605 -66
255f6r696K624J7266k853j6024R175J1423j4785o986J6142M492j0727l052J205
$$ -66 -9762 -7138 10128 7275 -8749 426 11849 -2936 -9922 6220 10712 -15 -3067 -1862
269a862K400O459l697j1728M288J2056n416r507M406L356l450J994K081l912p75
$$ -1862 538 6997 3300 -8428 -4140 7916 2500 -7007 -2601 755 -2695 -701 1380 -2532 -3307
284c307K259q18K162L505l982m683M742M538k318j842O80j370R62L261p37k933
$$ -3307 -1048 -1866 296 3801 -181 -4864 -122 4416 2098 256 936 -434 528 3789 3052 119
300A19m20O12N85J217q63k996K17J551l60o55N9m72j003R22J027j13q00p74J109
$$ 119 -301 311 896 2113 1250 -1746 -1529 22 -338 -993 -934 -1406 -2409 -1487 -460 -573 -1373 -2147 -1038
319a038J675L0j437M40J638j01p43O40R58r11m40O21O02q64p48J16M18k7j148
$$ -1038 637 667 -770 -330 1308 1207 464 1104 2062 1151 711 1332 1934 1070 322 438 856 829 -319
338c19j290J216J097j875j517J848M98k165N94K249p38j726O74J288P22Q37j972
$$ -319 -1609 -393 704 -1171 -2688 -840 -342 -2507 -1913 336 -402 -2128 -1454 -166 556 1393 -579
355e79j087L778J273m468j35N889j374n523J803L764j966o95o06j075K698J767
$$ -579 -1666 2112 3385 -1083 -1218 4671 3297 -2226 -423 3341 1375 680 74 -1001 1697 3464
371C464p536j930R822L79r569J356O538l568l280M041k02O05L745o813n183J1879
$$ 3464 -4072 -6002 3820 4199 -5370 -4014 2524 -1044 -4324 -283 -485 120 3865 -2948 -8131 3748
387C748M570j2305L89J0808n356o968P025J441m359N679m16j0959M904Q953r971
$$ 3748 8318 -3987 -3598 7210 1854 -5114 1911 3352 -1007 4672 4256 -6703 -1799 7154 -2817
402b817j670J2292o482j2276J0757M427j1741O768J0705j4052o472J2895j718
$$ -2817 -4487 7805 1323 -10953 -196 4231 -7510 -742 9963 -4089 -10561 2334 616
415F16m782J1022k884j4162J1654P811j9255K669K5455q694k1481R093P170p159
$$ 616 -4166 6856 3972 -10190 1464 9275 -9980 -7311 18144 9450 -12031 -2938 4232 -2927
429b927P874K327j4437Q557J1738k6270q256L7813M941l3410j91J7034p170j133
$$ -2927 4947 7274 -7163 1394 13132 -13138 -21394 16419 21360 -12050 -12241 4793 -2377 -3510
443c510N042q932J1883J8571l2873k7892M2941K7393l7338j1041K8102n099j9705
$$ -3510 1532 -7400 4483 23054 -9819 -37711 5230 32623 -4715 -15756 12346 7247 -12458
456a2458N470N365J2478J7258l0417l6423L8255L4661m1434j6405M3519j293l6119
$$ -12458 -6988 -1623 10855 28113 -2304 -38727 -472 34189 -7245 -23650 19869 18576 -17543
469a7543N408J2123n499J6971M813l1057L716K3746k3824j1352M2850M842l7170
$$ -17543 -12135 -12 -5511 11460 16273 -14784 -11068 12678 -11146 -22498 20352 25194 -11976
482a1976L016P417j9196K4591L5614l7269l0811L4320M501k8926K1278K2982k7066
$$ -11976 -8960 -1543 -20739 3852 39466 2197 -28614 5706 10207 -18719 2559 25541 -1525
495a525p104J4211j7048R26K8913j5075j7131L2044p621m7232K3645M1243l1326
$$ -1525 -8629 5582 -11466 -10540 18373 3298 -13833 18211 10590 -36642 -12997 28246 -3080
508c080p914M1833k7306n5261L6571N2125j7714k2513l495p927J5779R344l1282
$$ -3080 -10994 30839 3533 -51728 -15157 36968 19254 -3259 -6754 -14681 1098 10442 -20840
521b0840J8147N9415m3523q1006N1032P0670n0383l8383N0646J5031l9076j5101
$$ -20840 -2693 56722 13199 -67807 -16775 53895 3512 -34871 15775 30806 -8270 -23371
533b3371O08J9998M4731j6327o3881J6347M7458l3422k1648N0299O959l6902N589
$$ -23371 -22763 -2765 41966 25639 -38242 -21895 25563 -7859 -29507 20792 27751 -9151 -3562
546c562m025k7156M1876M3496n3802l0592N3002j97n6016J4433N0943O692j9018
$$ -3562 -7587 -34743 7133 50629 -3173 -33765 19237 19040 -36976 -22543 28400 35092 16074
559A6074l9860k8964N5295N4633n8150l9201O5772M772q0250J5412P7133j4610
$$ 16074 -23786 -52750 2545 57178 -972 -40173 25599 30371 -49879 -34467 42666 28056
571B8056m7848O784J0782M773J0206k6767j4534N4455J4886o2164p092L8325j9459
$$ 28056 -19792 -13008 -2226 2547 12753 -14014 -28548 25907 40793 -21371 -28463 9862 -9597
584i597k750N6723j2120p0573N771L8924l664J4136J9150m3867l1711L1505J4381
$$ -9597 -12347 44376 32256 -38317 -32546 6378 2714 16850 36000 -7867 -39578 -8073 6308
597F308j563K4349j9490n1497K6729M8687l1924k6510L0620J520j2907K5027j1916
$$ 6308 4745 29094 9604 -41893 -15164 33523 1599 -24911 5709 7229 -5678 19349 7433
610G433m8919K2842N1315j4287j8895J0577k5979k1794M0168L0333j2448o758
$$ 7433 -41486 -18644 32671 18384 -511 10066 -15913 -37707 2461 32794 20346 13588
622A3588k8701l9171M6808O8031m0773n9638L2039K8932k8815m781J7581m096
$$ 13588 -15113 -54284 -7476 60555 19782 -39856 -7817 21115 -7700 -12481 5100 1004
634A004L596L855k3144P296K9367l1780l0526N7407L6039n8155l7103K8818K1307
$$ 1004 4600 8455 -14689 -7393 21974 -9806 -40332 17075 53114 -5041 -42144 -13326 7981
647G981Q704O796k8504k0197K8986O163k5252J9164K6648l2952k3097K6940P340
$$ 7981 16685 23481 -5023 -25220 3766 9929 -15323 3841 30489 -2463 -25560 1380 8720
660H720j2741Q755j962j3062J8403N159l6715K077M3892k596l0344K599L856q140
$$ 8720 -4021 4734 2772 -10290 8113 13272 -23443 -21366 22526 19930 -10414 -7815 -3959 -12099
674a2099J8034J2409k2309m689J4327j0581l907K2380n077k2458J4865J4053j9608
$$ -12099 5935 18344 -3965 -8654 5673 -4908 -8815 13565 8488 -13970 895 14948 -4660
687d660l584J2991r673J34K5101p216l2853R24J9079Q302R000o562l2611l191
$$ -4660 -8244 4747 -4926 -4792 20309 13093 -19760 -18836 243 8545 17545 10983 -21628 -24819
701b4819L3364O692j5306K504l009j5707J1310K0926q515j3271R89j990O936K0524
$$ -24819 8545 15237 -69 2435 -574 -16281 -4971 15955 7440 -5831 -4842 -6832 104 20628
715B0628j0727l3231N055L2031O418j3760j3381j1000Q609K3333P38j5764k242
$$ 20628 9901 -23330 -18275 13756 20174 6414 -6967 -17967 -9358 13975 14713 -1051 -3293
728c293k997j0158J5685K5430j3268l0639L53K0483J2249j781j6697j3314J2935
$$ -3293 -6290 -16448 -763 24667 11399 -19240 -18887 1596 13845 12064 -4633 -17947 -5012
741e012J7539m878r014O74n557j874J5686Q516j5012j2122L192Q050R480K955
$$ -5012 12527 7649 -1365 -691 -6248 -8122 7564 16080 1068 -11054 -7862 188 9668 12623
755A2623j4732j2963Q947J3830L02m974p416n914O165J1569j192r148j812P36
$$ 12623 -2109 -15072 -6125 7705 8007 3033 -4383 -10297 -4132 7437 6245 -2903 -4715 -3979
769c979K173O460J643r002m556O036N399N17k605n034k484O812N435l274n555
$$ -3979 -1806 4654 6297 -2705 -7261 -1225 4174 4691 2086 -2948 -5432 1380 6815 3541 -2014
784b014j289J552M031K728l813n063J120L692P74r84j330j991l04L949J532k696
$$ -2014 -3303 -1751 2280 5008 1195 -3868 -2748 944 1718 734 -596 -2587 -2891 1058 2590 -106
800a06k841k29L201L128r88m267j266L404L003l55k431j674P9K042K273k42k918
$$ -106 -2947 -3176 25 3153 2165 -2102 -3368 36 3039 2684 253 -1421 -1342 700 2973 2731 -187
817a87k583Q33L784J977l028m147o4L889K169j475k758j297O24J893K244m92k868
$$ -187 -2770 -1937 1847 3824 796 -3351 -3415 474 2643 1168 -1590 -2887 -2263 -370 1874 1382 -1486
834a486j812J687L479J347l192k864J293L107J006j175j502j065J077R21J524
$$ -1486 -3298 -1611 1868 3215 23 -2841 -1548 1559 2565 1390 -112 -1177 -100 821 2345
849B345j120j754j347R07K726M96k937j578J318J033j41K25r10j112J218M55j5
$$ 2345 1225 -529 -1876 -969 1757 2253 -684 -2262 -944 89 -52 173 -737 -1849 -631 -176 -191
866a91N24l11k052J000L133p23k842J310R24o95J286L38k267K60J805j487p96
$$ -191 333 22 -2030 -1030 2103 1380 -1462 -152 772 77 1363 1701 -566 -306 1499 12 -784
883g84L051j190l446J951J882l034Q97K356k183k268L090k34k492K802J061l011
$$ -784 2267 1077 -2369 -418 1464 -1570 -673 1683 -500 -2768 322 88 -2404 398 1459 -1552
899a552Q44K222m114P38O321k750n233L937K863m830K64L852j662j97J790m966
$$ -1552 -708 1514 -2600 -1862 4459 1709 -3524 413 3276 -1554 -1290 2562 900 703 2493 -2473
915b473j836Q381m03q112L477O405p187l828O081R00j153K418m911m620Q701L672
$$ -2473 -4309 4072 3669 -4443 -966 5439 -1748 -5576 505 1405 252 2670 -2241 -6861 1840 5512
931E512j0723K004J1051n868r501N939M767k611K687r80p020N041N590j0641r54
$$ 5512 -5211 -3207 7844 1976 -7525 -1586 3181 570 3257 2277 -4743 298 5888 -4753 -5707
946e707J5002k530j4208L721O408m328J803M889p048j288O956p098n237J4207
$$ -5707 9295 6765 -7443 -3722 2686 -1642 161 5050 -1998 -3286 3670 -3428 -8665 5542
960E542K785j3711J688P501q381j73J2147m224p926P880n97j1344P902R498q575
$$ 5542 8327 -5384 -3696 3805 -4576 -4749 7398 3174 -4752 3128 2531 -8813 -911 8587 12
975A2m86O867j1267n536J6481J871j2593O219N623j4772j015J2892k293j646P942
$$ 12 -474 6393 -4874 -10410 6071 7942 -4651 1568 7191 -7581 -8596 4296 2003 357 8299
990H299j0748j2365J6067Q709j6409K225J5825r150j2714O787K762R71J1628o033
$$ 8299 -2449 -14814 1253 9962 -6447 -4222 11603 2453 -10261 -3474 -712 259 11887 5854
1004E854j8933J1066J3038j8881l233K6240p9k3707k147Q321K498R328k383j7314
$$ 5854 -13079 -2013 11025 -7856 -11089 15151 15072 -8635 -10782 -2461 37 9365 6982 -10332
1018a0332P409J6332j9872j3741K8084J1243k3560m860J0617m172N44O498p707
$$ -10332 -2923 13409 -6463 -20204 7880 19123 -4437 -9297 1320 -2852 -2308 4190 -3517
1031c517L663J5625j6949k3541K2715K2467j7171q936R867p847m799J3092j405
$$ -3517 146 15771 -1178 -24719 -2004 20463 3292 -5644 4223 -3624 -8423 4669 3264
1044C264o019J3937m840k4966R895K3241j1723j0299J3643k502j2578P626J982
$$ 3264 -2755 11182 6342 -18624 -8729 14512 2789 -7510 6133 3631 -8947 -1321 661
1057F61r167J4294J0125k1818p604J7159m194o827J8835K046k2538J362R761q423
$$ 661 -8506 5788 15913 -5905 -13509 3650 -544 -7371 11464 13510 -9028 -7666 2095 -6328
1071f328N782J7151j2081j5001R986p81p895J6787P452k2034p10J6348j2110j1388
$$ -6328 -546 16605 4524 -10477 -491 -1272 -9167 7620 15072 -6962 -7672 8676 -3434 -14822
1085a4822J9967P454j3466j46o85j0114J1046J2850j6033j231K0057j1935k4337
$$ -14822 5145 12599 -867 -1013 -1698 -11812 -766 12084 -3949 -5180 14877 2942 -21395
1098b1395J5473K0457r585m185K795j0560Q83J2152q259l442K1798l853l0955
$$ -21395 -5922 14535 4950 765 3560 -7000 -6117 6035 -2224 -5666 16132 12279 -18676
1111a8676L460K5000k029q614L671n954k844J0302n694r623J8780P560k5634l575
$$ -18676 -15216 9784 7755 -859 2812 -3142 -5986 4316 -1378 -11001 7779 15339 -10295 -13870
1125a3870K3185l357j5643Q303Q297m503R98n673j2313J3671J8225j2769j2266
$$ -13870 9315 5958 -9685 -1382 6915 2412 3410 -2263 -14576 -905 17320 4551 -7715
1138g715R490l861r410J6091J0042j4820m359M093q871M157J9853o059j9549N185
$$ -7715 1775 -2086 -11496 4595 14637 -183 -4542 -449 -9320 -5163 14690 8631 -10918 -5733
1152e733R511n526J667L293q353L170J1304r071r607J0480J810r056J1109Q772
$$ -5733 3778 -1748 -81 3212 -5141 -1971 9333 262 -9345 1135 2945 -6111 4998 13770
1166A3770j7831r120J3051L881k527P627l279j5886J550J1499K129J052l016j1695
$$ 13770 -4061 -13181 -130 3751 1224 8851 5572 -10314 -8764 2735 4864 5916 2900 -8795
1180h795K666J4305o463j1727J2320Q410j5935l983J4585q08j0267K838N584J318
$$ -8795 -6129 8176 1713 -10014 2306 10716 -5219 -9202 5383 4575 -5692 -2854 2730 4048
1194D048j63p513n675J1847Q091j1976l955R975l185q141O624N406o208J005L453
$$ 4048 3885 -3628 -9303 2544 10635 -1341 -5296 4679 1494 -6647 -23 5383 -825 180 3633
1209C633q024j188R372M58o121J384P01l515K355K708j854K995j21r908J32J4669
$$ 3633 -4391 -5579 3793 4251 -1870 -486 215 -3300 -945 1763 -91 2904 2783 -7125 -6993 7676
1225G676N17j3643p03R072l31k848J752j523k407J985K051Q00J275n777o519Q141
$$ 7676 8193 -5450 -6153 2919 2588 -260 1492 -31 -2438 -453 1598 2398 3673 -2104 -8623 -482
1241d82R630n417q280N79O83J476P644J147j0214n805N424O536K992k819p821
$$ -482 9148 3731 -4549 -3970 -3287 -1811 5833 6980 -3234 -9039 -3615 2921 5913 3094 -4727
1256d727k377P275M803j993j963k994l979M640R374j441j0015l742M508N848L869
$$ -4727 -7104 171 4974 2981 1018 -1976 -5955 -1315 8059 6618 -3397 -7139 -2631 3217 7086
1271G086m000q311j273N805N015L13l743n557k118O610N862j671n561l472Q52
$$ 7086 3086 -5225 -6498 -693 4322 4635 892 -4665 -6783 -173 5689 4018 -1543 -5015 -4163
1286d163N146M833k506o878j963M514M839N95l591m508L78M512K487q85k921k801
$$ -4163 983 5816 3310 -3568 -5531 -1017 3822 4417 826 -3682 -3304 1208 3695 2810 -111 -2912
1302b912J29L835L013k317m310j016L049L032k88k674k356J104K299J166r69j576
$$ -2912 -2783 1052 4065 1748 -2562 -3578 -529 2503 2215 -459 -2815 -1711 588 1754 785 -791
1318g91j141Q09K307P20j599j882O25J905O55j061j048k49J325O95l68q32r17
$$ -791 -1932 -1123 1184 1904 305 -1577 -952 953 1608 547 -501 -750 575 1270 902 70 -847
1335h47K81J512O12j552j590K01J938Q94j127j727k83J160J612j7j523j076l57
$$ -847 -566 946 1558 6 -1584 -1383 555 1449 322 -1405 -1688 -528 1084 1067 -456 -1532 -1889
1352a889K137J783m45k453j209J372K338O18j565k480l7K268J628m46j576j515
$$ -1889 248 2031 1586 -867 -2076 -704 1634 2252 687 -1793 -1830 438 2066 1620 44 -1471
1368a471m57K163K492j588k960n99J418J599J101j005k842l32K611J236n30p30
$$ -1471 -1928 235 2727 1139 -1821 -2420 -1002 597 1698 693 -2149 -2481 130 1366 836 106
1384A06j659q31K965K071k455j834J087L96J156J258k020k170J536J031o5N75
$$ 106 -1553 -2384 581 2652 197 -1637 -550 -154 1002 2260 240 -1930 -394 637 572 1147
1400A147J32l189o07L466R42k200j78j36p04J622R04k392k02K721j260j992K380
$$ 1147 1279 -1910 -2517 949 1891 -309 -487 -623 -1327 295 1199 -1193 -1395 1326 66 -1926 454
1417D54O31k969J306K348j569o76J242k326M06M111r46m102J828J990l289N27
$$ 454 1085 -1884 -578 1770 201 -475 767 -1559 -1153 2958 2012 -2090 -262 1728 -1561 -1034
1433a034L427k152j801K358r72k557L328J704l943P54K682l197j289M290k28k887
$$ -1034 2393 241 -1560 798 -174 -2731 597 2301 -1642 -888 1794 -1403 -2692 1598 1370 -1517
1449a517K684O0m685K023M320k373j155L241l005k778M595O59m009K702L439o012
$$ -1517 1167 1227 -3458 -1435 2885 512 -643 2598 -407 -3185 1410 2069 -1940 762 4201 -1811
1465a811k190N047J89k330L318j273m433L258J811n462K844P266n271o795N147
$$ -1811 -4001 1046 1235 -1095 2223 950 -3483 -225 1586 -3876 -1032 6234 963 -5832 -685
1480f85K429l545K486K002l732R89K099n992Q4J0407j499r483K878M449m890J8
$$ -685 1744 -1801 685 2687 -1045 -56 2043 -3949 -3865 6542 5043 -4440 -1562 2887 -2003 -1985
1496a985N124k229q50K575n375l918J0284K634r810P91O652m930l998N923Q70
$$ -1985 3139 910 60 2635 -2740 -6658 3626 6260 -3550 -2759 3893 -1037 -5035 888 1758
1511A758j890L388l344o692O584N721p265p56Q363m357p626N359L120l074M148
$$ 1758 -132 3256 -88 -6780 -196 5525 -1740 -2496 5867 1510 -6116 -757 2363 -711 3437
1526C437J110r011N58P203m026k187Q350j745r415K954M216m351L190O159o994
$$ 3437 4547 -4464 -3906 3297 -729 -2916 5434 3689 -5726 -2772 1444 -2907 283 6442 -552
1541e52n046O564r43m499P307K963q689P65N173o751j009J0729j278p489L399
$$ -552 -5598 966 23 -4476 2831 5794 -2895 -2130 3043 -3708 -4717 6012 4734 -2755 644
1556F44K88o546M895O642n782k68N039q074o354J1994N424r369l29M059n139p68
$$ 644 932 -5614 -719 5923 141 -127 4912 -3162 -9516 2478 7902 -1467 -1796 2263 -2876 -3644
1572c644O030k593q31P109m929j0054P615P469p888j231Q498k830p350L010Q34
$$ -3644 2386 -207 -1038 6071 1142 -8912 -1297 6172 -1716 -2947 5551 2721 -4629 -1619 -785
1587g85m12P659o43j2047J180R530m814l017Q594j410q342K560K548l512M849
$$ -785 -1197 6462 5819 -6228 -5048 4482 -332 -3349 5245 3835 -4507 -1947 601 -2911 1938
1602A938M278r218k448R430l055p884P181N784n675j100R84n231K961Q451m406
$$ 1938 6216 -3002 -5450 3980 925 -6959 222 6006 331 -769 215 -5016 -2055 6396 1990
1617A990n166O231j815r115O363R305n997l975L693l484k388P025O34n332L185
$$ 1990 -3176 3055 1240 -7875 -1512 7793 1796 -2179 1514 -1970 -4358 2667 3301 -2031 1154
1632A154J812o772N95N539l361o94P411l490r462M841O331n176Q61N556m607n107
$$ 1154 2966 -3806 -3211 2328 -1033 -1727 5684 2194 -7268 -2427 3904 -1272 -411 5145 538 -4569
1648d569L582Q80j02M711j634p932L465N331n483j468P309j131n678K865M16m597
$$ -4569 -987 -107 -209 4502 2868 -5064 -1599 3732 -1751 -3219 4090 2959 -2719 146 562 -4035
1664d035M069N088n256k883M133k078k824N220J661l272J58n69l584M532N464
$$ -4035 34 5122 -134 -3017 1116 -962 -3786 1434 3095 -177 -19 -588 -4172 360 5824
1679E824o514m628Q184J479p750L34N881j320j294J027j991p93K448j421q30N420
$$ 5824 -690 -5318 2866 4345 -3405 -3071 2810 1490 196 1223 -768 -1561 887 -534 -1364 4056
1695D056j109q489J307P268p44k846J448j249l596L840L063l063o59J423j911
$$ 4056 2947 -5542 -4235 3033 2289 -557 891 -358 -3954 -114 2949 -114 -773 650 -1261
1710a261R65K718k604j997L167O66k206J641R54n019O7O277L50m523r04J34m43
$$ -1261 -296 2422 -182 -2179 988 1654 -552 1089 2043 -2976 -2909 3368 3718 -805 -1709 -1575 -2018
1727b018L266K214l373k074J200o44J214K986j590m077J671K454j414Q8J383k257
$$ -2018 1248 3462 89 -1985 -785 -1429 -215 2771 1181 -2896 -1225 1229 -185 -97 1286 -971
1743i71j374L344J652k512j691O02M53K216O02l257o86J937l72q24K533L34l794
$$ -971 -2345 999 2651 139 -1552 -950 -497 1719 2321 -936 -1622 315 -57 -881 1652 1986 -1808
1760a808p62K741J192m81j183j013J97J790J6j060M13K66j756O66K494o23j600
$$ -1808 -2570 171 1363 882 -301 -1314 -1117 673 689 -371 42 308 -1448 -782 1712 1089 -511
1777e11k35J85N70J278L3j922m21Q97M60L81L45j278j305J022J322k12k11q51
$$ -511 -746 -561 9 1287 1320 -602 -1023 -126 334 715 1060 -218 -1523 -501 821 609 398 -453
1795d53j045L25K037P47j581j267K5P32J457K89r95j239P4Q71Q59M93j207j517
$$ -453 -1498 -1173 864 1611 30 -1237 -1212 -480 977 1266 271 -968 -894 -23 836 1329 122 -1395
1813a395L82J718R05r61r61q20M82J132J037q64j499m89J139R48K94j081j235
$$ -1395 -1013 705 1610 649 -312 -1132 -650 482 1519 655 -844 -1333 -194 754 1048 -33 -1268
1830a268J18J380M79j48o39r02j25J477P37m34q72m85L79Q42K37o83j93k43r5
$$ -1268 -1150 230 709 561 -78 -980 -1105 372 1109 675 -197 -682 -303 539 776 93 -100 -343 -438
1849d38P79N23m43q02j66L19N30L47n76m31k23M37O2J4L03m7p58P8N88M8m7o5
$$ -438 341 864 421 -381 -547 -228 302 649 73 -358 -581 -144 -82 -68 235 188 -570 -492 96 144 97 32
1871C2j19l48N50J69MJ8k39n08M02J106j73j199r7r0K97R50n0j335n27Q53M44
$$ 32 -87 -435 115 284 288 306 67 -441 -39 1067 894 -305 -402 -492 -195 755 705 -630 -1157 -304 140
1892A40L25O5p39j122P72J092j58o10k37n94O33J663n54j410j64Q71K9P64O53
$$ 140 465 530 -209 -1331 -559 533 375 -235 -472 -1066 -433 1230 676 -734 -898 -27 2 766 1419
1911A419k061r49J816R14n95N6j201q58J123J656o80r91J01p03j12K139n1k082
$$ 1419 -642 -1591 225 1139 544 600 -601 -1459 -336 1320 640 -351 -250 -953 -1065 1074 1023 -1059
1929a059N5J391q15j46J587j116j116J711O65j169K08m46j038J737J525j838j565
$$ -1059 -1004 387 -428 -574 1013 -103 -1219 492 1157 -12 196 -250 -1288 449 1974 136 -1429
1946a429J343L70j214J730R40k552m44J661q74J14J803j262j873J631R77k103
$$ -1429 -86 284 -930 800 1740 -812 -1256 405 -469 -355 1448 186 -1687 -56 921 -1182
1962a182R14J700j393l10J038j468j087K946N02k733Q43J857k586q20K964j35
$$ -1182 -268 1432 39 -271 767 -701 -1788 1158 1660 -1073 -230 1627 -959 -1779 1185 1050
1978A050j529J061n74j622J797J249k400M96K779k900k102L114O10j911J577P20
$$ 1050 -479 582 8 -1614 183 1432 -968 -472 2307 -593 -2695 419 1029 -882 695 1415
1994A415l099J43K540j688j37L156j380l315J904J963k410J199K671l312j489
$$ 1415 -1684 -1541 999 -689 -826 2330 950 -2365 -461 1502 -908 291 2962 -350 -1839
2009a839K472o55j655L524P68m039N38J974k897L34M158j544l172K328K63l150
$$ -1839 633 -22 -1677 1847 2615 -1424 -886 1088 -1809 -1475 2683 1139 -2033 295 558 -2592
2025b592K336K688k165j083K063k286k108M890N75l651J519J887l988l05L941
$$ -2592 -256 2432 267 -816 1247 -1039 -3147 1743 2318 -1333 186 2073 -1915 -2220 1721
2040A721p35j367K453k107l475L668K299l616P99L337l495k772L560Q04k045K698
$$ 1721 986 -381 2072 -35 -3510 158 2457 -1159 -360 2977 -518 -3290 270 1074 -971 1727
2056A727j22m393J500L053l082n53N335j605m589J997J454j995K164K322l959
$$ 1727 1605 -2788 -1288 1765 -1317 -1870 3465 1860 -2729 -732 722 -1273 891 3213 -746
2071g46q20K951j992k195N152Q74m829L03K445k824N29M085k029k452K510j227
$$ -746 -1566 1385 -607 -2802 2350 3224 -1605 -1302 1143 -1681 -1152 2933 904 -1548 962 -265
2087b65l462L601L837l996q98K529k811j366M196O17l087K304L73m449R53M220
$$ -265 -3727 -126 3711 -285 -1183 1346 -1465 -2831 1365 1982 -1105 1199 1572 -2877 -1924 2296
2103B296j860p74K897j818l973L126J841k946J868K595m212k359L894j44j531
$$ 2296 436 -338 2559 741 -3232 -106 1735 -1211 657 3252 -960 -3319 575 431 -1100
2118a100L207m74m465J477K764k823N55L421j700l287K522O55k736K613K309l662
$$ -1100 2107 1633 -2832 -1355 1409 -1414 -859 2562 862 -2425 97 752 -1984 629 2938 -724
2134g24k95K884k668j724M428J003l600l9J139j894J102K977k647j148K848j795
$$ -724 -1019 1865 -803 -2527 1901 2904 -696 -735 404 -1490 -388 2589 -58 -1206 1642 -153
2150a53l089L596K556l638m74K712j974j181K396k5j817K320k7l965J668L036
$$ -153 -3242 354 2910 -728 -1202 1510 -464 -1645 751 726 -1091 1229 1202 -2763 -1095 1941
2166A941j759o00K218j640k571K886Q28k260J259J727l324l84K690q27j462K481
$$ 1941 182 -418 1800 160 -2411 475 1303 -957 302 2029 -1295 -1679 1011 184 -1278 1203
2182A203j52k190O66P84k024J235K787j767k240J631Q2j538K485J290k761o04
$$ 1203 1051 -1139 -473 311 -1713 -478 2309 542 -1698 -67 15 -1523 962 2252 -509 -1113
2198a113J494n37l36J542m40j756J601P61k374O84J379j285O9K147j136k985J370
$$ -1113 381 -156 -492 1050 610 -1146 455 1216 -1158 -474 905 -380 -311 1836 700 -2285 -915
2215i15K112o63m1lj827J02K062Q3r18Q05j226j192K027J705k223j326J509J56
$$ -915 1197 534 493 490 -1337 -1235 827 910 -8 797 -429 -1621 406 2111 -112 -1438 71 227
2233B27o3P24o65j793J335J656n75q09j27j279N90K313m14j817j01J26j6J526
$$ 227 164 888 223 -1570 -235 1421 846 37 -90 -1369 -779 1534 1120 -697 -798 -672 -688 838
2251H38J029k457j844K028J529l50m02q53p52R94J292l92o02n70m27P67J662k51
$$ 838 1867 -590 -2434 -406 1123 773 371 -482 -1234 -240 1052 660 58 -512 -939 -172 1490 1239
2269A239k352o62J547R46K67n43j187n81J077J430l54j022p15nQ15J401q85j395
$$ 1239 -1113 -1775 -228 718 985 442 -745 -1326 -249 1181 827 -195 -910 -915 -100 1301 416 -979
2287i79L13P12L75M32k39j250l22J185P63j98p62r06O11Q94K48n81n72j05M5M66
$$ -979 -666 46 421 853 614 -636 -958 227 990 792 30 -876 -265 629 877 296 -276 -381 -336 130
2307A30M97q63n59K42O53K90k97q1m34J95M87K4k05m89K29L86J39k02l92j97N64
$$ 130 627 -236 -795 -553 100 390 93 12 -422 -227 260 284 79 -410 -181 205 344 142 -250 -447 117
2328A17L83o09L54l32p8N08N03j125k9Q8O74K58m07p72j4N60N13k89m29l51k78
$$ 117 500 -109 245 -87 -165 343 846 -279 -308 -220 454 712 305 -467 -481 79 592 303 -126 -477 -755
2349g55P51N55n59l76l83M68P16M86o86r29J66N44R17j80r81l49J56P24Q08n70
$$ -755 -4 551 -8 -384 -767 -299 417 903 217 -712 -546 -2 915 735 -246 -595 -439 285 1093 523
2369E23r35m89N48Q12O03q64q86m93J080P72J75q59j066l2J382O10n48n59p03
$$ 523 -412 -901 -353 459 1062 198 -688 -1181 -101 671 846 -13 -1079 -1111 271 881 333 -226 -929
2388i29N01P03O85p03j095R0R32L20K53r15r45N78J024L09k31o30o91l13J102
$$ -929 -428 275 960 257 -838 -748 184 504 757 -158 -1103 -525 499 808 577 -53 -744 -1057 45
2407D5J219j090r20K79J25N33N57o08r15M71N00r8M78l16j108N6J170M46r84M34
$$ 45 1264 174 -746 -467 -342 191 748 140 -775 -304 196 98 576 260 -848 -792 378 824 -160 274
2427B74m82m50N82R57o00p32M81m36J37R16j2j314N00M45q43M53J120q16q62O89
$$ 274 -208 -658 -76 881 281 -451 30 -406 -269 647 635 -679 -179 266 -577 -124 996 180 -682 7
2447GL30q06N90L25p29J91Q62q81m21J003m88l76Q71O05j506MQ93p12r0J284p56
$$ 7 337 -469 121 446 -283 -92 770 -111 -532 471 -17 -393 478 1083 -423 -419 474 -238 -328 956 200
2468B00j440R47O24q96Q54N23j425m93J369l91n19J278N0j966J126J114j446l06
$$ 200 -1240 -293 331 -565 289 812 -613 -1106 263 -128 -647 631 681 -1285 -159 955 -491 -797
2486g97J721o30j107J243l5j385J198Q80j337J36J096j603m82K190j29j507P76
$$ -797 924 294 -813 430 395 -990 208 1088 -249 -113 983 -620 -1102 1088 959 -548 228
2503B28L0j571N22J882j104l75J147j039j356J750Q90j493O55Q89j758n15K168
$$ 228 258 -1313 -791 1091 -13 -388 759 -280 -1636 114 1004 -489 166 1055 -703 -1218 950
2520I50n18j118J690j2k349P91J598j640K46K102j602j551J517L96j541J153J672
$$ 950 432 -686 1004 992 -1357 -566 1032 -608 -362 1740 138 -1413 104 500 -1041 112 1784
2537A784k454l53J516r23n14K216o3k503Q11Q46j452J006J946j826j097J648j017
$$ 1784 -670 -1023 493 -430 -944 1272 1209 -1294 -483 363 -1089 -83 1863 37 -1060 588 -429
2554d29j119K431R21k608K69J397j902l58K477j67j775J335Pk508J556K159j667
$$ -429 -1548 883 1804 -804 -535 862 -1040 -1398 1079 912 -863 472 479 -2029 -473 1686 19
2571A9m75J732j638j659K086J193j788J008Q62k780k72K441m73j251K464m97k520
$$ 19 -456 1276 -362 -2021 65 1258 -530 478 1340 -1440 -1712 729 256 -995 1469 972 -1548
2588a548J132J170j507O48K294k266j696K270r8j886K004J216k629J28J266j470
$$ -1548 -416 754 -753 -105 2189 -77 -1773 497 399 -1487 517 1733 -896 -768 498 -972
2604i72k79K734l97k507J700L72k235J069K331j752r93J599q96j549K555Q85k300
$$ -972 -1251 1483 1086 -1421 279 651 -1584 -515 1816 64 -929 670 -226 -1775 780 1665 -635
2621f35M43J130j958k99K690p86j146J390l98k437J561J600j551J66J471j829
$$ -635 -192 938 -1020 -1319 1371 585 -561 829 431 -2006 -445 1155 -396 -230 1241 -588
2637e88j196J892O27j625J453O47k695J35K177q18p55K210r29j926J245J052j604
$$ -588 -1784 108 735 -890 563 1210 -1485 -1350 827 9 -746 1464 535 -1391 -146 906 -698
2654f98O18J629j636j041J762p84j082J985O37j946M1J057j443j31K512o25j786
$$ -698 -80 1549 -87 -1128 634 -150 -1232 753 1390 -556 -515 542 -901 -1032 1480 855 -931
2671i31Q07L72j494J108J499j643k87J312r00j102J769M30j892J199Q61j744n74
$$ -931 -124 248 -1246 -138 1361 -282 -569 743 -157 -1259 510 940 -952 247 1108 -636 -1210
2688a210J861n15n20J480p98j522J063J206j481L96R15j288p27J342J84j075R31
$$ -1210 651 136 -384 1096 298 -1224 -161 1045 -436 -40 875 -413 -1140 202 386 -689 242
2705B42N85j823N78J163p23p61J444j90j270O84K67m64M98O64j167l92R78k95
$$ 242 827 -996 -418 745 22 -739 705 515 -755 -71 196 -268 230 894 -273 -665 313 18
2723A8p25J473j05j569M15R73o81l19P85Q8q05P78m34r64O77R36l56l09N52r62
$$ 18 -707 766 661 -908 -493 480 -201 -520 265 353 -452 326 -108 -1072 -395 541 185 -124 428 -534
2743e34l29J367R9o49N9L26j120P76P64m17p56O46r0k91K95n1n57K59P80m21n61
$$ -534 -863 504 603 -46 13 339 -781 -5 759 342 -414 232 142 -149 146 95 -462 -203 577 156 -405
2764d05N31n55k09J402k5j236n52Q84O24k49M29p96k92L81K87J57l73k59l01O77
$$ -405 126 -429 -638 764 739 -497 -1049 -165 459 210 639 -157 -449 -68 219 376 3 -256 -557 120
2784A20O82m46p53R9K24J29M23l03j052j29J046L36j52o47L8k86R13M60m95o46
$$ 120 802 356 -397 -298 -74 55 478 175 -877 -1006 40 376 224 -423 -385 -671 242 702 207 -439
2804d39j05NJ065L09p64p44J91J011J40l31m98k63p5R17L99o71m41l17P26P04
$$ -439 -544 -539 526 835 71 -673 -482 529 669 338 -160 -423 -498 419 818 147 -294 -611 115 819
2824H19l79o17k02L07L44j26M8m84l22M83N79M6n93k72J67M48K27k3o86j44K57
$$ 819 440 -177 -379 -72 272 146 194 -290 -612 -129 450 496 -97 -369 -202 246 473 450 -236 -380 -123
2845a23N37L70l35r59l8P15L94l68n77K01J61J47K64k30m35J49N2O14l82j79l67
$$ -123 414 784 449 -510 -548 167 561 193 -384 -183 -22 125 389 159 -276 -127 -75 539 157 -22 -389
2866c89K50M60j51k42k23j02N64J32J83o66j62K57L52J86j44p75K00O62L21k83
$$ -389 -139 321 170 -72 -295 -397 167 299 482 -184 -346 -89 263 449 305 -470 -270 392 713 430
2886D30n78m93M28P41K3m08p37L3N23N96L01q86p47M66Q35l0l94o15k95N82Q12
$$ 430 -148 -641 -213 528 551 143 -594 -561 -38 558 859 -27 -774 -308 527 497 103 -512 -807 -225 587
2907E87K51r82o69O15M79O75l94p36p85P83R80k14r9p57o12N13J325k03r95n76
$$ 587 838 -144 -813 -198 281 956 562 -174 -959 -176 804 590 491 -266 -878 -365 960 757 -238 -814
2927h14J30M45J133l47r12n88P41O26j6L1r58l83J025R42n31p04j55k02L76J233
$$ -814 -684 -239 894 547 -365 -953 -212 414 398 429 -529 -912 113 1055 524 -180 -335 -537 -161 1072
2947A072k87j485l37J137K7M34M3j110m46J247lk93M27n01q87P51J062o50q12
$$ 1072 785 -700 -1037 100 127 561 604 -506 -952 295 292 -1 426 -75 -962 -211 851 201 -611
2966f11N73M25p01P59k97j073O33J003o08K99J5j013n22J701L56j209K40M06q81
$$ -611 -38 387 -314 445 148 -925 -292 711 103 402 417 -596 -1118 583 939 -270 -30 376 -505
2985e05P2J351r33n83R65l55n55K81O52j130P18Q44j009p39J126m1p06R60M14
$$ -505 -433 918 -15 -598 367 12 -543 -262 390 -740 -22 822 -187 -926 200 159 -547 413 827
3004H27j720K16J424q00n08J207j82j007O28L81j351R91P68q87l87J151j141n51
$$ 827 -893 -677 747 -53 -561 646 464 -543 85 466 -885 106 874 -13 -400 751 -390 -941
3022i41J705L85j508J31M91j217L66J730r36j108J090j78j166J259J088j402k40
$$ -941 764 1149 -359 -228 263 -954 -588 1142 206 -902 188 10 -1156 103 1191 -211 -451
3039d51J424j406j98J166j92j015J349M73k086L26J162o63l93J714p44k000J260
$$ -451 973 -433 -631 535 343 -672 677 1150 -936 -610 552 -111 -504 1210 466 -1534 -274
3056b74P04p82Q84P67j997n97J965o22o38J276M51k032L46J124j145O5J590j001
$$ -274 430 -352 532 1299 -698 -1295 670 48 -590 686 1137 -895 -549 575 -570 -505 1085 84
3074H4q02J026J41j318Q44J162j475j14J089j146o26J764L85j387P43K52k054
$$ 84 -718 308 449 -869 -25 1137 -338 -452 637 -509 -1135 629 1014 -373 370 622 -1432
3091a432N92K150j000q16J123n10j527J622R06j437N06O65j460n08J975m16j119
$$ -1432 -840 1310 310 -506 617 107 -1420 202 1108 -329 177 842 -618 -1126 849 433 -686
3108f86J368n1j664M82J522j114q8J468j330j140J532K21j378J328R84k055o37
$$ -686 682 631 -1033 -551 971 -143 -231 1237 -93 -1233 299 520 -858 470 1454 -601 -1238
3125a238J625k23q47J674n2j687M81O20j111N83J545j268j101J305l46j023J513
$$ -1238 387 164 -683 991 939 -748 -267 353 -758 -175 1370 102 -999 306 -40 -1063 450
3142D50N35j422L09O37j158k14J804o16j350J165M14j511L17J429q24n59J265
$$ 450 985 -437 -128 509 -649 -863 941 325 -1025 140 554 -957 -640 789 -35 -594 671
3159F71q41p81J336K88j350P32Q06j531k85J637n6j254J161K23j488L70Q20p61
$$ 671 -170 -951 385 673 -677 55 861 -670 -955 682 626 -628 533 756 -732 -362 458 -303
3177c03L11R74j053q13J014K19p81P15M40j425R7R96p39j15J115j54j278P12N42
$$ -303 8 982 -71 -884 130 349 -432 283 723 -702 -605 391 -348 -463 652 498 -780 -68 474
3196D74q79M46O20n53n55R34m02j083J442J80q18k33J142j250k74J279J06r67
$$ 474 -405 41 661 108 -447 487 85 -998 444 624 -194 -427 715 -535 -809 470 576 -391
3214c91N59j37o59O90N41q44K4P12q57n29J041N59j285O00O81q35k62Q62m16j42
$$ -391 168 31 -628 62 603 -241 -217 495 -362 -891 150 709 -576 24 705 -130 -392 470 54 -88
3234h8M43n7m29K39K05q34N85M45n07j32Q0J22m79M47M49j003j4P32j89k49K28
$$ -88 355 298 -131 108 313 -521 64 509 2 -130 -50 72 -407 40 489 -514 -528 204 15 -234 -6
3255fJ08k20jJ28j19L58O4o23J07P05p62j38Q15K12q15l4R3J44K16J28l11K9J64
$$ -6 102 -118 -119 9 -110 248 312 -311 -204 501 -261 -399 416 628 -187 -221 -128 16 232 360 49 78 242
3278B42m23L0K59k68l08L15M05l31l09K97J40k27j6N66m28m41M20J66K04J56r39
$$ 242 -181 -151 108 -160 -468 -153 252 -79 -388 -91 49 -178 -194 372 -56 -497 -77 89 293 449 -490
3299d90J16L19L15r3l51J69l88K97K76K56q55j08N68K88j20j75m05K9M00J41J71
$$ -490 -374 -55 260 167 -184 -15 -403 -106 170 426 -429 -537 31 319 199 24 -381 -352 48 189 360
3320C60m93Q5l26O23J89o43m2j19L50K19j43l37j3K2L15J41Q4l99m08P01R6K34
$$ 360 -133 -48 -374 249 438 -205 -247 -366 -16 203 60 -277 -290 -268 47 188 272 -127 -535 166 262 496
3342D96m51l73K42Q4K75jl17n29K91K17K19k71O8j48M74l5Nl04P7K3L88k59L7
$$ 496 45 -328 -86 -2 273 272 -45 -574 -283 -66 153 -118 -50 -198 276 241 246 -58 19 42 430 171 208
3365B08k37l35M29L20k97Mm86J77M15M2j76l21J43J84J22J90n66l69N68N1j0k07
$$ 208 -29 -364 65 385 88 92 -394 -217 198 240 64 -257 -114 70 192 382 -184 -553 15 66 56 -151
3387a51p2k12N03K85j04k71n85N38K19L41k61o43M23R4J56j2l85l26J68O38K1
$$ -151 -223 -435 68 353 249 -22 -607 -69 150 491 230 -413 10 104 260 248 -137 -463 -295 343 364
3408C64k11m52o7J47M99J06n40l39M25L82j37j38Pm08J01Q46k91m63k89M53J46
$$ 364 153 -299 -366 -219 280 386 -154 -493 -68 314 177 39 46 -362 -261 585 294 -169 -458 -5 141
3429A41K55K44j059k62P08K61P6o2p90m4N12P80m71o82O8J74N0Q91n45p49N6K49
$$ 141 396 640 -419 -681 27 288 364 302 -488 -532 -20 760 289 -393 -325 -151 -101 790 245 -504 -448 -199
3451a99M14R2j6r57j54J142L99q24m7j65j78N68Q15r44m54r5N68L50L78n77r35
$$ -199 215 307 291 -666 -820 322 721 -103 -150 -315 -493 75 890 -54 -508 -603 -35 315 693 116 -819
3472h19N01O54j40r5L1o94k42J282J79j075K29Oj98K98O13o65p90J161k3j08J99
$$ -819 -318 336 196 101 132 -562 -804 478 657 -418 -189 -183 -381 -83 530 -135 -925 236 213 105 304
3493C04k83o18J50J319o04m96M62n08k54P75O62j336k52R19n04J20M98m70j90
$$ 304 21 -597 -447 872 268 -228 234 -274 -528 247 909 -427 -679 240 -264 -144 354 -116 -306
3512c06M31L04j208N41L43l84K46R83q67r85R33M49o89P21j5j167L18P73j24p52
$$ -306 125 429 -779 -238 105 -279 -33 950 83 -902 31 480 -209 512 497 -670 -352 421 297 -455
3532d55R03m63n54P01L80r18K19R16o87k79K75j55q58J121R13j382j7N88n00j8
$$ -455 448 -15 -569 132 512 -406 -187 729 42 -237 38 -117 -975 146 1059 -323 -340 248 -252 -270
3552b70J199m83j086M22N73q57P21O01j194k0J159o12j009R51M64q08M47M20r87
$$ -270 929 446 -640 -218 355 -502 219 820 -374 -394 765 153 -856 95 559 -249 198 618 -369
3571c69k40P51j6k68J003q87j401Q16J428o04m01N32p09l94J282N4j110O30K79
$$ -369 -609 142 126 -142 861 -26 -1427 -611 817 213 -188 344 -365 -759 523 577 -533 97 376
3590C76j031K23J269j207j43J152j70r16L67Q6r29J030J109j097p30Q97l26n71
$$ 376 -655 -432 837 -370 -513 639 469 -447 -80 6 -923 107 1216 119 -611 286 -40 -611
3608f11Q61L60j159L50N63r63M27R30m52p18Q80j97j061N90R28j163Q4R21o40
$$ -611 250 610 -549 -199 364 -599 -172 758 306 -412 468 271 -790 -200 728 -435 -351 570 -70
3627g0p02J094M1o06P63K19j423J35J336q41k46Q67l59r21N31O06p59L23P22p89
$$ -70 -772 322 363 -243 520 739 -684 -549 787 -54 -300 567 208 -713 -182 424 -335 -12 710 -79
3647g9o07J070j59r92J290j2r24J01N78o43M9J010n74q52Q49J25q18N66J077j203
$$ -79 -686 384 225 -767 523 511 -413 -312 266 -377 -328 682 108 -744 105 230 -588 -22 1055 -148
3667a48o35J101m56k53N59L77r80J97M28p93K18J084n39n27O41N4q39M65P98q25
$$ -148 -783 318 -138 -391 168 545 -435 -238 190 -603 -385 699 160 -367 274 328 -511 -46 752 -73
3687g3P9N08m80n46Q52j91m40M08K58o92J94N36q03Q5Q79l47q37O03K16o75J78
$$ -73 6 514 34 -512 340 149 -291 117 375 -317 -123 413 -390 -305 574 227 -610 -7 209 -466 -288
3708b88J004p70m69N17J02l31K86M16o72L47J51p31L04N87l68n30L21M17o68N37
$$ -288 716 -54 -523 -6 96 -235 51 467 -205 142 293 -438 -134 453 85 -445 -124 293 -375 162
3728A62M27p83Q7M38l35k76O84j06n88K66K42k78j29N40k79m10P38l47m90M80
$$ 162 589 -194 -107 331 -4 -280 404 298 -290 -24 218 -60 -189 351 72 -338 400 53 -437 43
3748D3L08k99J04O3k05j79L72J8j69J25J68p41J64N90l85j27K61j57l82K83K02
$$ 43 351 52 156 219 14 -165 207 225 56 181 349 -392 -228 362 -23 -150 111 -46 -428 -145 57
3769E7l40L40J24k34p0L33m79j09M93n6k68L17K2j27l15N76j3m27J00J45k2n5
$$ 57 -283 57 181 -53 -123 210 -269 -378 115 59 -209 108 130 3 -312 264 251 -176 -76 69 47 -8
3791hK3k00K52k2k21J79K00j00k87L99j29l73o3O06j00k59K38K6m45J30J49O6
$$ -8 15 -185 67 45 -176 3 203 103 -184 215 86 -287 -350 256 156 -103 135 161 -284 -154 -5 61
3813F1J12k2Ok33L50j53J0K1j44j7p8J42J04k96j6J57L81r6m80J00R9L7L0L4k35
$$ 61 173 151 157 -76 274 121 131 152 8 -9 -87 55 159 -137 -153 4 385 289 -191 -91 8 45 75 109 -126
3838a26J84k21L0L29k53l49M60k9L56N6k04l04L8K26j12l3p4l2j39L05M82o89
$$ -126 58 -163 -133 196 -57 -406 54 25 381 437 233 -71 -33 193 81 48 -26 -58 -197 108 590 -99
3860i9J69j50K85j91o0k32K41K4j43J32q4m4j59K53K00m20M45m8j13j01N65k98
$$ -99 70 -80 205 14 -46 -278 -37 -13 -156 -24 -108 -152 -311 -58 142 -278 167 119 6 -95 470 172
3882A72o8l80K95J86jJ5m54P5R0N1j48L91k91N7J03J23k85J20k12p5K08q5J49
$$ 172 104 -276 19 205 204 219 -235 -160 -70 -19 -167 224 -67 -10 93 216 -69 51 -161 -236 -28 -113 36
3905C6o0j45L65j60R6k3l93L22K74l4j54q6O3j26j35K23m0k60L29j14j21L76l76
$$ 36 -24 -169 196 36 132 109 -284 38 312 278 124 38 101 -25 -160 63 23 -237 92 -22 -143 233 -143
3928a43k18L59J78m69j4K39N0j43K36J79o88M01M14m02J36J01j71m64N86k5k79
$$ -143 -361 -2 176 -293 -307 -68 -18 -161 75 254 -434 -33 381 -21 115 216 45 -419 167 142 -137
3949a37K82j27k53P21k55n03J5L60J43l29K47j14m65K29N44j91j09m0j84K82M01
$$ -137 145 18 -235 486 231 -272 -257 103 246 -83 164 50 -415 -186 358 167 58 18 -166 116 517
3970E17j64o97J92K80j82J82J46n35M7M56J24o34J57J62l39K72L24m81j30L26
$$ 517 353 -344 -152 128 -54 128 274 -261 -214 242 366 -268 -111 51 -288 -16 308 -173 -303 23
3990B3L1Q7J93l92p46N53O55k38l64O38n89n13Q45K39n46k37N94k41p7L51m13
$$ 23 54 141 334 -58 -804 -251 404 166 -198 440 -149 -662 183 422 -124 -361 233 -8 -85 266 -147
4011a47m49Q51M36o53L0m9l19k6P78q1n75r0L71m42L63M64p54k4N59l60l20R05
$$ -147 -596 255 691 38 68 19 -300 -326 452 371 -204 -294 77 -365 -2 462 -292 -316 243 -117 -437 468
4033D68n60k79K49N30p91l6O79k78p1N87l71q98N84M53l66K50J86p17o8J038l19
$$ 468 -92 -371 -122 408 -383 -419 260 -18 -89 498 127 -771 -187 266 -100 150 336 -381 -449 589 270
4054B70l45J12N89j009K01N65n56m45J220q6q26L32R2m50M14M56p75l2M90l18
$$ 270 -75 37 626 -383 -182 383 -173 -618 602 516 -310 22 114 -336 78 534 -241 -273 217 -101
4074a01l02Q43Nj001L05Q92n24n10Q62k19o22N91j84m35K01P73j003L51L81p45
$$ -101 -403 440 445 -556 -251 641 117 -393 469 250 -372 219 35 -400 -199 574 -429 -78 303 -442
4094d42j47P71J37n35L88k07n62L56J162n27p68O51j09l01L72O1n42K35M65o37
$$ -442 -589 182 319 -216 172 -35 -597 -241 921 394 -374 277 168 -133 239 300 -242 -7 458 -179
4114a79Q9L33l05n05J167L15j239m03O70k93J70N81j47r08L87L80j35L21M60r79
$$ -179 -90 243 -62 -567 600 915 -324 -727 -57 -350 -180 401 254 -654 -267 113 -22 299 759 -220
4134b20n80J219p1n36M44p7m01O28J00r77L05P79n76j33K56k37o47P01N15o00
$$ -220 -800 419 348 -188 256 179 -222 406 506 -471 -166 613 37 -96 160 -77 -724 -23 492 -108
4154a08J46J09n66j68J001k30n66O59m3o56J64N28m92K1M21m0n80N12N5m30M00
$$ -108 38 147 -419 -587 414 184 -382 277 234 -422 -258 270 -222 -201 220 180 -400 112 167 -263 137
4175A37k1j28l18N46j68k06N04jo31k9K51KJ15K30k68o28P50Nj13k30L97k41J1
$$ 137 116 -12 -330 216 48 -158 346 345 -286 -315 -64 -62 53 283 15 -613 137 142 29 -201 196 -45 -34
4198c4L98l83l46M30L63l56j39K28l38J90N05n88k8K66k17k45L16J42m23lN18
$$ -34 364 -19 -365 65 428 72 -67 161 -177 13 518 -70 -98 168 -49 -294 22 164 -259 -262 256
4219B56m54j33L58R8k53N4K05l76R0M16n59L78K98k01l63J49K00l17J90K33j96
$$ 256 -198 -331 27 125 -128 -74 131 -245 -155 261 -298 80 378 177 -186 -37 163 -154 36 269 73
4240G3m25M48m5j04M15k13l64j8L35l79K72O6p4m1J19j86k09J74L44l19J92P8
$$ 73 -352 96 51 -53 362 149 -215 -233 102 -277 -5 61 -13 -54 65 -121 -330 -156 188 -131 61 139
4262A39k1k58J51K60n74M38l6k77J59K38o8m31M50r9m20N62ml70k08K96j36N0
$$ 139 118 -140 11 271 -303 135 99 -178 -19 219 151 -280 170 71 -349 213 209 -161 -369 -73 -209 -159
4284a59K29QJ41l74M2n9K38K0R3m47M34k66m2p3L86k81J49K10k53M0k15J78N2
$$ -159 70 78 219 -155 -113 -172 66 86 179 -268 166 -100 -142 -215 171 -110 39 249 -4 36 -179 -1 51
4307E1Q4R4m84L16O9m49L85l6o6k00M52n20J00J25r8J02J07k10K2J09J67m8l35
$$ 51 135 229 -255 61 130 -319 66 30 -36 -236 216 -304 -204 -79 -177 -75 32 -178 -156 -47 120 72 -263
4330b63N9M2K36Np2Kj46L30k21J58j89J37J2j14K9K3J62k95N3m5O9j89L95l69
$$ -263 -204 -162 74 79 7 9 -137 193 -28 130 -59 78 90 -24 5 28 190 -105 -52 -97 -28 -217 178 -191
4354a91J80j15m7K79j27K21j53J4Mj31J35J55j86p4l1o8L06j17l5J61J8R8k12
$$ -191 -11 -126 -173 106 -21 200 47 61 65 -66 69 224 38 -36 -67 -135 171 54 19 180 198 296 84
4377H4K0N2J5j16k89j5R3K39p0k90L21j63J65j32K78j71P5j05K0O7O8k0k4j22
$$ 84 104 156 171 55 -234 -249 -156 83 13 -277 44 -119 46 -86 192 21 96 -9 11 78 146 126 102 -20
4401b0Q6p2Q6mj70K50n1j00N6j25j32Q0j58K93j0q2L3j25L48K17l17j15l84L95
$$ -20 66 -6 80 76 -94 156 105 5 61 -64 -196 -116 -274 19 9 -73 -40 -165 183 400 83 -32 -416 -21
4425b1J48RK1l68K22K13k88q9K55l1KJ63k28p7l5L09k99J46j59J18n8M3j34Nj6
$$ -21 127 136 157 -211 11 224 -64 -153 102 71 73 236 8 -69 -104 205 -94 52 -107 11 -47 -4 -138 -133 -149
4450a49K08m53N28L9k22J46K2J60m25L87L9n68J05K96P8j0j12J75l46L90N5n59
$$ -149 59 -394 134 173 -49 97 119 279 -146 241 280 -288 -183 113 191 181 69 244 -102 288 343 -216
4472b16J79R4R8m41L37j3p0o5L92l55K3M1k12J22L20L5k79O0N7j75M81k75k16
$$ -216 -37 57 155 -286 51 38 -32 -97 295 -60 -37 4 -208 -86 234 269 -10 50 107 -68 413 138 -78
4495g8MK73m63K21q4K65l26J43J97m80L02J4mjJ90k41l06M68r1j09j61J83o5j29
$$ -78 -74 199 -264 -43 -127 138 -188 -45 152 -328 -26 -12 -16 -17 173 -68 -374 94 3 -106 -267 -84 -149 -278
4519b78M75l8k66L23k14m31M66K65l08l82N31J04m20M18k19k28J80L34n13K07
$$ -278 197 159 -107 216 2 -429 37 302 -6 -388 143 247 -173 245 26 -202 -22 312 -201 6
4539Fk1k8j68N01q3l74k2M27l50J87J53j73n46N43Q6k69R4J54l05J20K70j71k41
$$ 6 -15 -43 -211 290 207 -167 -189 238 -112 75 228 55 -491 52 138 -131 -37 117 -188 -68 202 31 -210
4562b10O68r8n05O25l00n18K08N89n09pM15n22m65R74Lo26K52K4k00j07K91J08
$$ -210 458 360 -145 480 180 -338 -130 459 -50 -57 358 -164 -629 345 348 -278 -26 -2 -202 -309 -18 90
4584I0m4P8p5l43L61J84m04KP22l79n55P53m02O1K9L36q29K77K52j60k46O71l93
$$ 90 46 124 49 -294 67 251 -153 -151 571 192 -363 390 -12 49 78 414 -415 -138 114 -46 -292 379 -14
4607a4j50L16j89m02L55N00l47j69M79l55l93K35L94k18K6L33n32J68J16q1m80
$$ -14 -164 152 -37 -439 -84 416 69 -100 379 24 -369 -134 260 42 68 401 -131 37 153 72 -408
4628d08L95J62k17N7M64n01k09N36k39m00O02k42k78L10K20k27l62M51m8j17L95
$$ -408 -13 149 -68 -11 453 -48 -257 279 40 -360 242 0 -278 32 252 25 -337 114 66 -51 344
4649C44j61n70J48M07l64J10L37k55l77O06q2l89L10J08k36J94Q0m65j17L78R
$$ 344 183 -387 -239 168 -196 -86 251 -4 -381 225 143 -246 64 172 -64 130 210 -255 -372 6 15
4670A5m27L39J33m62M29K56l48k89O53j77k92L86P1n34L95l5l15L19K35l50l62
$$ 15 -412 -73 60 -402 27 283 -65 -354 299 122 -170 216 287 -247 148 113 -202 117 352 2 -360
4691c60N45J37n63N9K68j22J76J11m02j62N48k82j08K15L13o70J15N49l26l6K91
$$ -360 185 322 -241 -182 86 -36 140 251 -151 -313 235 -47 -155 60 373 -297 -182 367 41 5 296
4712B96m37p5M02P4k20Q9M2j17l54N22l39m1K58J76m65J54K41k37m4M48k42Q0
$$ 296 -141 -216 186 260 40 129 171 54 -300 222 -117 -158 100 276 -189 -35 206 -31 -75 373 131 211
4734B11j69q1j90L16l5j2k3j26K08l65J76R6o6k4l3J7r2L73j10n9N5Jl85Q3L22
$$ 211 42 -39 -229 87 52 40 17 -109 99 -266 -90 6 -60 -84 -117 -100 -192 181 71 12 67 68 -317 -234 88
4759H8k00L50k89k8j12L32j57K95j81K50n26K52M0k89J76q8Qn5L4j29J72J44r9
$$ 88 -112 238 -51 -79 -191 141 -16 279 98 348 -178 74 114 -175 1 -87 -79 -134 -100 -229 -57 87 -12
4782a2K67l46L1M0J21l2K3l63K77p6N8j70N10k49Q1N1l20L37k37K68k37j38K34
$$ -12 255 -91 -60 -20 101 69 92 -271 6 -70 -12 -182 328 79 160 211 -109 228 -9 259 22 -116 118
4805A18L0j06o9p2NM24l8J35n37K80l85o2L36j10n3K58l11K41k59J21n0j5K43
$$ 118 148 42 -27 -99 -94 330 292 427 -110 170 -215 -277 59 -51 -104 154 -157 84 -175 -54 -104 -119 124
4828A24j51N9j42J36m0%P9r2j15K7J5R1J27j44j69K46M5j60J52j23k68J00M22
$$ 124 -27 32 -110 26 -14 -14 65 -27 -142 -115 -100 -9 118 -26 -195 51 96 -64 88 -35 -303 -203 219
4851B19k09J0J02j52j91L42J76l19j70J97N3m8j19N1l0K46Ol29k4K61N6l77N33
$$ 219 10 20 122 -30 -221 121 297 -22 -192 5 58 10 -109 -58 -88 158 164 -165 -189 72 128 -249 284
4874B84k57j00J88O2j56l1J4j6k99N89j09j0k11Q3Jl9o4L3J82k69M3L70j48j70
$$ 284 27 -73 115 177 21 -10 4 -12 -311 278 169 159 -52 31 32 -7 -71 -38 144 -125 -82 288 140 -30
4898c0j4K7P3l36L4L38j33P2J07K3k43Q1or9J12L7n1k04M27J7j0j30j94M6j6J84
$$ -30 -44 -17 56 -280 -246 92 -41 31 138 161 -82 -1 -7 -106 6 43 -8 -212 215 232 222 92 -102 -56 -72 112
4924A12M3j13j17K01l3m1l8J03k54Q1K78l30J10n3R8N2k43J75j57K19p1j71L26
$$ 112 155 42 -75 126 93 52 14 117 -137 -56 222 -108 2 -51 47 99 -144 31 -126 93 22 -149 177
4947A77j62j67J48J89k16L13j74O6j07K00k13J95l28R1j54p8J97l49R2L47j34
$$ 177 15 -152 -4 185 -31 282 108 174 67 267 54 249 -79 12 -142 -220 -23 -372 -280 67 -67
4968f7j84J16J65k64J32r0L31m01K08K42j16o6m5k18K46K14k26kJ84j37j36O3
$$ -67 -251 -135 30 -234 -102 -192 139 -262 -54 188 72 6 -39 -257 -11 203 -23 -25 159 22 -114 -51
4990e1J35k78O8j2p1L03K40m60L9R3l05L91k88K57k57L09O0j46l61M55J03l16
$$ -51 84 -194 -126 -138 -209 94 334 -126 -87 6 -299 92 -196 61 -196 113 173 27 -334 121 224 -92
5012i2Q0L68m98O1M04l69J16K57l12O9l5K5m2j50K05j97j61K63N4p6l5M4R5j29
$$ -92 -12 356 -142 -81 323 -46 70 327 15 84 49 74 32 -118 87 -110 -271 -8 46 -30 -65 -21 74 -55
5036e5J2J65j35L9j85k11M16%K8l5K61m60j03L43o3j55K32L0j62K53m4R6n10M78
$$ -55 -43 122 -13 26 -159 -370 46 46 74 39 300 -160 -263 80 17 -138 94 124 -38 215 171 267 -243 235
5060B35j75m22N94o01K01M94k94j72L2j02n9L55r1L7m25J64N50l36K4R2m31K60
$$ 235 60 -362 232 -369 -168 326 32 -140 -108 -210 -269 86 -5 32 -393 -229 321 -15 9 101 -330 -70
5082g0L08j70m62M07J20j93J22L30m12k40M61j19k69L70q0m43K80K79k56k09J85
$$ -70 238 68 -394 13 133 -60 62 392 -20 -260 201 82 -187 183 103 -340 -60 219 -37 -246 -61
5103f1j5j89L60K56m62L21j18j02q7L74k19k08K45Rl68L63O9n49K59M76k00n45
$$ -61 -76 -265 95 351 -111 210 92 -10 -97 277 58 -150 95 104 -264 99 168 -381 -122 354 154 -391
5125c91K50J26j53J22J28o70P00M6Kk32N43l18m19M57j5k00L09J9k42k07K81k06
$$ -391 -141 -15 -168 -46 82 -588 112 158 160 -72 471 153 -266 191 176 -24 285 304 62 -145 136 -70
5147g0n01P22Nk54L1Rl11O54N0l20k48L89L8m09J40K2P9J26K05k26m08L30r5j43
$$ -70 -571 151 156 -98 -67 -58 -369 285 335 15 -233 156 194 -215 -75 -53 26 152 357 131 -277 53 -42 -185
5171a85M40j77j58JR1o7K45J03j23l24L67m48K58N3K5j49p0P8Mk59J50J32l4K46
$$ -185 255 78 -80 -79 12 -55 190 293 170 -154 213 -235 23 76 101 -48 -118 -40 -36 -295 -145 -13 -47 199
5195A99m33J89P4N8%j21J52j90q1J84j82l5K17P4q6O4J5q7j43K42J29m38J84K23
$$ 199 -234 -45 29 87 87 -34 118 -72 -153 31 -151 -186 31 105 19 83 98 11 -132 110 239 -199 -15 208
5219B08l20K15J32j70k73l5K55l53J77K44j59K6J04O5k72M17j43l03M63j27j74
$$ 208 -112 103 235 65 -208 -243 12 -341 -164 80 -79 -53 51 116 -156 261 118 -185 278 151 -23
5240b3J01K8k40J73J20Rm56L24Nj93qJ96j9j85L71j21j43J6K2J05j75K98m49J70
$$ -23 78 106 -134 39 159 168 -288 36 41 -152 -160 36 17 -168 203 82 -61 -45 -23 82 -93 205 -244 -74
5264g4mL26m75J82K72k35J03j41o0j21N04o8l66J45r2L26j54R3k41j94L0L22k05
$$ -74 -78 248 -227 -45 227 -8 95 -46 -106 -227 277 209 -157 -12 -104 222 68 161 -80 -274 -244 78 -127
5287a27K29j0l31M4J20J69j71J12j63L2j1J04l68L17M05k34p3K00j99n7N6k0N4
$$ -127 102 92 -239 -195 -75 94 -77 35 -128 -96 -107 -3 -371 -54 351 117 44 244 45 -12 44 24 78
5310G8j10J3K06q5l2K14l11L42k88N0J05k97J22n9k81N74l18J89k3J3j27k7M7
$$ 78 -32 -19 187 102 70 284 -27 315 27 77 182 -115 7 -52 -333 241 -77 112 89 102 -25 -52 -5
5333ej71J89Q4k03L62j23l60J18J53k37L19k25oJ46J09l29J37O1J2M9J3j23Q0
$$ -5 -176 13 97 -106 256 133 -227 -109 44 -193 126 -99 -105 41 150 -179 -42 19 31 80 93 -30 50
5356E0K7j66O2j31Q1J57R0o8r4J57n3q7n9J95N1k5k23J8J17n6k0O3m10R7K87j31
$$ 50 77 -89 -27 -158 -77 80 170 102 8 165 112 25 -34 161 212 187 -36 -18 99 43 23 86 -324 -227 60 -71
5382g1J31J26l11J98k0K7Q7k86K63l3k54J1J01r3O7P9L86o16J48R1m7L4j42K47
$$ -71 60 186 -125 73 53 80 167 -119 144 111 -143 -132 -31 -124 -57 22 408 -208 -60 31 -16 18 -124 123
5406A23j9j66m9K75j85P1j07L35l75Q0j26P3k5J46pk21R4K62j2P1k07K7j65J08
$$ 123 104 -62 -111 164 -21 50 -57 278 -97 -17 -143 -70 -95 51 44 -177 -83 179 167 238 31 58 -107 1
5430Am9J60l8K77k65o4p9J4K00J11k05O3j06K14k39j24o7K62j05J99N2k68j08
$$ 1 -48 112 74 351 86 22 -57 -43 157 268 63 126 20 234 -5 -129 -196 66 -39 160 212 -56 -164
5453a64PK17k3j67M8J44K2m4j05K17J47m16J24k3L11l70r3O11m77J52k78m3L54
$$ -164 -157 60 37 -130 -82 62 84 40 -65 152 299 -117 7 -16 295 -75 -168 443 -34 118 -160 -203 151
5476A51j12k50J25K13p7k84J71J50j08j46Q7J5l21L49K45l79L8L47k2rJ59m98
$$ 151 39 -211 -86 127 50 -234 -63 87 -21 -167 -80 -65 -386 -37 208 -171 -133 214 192 183 342 -156
5498a56J47n8Qo4k8L09j76j7J41K3l66L23J14m84K07R1L9m6j26O7N9L15l21q2
$$ -156 -9 -67 -59 -123 -151 158 -18 -35 106 129 -237 86 200 -284 -77 14 53 7 -119 -52 7 322 1 -81
5522h1j7K56k53J51J30l39j34L17k05J62r7J99J8R3J94l78r4N6l9k00M76m21K2
$$ -81 -98 158 -95 56 186 -153 -287 30 -175 -13 -110 89 107 200 394 16 -78 -22 -61 -261 215 -206 -184
5545a84J01J87k85j10N50k59k27J89O3k56J92J30j58K63j78k51L04L6o4o5K90
$$ -184 -83 104 -181 -291 259 0 -227 -38 25 -231 -39 91 -67 196 18 -233 71 107 43 -22 268
5566B68l02N7m5j79J18j98M55j51j52N10l14j03Q6n5J56j59n3j73J91KJ97m35
$$ 268 -34 23 -22 -201 -83 -281 174 23 -129 381 67 -36 50 -5 151 -8 -61 -234 -43 -41 156 -279
5588b79M16J28l36K03o3j97p7M17k33k38K35N5O1L9l1N4m06M38j49k23K17q9j10
$$ -279 137 265 -71 132 69 -128 -205 212 -21 -259 -24 31 92 131 100 154 -252 186 37 -186 31 -58 -168
5611a68J58O9m37M68M3N7l57K45J8l47M27J79l96rR1l11K54K81k50k51J96K07
$$ -168 -10 59 -378 90 133 190 -167 78 96 -251 176 355 -41 -50 41 -270 -16 265 15 -236 -40 167
5633A67k28m6J98m07L62K55j06l93J09J39k20o0M83k69l23K22K62j72J61J17k80
$$ 167 -61 -107 91 -316 46 301 195 -198 -89 50 -170 -230 253 -16 -339 -117 145 -27 134 251 -29
5654b9q9K41n7r0L35k35k17K07q4l0j51J76k70K72J44k17k67M40J38m00J15mk
$$ -29 -118 123 66 -24 311 76 -141 66 -18 -48 -199 -23 -293 -21 123 -94 -361 79 217 -183 -68 -72 -74
5677g4j19L68j87m73N09J18l52J11L2q1j27L23J24k84O1K61l28J44J21k92N9K21
$$ -74 -193 175 -12 -485 24 142 -210 -99 -67 -148 -275 48 172 -112 -51 210 -118 26 147 -145 -86 135
5699A35Nq8r0k8k68J64L46j28j10m3j67J69j40Q0L9j94M42k05J92k94P1m2J62
$$ 135 140 52 -38 -66 -334 -170 176 48 -62 -105 -272 -103 -243 -163 -124 -318 124 -81 111 -183 -112 -154 8
5722Hj26K35n3lk70K78j28j44J68J56j01m40M67r4k72K21K28j09j63R3J1jL55
$$ 8 -118 117 64 61 -209 69 -59 -203 -35 121 20 -420 47 -47 -319 -98 130 21 -142 -49 -38 -39 316
5745C16n46J28J2l1K0j65L82j69J26n2o8oJ08K30j60r4Q3j71p8K72J20m45M53
$$ 316 -230 -102 -90 -121 -101 -266 116 -53 73 21 -47 -53 55 285 125 31 114 -57 -135 137 257 -188 265
5768B65j12l35J19J47k27J13J52j23L6K01j79j82J70j23J27P9K18m41J45O6M7
$$ 265 153 -182 -63 84 -143 -30 122 -1 35 236 57 -125 45 -78 49 128 346 -95 50 116 163
5789A63M1j88J51j85J40j25n6jr0O6l44N52j71k00L0K14K1j60J28J06m28L82r2
$$ 163 204 16 167 -18 122 -3 -59 -60 -150 -84 -428 124 -47 -247 -217 -3 18 -142 -14 92 -336 46 -46
5812d6N1J85k23l4L3rK40j50k34K99m1j71K9K21l2k90K20j18p5J05J47l07J40
$$ -46 5 190 -33 -67 -34 -43 197 47 -187 112 71 -100 -71 150 118 -172 48 -70 -145 -40 107 -200 -60
5835f0J49n7K22k06j80J87j65j91J58n4J72L0J57k62j64L34j40o2J07p3L58k33
$$ -60 89 32 254 48 -132 55 -110 -301 -143 -197 -25 5 162 -100 -264 70 -70 -132 -25 -98 260 27
5857B7p2J14J53k31j51K74q7m3K76m10K36n5J85j55K34j43k85J97k94J20L23r1
$$ 27 -45 69 222 -9 -160 114 27 -16 260 -150 86 31 216 61 295 152 -133 64 -230 -110 213 122
5879A22j41M25m89m0J41J39l34K54p1j41o4L28j62j12L17j11j17O1n7L0n5j5k6
$$ 122 -19 406 -83 -123 18 157 -177 77 6 -135 -199 129 -33 -145 172 61 -56 5 -52 -22 -77 -92 -118
5902a18L84j70R4J7k84L31k19j20J58l06J26R9Mj0J38r8j01K40K7l08K16k1J4
$$ -118 266 96 190 207 -77 254 35 -85 73 -233 -107 -8 -4 -14 124 26 -75 165 192 -116 100 79 93
5925I3q8L4L5N7k19J88mk25J50L8K4j82K20p4J36j68j63K82O0m34J32Q9L21m08
$$ 93 5 39 74 131 -88 100 96 -129 21 59 83 -99 121 47 183 15 -148 134 194 -240 -108 -19 302 -106
5949a06P2o0n7N5k3J78l5rJ66k53L35k30l9K1j3M5L8k7n3k2M5p5J66Jl4J09j75
$$ -106 -34 -94 -151 -96 -119 59 24 15 181 -72 263 33 -6 15 2 47 85 58 5 -17 28 -47 119 120 86 195 20
5976B0j77K84l81M20Rk03p2L88l77L1K3J49k92P7K52l80K03k5M5J0J5n2j19K14
$$ 20 -157 127 -254 166 175 -28 -100 288 -89 -58 -35 114 -178 -101 151 -229 -26 -51 -6 4 19 -33 -152 62
6000F2K92n27L2K87j53J09m1J16k32m6j11MJ95K16k16N2j49J69k5Q2j37R7n3r7
$$ 62 354 -173 -141 146 -7 102 61 177 -55 -101 -212 -208 -13 203 -13 39 -110 59 34 116 -21 76 23 -74
6024g4q0J25m1J1l6K28p2j62j05K78j14J94j62K44r3l44L85n2J42l4n06K16K98
$$ -74 -154 -29 -70 -59 -95 133 61 -101 -206 72 -42 152 -10 234 141 -203 182 130 272 238 -268 -52 246
6047B46j24J44O4k54o9J19j4k38J63L35l96j00J59k09j56L69K4k42P0L6j36M61
$$ 246 122 266 330 76 7 126 112 -126 37 372 -24 -124 35 -174 -330 39 63 -179 -109 -73 -209 252
6069B52j1m05o2M06j48k44K76o0J16l0r4k81J70M4M9l3L37k71k67L25N3Qk8j71
$$ 252 241 -164 -226 180 32 -212 64 4 120 90 -4 -285 -115 -71 -22 -55 282 11 -256 69 122 130 102 -69
6093f9N5j96M15l74k82O00k30j07l8L57j21l1M20j81m31J92J74k93J20N19n24
$$ -69 -14 -210 205 -169 -451 149 -81 -188 -226 131 10 -21 399 218 -213 -21 153 -140 -20 499 -25
6114b5L8J23k78K23J82j91n6l8J86n6m41K06J74j17L39k29n9K65j00k07n7K89
$$ -25 13 136 -142 81 263 72 16 -22 164 108 -333 -127 47 -70 269 40 -19 246 146 -61 -118 171
6136A71k10K25q8m1k09K67j23R8o7r1J3K71o6l08K71L5j98m0l5K99Rl29K85m19
$$ 171 -39 186 98 57 -152 115 -8 90 23 -68 -55 216 150 -158 113 148 -50 -90 -125 174 183 -146 139 -280
6160b80l1N68k29J24k21qL22l00M48l53k9J92m4Oo4P0j54p0M3j21J08J62j37q8
$$ -280 -311 257 28 152 -69 -77 245 -55 393 40 11 203 159 165 101 171 17 -53 -10 -131 -23 139 2 -86
6184h6J48Q8n1k09L39k47Mo5J72k17J76j21N0L6J16j8j9Oj88OJ75K74l81M3K97
$$ -86 62 150 99 -110 229 -18 -14 -79 93 -124 52 -69 -19 17 133 115 96 102 -86 -80 95 369 -12 31 328
6209C28l22j07k9K06J08kj27K02k09l7p9j65J99j62O6J83o5n9J86j27Q6j11J05
$$ 328 6 -101 -130 76 184 182 55 257 48 11 -68 -233 -34 -196 -130 53 -12 -71 115 -12 74 -37 68
6232F8j60j7J24J04j18J41l54J44l0R1K58l35K90j4p5r6R1n9q7J57k14j09k5J49
$$ 68 -92 -109 15 119 1 142 -212 -68 -98 -7 251 -84 206 192 117 21 112 53 -34 123 -91 -200 -225 -76
6256g6j8QL8p0R6p3Mq4L92j49J5R4j99J54j51L7Pk2l3n4o4K14P8N3l18qJ60j94
$$ -76 -94 -86 -48 -118 -22 -95 -91 -175 217 68 83 177 -22 132 -19 18 25 3 -30 -84 -148 66 144 197 -121 -129 31 -163
6284a63K22Q6k08J5K63k97J43j4j15P3J7K09j08l41L69k47K66j72p2j90J60J81
$$ -163 59 145 -63 -48 215 -82 61 47 -68 5 22 231 123 -218 151 -96 170 -2 -74 -264 -104 77
6306G7J09k06J11J29k47R5j63K18p3k41J67j77J99q6l6J17Q6k16K80k16o6oj07
$$ 77 186 -20 91 220 -27 68 -95 123 50 -191 -24 -201 -2 -88 -124 -7 79 -137 143 -73 -139 -145 -252
6329b52L88o3k9j25O5k13L74j0l09Q9m7K35k05L10o1mj28j8j16P9j74K70pp2M1
$$ -252 136 73 44 -81 -16 -229 145 135 -174 -85 -132 103 -102 208 147 143 15 -3 -119 -40 -214 56 49 -23 18
6354A8J45k89j56M93j0j62m8J62L8k15Q7l0j74P5J22r4j11J18k23L53j05m8J90
$$ 18 163 -126 -282 211 201 39 -9 153 191 -24 63 33 -141 -66 56 -38 -149 -31 -254 99 -6 -54 136
6377A36j14O6R0J07j22p2l72J10K26l72K07l1L15j02K3j1P0l5P3N9j55j66O7K06
$$ 136 22 88 178 285 163 91 -281 -171 55 -317 -110 -141 174 72 95 84 154 119 192 251 96 -70 -3 203
6401B03M6k45j75j88L33M8j89p1J84j6o9Q7o1K16k77M44l10lJ49l14K15J00L3
$$ 203 249 4 -171 -359 -26 22 -167 -238 -54 -70 -139 -52 -113 103 -174 270 -40 -43 106 -208 7 107 140
6424A40j79O6q0Q0N9l50R5L66j77n4J35J1j77K38N1l18M3K00o5j15p5k9L80k41
$$ 140 -39 27 -53 27 86 -264 -169 197 20 -34 101 112 -65 173 224 -94 -51 149 84 -31 -106 -135 245 4
6448DrL42j32j6j70l7k71k4M73l25N8l8J79om3j04J47J25%ok9j75K21OK9J2j65
$$ 4 -5 337 205 189 19 -18 -289 -313 160 -165 -107 -145 34 28 -15 -119 28 153 153 147 118 -57 164 170 199 211 46
6475D6j37M5r8K94j15r0m5J55r0J63k17K04j52j47L27m8k05K02L3m1j12j15J82
$$ 46 -91 -46 -144 150 35 -55 -100 55 -35 128 -89 115 -37 -184 143 95 -110 92 125 84 -28 -143 39
6498C9j6j30K01j83J78K6k98K53p1NM2P8j43J39j66J3p8J63N6q3j11J62q6k35
$$ 39 23 -107 94 -89 89 115 -183 70 -1 4 46 124 -19 120 -46 -33 -111 52 108 25 -86 76 -10 -245
6522b45J94J05l47L67j28J55N9j82J34k05j05Q9j31L43rj75J55j46k76j8J63L43
$$ -245 -51 54 -293 74 -54 101 160 -22 112 -93 -198 -109 -240 103 94 -81 74 -72 -348 -366 -203 140
6544A40j83J45pk72M0K47j84l6q0L55j41k12L75j63j13K28k02k1K55k85K18K05
$$ 140 -43 102 95 -177 -137 110 -74 -110 -190 165 24 -188 187 24 -89 139 -63 -84 171 -114 104 309
6566C09k48l21L28K22k43l36M06k46j56L48J9j31n3m4K4lR3Rj40J82J25O4j12
$$ 309 61 -260 68 290 47 -289 117 -129 -285 63 82 -49 -102 -146 -122 -125 -32 -23 -163 19 144 208 96
6589I6k83J43J36k0k27L0J78jq4J79j8l60j1L14l6k50L01j95k15J07J31nj47M16
$$ 96 -187 -44 92 72 -155 -125 53 52 -32 147 129 -231 -242 72 36 -214 87 -108 -323 -216 -85 -90 -237 179
6613A79l54K02R8Ql01K8K42k02K61o2k25L7K89j60l78J68L14j42M7J60k11k6L23
$$ 179 -175 27 125 133 -168 -140 102 -100 161 99 -126 -89 200 40 -338 -170 144 2 49 209 -2 -28 295
6636B95j06q6j09K23n49K44K35l12k5Q0j20K93K01k44l7K08k80K22k75K32j11
$$ 295 189 103 -6 217 -332 -88 147 -165 -190 -110 -230 63 264 20 -17 191 -89 133 -142 90 -21
6657b1Q1J50m45J46M2K40k58j57K69q4j79K44j81K62Q4k21r9K10l4l80M71Q9m81
$$ -21 60 210 -235 -89 -47 193 -65 -222 47 -37 -216 28 -153 109 193 -28 -127 83 49 -331 140 229 -252
6680b52NM87k94o5l4L55k84l7K43j41p7o0J73j31J90%p9j51J77k34L28p5J47m15
$$ -252 -247 240 -54 -119 -153 202 -82 -119 124 -17 -94 -154 19 -112 78 78 -1 -152 25 -209 119 44 191 -224
6704b24J7K09k44L80k89J47n7J85J47l85R4o8k2k1N6L85n8n81N68n7l02Q1P3l5
$$ -224 -207 2 -242 138 -151 -4 -61 124 271 -114 -20 -88 -110 -131 -75 310 252 -329 239 182 -120 -39 34 -1
6728aK59j70rk7o7j29K34J02j97l22L21j49R8Np6Q2M7N3j22o9L01r3m43K65P0
$$ -1 258 88 79 52 -15 -144 90 192 -5 -327 -6 -155 -57 -52 -128 -46 1 54 -68 -137 164 71 -372 -107 -37
6753c7j32J16K40k99J5K5J83j77J68q8J45p3L11n38J93J1j06o2jRp8L01k26o0
$$ -37 -169 -53 187 -112 -97 -72 111 -66 102 14 159 86 397 -141 52 63 -43 -105 -106 -97 -175 126 -100 -160
6777a60P1J85l58K32Q7m8k54K74m8J71k14J74k06P9R7l22O5J50j92M91l08k0n9
$$ -160 -89 96 -262 -30 57 9 -245 29 -19 152 -62 112 -94 -15 82 -240 -175 -25 -217 274 -34 -54 -113
6800a13M6Lj14qK39l5j38J56K09l85K03K3J23j43j51K14l23R9J56l3p2K92l69
$$ -113 -67 -64 -178 -186 53 18 -120 36 245 -140 63 86 209 66 -85 129 -194 -95 61 28 -44 248 -121
6823a21L08j84J94j30m2n08L00J20J12lk24K05p3L5K51j39l09J10p1k1rK93J13
$$ -121 187 3 197 67 25 -483 -183 -63 49 46 -178 27 -46 -11 240 101 -208 -98 -169 -190 -199 94 207
6846B07j22k7r1K46k69mJ38P3q5j67Q8M1k19R8K6m5J70k34J79J65m93L23J00k83
$$ 207 85 58 -33 213 -56 -60 78 151 66 -101 -13 28 -191 -93 -67 -112 58 -176 3 168 -325 -2 98 -185
6870a85J80J76k86J40j84K40j74l01M10K30j19Q1k10j36R0J31l34K26R0p2k7J8
$$ -185 -5 171 -115 25 -159 81 -93 -394 16 246 127 208 -2 -138 -48 83 -251 -25 65 -7 -34 -16
6892a6j03P4J76j65K2J2q7J5J10L4j15J86l40J15K93k90J8q5n1L03J62n39L62
$$ -16 -119 -45 131 -34 -12 0 -87 -72 38 72 -43 143 -197 -82 211 -79 -61 -146 -197 106 268 -271 91
6915I1N1K6j38j66L57l71K90j14r9J29Q5Kl21K09k32O5L23l72J75q6K91o5j24
$$ 91 142 168 30 -136 221 -150 140 26 -73 56 141 143 -178 31 -201 -136 187 -185 -10 -96 195 130 6
6938Fj47K84j83J57l4q3K25k55K68j36n6o5K09j30n8r0J80j92J77p2j7L62n94
$$ 6 -141 143 -40 117 83 0 225 -30 238 102 46 -19 190 60 2 -88 92 -100 77 5 -12 350 -244
6961b44J89L3kN7m8J5J92j53J09l38K91P6p9K9k14r6J30j00M35j43j32k90L79
$$ -244 -55 -22 -24 33 -15 0 192 39 148 -190 101 177 98 127 -87 -183 -53 -153 282 139 7 -283 96
6984I6k05J35J84j85%j35O4o8K32j39K43k22K2j29N5L51m52L88k46l0j55R3J80
$$ 96 -109 26 210 25 25 -110 -46 -114 118 -21 222 0 22 -107 -52 299 -153 235 -11 -41 -196 -103 77
7007G7l56K35K40K7k50r7K71k8k94L29l70L99l56jN63k86R4l81l0M72l07n3K56
$$ 77 -279 -44 196 223 -27 -124 147 119 -175 154 -216 183 -173 -174 389 103 197 -184 -214 258 -49 -102 154
7030A54k01o1J72j00j82K99j7k28R2K01j81m6P6K23m26K28K42j48q8K52k35n0
$$ 154 -47 -108 64 -36 -218 81 64 -164 -72 129 -52 -98 -22 201 -225 3 245 97 9 261 26 -24
7052b4J77j11k68J14L05l44J85L06k82j81Q8J41k20K98k04O7k04J19Q7j13K91
$$ -24 153 42 -226 -112 193 -151 34 340 58 -123 -35 106 -114 184 -20 47 -157 -38 49 -64 227
7073B27l17n5K18J35l34j45L38J26l61M53k09j77Q3j61Q1j39M36l92J7L32j69
$$ 227 -90 -145 73 208 -126 -271 67 193 -168 285 76 -101 -18 -179 -98 -237 199 -193 -176 156 -13
7094a3j1j12K81j36j84K04k95K38N1L8k16M65j71k3n3PJ44m28L86l16J73j52k8
$$ -13 -24 -136 145 9 -175 29 -266 -28 23 61 -155 310 139 116 63 70 214 -214 172 -144 29 -123 -151
7117a51K85Q7m7k02n6R3p1k53NK23k6j17N9K93j14R7k79N1O3J50j66J13pr6J8
$$ -151 134 221 174 -28 -84 9 -62 -315 -310 -87 -113 -230 -171 122 8 105 -174 -123 -60 90 -76 37 30 -66 -48
7142d8P8P9m5M4p5q7j4L9K51l20M84j96k59k5K61j99J85k02j74K79L8l37P6M13
$$ -48 30 109 64 108 33 -54 -68 -29 222 -98 386 190 -69 -94 167 -32 153 -49 -223 56 94 -243 -167 246
7166B46m11J04M8j41k36L55q6K20r4j47Q7J18N1q8k88L18P5n64K93J21J42q1M5
$$ 246 -165 -61 -13 -154 -390 -35 -121 99 5 -142 -55 63 114 26 -262 56 131 -433 -140 -19 123 42 87
7189H7k3j42J41J25j69j43K92r2j22K6q3J17k7J41n5R9j39k90K96o6J60j04J85
$$ 87 64 -78 63 188 19 -124 168 76 -46 -20 -103 14 -13 128 73 172 33 -257 39 -27 133 29 214
7212B14Q6j19j73J13J22j30m5J7j36J76j44J88j06Q1j35m1K85j89l40L81o5k57
$$ 214 300 181 8 121 243 113 68 85 -51 125 -19 169 63 144 9 -32 253 64 -276 105 40 -217
7234b17K88k1j41J41O1K8n6M2j21MK4M0KL4Mp0J86n8o4j52J16k1p3k9J8J81j87
$$ -217 71 50 -91 50 111 139 83 125 4 8 32 72 74 108 112 42 228 170 106 -46 70 49 -24 -53 -35 146 -41
7261d1K32k65j36K06r1oJ41l2Oj40K14L7k77K21R3q3p8P0j2k31L15k47Q4J81m9
$$ -41 191 -74 -210 -4 -95 -101 40 8 14 -126 88 125 -152 69 162 79 1 71 59 -172 143 -104 -20 161 112
7286A12r6O6j86J51J88Kk61j33K39l21L65k64K23q0k30L05j67K93j19O8n33M42
$$ 112 16 82 -104 47 235 237 -24 -157 82 -239 126 -138 85 5 -225 80 -87 206 87 155 -378 64
7308F4K07k93j23J44J93l40Q1k7K09K0j84M9J8q8j14K90k70O8Q6pp4p3NJ13m8
$$ 64 271 -22 -145 -1 192 -148 -67 -94 115 135 -49 0 18 -70 -184 106 -164 -96 -10 -17 -91 -164 -159 -46 -94
7333i4P0j1j74m0M37p1k00J22j93K10p3J05k02L7J90l4m6o3oP3J10k73J25O4o8
$$ -94 -24 -35 -209 -249 188 117 -83 39 -154 56 -17 88 -114 -77 113 79 33 -30 -36 37 147 -126 -1 63 -5
7358eJ43k91K4K30k47K38J21k51O1K6K04k93P6J87m00M7J84k11J92n3K43j05j28
$$ -5 138 -153 -129 101 -146 92 213 -38 23 49 253 -40 36 223 -177 -130 54 -157 35 -18 225 120 -8
7381hj7k12n2L47l5P2j73n8J14K18J02m31J40kJ11j6P3l82R6K48k51J28M8k4j19
$$ -8 -25 -237 -289 58 23 95 -78 -136 -22 196 298 -133 7 5 116 100 173 -209 -113 135 -116 12 60 36 -83
7406h3J07J8k56J42j23K46k36K18j10Q7n1oJ39q6J62o2k37L15k70K62k09J31J28
$$ -83 24 42 -214 -72 -195 51 -185 33 -77 10 -41 -47 92 6 168 106 -131 184 -86 176 -33 98 226
7429B26j92N6l1J80k79Q8l29K64j28M38m57n4J74J4P1k23J01p4K25J4o8j11K12
$$ 226 34 90 59 239 -40 48 -281 -17 -145 293 -164 -218 -44 -30 41 -182 -81 -155 70 84 16 -95 117
7452A17j80J73mk07L8k1J0J27n2K38k68L30k96n4J52j74p0K33J4j19M9O9qj99
$$ 117 -63 110 106 -101 -63 -84 -74 53 1 239 -29 301 5 -49 103 -71 -141 92 106 -13 36 105 97 -102
7476a02J68j43M5P1o3K46l23J41j02J56j63J74L9k62J5L81k57N6k48k3K18O4K06
$$ -102 66 -77 -32 39 -24 222 -101 40 -62 94 -69 105 144 -118 -103 278 21 77 -171 -194 24 88 294
7499B94j78J41k45l7p7M0q6M07l34j53L8N77m84Q8k41L16o8K53k25j73L1K21j47
$$ 294 116 257 12 -25 -102 -62 -148 259 -75 -228 -190 387 -97 -9 -250 66 -2 251 26 -147 -116 105 -42
7522d2o2J05MP0P0j41rK06r2p5p6N7k25J22K05o8m4NR3j76J7J53k51M07m33k9
$$ -42 -104 1 5 75 145 4 -5 201 109 34 -42 15 -210 -88 117 49 5 10 103 -73 -56 97 -154 253 -180 -209
7548b09K23Jj3j72P%J10RJ85j97P3m7jj31L02m3k61K39R8o9j6K61k57j7J02n3
$$ -209 14 15 2 -170 -163 -163 -53 -44 141 -56 17 -30 -31 -162 140 97 -164 75 173 104 88 349 92 75 177 124
7574A24k50L12qj91j63j5M00j47N9m5j12J94r0n0m8K60j03l45K09O4k40M6J46
$$ 124 -126 186 178 -13 -176 -191 209 62 121 76 -36 158 68 18 -30 230 127 -218 -9 55 -185 -139 7
7597Gk59K78N4j28J21r5j3j41j61P9Q4K73J17k54j59K73j61o8R6j09R7M60m57
$$ 7 -252 26 80 -48 73 -22 -35 -176 -337 -258 -174 99 216 -38 -197 76 -85 -153 -57 -166 -69 391 -66
7620f6K13k12j02L79k10k54L69k33K7K62n61K17J91k30L43k55J57K86m73K50k21
$$ -66 147 -65 -167 212 2 -252 117 -116 -89 173 -388 -171 20 -210 133 -122 35 321 -152 98 -123
7641a23J49n5nJ15Lk6j33J09k3M6k85K36n9q2J73m0J6j0K33l71k2L11k71J17N5
$$ -123 26 -29 -34 81 84 58 -75 34 11 57 -228 8 -51 -133 40 0 16 6 239 -132 -154 157 -114 3 58
7666E8n0q2P9o7J30k54K00j91O3n5L46p5r1N1j32Q9k6r1R9j32J13q9K22q1l78
$$ 58 8 -74 5 -62 68 -186 14 -177 -114 -169 177 102 11 62 -70 19 -7 -98 1 -131 -18 -107 115 34 -344
7691c44M49j93J37NJ69m60J10K47k0NJ87k70r8J40R2N1N7k7k35j44K10j10O4J0
$$ -344 105 -88 49 54 223 -237 -127 120 100 105 292 22 -76 64 156 207 264 237 2 -142 68 -42 22 32
7715C2j87ML8K7m0K34l8J1qO9k82J07j99K51P2k51L98j67j89K6J43O9r8%r0J86
$$ 32 -155 -151 -113 -86 -126 108 70 81 73 142 -140 -33 -232 19 91 -160 238 71 -118 -92 51 120 22 22 -68 118
7741A18j58R7l80L61R1k22J0P1R4l67Q8J72j87L18k77J18N0L0o1k0J58J00j75
$$ 118 -40 57 -323 38 129 -93 -83 -12 82 -285 -197 -25 -212 106 -171 -53 -3 27 -34 -54 104 204 29
7764B9O6n3m12N13k41q8K19j50P3R3R5j30k9L9j28k2J67J18k57K1K0r2K12j23
$$ 29 95 42 -370 143 -98 -186 33 -117 -44 49 144 14 -15 24 -104 -126 41 159 -98 -77 -57 -149 63 -60
7788f0K97j0k65M08o22J93O3J99l06K5K46m96K51J74j45J30k47K54k35J64nn5
$$ -60 237 227 -38 370 -252 -59 4 203 -103 -78 168 -328 -77 97 -48 82 -165 89 -146 18 13 -42
7810d2o7J8j94L61q3J01j20M6j7k42L28%j99J79j01k68L39j12Q0J29k42QL3R0
$$ -42 -109 -91 -285 76 -7 94 -26 20 3 -239 89 89 -110 69 -32 -300 39 -73 7 136 -106 -98 -65 25
7834B5J04k35j33M83j85M4j28R0k92J29J50k06L14j36J65k56p7K12Q3k57J25k14
$$ 25 129 -106 -239 244 59 103 -25 65 -227 -98 52 -154 160 24 189 -67 -144 68 151 -106 19 -195
7856a95P2L7J78l7j1n4N9N6k01K60j61J72K7k17q4P8J70k52J24j21J2k4P7K58
$$ -195 -123 -86 92 55 44 -10 49 105 -96 164 3 175 202 -15 -99 -21 149 -103 21 -100 -88 -112 -35 223
7880B23k74J70mj50l1J35j86M7M20l53k23L49k01J57j07J21l3P6j59n2j72J39
$$ 223 -51 119 115 -35 -66 69 -117 -70 350 -3 -226 123 -78 79 -28 93 60 136 -23 -75 -247 -108
7902a08K25k32K3k6K08J01j60j46j6R8J60l36L47j61K38K00m86L7K26k62N6m9
$$ -108 117 -115 -92 -118 90 191 31 -115 -131 -33 127 -209 138 -23 215 415 -71 -34 192 -70 -14 -63
7924f3m6K17k50J48N2r0p1m7j14J49P8l1l7J69j03k25K23n5K51j92q3L36k88R9
$$ -63 -109 108 -142 6 58 -32 -103 -150 -264 -115 -37 -68 -105 64 -39 -264 -41 -96 155 -37 -120 216 -72 27
7948B7j5l3Q5n8r6M6J63m9l78K10J43p5QN3j4l1K65k36L1l3j84q2L20j1J9R2j9
$$ 27 12 -21 64 6 -90 -44 119 70 -308 -98 45 -30 -22 31 17 -14 251 15 46 13 -171 -253 67 56 75 167 148
7975A48j62K6L2j14J3N5L4J01l44k8L44j16k3m9K30J07j58j35R3J3n0j08l1R7
$$ 148 -14 12 44 -70 -57 -2 32 133 -211 -239 105 -11 -34 -83 147 254 96 -39 54 67 17 -91 -122 -25
7999b5R4j31r8L49l02K0m8J85j36K9p3P8j37L2J55q7K07J3j67L1j30R7j6l7J48
$$ -25 69 -62 -160 189 -113 -93 -141 44 -92 -63 -136 -58 -195 -163 -8 -95 112 125 -42 -11 -141 -44 -60 -97 51
8024E1k27O1J2Q0K64j22l57O2J08p5K55k8j04j10K13J59l69k0J83j40K7q3L94
$$ 51 -176 -115 -103 -23 241 119 -238 -176 -68 -143 112 84 -20 -130 83 242 -127 -147 36 -104 -77 -160 234
8047B34Jj92n1J31k80m4M49m98K29k0M4M5K1j96J40O2K1l46K49n5O4m3m9Q5p3
$$ 234 235 43 -8 123 -157 -201 248 -250 -21 -41 3 48 69 -127 13 75 96 -250 -1 -56 8 -35 -84 1 -72
8072g2J50k7J03l04K67J38k43O2k20MJ28qj72J6LK33k4J25J03k83J80J6l6lk06
$$ -72 78 51 154 -150 117 255 12 74 -146 -142 -14 -22 -194 -178 -175 58 34 159 262 -21 159 175 139 136 -70
8097g0L9k20J66K33j8j54J02R0k31J06j08J18O0j2j51J42k9k68J35M0J55m03M17
$$ -70 -31 -251 -85 148 130 -24 78 168 -63 43 -65 53 113 101 -50 92 63 -205 -70 -30 125 -278 139
8120A39j51O5l4P2l6J7k4j44L46k90Q3m9k69L74J70l70P4J01n4j4m9L4N3J99l72
$$ 139 -12 53 19 91 55 72 48 -96 250 -40 43 -6 -275 99 269 -101 -27 74 20 6 -43 -9 44 243 -129
8145a29k8J43j20k2J77K03l29J91l16L94k79K70j18j62M00l27J92j41p9p4L81
$$ -129 -157 -14 -134 -156 21 224 -105 86 -230 164 -115 155 37 -125 275 -52 140 -1 -80 -154 227
8166B27l09k30L76J79k34n9L26k74MK80k41k80K63K7J3j26O9j58R7o3L4l1P8Q6
$$ 227 -82 -312 64 243 9 -50 276 2 6 286 45 -235 28 55 68 -58 11 -147 -50 -113 -79 -110 -32 54
8190E4j46
$$ 54 -92
8191i2
$$ Imaginary data points
##PAGE= N=2
##DATA TABLE= (X++(I..I)), XYDATA
0@%%%%%%%%%%%%%pJ5j6J6j6K2l0L2m0M8n2O0p2Q5r5J06j20J40j61J81k05K33k61
$$ 0 0 0 0 0 0 0 0 0 0 0 0 0 0 -7 8 -8 8 -8 14 -16 16 -24 24 -28 32 -40 45 -50 56 -64 76 -85 96 -109 124 -137
36a37K91l27L65m06M50m98N52o10O72p43Q22r05R96j098J209j333J470j621J793
$$ -137 154 -173 192 -214 236 -262 290 -320 352 -391 431 -474 522 -576 633 -700 770 -851 942
55I42j989K213k473K779l141L583m135M842n786P110r098J2391j8775L5343j51376
$$ 942 -1047 1166 -1307 1472 -1669 1914 -2221 2621 -3165 3945 -5153 7238 -11537 23806 -127570
70a27570l55074M49204L33299k23816j63680J01463l60o9896o719O7914J23165
$$ -127570 -482644 -33440 299859 76043 -87637 13826 13466 -56430 -63149 4765 127930
81A27930k6420k48566M742L03451j9564l01308M2079K12356m2584l9954O4978
$$ 127930 101510 -147056 -142314 161137 141573 -159735 -117656 94700 52116 12162 77140
92G7140j50917j31702K23295J81581j42543j25257Q118p853M9255Q7973j9260
$$ 77140 -73777 -205479 17816 199397 56854 -68403 -60285 -68138 -18883 69090 49830
103D9830j7463q418j41430j5796K64869M5849k83613k1668K36507l9200j68428
$$ 49830 32367 23949 -117481 -133277 131592 177441 -106172 -127840 108667 69467 -98961
114i8961P2142Q5216o2184M631M0321n0300k6923M804q885R4483P0945j64985
$$ -98961 -26819 58397 -3787 844 41165 -9135 -36058 -31254 -40139 54344 125289 -39696
126c9696j05783J65372N6098j38891N0946J32647j23143j29107J13892R0722n4875
$$ -39696 -145479 19893 75991 -62900 -11954 120693 -2450 -131557 -17665 73057 18182
137A8182l0717L8J1692N2945m6573j18531Q4510J67773p8949j44469N1729N0025
$$ 18182 -12535 -12497 -805 52140 5567 -112964 -28454 139319 60370 -84099 -32370 17655
149A7655m8190L6063N7254n3203k9260J4108m9784J9974J21636k6190j36881K3266
$$ 17655 -30535 5528 62782 9579 -19681 -5573 -55357 -35383 86253 60063 -76818 -53552
161e3552R8781j8003m3050p953j2344N5771O7364q8036r5500Q3791O7552o4443
$$ -53552 45229 27226 -15824 -23777 -36121 19650 87014 -1022 -96522 -12731 54821 -9622
173i622N422O7455n5851q2454L6119O6109L2116k871q8445o7583R6106R0462p3605
$$ -9622 -4200 63255 7404 -75050 -38931 27178 59294 56423 -32022 -99605 -3499 86963 13358
186A3358n9709M8428N171l1093L3791J4402m3410K77K3722q666J9062J5667o3228
$$ 13358 -46351 2077 7248 -23845 9946 24348 -19062 -18785 4937 -3729 15333 31000 -32228
199c2228k6235Q0042L5288n0937k1348m96j7286L6222N5409l4189n6702J0134
$$ -32228 -58463 21579 56867 5930 -15418 -15914 -33200 3022 58431 24242 -32460 -22326
211b2326J7722N743K8667o428m9144L319L5466j1410q400K4031j6197l1102K8314
$$ -22326 -4604 1139 29806 23378 -25766 -22447 13019 1609 -6791 17240 1043 -30059 -1745
224a745K7759k5230j7362O605P58K0398J9774l6340l2746L4190K8130j9742o173
$$ -1745 26014 784 -16578 -9973 -9215 11183 30957 -5383 -38129 -3939 24191 4449 -1724
237a724J0253j2940o609J4307K012L32Q374j7880j8979K6883K0928k8218j7208
$$ -1724 8529 -4411 -11020 3287 5299 5631 14005 -3875 -22854 4029 24957 -3261 -20469
250b0469K2784R925j1848n838l337K756J4335j964j7405N768J4200j2038q729
$$ -20469 2315 12240 392 -5446 -8783 -6027 8308 6344 -11061 -5293 8907 -3131 -11860
263a1860J6737N962j3805l428O399K892K953k468r390M150J2249n159j1534M779
$$ -11860 4877 10839 -2966 -6394 5 2897 5850 3382 -6008 -1858 10391 5232 -6302 -1523
277a523O613m348r62K578l812j948L166m3o43K284l378m348M650M908l528k912
$$ -1523 5090 742 -220 2358 -1454 -3402 -236 -279 -922 1362 -2016 -6364 -1714 3194 -334 -3246
293c246J573M11L97L261o99k956K37K083Q41P79j068k130O74K561l92j642j55
$$ -3246 -1673 -1262 -865 2396 1697 -1259 -1022 1061 1902 2681 1613 -517 157 2718 2326 684 529
310E29k3j006N98R78r94j556l27Q23J097p18j826J90J860q5r77L61Q19l48k37
$$ 529 506 -500 98 1076 82 -1474 -1801 -978 119 -599 -2425 -2235 -375 -460 -1437 -1076 -257 -605 -842
329h42J038R09o75k65P35P13N36j309p28J288R92j459j564J525N58j995l99J857
$$ -842 196 1105 430 165 900 1613 2149 840 112 1400 2392 933 -631 894 1452 -543 -942 915
347I15n63k696O84J296j68m9j535j008L095J674m427m56N767m37n769K302M779
$$ 915 352 -2344 -1660 -364 -532 -581 -2116 -3124 -29 1645 -2782 -3238 2529 2092 -3677 -1375 3404
364C404j617j932O72l33J787J834n319k074R311P88j0549L56P917l025n014L871
$$ 3404 1787 -145 527 194 1981 3815 -1504 -3578 5733 6521 -4028 -3672 4245 1220 -3794 77
380G7J092k205K040l926m910R703N779j2679k292J2165l066q965P175M694o159
$$ 77 1169 -1036 1004 -2922 -7832 1871 7650 -5029 -7321 4844 1778 -7187 -12 4682 -1477
395a477K439K626q984L172J0813p349n646J1381k619j3099Q692Q666j1662J423
$$ -1477 962 3588 -5396 -2224 8589 1240 -4406 6975 4356 -8743 -51 8615 -3047 -1624
409a624J0798j1501r382J3987L152r588O305J136j3827P328J1914j5815j736K3413
$$ -1624 9174 -2327 -11709 2278 5430 -4158 2147 3283 -10544 -3216 8698 -7117 -8853 14560
423A4560o886k4459R871J5572q286J242N513j2046K204J3528j7219r621L3348
$$ 14560 7674 -16785 -6914 8658 372 1614 7127 -4919 -2715 10813 -6406 -16027 17321
436A7321O435l7126l744K5495l699q547P352m529J346J3386k2713k4125M0084
$$ 17321 23756 -13370 -17114 8381 4682 -3865 3487 -1042 304 13690 -9023 -33148 6936
449F936K9629m1736k0629L2316K505k4025P908J4508K370N482k1968k8799L5751
$$ 6936 36565 -5171 -25800 6516 9021 -15004 -7096 7412 9782 15264 -6704 -35503 248
462B48L8816l9958k6583M2898O468m1662M440K5634n283K874M981k6769k815K9020
$$ 248 39064 -894 -27477 15421 21889 -19773 -15333 10301 5018 7892 12873 -13896 -16711 12309
476A2309j2553j7251L4879P017m4132j418K4331r993J0096K8848l3601l6304L7329
$$ 12309 -244 -17495 17384 24401 -19731 -21149 3182 -6811 3285 32133 -1468 -37772 -443
489d43J9398l1206J0668K6537k6769j6175K1622m893o321K5740p557k6264K2877
$$ -443 18955 -12251 -1583 24954 -1815 -17990 3632 -1261 -7582 18158 10601 -15663 7214
502G214M671m1044J7351M7519k7968k7398L5279j1401m9819L6090N7069k9367
$$ 7214 11885 -29159 -11808 35711 7743 -19655 15624 4223 -45596 -9506 47563 18196
514A8196l9755O058N119J0622J3350k1600K387M4777l2750p2714M9660Q0510n0528
$$ 18196 -21559 -15501 -10382 240 13590 -8010 -5623 39154 6404 -66310 -16650 63860 13332
527A3332n5369N0965K3976m7840j2874K2597J7899K3948j9200n9657J4174N8766
$$ 13332 -42037 8928 32904 -14936 -27810 -5213 12686 36634 17434 -42223 -28049 30717
539C0717k3235l3844M3687J2782m8439j685J8069j5203K5291L7653n0372m1122
$$ 30717 7482 -26362 17325 30107 -18332 -20017 -1948 -17151 8140 45793 -4579 -45701
551d5701N3693J5619n3499J1244N6498p083l8726k4072m570N0409M6895n7392
$$ -45701 7992 23611 -29888 -18644 37854 30771 -7955 -32027 -36597 13812 60707 3315
563C315n1572O0518K1843p3739Q120Q2171j7235o5025J0287K8466k359K386j4209
$$ 3315 -48257 12261 34104 -39635 -31515 50656 33421 -31604 -21317 7149 4790 7176 -7033
576g033j3826M1215J4955o2357j2622N3874l773j9451L8622p686o8703J0288O0275
$$ -7033 -20859 20356 35311 -27046 -39668 14206 10433 -9018 29604 21918 -46785 -36497 23778
589B3778k079j2204R850l4274k7491M1951K7303j6593M026j1094m1319K3976N3323
$$ 23778 21699 9495 19345 -14929 -42420 -469 26834 10241 14267 3173 -38146 -14170 39153
602C9153k9724l8794L2785J3679k3870J1056ol8176J9896N4537j9639l9433J0800
$$ 39153 9429 -29365 3420 17099 -6771 4285 4279 -33897 -14001 40536 20897 -18536 -7736
615g736m659j4469L8883K9096l0486k2591r635j4776M1558N7736m5242o8360L5622
$$ -7736 -12395 -26864 12019 41115 10629 -11962 -21597 -36373 5185 62921 17679 -50681 -15059
628a5059M5130l0721j4935K4790j603p574M832j5171K0K7716j8475k9522M5583
$$ -15059 30071 -650 -15585 9205 7602 28 4860 -10311 -10291 17425 -1050 -30572 15011
641A5011L2850o2022l8454M6635L1866r147p267k1389j6453K9920J6902k6560
$$ 15011 47861 -14161 -52615 -5980 25886 16739 9472 -11917 -28370 1550 18452 -8108
653h108O871K6033k8410k5959L1842J6154j9674J499N286j3017R812R438k7761
$$ -8108 -1237 24796 -3614 -29573 2269 18423 -1251 248 5534 -7483 2329 11767 -15994
666a5994r47M2265l157m0410K279J7470m629Q657J0889k2103j0357J9393k545
$$ -15994 -16941 25324 22167 -18243 -15964 1506 -3123 5534 16423 -5680 -16037 3356 811
679H11r028J8071l97k3696J0078J9008j8173r038J7989k392o202J7578n480l0937
$$ 811 -8217 9854 9457 -14239 -4161 14847 -3326 -12364 5625 3233 -2969 14609 9129 -21808
693b1808N288K9060L895n875r110k3271J865L5839O491k5870l732N034r465Q545
$$ -21808 -16520 12540 16435 10560 1450 -21821 -19956 15883 22374 -3496 -7228 -2194 -11659 -3114
707c114J9898j0923j8475N510O132L253J1734r459k8324R493L4633N78k4239j1212
$$ -3114 16784 5861 -12614 -7104 -972 2281 14015 4556 -23768 -14275 20358 20936 -3303 -14515
721a4515J232J2380J9615l571k1982l056O401k886J0931J8126j6556l0085P326
$$ -14515 -13283 -903 18712 15141 -6841 -9897 -3496 -6382 4549 22675 6119 -23966 -16640
734a6640K7249O454j1554j5503p259J5302J7393q513j4734J484K566k6J1453N366
$$ -16640 10609 17063 5509 -9994 -17253 -1951 15442 6929 -7805 -6321 -3755 -3781 7672 13038
748A3038j6832j0855R918J1469L651k843j3409q419J2860J4701m492j0197n092
$$ 13038 -3794 -14649 -4731 6738 10389 7546 -5863 -14282 -1422 13279 8787 -1410 -6502
761f502o08P440R792m106j1410j019M915K581L494p29q952l177Q632N183l027
$$ -6502 -7110 330 10122 6016 -5394 -6413 -1498 1083 4577 3848 -5104 -8281 351 5534 2507
776B507m134l182J75P018M390n625n637J142L869L087P52l998m187K271N056k66
$$ 2507 -1627 -4809 -4634 2384 6774 1149 -4488 -3346 523 3610 4362 364 -3823 -1552 3504 3238
792C238k869r27r74O91L209J74l527k298J203L314J621k387m129k88M439K538
$$ 3238 369 -558 -1532 -841 2368 2542 -985 -3283 -2080 1234 2855 468 -3661 -3949 490 3028
808C028k223k790o82J551K196J493j356k715j349K790L639K56l899l120J688L910
$$ 3028 805 -1985 -2667 -1116 1080 2573 1217 -1498 -2847 -57 3582 3838 -61 -3181 -1493 2417
824B417J354k893k684p7J830J418N24j248l025o85K343L109l64l550k363K094
$$ 2417 3771 878 -1806 -1883 -53 1365 1889 641 -2384 -3069 -726 2383 2019 -1531 -3894 -1800
840a800L411K98k279j297K28J145J600L48j229j247n78J595K522j13l296j271
$$ -1800 1611 1909 -370 -1667 -1439 -294 1306 1654 425 -822 -1400 195 2717 2604 -692 -1963
856a963K437J066m66m68j065p77J062Q81q12j60Kj726P79K755j132k964J069K253
$$ -1963 474 1540 1074 606 -459 -1236 -174 707 -105 -265 -263 -1989 -1210 1545 413 -2551 -1482 771
874G71q57m1J135j832k74K493o93j222J981j93k883J687K450k403p66K690j359
$$ 771 -86 -127 1008 -824 -1098 1395 702 -520 1461 1268 -1615 72 2522 119 -647 2043 684
891F84k632K563R92l011J321J986l262m16L053k808q19N384j509o043L259M186
$$ 684 -1948 615 1607 -1404 -83 1903 -1359 -1775 1278 -1530 -2349 3035 1526 -4517 -1258 2928
907B928m399p50M676j069k502K426k571j935P123J444r194J469P980n771n103
$$ 2928 -1471 -2221 2455 1386 -1116 1310 -1261 -3196 3927 5371 -3823 -2354 5626 -145 -5248
922e248P006K519l963J81k043l998P171M742r957r29J0775m412j0920O496P745
$$ -5248 1758 4277 314 495 -1548 -5546 1625 6367 -3590 -4519 6256 1844 -9076 -2580 5165
937E165m054j159N80n485L292P155p530l074J2995j073j5705L630J1496m257k665
$$ 5165 1111 -48 532 -4953 -1661 5494 -2036 -5110 7885 6812 -8893 -5263 6233 1976 -689
952f89N324m997m211P432k929o115J1143M019j5055j033J1044m695l796J0474
$$ -689 4635 -362 -4573 2859 -70 -6185 4958 8977 -6078 -7111 3933 -762 -4558 5916
966E916j928j0989N942L686r635N457J1016q939n446Q042n710o354J5493M093
$$ 5916 3988 -7001 -1059 2627 -7008 -1551 9465 526 -4920 3122 -2588 -8942 6551 10644
980A0644j5495K060R300j1382l049J5289p03q231M779m815j1171J4047J1759j6413
$$ 10644 -4851 -2791 6509 -4873 -7922 7367 6664 -1567 3212 -1603 -12774 1273 13032 -3381
994c381l600J5894o767j5016R324Q355l080N215l969j7267Q697J7113j3896p850
$$ -3381 -6981 8913 2146 -12870 -3546 4809 1729 6944 2975 -14292 -5595 11518 -2378 -10228
1008a0228K3191N47k6670q32J7318K811J498k318j4648L517J7250j3153j4943
$$ -10228 12963 13510 -13160 -13992 3326 6137 7635 5317 -9331 -5814 11436 -1717 -16660
1021a6660K5138J2838k7904q483J7277r9m416O747m356l082J1581j0781j9672
$$ -16660 8478 21316 -6588 -15071 2206 2107 -2309 4438 82 -3000 8581 -2200 -21872
1034b1872K1204K4610k0522j6822J2916J27o885J2448K505j0519P189N3k0249
$$ -21872 -668 23942 3420 -13402 -486 -359 -7244 5204 7709 -2810 4379 4432 -15817
1047a5817Q068K6130j1124j7982J2972L299j4221N932Q282q812O462R387j9833
$$ -15817 -7749 18381 7257 -10725 2247 5546 -8675 -2743 5539 -3273 3189 12576 -7257
1060g257r809K1074K420j1863J2357L493k2652k68J7645m136j417J3647j0560
$$ -7257 -17066 4008 6428 -5435 6922 10415 -12237 -12505 5140 1004 -413 13234 2674
1073B674j7965J1532Q420q190R604Q176k1510m889J9886n525j3554J7544R214
$$ 2674 -15291 -3759 4661 -3529 6075 14251 -7259 -12148 7738 2213 -11341 6203 15417
1086A5417j8843m335O236n198P220J2752j3949q274J7294n951k2544J5508K3967
$$ 15417 -3426 -7761 -1525 -6723 497 13249 -700 -8974 8320 2369 -20175 -4667 19300
1099A9300j3238j2975N581l992r13J3264l825p966J4744j045k7365L966K9987
$$ 19300 6062 -6913 -1332 -5324 -6237 7027 3202 -4764 9980 8935 -18430 -14464 15523
1112A5523k336j7496K650l3l951R191m25j0459J2451Q269k3220o148K5755J13
$$ 15523 13187 -4309 -1659 -1692 -5643 3548 3123 -7336 5115 13384 -9836 -15984 9771 9884
1126I884j9842O601J2170p784m182J50o684J0396J6794j3991j7267J1136M754
$$ 9884 -9958 -3357 8813 1029 -3153 -3003 -9687 709 17503 3512 -13755 -2619 2135
1139B135q168J1106R665j6705q558J0052j907P57J5108n308k1517N594J4969n347
$$ 2135 -6033 5073 14738 -1967 -10525 -473 -2380 -1623 13485 8177 -13340 -7746 7223 1876
1153A876l689M773n607j39R734o582j0969J0421O675r676M424Q291j5201r271
$$ 1876 -1813 2960 -2647 -2786 6948 366 -10603 -182 6493 -3183 1241 9532 -5669 -14940
1167a4940J6968P274p768J768j318j2811L299J4995O78n613k774p038J907J4063
$$ -14940 2028 9302 1534 3302 1984 -10827 -7528 7467 8145 2532 -242 -7280 -5373 8690
1181H690l939j3590R564R934j4988o138J5661J451j2471K228P577r23l344m393
$$ 8690 4751 -8839 725 10659 -4329 -10467 5194 6645 -5826 -3598 3979 3056 -288 -4681
1195d681k618J0396P554j2171o977J1095P80q982N446P137p120k181M449m572
$$ -4681 -7299 3097 10651 -1520 -8497 2598 3378 -5604 -158 6979 -141 -2322 2127 -2445
1209b445j855R424N60q367L95L162k408J125L311k253l30N79o447K99J2766J47
$$ -2445 -4300 5124 5684 -2683 -2288 874 -1534 -409 2902 649 319 898 -5549 -5250 7516 7663
1225G663j4833n76J1567J80n684J371L5k249K584K662q75m71l819l570P782Q228
$$ 7663 -7170 -7746 3821 4001 -1683 -312 -277 -2526 58 2720 1845 1374 -2445 -6015 1767 9995
1241I995p541r548K891N020J167L609p54r955l686Q294P048j129n209o670M58
$$ 9995 2454 -7094 -4203 817 1984 5593 4839 -5116 -8802 -508 6540 5411 202 -6468 -6010
1256f010Q215L743m580l760j304n33M703P082l554j0517p05P414N620M9n710o705
$$ -6010 2205 5948 1368 -2392 -3696 -4229 474 7556 4002 -6515 -7220 194 5814 5863 153 -6552
1272f552J383P990L894l196m964l760J144O718L988m014o666q29L168M743K193
$$ -6552 -5169 2821 6715 3519 -1445 -5205 -4061 2657 6645 2631 -4035 -4864 -1696 3047 5240
1287E240m377o374M65O254L551k309m217l214K500N012J601l053l189p88J719
$$ 5240 863 -5511 -5046 1208 4759 2450 -1767 -4981 -2481 2531 4132 1079 -2110 -2898 -1179
1302a179L643J970l700l999N23M066K284j702l310j171J624K557L59j953j385
$$ -1179 2464 4434 734 -3265 -2742 1324 3608 1906 -1404 -2575 -951 1606 1965 12 -1373
1317a373l53J457J663N4k140j599J540J774R6j407j052M84J489N03r66r01j19
$$ -1373 -1726 -269 1394 1448 -692 -2291 -751 1023 1119 -288 -1340 -856 633 1136 170 -731 -850
1334h50R31J048M08j750r69Q79J684M87j650j564m1K105J036r63j840n35N15J650
$$ -850 81 1129 1537 -213 -1182 -303 1381 1868 218 -1346 -1387 718 1754 791 -1049 -1584 -1069 581
1352E81J263j215k474o83K450J973l67k090j550N00K878J344k067j761m63R72
$$ 581 1844 629 -1845 -2528 -78 1895 1528 -562 -2112 -1612 1266 2610 543 -1218 -1681 -709
1368g09K181J416j795k985L3K794Q23K8j788k488Q71K647Q62j449r43j337L69
$$ -709 1472 2888 1093 -1892 -1859 935 1758 1786 -2 -2490 -1619 1028 1890 441 -502 -1839 -1470
1385a470K568J193k933j801J661J337M69J96j560j999J612K388q92p1m99j458
$$ -1470 1098 2291 -642 -2443 -782 555 1024 1220 -340 -2339 -727 1661 769 698 199 -1259
1401a259n05L662Q17l023n77O76m2Q48R22k116p80K541m69l028K564R31k722N10
$$ -1259 -1764 1898 2715 -308 -885 -209 -251 597 1519 -597 -1377 1164 695 -2333 231 1162 -1560 -1050
1419a050K654j382j855J756p31k39L013n92m189J214L427k420p90L219j239k839
$$ -1050 1604 222 -1633 123 -608 -847 2166 1574 -2615 -1401 2026 -394 -1184 2035 796 -2043
1435b043K483O27k700K199K664m190r41L670k578j833M343L99m288J499J768l625
$$ -2043 440 1067 -1633 566 3230 -960 -1901 1769 -809 -2642 1701 2100 -2188 -689 1079 -2546
1451b546Q82M599k195k686L017j114l495M244K515m593R47L663m763k646N811
$$ -2546 -1664 2935 740 -1946 1071 -43 -3538 706 3221 -1372 -425 3238 -1525 -4171 1640
1466A640J332l481J566L12m534K684L586m799L45O528m257p444N433M849m671
$$ 1640 2972 -509 1057 1369 -3165 -481 3105 -1694 -1349 5179 922 -6522 -1089 3760 -911
1481i11K95L009l630p94L215l394j122R226j688r755K294O808l766j860N412j437
$$ -911 -616 2393 -1237 -2031 1184 -2210 -3332 5894 4206 -5549 -3255 3553 -213 -2073 3339 1902
1497A902l404K377k320l217Q621L203j0188j410Q277l437n276N946K651m341J165
$$ 1902 -1502 875 -1445 -4662 3959 7162 -3026 -4436 3841 404 -4872 1074 3725 -616 549
1512E49r13n626N484O986p098l236P510k255q126N316O177m463L80K107o869k06
$$ 549 -364 -5990 -506 6480 -618 -3854 3656 1401 -6725 -1409 4768 305 685 2792 -4077 -4283
1528d283Q528j659n172N920L75r867K541P560l430m95N401o331o077P682K148
$$ -4283 4245 2586 -2586 3334 3709 -6158 -3617 3943 513 18 5419 -912 -6989 693 2841
1543B841n784M815L913q946j488P067l831k596R206J2r792J868L939m735K803
$$ 2841 -2943 1872 5785 -3161 -4649 2418 -1413 -4009 5197 5209 -4583 -2715 1224 -3511 -708
1558g08P580n699m290N239m182n261J0997N974j0897l628O643k807k238O338n23
$$ -708 6872 1173 -3117 2122 -2060 -7321 3676 9650 -1247 -4875 1768 -1039 -3277 3061 2538
1573B538m178M862k546q870O318R770q032m511Q455j690q411L894M337j507L765
$$ 2538 -1640 3222 676 -8194 -1876 7894 -138 -4649 3806 2116 -6295 -2401 1936 429 4194
1588D194n59j0588R55J1735k958o101O639N24r452K455O044l342J718L958p905
$$ 4194 3635 -6953 -5998 5737 2779 -3322 3317 3841 -5611 -3156 2888 -454 1264 5222 -2683
1603b683l510R604J3r132N410O970p035l551L318k225J179Q055m099p570N141
$$ -2683 -6193 3411 3424 -5708 -298 6672 -363 -3914 -596 -2821 -1642 6413 2314 -5256 -115
1618a15J749p495M861R577o516o947M284L68k878N733J966o551J153L465n451
$$ -115 1634 -5861 -1000 8577 2061 -4886 -602 -234 -3112 2621 4587 -1964 -811 2654 -2797
1633b797m50O964k030l602N527k242q866M879Q301m990k853N220l240n328M529
$$ -2797 -3247 3717 1687 -1915 3612 1370 -7496 -2617 5684 694 -2159 3061 -179 -5507 -978
1648i78L423k155K525j016p016K414P165m206l581P106k60o972K241L116m042
$$ -978 2445 290 2815 1799 -5217 -2803 4362 156 -3425 3681 3421 -3551 -1310 1806 -2236
1663b236K416N272n053m795M766P65l637L681K342m851n88K001k698K825M989
$$ -2236 180 5452 399 -4396 370 1135 -2502 1179 3521 -1330 -1918 83 -2615 210 5199
1678E199n945n256P581K789p380p97P256j104l447J043n48r87K988l74j759L406
$$ 5199 -746 -6002 1579 4368 -3012 -3809 3447 2343 -1104 -61 -609 -1596 1392 1018 -741 2665
1694B665l28p426J325Q583r85n727J069O64k818L243L319l750j788K029p71M6
$$ 2665 2337 -5089 -3764 4819 3834 -1893 -824 -160 -2978 265 3584 -166 -1954 75 -696 -650
1710f50K183j438k936L170J861l096N68J407l458k7O045p3n725o01K273L59K309
$$ -650 1533 95 -2841 329 2190 -906 -338 1069 -2389 -2416 3629 3556 -2169 -2770 -497 -138 2171
1727B171R99l755k093K063R72K14J919j633l901J838L416j924j160J256j174j188
$$ 2171 3170 -585 -2678 -615 357 571 2490 857 -3044 -1206 2210 286 -874 382 -792 -1980
1743a980K971J343l288j289J564J172J168N7l004j113L337J94j413J580K46l290
$$ -1980 991 2334 -954 -2243 -679 493 1661 1718 -1286 -2399 938 1132 -281 1299 1545 -1745
1759a745m34L495J242k177j009m15L76J699N7j536q7O50j040M14J722k20k156
$$ -1745 -2179 1316 2558 381 -628 -1043 -667 1032 1089 -447 -534 116 -924 -510 1212 992 -1164
1776a164k50J436K39J79L11j666n77J749N70j15l62q31r03J642J210o20p38p29
$$ -1164 -1414 22 261 440 751 -915 -1492 257 827 712 350 -481 -1384 258 1468 848 110 -619
1794f19k66P29J462K60j900j169N13J110Q76j10j571q06M84J383P34l12j507q85
$$ -619 -885 -156 1306 1566 -334 -1503 -990 120 996 886 -685 -1491 -1007 376 1110 798 -709 -1594
1812a594R53J973J6j319r31k87J229R73J17r53j333J48J616Q89l49j495r46O01
$$ -1594 -641 1332 1348 29 -902 -1189 40 1013 1130 177 -1156 -1008 608 1497 1148 -347 -1293 -692
1830f92J213K24n01r20q13J019R73N15j036j072M0R14J099n07j026J5M7O97M15
$$ -692 521 745 244 -676 -1489 -470 503 1018 -18 -1090 -1050 -136 963 456 -570 -555 -508 189 604
1849F04N9n46p14J27P35M21k84l42l31J70M55j03k9k73j27m87K87O53j11k97j83
$$ 604 663 117 -597 -470 265 686 402 60 -271 -101 354 251 222 -51 -178 -665 -378 275 164 -133 -316
1870c16Q9j19L20M67n54k89Kj1O03M56m43q54K81O06K03M43j69j451m54J266P12
$$ -316 -227 -346 -26 441 -113 -402 -400 -411 192 648 205 -649 -368 238 441 884 715 -736 -1190 76 788
1891G88o16K52j045n58J353Q95q26q32L9n6K53J472p04j541J82R16L98n6K63j221
$$ 788 172 424 -621 -1179 174 1069 243 -589 -550 -606 -353 1119 415 -1126 -944 -28 370 314 577 -644
1911f44p88J932J031j106m25l85p08J330J561j260j271M28k4j68J585J27k515
$$ -644 -1432 500 1531 425 0 -385 -1093 237 1798 538 -733 -305 -329 -497 1088 1215 -1300
1928a300J23J859l26p66R21p51r25J448N05j011n83P92n56Q27J856k258j920K164
$$ -1300 -1177 682 356 -410 511 -240 -1165 283 788 -223 -806 -14 -570 257 2113 -145 -2065 99
1946I9J021j524R93Q74k383n47K224R5j123J531o32k012J403J501k369m7K016
$$ 99 1120 -404 589 1463 -920 -1467 757 852 -271 1260 628 -1384 19 1520 -849 -896 1120
1963A120q85j188J179m19j281K261R36k674k29K227j509j443L147O80k935P52
$$ 1120 235 -953 226 -193 -1474 787 1723 -951 -1180 1047 -462 -1905 1242 1922 -1013 -261
1979b61N38j580J419K081k429n35K772k106k469L220J668k937K11J699k492p64
$$ -261 277 -1303 116 2197 -232 -767 2005 -101 -2570 650 2318 -619 -408 1291 -1201 -1965
1995a965L139l33j831K274n84l742J812L002j891n75K675k552k302L540M32k319
$$ -1965 1174 841 -990 1284 700 -3042 -1230 1772 -119 -694 1981 -571 -2873 667 1099 -1220
2011a220K722J103m220k07K953j308o88L408j029l971J764J764k505J098L252
$$ -1220 1502 2605 -1615 -1822 1131 -177 -865 2543 1514 -2457 -693 1071 -1434 -336 2916
2026B916k726k093K204p61k008L962J143m308M04K631k789q71M357k98k700J553
$$ 2916 190 -1903 301 -460 -2468 1494 2637 -1671 -1267 1364 -1425 -2296 2061 1763 -937 616
2042F16n71k917K879L191l416r59L521k542l217L989J692k778J225P33m080R33
$$ 616 45 -2872 7 3198 -218 -1177 2344 -198 -3415 574 2266 -512 713 1446 -2634 -1701
2058a701L946k347j726M058n17n350J928L265j951N73K240l272j944L958n97k507
$$ -1701 2245 -102 -1828 2230 1713 -3637 -1709 1556 -395 178 2418 -854 -2798 1160 563 -1944
2074a944L981J289n243n24L791j364p24L426j518l209J974O22k983K735L584m113
$$ -1944 2037 3326 -1917 -2441 1350 -14 -738 2688 1170 -2039 -65 557 -2426 309 3893 -220
2090b20k556L680j454j995L936J336l847L96J746l338L13M697j293k881K379m53
$$ -220 -2776 904 -550 -2545 1391 2727 -1120 -724 1022 -2316 -2003 2694 1401 -1480 899 446
2106D46l816K880L345k837q1K443l402k374M220J544k596J253M64m183P97L818
$$ 446 -3370 -490 2855 18 -63 2380 -1022 -3396 824 2368 -228 1025 1489 -2694 -1897 1921
2122A921j800j159L285j287l747K017K100k478J155K512l122j611L526j334k077
$$ 1921 121 -1038 2247 960 -2787 -770 1330 -1148 7 2519 -603 -2214 1312 -22 -2099
2137b099L883J263m451m80K582j233L16K561j973k094K597m26k873K826K860l785
$$ -2099 1784 3047 -1404 -1884 698 -535 -219 2342 369 -1725 872 446 -2427 399 3259 -526
2153e26j631K995p20j992K769M59k234J111L95l077J042L800j088k107J450q14
$$ -526 -2157 838 118 -1874 895 1354 -880 231 626 -2451 -1409 2391 1303 -804 646 -168
2169a68k224K647J841k493K45J865k761r82L349j47j945J158R99k452j57J945
$$ -168 -2392 255 2096 -397 -152 1713 -1048 -2030 1319 1172 -773 385 1384 -1068 -1225 720
2185G20j583O12K710j959k920J586J575j378J163J560k843j460K657J57j269J555
$$ 720 -863 -251 2459 500 -2420 -834 741 -637 526 2086 -757 -2217 440 597 -672 883
2201H83R9k129R52J307j407m65J650p34o69J966r30k603J418K526q17j292J97
$$ 883 982 -1147 -195 1112 -295 -760 890 156 -513 1453 523 -2080 -662 1864 1047 -245 -48
2218d8j286L08K131L11k014M24k71r45J668J752j830k027J614J052q71M14m65
$$ -48 -1334 -1026 1105 1416 -598 -174 -445 -1390 278 2030 200 -1827 -213 839 -32 382 -83
2235h3j209J014J866r29j184K15j56J60J887j01k721j01J370M75L92N81k287j520
$$ -83 -1292 -278 1588 659 -525 -310 -466 -306 1581 1480 -1241 -1342 28 503 895 1476 -811 -2331
2253b331K086J942j070j086l49j6Q28J217q84j038J87J02P69J057q79j793j80
$$ -2331 -245 1697 627 -459 -808 -824 4 1221 337 -701 -514 -412 357 1414 535 -1258 -1438
2270a438K166R64q69q37j042J44J594J040j357q84k76N66O88J067j257j549N05
$$ -1438 728 1692 823 -14 -1056 -912 682 1722 365 -519 -795 -229 459 1526 269 -1280 -775
2287g75Q10N03k16j20j002j20J437Q22r45r18m03N64J133N5o86p38J86N84L16
$$ -775 35 538 322 202 -800 -920 517 1339 394 -524 -927 -363 770 825 139 -599 -413 171 487
2306D87k88k50m23J23O85j64K6l32j11J50N18j85n48m13M49M13J87n67j80L83
$$ 487 199 -51 -474 -351 334 170 196 -136 -247 -97 421 236 -312 -725 -276 137 324 -243 -423 -40
2326d0N03k92j37j98K56mM35j16n87l32N52M40J61q30k43K66L26N52m77n95l35
$$ -40 463 171 34 -164 92 88 523 407 -180 -512 40 480 641 -189 -432 -166 160 712 235 -360 -695
2347f95J92Q68K26n87p94K76N33O58J0j168m13R9J390M55p37r34j68O94Q67K04
$$ -695 -503 365 591 4 -790 -514 19 677 687 -481 -894 -795 595 1050 313 -621 -789 -95 772 976
$$ [...]
8191d22
##END NTUPLES=NMR FID
##END=
