##TITLE=1H_Pr BrEtOH
 D2O
 8 sc, 
 6.3.2024
##JCAMPDX= 6.0         $$ Bruker NMR JCAMP-DX V2.0
##DATA TYPE= NMR FID
##DATA CLASS= NTUPLES
##ORIGIN= UXNMR, Bruker Analytische Messtechnik GmbH
##OWNER= root
$$ XWIN-NMR		Version 3.5
$$ Wed Mar  6 18:06:18 2024 Russian Standard Time (UT+4h)  she@DPX200
##.OBSERVE FREQUENCY= 200.1313
##.OBSERVE NUCLEUS= ^1H
##.DELAY= (6, 6)
##.ACQUISITION MODE= SIMULTANEOUS
##.ACQUISITION SCHEME= undefined
##.AVERAGES= 8
##.DIGITISER RES= 18
##SPECTROMETER/DATA SYSTEM= spect
##.PULSE SEQUENCE= zg30
##.SOLVENT NAME= D2O
##.SHIFT REFERENCE= (INTERNAL, D2O, 0, 15.7039)
##AUDIT TRAIL= $$ (NUMBER, WHEN, WHO, WHERE, WHAT)
$$ ##TITLE= Audit trail, XWIN-NMR		Version 3.5
$$ ##JCAMPDX= 5.01
$$ ##ORIGIN= Bruker BioSpin GmbH
$$ ##OWNER= she
$$ F:/spectra/data/she/nmr/H-F/1/audita.txt
$$ ##AUDIT TRAIL=  $$ (NUMBER, WHEN, WHO, WHERE, WHAT)
(   1,<2024-03-06 18:05:17.93 +0400>,<she>,<DPX200>,
      <created by zg, POWCHK disabled, PULCHK disabled
       configuration hash MD5:
       00 E9 B6 7A A2 85 ED C7 34 08 36 98 17 FE 4E 26
       data hash MD5: 16K
       F5 5C 1F 9D 61 06 5F C5 B6 0C 54 72 E4 E0 F3 6E>)
$$ ##END=
$$ 
$$ hash MD5
$$ 2D 49 02 5F BC 7F 6A 5F A0 DE CF 6F CC EE 38 EB
##$RELAX= 
##$RELAX= 
##$RELAX= 
##$RELAX= 
##$RELAX= 
##$RELAX= 
$$ Bruker specific parameters
$$ --------------------------
##$DU= <F:/spectra>
##$EXPNO= 1
##$NAME= <H-F>
##$PROCNO= 1
##$TYPE= <nmr>
##$USER= <she>
##$AMP= (0..31)
100 100 100 100 100 100 100 100 100 100 100 100 100 100 100 100 100 100 
100 100 100 100 100 100 100 100 100 100 100 100 100 100 
##$AQSEQ= 0
##$AQ_mod= 1
##$AUNM= <au_zg>
##$AUTOPOS= <>
##$BF1= 200.13
##$BF2= 200.13
##$BF3= 200.13
##$BF4= 200.13
##$BF5= 200.13
##$BF6= 200.13
##$BF7= 200.13
##$BF8= 200.13
##$BYTORDA= 1
##$CFDGTYP= 0
##$CFRGTYP= 5
##$CHEMSTR= <none>
##$CNST= (0..31)
1 1 145 1 1 1 1 1 1 1 1 1 1 1 1 1 1 1 1 1 1 1 1 1 1 1 1 1 1 1 1 1 
##$CPDPRG= <>
##$CPDPRG1= <>
##$CPDPRG2= <>
##$CPDPRG3= <>
##$CPDPRG4= <mlev>
##$CPDPRG5= <mlev>
##$CPDPRG6= <mlev>
##$CPDPRG7= <mlev>
##$CPDPRG8= <mlev>
##$CPDPRGB= <>
##$CPDPRGT= <>
##$D= (0..31)
0 1.2 0 0 0 0 0 0 0 0.06 0 0.03 0 0 0 0 0.0002 0 0 0 0 0 0 0 0 0 0 0 0 
0 0 0 
##$DATE= 1709733917
##$DBL= (0..7)
120 120 120 120 120 120 120 120 
##$DBP= (0..7)
150 150 150 150 150 150 150 150 
##$DBP07= 0
##$DBPNAM0= <>
##$DBPNAM1= <>
##$DBPNAM2= <>
##$DBPNAM3= <>
##$DBPNAM4= <>
##$DBPNAM5= <>
##$DBPNAM6= <>
##$DBPNAM7= <>
##$DBPOAL= (0..7)
0.5 0.5 0.5 0.5 0.5 0.5 0.5 0.5 
##$DBPOFFS= (0..7)
0 0 0 0 0 0 0 0 
##$DE= 6
##$DECBNUC= <off>
##$DECIM= 32
##$DECNUC= <off>
##$DECSTAT= 4
##$DIGMOD= 1
##$DIGTYP= 9
##$DL= (0..7)
0 120 120 120 120 120 120 120 
##$DP= (0..7)
150 150 150 150 150 150 150 150 
##$DP07= 0
##$DPNAME0= <>
##$DPNAME1= <>
##$DPNAME2= <>
##$DPNAME3= <>
##$DPNAME4= <>
##$DPNAME5= <>
##$DPNAME6= <>
##$DPNAME7= <>
##$DPOAL= (0..7)
0.5 0.5 0.5 0.5 0.5 0.5 0.5 0.5 
##$DPOFFS= (0..7)
0 0 0 0 0 0 0 0 
##$DQDMODE= 0
##$DR= 18
##$DS= 0
##$DSLIST= <SSSSSSSSSSSSSSS>
##$DSPFIRM= 0
$$ [...]
##$SUBNAM2= <"">
##$SUBNAM3= <"">
##$SUBNAM4= <"">
##$SUBNAM5= <"">
##$SUBNAM6= <"">
##$SUBNAM7= <"">
##$SUBNAM8= <"">
##$SUBNAM9= <"">
##$SW= 18.0517328524113
##$SWIBOX= (0..15)
0 0 2 0 0 0 0 0 0 0 0 0 0 0 0 0 
##$SW_h= 3612.71676300578
##$TD= 16384
##$TD0= 1
##$TE= 0
##$TE2= 300
##$TE3= 300
##$TEG= 300
##$TL= (0..7)
0 120 120 120 120 120 120 120 
##$TP= (0..7)
150 150 150 150 150 150 150 150 
##$TP07= 0
##$TPNAME0= <>
##$TPNAME1= <>
##$TPNAME2= <>
##$TPNAME3= <>
##$TPNAME4= <>
##$TPNAME5= <>
##$TPNAME6= <>
##$TPNAME7= <>
##$TPOAL= (0..7)
0.5 0.5 0.5 0.5 0.5 0.5 0.5 0.5 
##$TPOFFS= (0..7)
0 0 0 0 0 0 0 0 
##$TUNHIN= 0
##$TUNHOUT= 0
##$TUNXOUT= 0
##$USERA1= <user>
##$USERA2= <user>
##$USERA3= <user>
##$USERA4= <user>
##$USERA5= <user>
##$V9= 5
##$VALIST= <valist>
##$VCLIST= <CCCCCCCCCCCCCCC>
##$VD= 0
##$VDLIST= <DDDDDDDDDDDDDDD>
##$VPLIST= <PPPPPPPPPPPPPPP>
##$VTLIST= <TTTTTTTTTTTTTTT>
##$WBST= 1024
##$WBSW= 4
##$XGAIN= (0..3)
0 0 0 0 
##$XL= 0
##$YL= 0
##$YMAX_a= 733881
##$YMIN_a= -875945
##$ZGOPTNS= <>
##$ZL1= 120
##$ZL2= 120
##$ZL3= 120
##$ZL4= 120
##$ABSF1= 10
##$ABSF2= 0
##$ABSG= 5
##$ABSL= 3
##$ALPHA= 0
##$AQORDER= 0
##$ASSFAC= 0
##$ASSFACI= 0
##$ASSFACX= 0
##$ASSWID= 0
##$AUNMP= <proc_1d>
##$AZFE= 0.1
##$AZFW= 0.1
##$BCFW= 1
##$BC_mod= 2
##$BYTORDP= 1
##$COROFFS= 0
##$CY= 11.3945322036743
##$DATMOD= 1
##$DC= 2
##$DFILT= <>
##$DTYPP= 0
##$F1P= 15.7292609196834
##$F2P= 12.9074282941183
##$FCOR= 0.5
##$FTSIZE= 0
##$FT_mod= 4
##$GAMMA= 1
##$GB= 0.15
##$INTBC= 1
##$INTSCL= 1
##$ISEN= 128
##$LB= 0.24
##$LEV0= 0
##$LPBIN= 0
##$MAXI= 10000
##$MC2= 0
##$MEAN= 0
##$ME_mod= 0
##$MI= 1.114404
##$NCOEF= 0
##$NC_proc= 0
##$NLEV= 6
##$NOISF1= 3.799351
##$NOISF2= 2.8
##$NSP= 1
##$NTH_PI= 0
##$NZP= 0
##$OFFSET= 15.70392
##$PC= 1
##$PHC0= -24950.39
##$PHC1= 17.38731
##$PH_mod= 1
##$PKNL= yes
##$PPARMOD= 0
##$PSCAL= 0
##$PSIGN= 0
##$REVERSE= no
##$SF= 200.130013532006
##$SI= 16384
##$SIGF1= 3
##$SIGF2= 2
##$SINO= 400
##$SIOLD= 16384
##$SREGLST= <1H.CDCl3>
##$SSB= 0
##$STSI= 0
##$STSR= 0
##$SW_p= 3612.71676300578
##$SYMM= 0
##$S_DEV= 0
##$TDeff= 0
##$TDoff= 0
##$TI= <>
##$TILT= no
##$TM1= 0
##$TM2= 0
##$TOPLEV= 0
##$USERP1= <user>
##$USERP2= <user>
##$USERP3= <user>
##$USERP4= <user>
##$USERP5= <user>
##$WDW= 1
##$XDIM= 8192
##$YMAX_p= 0
##$YMIN_p= 0
$$ End of Bruker specific parameters
$$ ---------------------------------
##NTUPLES= NMR FID
##VAR_NAME=  TIME,          FID/REAL,        FID/IMAG
##SYMBOL=    X,             R,               I
##VAR_TYPE=  INDEPENDENT,   DEPENDENT,       DEPENDENT
##VAR_FORM=  AFFN,          ASDF,            ASDF
##VAR_DIM=   8192,          8192,            8192
##UNITS=     SECONDS,       ARBITRARY UNITS, ARBITRARY UNITS
##FACTOR=    0.0002768,     1,               1
##FIRST=     0,             0,               0
##LAST=      2.2672688,     0,               0
##MIN=       0,             -875945,         0
##MAX=       2.2672688,     733881,          0
$$ Real data points
##PAGE= N=1
##DATA TABLE= (X++(R..R)), XYDATA
0 0 0 0 0 0 0 0 0 0 0 0 0 0 0 -2 0 -8 8 -8 8 -8 16 -16 16 -24 24 -29 36 -37 45 -52 60 -68 76 -87 95 -110 122
37 122 -133 152 -167 187 -207 228 -255 278 -307 340 -371 414 -452 500 -551 608 -671 742 -826
56 -826 920 -1029 1162 -1315 1509 -1751 2066 -2502 3121 -4096 5811 -9454 20533 -128521 -738285
71 -738285 -875945 -515948 27698 366750 388183 244779 186582 239754 231160 -9939 -403233
82 -403233 -680992 -589823 -142616 386081 672738 603365 289564 -62264 -312248 -426054
92 -426054 -431740 -329371 -104135 197824 438122 488481 329920 64400 -172986 -311158 -369278
103 -369278 -370844 -271767 -19383 335917 610805 598916 244956 -260454 -594263 -563942 -254348
114 -254348 73799 223664 202326 167461 228614 306006 215863 -106184 -491606 -654094 -430354
125 -430354 61630 497228 611050 395181 55043 -189406 -264043 -245405 -233152 -223668 -130434
136 -130434 86817 338096 463433 362197 78943 -228193 -407338 -409297 -272544 -62026
146 -62026 165232 349664 420689 323063 71300 -218300 -389139 -362783 -193950 -6667 115400
157 115400 179898 239576 294500 260109 59802 -255698 -501315 -489936 -193864 209213 461140
168 461140 429074 195799 -40770 -150269 -152388 -152713 -206563 -242306 -141437 112781 381991
179 381991 473062 299486 -41581 -339689 -431388 -311142 -95933 91164 199111 242131
189 242131 243803 191967 61975 -124638 -285584 -332174 -236430 -46590 149798 279774 312551
200 312551 245499 88992 -119924 -304151 -370501 -268660 -39083 198126 316656 278364
210 278364 146683 13593 -78431 -146021 -214533 -257860 -205266 -20033 230977 398659 362642
221 362642 131827 -156049 -331374 -320303 -178667 -20375 84834 141138 184710 216923 189963
232 189963 58993 -144501 -312509 -338477 -196534 35549 232643 308275 254548 123573
242 123573 -26522 -155805 -237947 -250351 -175965 -26941 142327 255315 263813 172597 27696
253 27696 -116805 -219894 -255710 -210316 -82679 95868 253636 309854 226735 41396 -150282
264 -150282 -256471 -245964 -152612 -34567 72185 157537 214193 218025 139417 -20511 -198914
275 -198914 -301885 -266887 -106718 92821 233661 262807 191606 70384 -53483 -152335 -210240
286 -210240 -210692 -139417 -4280 148138 249709 249657 146216 -14097 -162687 -242538 -230348 -138015
298 -138015 458 137948 227102 233418 151192 11145 -130334 -217813 -222308 -149906 -29132
309 -29132 98998 195845 229018 181220 60828 -91979 -214619 -250840 -183754 -43941 105439
320 105439 203212 219904 160943 54546 -64916 -164013 -213386 -190927 -95490 44951 175789
331 175789 238678 204574 88491 -58428 -175410 -221028 -185133 -87769 35643 144935 205545
342 205545 195731 114786 -12418 -139063 -214830 -208370 -121380 11795 137767 208587 200791 120835
354 120835 -409 -118959 -194486 -200431 -134949 -19737 105038 192474 208945 146226 27552
365 27552 -101414 -190654 -206249 -144836 -32298 88788 175526 198821 151830 50738 -69898
376 -69898 -167404 -204886 -165838 -62658 65695 168366 205557 164699 64070 -57695 -155488
387 -155488 -195780 -165211 -76710 40055 142733 194062 174309 89583 -28784 -136529 -193486
398 -193486 -178967 -98096 19026 129292 191459 181968 104098 -12343 -122543 -184717 -177461
409 -177461 -106928 -442 104144 172258 180263 124012 20631 -94033 -176922 -192844 -133137
420 -133137 -20902 97550 174783 183334 124902 25526 -78372 -153132 -175992 -138408 -50697
431 -50697 59504 152468 190286 153480 55910 -63446 -155559 -185602 -146000 -54803 51864
442 51864 137041 173771 150147 73066 -32037 -128563 -179383 -162599 -83152 28127 128425
453 128425 178529 160990 84782 -20411 -116095 -168304 -161004 -95452 5050 104252 166543 167594
465 167594 106386 4128 -99409 -164924 -168435 -109260 -10885 89902 156674 166162 116038 23544
477 23544 -77922 -151431 -169573 -124323 -32378 70984 146762 168041 127521 41339 -59258
488 -59258 -139036 -168383 -136014 -51867 52745 137879 169402 135975 52581 -46601 -125237 -156837
500 -156837 -135049 -68204 23060 110851 163200 156336 85775 -22948 -124159 -172760 -149746 -69417
512 -69417 29212 107959 143213 132484 83749 8132 -76895 -144565 -163495 -116075 -14895 96903
524 96903 167310 165071 95885 -3990 -91317 -138760 -138659 -97362 -25785 58186 128041 155589 123053
537 123053 39223 -61855 -137562 -157978 -119619 -39595 51924 125967 157113 131023 51756 -51146
549 -51146 -133921 -159767 -118609 -36613 47540 104370 125080 113967 73253 3350 -84281 -156256
561 -156256 -168668 -100156 23256 137343 180957 136317 40457 -50095 -98194 -106557 -95715 -74650
573 -74650 -31669 41819 124410 169242 134294 24957 -102052 -176386 -162193 -78502 21073 91692
585 91692 119373 112914 82689 29574 -41679 -111203 -144845 -118711 -39499 55546 124050 142702
597 142702 110765 43866 -38603 -113852 -153808 -133714 -51892 57381 138854 151347 96639 14738
609 14738 -49663 -80296 -90941 -94408 -82212 -30856 61773 153942 182328 111028 -27527 -149834
621 -149834 -183782 -120752 -16527 61180 84944 77631 72087 71719 47353 -22406 -113839 -167628
633 -167628 -135211 -25055 98849 165831 147685 70629 -16396 -78099 -107765 -109809 -84182 -27975
645 -27975 47528 111270 130655 94398 24126 -46068 -92891 -111950 -104370 -65066 9869 102031
657 102031 164682 150618 53180 -74300 -154999 -145062 -66904 14912 52727 52054 52921 76233 94526
670 94526 59062 -42677 -155342 -193386 -115470 35215 158092 178766 102045 -1664 -63532
681 -63532 -70029 -57562 -61252 -72250 -52192 18589 109231 156828 120967 17986 -88679 -142366
693 -142366 -127687 -68828 572 60758 103021 117637 90202 20863 -62013 -116125 -113704 -65388
705 -65388 -6188 36286 61644 83408 99621 83257 12116 -93839 -171736 -158367 -50462 85599
717 85599 160305 134142 46144 -29849 -49264 -33847 -33733 -68118 -97583 -65291 37091 148264
729 148264 182689 104999 -35118 -143917 -158146 -90314 -3598 48131 59542 60206 68741 70653
741 70653 38298 -31796 -103723 -130623 -92367 -11831 66181 108497 109576 77887 23045 -45404
753 -45404 -107551 -131219 -93534 -7637 78883 116970 93232 38204 -5341 -23587 -36094 -64917
765 -64917 -98681 -93755 -21565 91183 170316 152580 41670 -87562 -149757 -117390 -35475 26219
777 26219 38055 26330 35160 70341 91289 51749 -43787 -135869 -155559 -83600 31386 116603
789 116603 129494 83296 20369 -26514 -53801 -72521 -81491 -66458 -18246 47960 97289 103296
801 103296 65870 8046 -45046 -81225 -96217 -84452 -38173 36340 108508 133581 89847 -571
813 -571 -82505 -109690 -79482 -28705 4935 16537 29902 61824 94042 85355 14439 -86965
825 -86965 -151384 -129690 -34152 71907 122916 101128 42244 -6237 -25956 -34799 -52567 -75315
837 -75315 -73052 -25284 52535 114640 119118 62656 -19833 -83481 -103110 -82764 -40781 7712
849 7712 53650 85827 90061 58328 98 -57163 -87655 -81316 -48838 -8181 31160 65391 88401
862 88401 84193 40214 -34306 -102818 -123377 -80014 1209 71360 95047 73139 34287 4153
874 4153 -15512 -38430 -68216 -85819 -64474 1253 79368 122540 101722 30124 -48598 -92781
886 -92781 -89283 -55680 -15729 18401 46747 69451 76102 54000 3685 -55690 -93641 -91151 -50165
899 -50165 8949 60013 86577 82579 50847 80 -52657 -87701 -87440 -51470 3616 53921 78102
912 78102 73395 47118 10429 -29371 -65053 -84745 -74009 -28725 35629 88403 100958 67337
924 67337 6479 -49083 -77416 -74113 -50119 -16717 19951 54213 77075 75003 40546 -16253
936 -16253 -70490 -94500 -77572 -28796 27525 68098 80728 65758 30862 -12691 -53835 -77791
948 -77791 -74755 -43014 6970 55255 82081 76577 42890 -5643 -50596 -76968 -75847 -47418 -1461
961 -1461 46035 76987 79041 51143 3842 -44114 -74990 -77898 -52412 -8361 38772 71127 77596
974 77596 55509 12951 -33470 -67452 -77240 -59299 -20057 27657 66508 80840 64215 22608
986 22608 -27981 -66736 -78812 -61666 -22081 23030 58586 73769 63538 31236 -13124 -55092
998 -55092 -77170 -70016 -35365 12491 55261 76265 68673 36778 -7937 -49661 -74420 -71695 -41415
1011 -41415 5145 49425 73443 68900 39393 -1593 -39645 -64080 -68327 -50154 -12559 33798
1023 33798 70940 81439 56687 6932 -44234 -73777 -71839 -43002 -4197 30807 54693 62884
1035 62884 54034 24976 -17475 -58884 -79445 -66325 -23733 28427 66274 75194 55213 18099
1047 18099 -21722 -52911 -67059 -58704 -29643 12425 51160 70697 62657 31273 -10506 -46758
1059 -46758 -66430 -63726 -39540 1331 45259 74068 72810 40013 -9740 -52502 -69733 -58227
1071 -58227 -28987 3840 31220 50836 59389 50894 20077 -26441 -67974 -81824 -57197 -5289
1083 -5289 46251 72127 64919 35497 762 -27177 -45816 -54654 -50175 -27251 12206 53198 75232
1096 75232 64238 23606 -26250 -61580 -69883 -51547 -17078 19770 48342 61462 53947 27618
1108 27618 -10458 -46037 -64044 -57898 -30075 7889 42090 61706 60799 37735 -1365 -42416
1120 -42416 -68276 -66200 -35878 8262 45764 61862 53556 29608 214 -27968 -49293 -58405
1132 -58405 -48028 -16428 27344 63603 72820 49127 4210 -39171 -62040 -58192 -35604 -5586
1144 -5586 22366 43898 54892 49501 24401 -14673 -52337 -69174 -56423 -18974 24722 55035
1156 55035 61899 45410 16343 -15737 -41717 -55361 -51768 -28861 7034 42967 62795 57689
1168 57689 28854 -10402 -43834 -59398 -52644 -28689 4650 36064 55862 56387 35385 231
1180 231 -35813 -58025 -57492 -34612 -312 32159 52379 54695 38468 8478 -25759 -52777 -60652
1193 -60652 -44302 -9364 29653 55599 57672 37922 7202 -23121 -43672 -51016 -43680 -21229
1205 -21229 11778 45383 63410 54527 20860 -22598 -54097 -59557 -41478 -10856 17036 36112
1217 36112 45044 43480 29553 1867 -33014 -59716 -61673 -34314 9542 47859 62159 49026
1229 49026 19652 -11502 -33481 -44711 -44164 -31584 -6749 24967 50660 57353 39412 4164
1241 4164 -31634 -53822 -54064 -35169 -5142 26513 49636 55354 39219 6317 -28760 -50626 -49902
1254 -49902 -31278 -5904 16844 33547 44280 44663 28652 -5159 -45246 -68811 -58662 -17254
1266 -17254 31765 59543 54454 26837 -1157 -16218 -21982 -28684 -38345 -38025 -15460 26496 64260
1279 64260 70420 37348 -16154 -56953 -63319 -39718 -6888 16509 26647 31614 34987 32193 14115
1292 14115 -17792 -48385 -58354 -40368 -3448 31854 51088 49685 31997 5707 -23519 -46919
1304 -46919 -53926 -37826 -3983 30725 48439 42584 22544 2527 -11243 -22934 -36305 -45496
1316 -45496 -36009 -1219 45077 73411 61023 13338 -38652 -62561 -48423 -15665 8399 13841
1328 13841 12125 19565 35659 42043 20694 -24492 -64863 -69865 -33997 18979 55230 57666 33878
1341 33878 5546 -13070 -22593 -30302 -35999 -31350 -10204 21325 45829 49432 30539 1969 -23246
1354 -23246 -38847 -43932 -36985 -15409 18936 50928 61045 38609 -4085 -40663 -49529 -32469
1366 -32469 -8660 3267 3823 8512 26634 47305 45215 8526 -45153 -77995 -63650 -10520 43915
1379 43915 63768 43423 8316 -12425 -11674 -6148 -14391 -33820 -42402 -21273 23004 60976 64422
1392 64422 30764 -16739 -48304 -51131 -33064 -9990 8685 22658 33958 37570 26687 1875
1404 1875 -24741 -39611 -36861 -22145 -4624 12098 28435 42543 43993 21991 -18784 -56151
1416 -56151 -64457 -35506 11696 45070 45422 22742 1136 -2454 2892 -2142 -25348 -49528 -46492
1429 -46492 -7177 46628 75377 56899 5445 -42186 -55977 -36209 -7782 7040 6474 7146 19258
1442 19258 35855 36930 12533 -26106 -53793 -51850 -23457 12497 36168 41496 33390 17959 -1334
1455 -1334 -23643 -39913 -40775 -22807 5658 28873 35575 27265 15322 5064 -5143 -21837 -39957
1468 -39957 -44855 -24160 17178 54597 61917 32747 -11638 -41260 -40979 -21151 -3535 143 -1917
1481 -1917 5872 26979 44442 37281 2080 -41146 -62261 -46517 -6755 29829 43657 34480 17004
1494 17004 3423 -5671 -16025 -28051 -34185 -25448 -1220 25888 41282 37597 19351 -3291 -23150
1507 -23150 -35483 -37954 -26447 -1890 26981 45083 40970 17366 -11328 -28763 -29615 -20828 -13002
1520 -13002 -7747 1903 20101 39135 43129 21192 -17503 -49815 -54224 -28170 8697 33086 34866
1533 34866 22421 9921 4634 -886 -13154 -30276 -38468 -26515 3930 35655 48850 36703
1545 36703 8714 -18797 -33315 -33328 -23959 -10356 5645 21523 32388 32018 18417 -3647 -23923
1558 -23923 -34216 -31166 -18204 63 19163 33156 36795 25298 1180 -24782 -39718 -36136
1570 -36136 -16908 6822 23210 28199 24817 17307 6971 -8630 -25223 -36268 -32381 -11223 16997
1583 16997 37580 39657 24268 861 -18983 -29081 -28987 -20951 -8634 7817 24256 33398 29970
1596 29970 13248 -9354 -28210 -34791 -27830 -11750 8205 24439 32469 29652 15210 -5653 -24895
1609 -24895 -34203 -29882 -14118 6014 22712 30636 27653 16394 -298 -18168 -30580 -31838 -20442
1622 -20442 -822 19812 32343 32140 19583 583 -18056 -29879 -31022 -21034 -3085 16357 28988
1635 28988 30730 21118 4276 -13296 -26083 -30079 -24279 -9366 10173 26928 34064 27036 8667
1648 8667 -13199 -28168 -31520 -23275 -7668 9255 22380 28607 25724 13067 -4632 -22655 -31771
1661 -31771 -28334 -13536 5916 22008 29730 27165 15764 -1954 -20080 -31406 -30818 -16655 4295
1674 4295 22439 30007 25281 12850 -1561 -13700 -22267 -26464 -22795 -8842 12405 31299 36727
1687 36727 24393 326 -21994 -31796 -26743 -13477 646 11027 18731 23387 22791 12860 -4960
1700 -4960 -24763 -34479 -28342 -9233 13300 28145 30460 21496 6620 -8609 -21317 -27256 -23799
1713 -23799 -11062 6442 21103 27322 22921 11678 -2947 -15819 -25681 -27797 -20040 -1901 20346
1726 20346 34837 32277 14106 -9523 -25077 -26886 -17855 -6941 807 7246 15911 24514 26069
1739 26069 13149 -11011 -32500 -38335 -23406 2666 24398 30167 22266 9415 -1027 -8119 -14736
1752 -14736 -21225 -22877 -14302 4529 24103 32894 26428 7698 -12804 -25072 -26772 -19739 -7895
1765 -7895 6948 19966 26900 23502 9851 -7820 -20925 -24591 -19230 -9545 1546 12435 21973
1778 21973 26722 20537 3033 -19379 -33931 -31563 -12989 10023 24092 24625 15472 6269 20
1791 20 -5694 -14051 -23416 -24701 -12003 10447 30829 35333 20998 -2878 -21733 -27134 -20672 -9706
1805 -9706 -146 7263 14490 20850 21325 12046 -5240 -22253 -29460 -23092 -6910 10398 22096 25071
1819 25071 19581 8249 -6371 -19631 -25911 -21785 -8307 7665 19347 22444 17702 8925 -940
1832 -940 -11478 -21206 -25134 -18882 -2103 18338 31084 28390 11525 -8499 -21333 -22128 -15196 -7259
1846 -7259 -894 6034 14604 22498 22718 10221 -10533 -28369 -31990 -18946 2202 19282 24310 19149
1860 19149 9246 727 -5897 -13455 -19921 -20385 -11823 4676 21259 28626 22167 6033 -11234 -21584
1874 -21584 -22901 -16672 -6085 5772 16283 21923 19830 9983 -4447 -17330 -22393 -19582 -9553
1887 -9553 2206 13583 21093 22502 14935 -102 -16339 -26595 -24083 -10803 5974 17560 20235
1900 20235 15574 8731 1283 -6228 -15097 -22050 -20912 -8761 10639 26836 29538 17002 -2840
1913 -2840 -18541 -22222 -16287 -7687 -957 4292 10623 17752 20626 13546 -3074 -21104 -29446 -22655
1927 -22655 -4858 13075 22499 20669 12479 2999 -5373 -12359 -17689 -18339 -11956 949 14958 22830
1941 22830 20642 10250 -3229 -15032 -21056 -20184 -12207 871 15134 23258 21356 10047 -4998
1954 -4998 -15347 -18100 -14247 -8250 -2334 4267 13285 21285 21272 9524 -10591 -27328 -29163 -15265
1968 -15265 5286 19625 20486 12347 4344 1017 -646 -6393 -15932 -21793 -16344 1550 21714 30852
1982 30852 22655 2784 -15238 -22352 -18012 -9139 -1575 3842 9357 14952 17579 12590 189 -13863
1996 -13863 -21710 -19895 -9743 3089 13438 19403 19340 12320 -659 -14871 -23163 -20472 -8311 6497
2010 6497 15127 15052 10626 6388 4076 -865 -10954 -21615 -23496 -10910 10931 28636 29533 13392
2024 13392 -8055 -20196 -18258 -8604 -1922 -1490 -1967 4081 15113 22507 16751 -1568 -21631 -29700
2038 -29700 -20786 -1789 14352 19932 15938 9051 2481 -2753 -9172 -15307 -16816 -10470 1921 13593
2052 13593 18439 15892 8703 -397 -9508 -17249 -20341 -15217 -788 16009 25521 20741 5164 -9611
2066 -9611 -15580 -12164 -6183 -4812 -5597 -2394 8305 21351 24453 11984 -11160 -29183 -28568 -11909
2080 -11909 8654 19236 16378 7476 1596 2031 1928 -4075 -14795 -20827 -14705 2388 19462 25680
2094 25680 17984 2458 -10701 -16846 -15807 -11341 -4990 3155 11921 17024 14971 6337 -4124 -11867
2108 -11867 -13700 -12267 -8701 -3178 5628 16242 22279 16461 768 -17171 -25550 -18989 -3065 10161
2122 10161 13694 9678 5167 5375 6771 2708 -8820 -20843 -22581 -9496 11285 25523 24174 10375
2136 10375 -6221 -14755 -13877 -9280 -5595 -3909 536 8072 15855 17133 9090 -4639 -15426 -18830
2150 -18830 -14073 -4498 5039 12213 16393 15355 7647 -3986 -14920 -18867 -13148 -2731 6728 10471
2164 10471 10315 9295 8498 4509 -4004 -15005 -21246 -15861 -600 16109 23330 17350 4156 -7639
2178 -7639 -11905 -10049 -7834 -6286 -4733 807 10760 17763 16449 5579 -8669 -18469 -18480 -10610 117
2193 117 8747 13466 13822 10510 3590 -5716 -13034 -15452 -11229 -2907 4989 10180 12220 11702 7734 311
2209 311 -10194 -18057 -18271 -8947 5767 16795 18279 10943 1064 -6188 -8703 -9068 -9092 -8612 -4078 5182
2225 5182 14772 18598 12726 -528 -12818 -18189 -14821 -5923 2544 8979 11934 12274 8713 1845 -6648
2240 -6648 -12950 -14572 -9791 -1450 6097 11639 13204 10961 5238 -3916 -13101 -17390 -13878 -3264 8732
2255 8732 15474 14424 7665 218 -4834 -7714 -9537 -10771 -8289 -1041 9483 16790 16268 7474 -4749
2270 -4749 -13441 -15781 -11352 -3992 3318 8918 12368 12150 7424 -783 -9080 -13532 -12031 -6442 597
2285 597 6381 10847 12919 10937 3915 -6568 -16197 -18362 -10564 2262 12787 15065 9826 2900
2299 2900 -1592 -3041 -4996 -9241 -12090 -9824 442 13108 19775 15518 2621 -10556 -16304 -13307
2313 -13307 -5632 771 4511 6943 9064 10014 7052 -121 -9052 -14225 -12806 -6371 2452 9565 13054
2328 13054 12638 7454 -746 -10415 -15718 -13892 -5198 5464 11561 10934 6453 2587 971 -1129 -6169
2343 -6169 -12946 -14831 -7795 6267 18928 20437 9913 -5515 -15014 -13931 -6745 -233 1356 923
2357 923 3055 8792 12860 10098 -962 -13494 -18840 -13670 -1578 9277 13670 11746 6867 1759
2371 1759 -2953 -8085 -11392 -10833 -4728 3970 9898 11015 8191 3878 156 -4364 -9927 -13808 -11590
2386 -11590 -1895 11193 19197 15975 3658 -8839 -13926 -9087 -2372 311 -1448 -1868 3366 12232
2400 12232 16288 9241 -5930 -18995 -20643 -9522 5670 14433 13121 5996 342 -981 -988 -3637
2414 -3637 -8931 -11603 -8090 1622 11586 15482 11565 2803 -5689 -10758 -11846 -9438 -4112 3686 11097
2429 11097 13539 9338 1226 -6360 -8907 -7085 -4625 -3791 -3376 826 9109 16071 14240 1963 -13089
2444 -13089 -20729 -15499 -1166 10642 12892 6956 667 -301 3111 3710 -2805 -12626 -16544 -8851 6534
2459 6534 18495 19155 7890 -5766 -12885 -10920 -5315 -1086 -215 604 3901 9168 11277 6609 -2572
2474 -2572 -10759 -13509 -9291 -2707 4160 8861 11049 10133 5074 -3209 -10657 -13453 -9039 -490 6356
2489 6356 7998 6090 4133 3947 3248 -1104 -8919 -14921 -13025 -1914 12088 18550 13522 1196 -8860
2504 -8860 -10819 -6481 -1609 -1084 -2944 -2073 3976 12091 14047 6617 -6556 -15990 -15972 -7220 3980
2519 3980 10106 9722 6019 3075 1363 -1172 -5616 -9864 -9598 -4780 3428 9707 11154 8108 2935
2534 2935 -2601 -7446 -10327 -10344 -5499 3024 10550 12826 8359 338 -5972 -7467 -5788 -3964 -3895 -3513
2550 -3513 890 8269 13972 11964 1592 -11126 -17046 -12475 -1605 7778 9646 6178 1781 1459
2564 1459 2873 2009 -4014 -11286 -13288 -6198 5816 14730 14897 6656 -3652 -9522 -9029 -5589 -2521
2579 -2521 -1138 770 4569 8647 9151 5200 -2126 -8464 -11043 -8510 -3186 3277 7906 9824 8525
2594 8525 3937 -3159 -9163 -10528 -7028 -1286 3814 5647 5574 5278 5156 3146 -2071 -9407 -13089 -10049
2610 -10049 -130 10651 14839 10489 653 -6658 -7568 -4566 -2143 -2745 -4250 -1940 4696 12080 12878
2625 12878 5257 -6567 -14709 -13488 -4741 4321 8297 7002 3966 2280 2186 642 -3931 -8955 -10073
2640 -10073 -5640 2267 9560 11321 7426 1656 -3874 -6880 -8352 -7480 -3822 2045 7545 9865 7386
2655 7386 1910 -3648 -5923 -5742 -4943 -4563 -2628 1587 8134 12170 9736 504 -9901 -14168 -9939
2670 -9939 -839 6391 7122 3969 1472 2438 4344 2251 -4099 -11527 -12639 -5398 5974 13842 12879
2685 12879 4652 -4210 -7925 -6871 -4059 -2287 -2029 -476 3617 7798 9026 5106 -2090 -8035 -9991
2700 -9991 -7535 -2493 2395 6574 8667 8014 3785 -2699 -8159 -9613 -6236 -340 3359 4433 3736
2715 3736 3932 5102 4427 -525 -8562 -13190 -10334 58 10843 14142 8675 -964 -7066 -6199 -2346
2730 -2346 -288 -2732 -5381 -3512 3896 11891 12933 4825 -6507 -13795 -11621 -3997 4102 7107 5579
2745 5579 3434 2503 2423 462 -3632 -7798 -8552 -4278 2314 7362 8615 6628 2853 -1564 -5433 -8634
2761 -8634 -8200 -4016 2766 8529 9125 5031 -393 -3493 -3518 -2923 -3540 -5447 -4586 653 8429 12888 9038
2778 9038 -513 -10087 -12729 -7608 446 5346 4769 2362 1819 3609 4609 1601 -5024 -10542 -9671 -2932
2794 -2932 5664 10660 9366 3549 -1370 -4444 -5387 -5234 -4596 -2412 1713 5907 7477 5801 1781 -2664
2810 -2664 -4917 -5638 -5461 -4188 -851 4549 9273 9648 4442 -3412 -9581 -9432 -4040 1326 3634 2927
2826 2927 2092 3247 5405 4700 -486 -7949 -11715 -8343 896 8596 11047 6588 416 -4058 -4329 -3452
2842 -3452 -3384 -3610 -3130 278 5469 8563 7139 1965 -3986 -7642 -7597 -4802 -1063 2837 5845 7418
2858 7418 5773 1572 -3645 -6429 -6756 -3866 -681 1555 3301 4458 5887 5218 1489 -4629 -9511
2873 -9511 -9444 -3442 3735 8319 7805 3610 -353 -2331 -2245 -2865 -4422 -5169 -2820 2440 7506 9139 5567
2890 5567 -632 -5965 -7527 -6150 -2602 828 3386 5180 5784 4711 1228 -3053 -6323 -6500 -4093
2905 -4093 -553 2204 4755 5811 5378 2849 -1481 -5889 -8271 -6652 -1201 4525 6992 6118 3150
2920 3150 200 -1671 -2766 -4113 -5469 -4795 -973 4394 7970 7427 3213 -2254 -6063 -6707 -4939 -2140
2936 -2140 1388 3556 5438 5284 3435 5 -3905 -5799 -5571 -3327 -296 2543 5070 6415 5365
2951 5365 1878 -3294 -7524 -8043 -4352 1026 5069 5918 4114 1854 425 -811 -2439 -4866 -6532
2966 -6532 -4342 1093 6520 8856 6509 630 -4409 -5998 -5433 -2924 -714 924 2905 5074 5485
2981 5485 3707 -275 -4176 -6198 -5487 -2511 779 3700 5408 5717 4181 -197 -4249 -7114 -6452 -2218
2997 -2218 2618 4872 4472 3102 1924 1109 -287 -3370 -6483 -6661 -2904 3369 8321 8378 4053 -2312
3013 -2312 -5524 -5292 -3313 -1582 -702 309 2277 4961 5992 3613 -1192 -5968 -7472 -5455 -1058
3028 -1058 2913 5234 5305 4327 2034 -1419 -4641 -5982 -4856 -1146 2230 4023 4149 3025 2191 1114
3044 1114 -1272 -4996 -7253 -6057 -379 6183 8984 6577 939 -4136 -5196 -3189 -1208 -1087 -1802
3059 -1802 -1373 2584 6655 7712 3306 -3694 -8328 -8205 -3517 2288 5426 4691 2894 1719 778 -108
3075 -108 -2915 -5244 -5125 -2747 1465 5064 6023 4544 1918 -1035 -3982 -5669 -5405 -2600 1548 5825
3091 5825 6752 3891 -18 -3012 -3329 -2463 -1990 -2848 -2609 353 4696 8097 6570 258 -6373 -8864
3107 -8864 -6084 -107 4372 4375 2389 934 1323 2452 1357 -2513 -6471 -7052 -2837 3871 7795 7155
3123 7155 3059 -1640 -4194 -4292 -3191 -2362 -1296 847 3486 4984 4401 1818 -1792 -4097 -4558 -3660
3139 -3660 -2114 126 3136 5762 6002 3055 -1994 -6492 -6723 -3487 659 3032 2902 1447 1508 2916
3155 2916 2897 83 -4736 -7938 -6233 165 6392 8740 5462 -263 -3911 -4003 -2036 -720 -1464 -2388
3171 -2388 -1246 2569 6324 6531 2419 -3540 -6889 -6522 -2449 1257 3258 3499 3182 2428 991 -813
3187 -813 -3309 -4748 -4142 -1401 1632 3610 4142 3472 2084 -87 -2829 -5116 -5869 -2790 1914 5667
3203 5667 6018 3098 -588 -2507 -2499 -1534 -1700 -2899 -2874 161 4553 7523 5486 197 -5918 -7776 -4942
3220 -4942 -68 3339 3425 1977 1096 1417 2265 861 -2615 -5984 -6064 -2283 3210 6524 5929 2506 -1107
3237 -1107 -2994 -3520 -3330 -2446 -1202 905 3182 4542 3961 1392 -1198 -3409 -3936 -3761 -2532 -21
3253 -21 3079 5345 5496 2540 -1832 -5354 -5336 -2663 689 2251 1807 1189 1466 3151 2983 -144 -4453
3270 -4453 -7061 -5333 261 5551 7207 4301 -556 -3163 -2895 -1268 -964 -1945 -2719 -1015 2678 6096
3286 6096 6026 2013 -3312 -6210 -5492 -1952 1186 3056 3076 2556 2313 1463 -375 -3025 -4255 -3771 -1624
3303 -1624 1006 3157 3483 3293 2282 152 -2651 -5112 -5451 -2501 2030 5086 5077 2227 -545 -2050
3319 -2050 -1398 -825 -1931 -3221 -3134 -95 4719 7318 5214 -545 -5882 -6974 -3688 671 3191 2270
3335 2270 691 562 2016 3045 1398 -2459 -5973 -5710 -1781 3374 5570 4842 1867 -1052 -2459 -2530
3351 -2530 -2527 -2440 -1391 364 2780 4106 3292 834 -1155 -2751 -3079 -3071 -2644 -596 2420 5014 5372 2581
3369 2581 -2082 -4907 -4570 -2024 1219 1831 858 411 1389 3538 3467 279 -4636 -7132 -4898 636 5366
3386 5366 6593 3214 -717 -2891 -2005 -694 -843 -2092 -2824 -1062 2578 5354 5126 1391 -2951 -4906
3402 -4906 -4491 -1979 250 1889 3115 3131 2827 981 -1534 -3317 -3726 -2246 -501 586 1688 2193
3418 2193 3147 3410 1059 -2624 -5726 -5787 -2176 2863 5316 4353 1014 -1319 -1690 16 -195 -1733 -3727
3435 -3727 -3435 305 4885 6928 4377 -1075 -5037 -5577 -2767 406 2029 1550 869 1399 2436 2284
3451 2284 -145 -2826 -4817 -3880 -955 2325 3561 3816 2248 849 -997 -2877 -3929 -3235 -775 1945
3467 1945 3279 3072 1417 11 -345 -509 -1591 -3235 -3551 -1566 2441 5581 5371 1883 -2737 -5061
3483 -5061 -3796 -1111 1020 1240 147 524 2198 3343 2703 -795 -4092 -5573 -3153 820 3729 4095
3499 4095 2682 671 -721 -1286 -1964 -2512 -2427 -1265 1449 3142 3485 2146 541 -1260 -2173 -2696 -2891
3516 -2891 -1827 369 3251 4589 3499 431 -2595 -3877 -2665 -685 153 -146 457 1100 2962 3535
3532 3535 1383 -2449 -5210 -4773 -1676 1971 4043 3504 1560 -208 -768 -1002 -1560 -2065 -2542 -1414 1315
3549 1315 3363 3862 2404 -20 -1976 -3079 -3308 -2233 -179 1494 3217 3444 2111 -15 -1909 -2744
3565 -2744 -2017 -1376 -852 -171 1377 2648 3696 2419 -421 -3623 -4887 -3025 -307 2639 3113 2105
3581 2105 725 322 291 -500 -1943 -3073 -2845 -631 2510 3928 3516 1089 -1221 -2531 -2880 -1959 -1130
3598 -1130 80 1371 2550 2917 1639 -113 -2072 -2701 -2252 -1443 -436 541 1899 3126 3001 1457
3614 1457 -1566 -3951 -3804 -2084 485 2403 2693 1491 957 484 264 -929 -2572 -3423 -2306 418
3630 418 3085 4068 2939 194 -1698 -2532 -2096 -1835 -632 518 1463 2323 2478 1395 -449 -1937 -2513
3647 -2513 -2306 -1636 -330 1033 2470 3267 2448 130 -2753 -3962 -3057 -408 1495 2126 1341 769 834
3664 834 1359 666 -1538 -3756 -3845 -1659 2297 4548 3906 1495 -1261 -2323 -1914 -1162 -645 -750 -457 776
3682 776 2570 3136 1870 -481 -2794 -3477 -2403 -718 1011 2319 2435 2297 1097 -570 -2247 -2956
3698 -2956 -2050 -477 1077 1750 1504 1444 1494 1055 -477 -2500 -3610 -3123 12 3103 3938 2860 143
3715 143 -1746 -1688 -999 -619 -1166 -1395 -833 1298 3263 3481 1321 -1925 -3485 -3357 -1616 656 1587 1941
3733 1941 1640 1150 709 -286 -1580 -2593 -2241 -1015 748 1670 2127 2054 1613 30 -1297 -3203 -3077 -1600
3751 -1600 925 3202 3186 1448 -771 -1306 -1080 -216 -586 -1577 -1894 -260 2639 4512 3542 -106 -3491
3768 -3491 -4461 -2569 304 2010 1686 563 248 946 1622 728 -1234 -3300 -3422 -1250 1471 3508 3056
3785 3056 1163 -388 -1659 -1736 -1852 -1440 -805 717 1850 2034 1760 390 -502 -1199 -1489 -1886 -1832 -463
3803 -463 1418 3351 3643 1584 -1534 -3378 -2904 -1088 805 1136 498 90 857 2078 2250 -54 -2910
3820 -2910 -4385 -3000 171 3252 3947 1781 -308 -1768 -1123 -307 -446 -1194 -1556 -295 1739 3150
3836 3150 2960 952 -1644 -2963 -2550 -1280 183 1019 1522 1891 1813 891 -616 -1771 -2441 -1341 -228
3853 -228 586 1105 1203 1805 1677 746 -1263 -2991 -3067 -1625 1237 3083 2972 1085 -789 -893 -527 34
3871 34 -642 -1803 -1870 -120 2477 3553 2865 -185 -2945 -3776 -1957 -187 1151 958 565 549 1182 1282
3889 1282 144 -1604 -2965 -2301 -775 1166 2217 2562 1689 304 -853 -1695 -2133 -1539 -501 843
3905 843 2012 1754 907 269 -243 -309 -1204 -1962 -2032 -596 1370 2906 3254 1081 -1487 -3230 -2541 -648
3923 -648 780 802 129 -200 915 2138 1836 67 -2699 -3726 -2572 274 2777 3168 1553 -397 -1280
3940 -1280 -1033 -110 -510 -1402 -1324 -151 1466 2839 2524 873 -1284 -2381 -2011 -1155 95 723 1533 1596
3958 1596 1625 680 -845 -1815 -1957 -1402 -329 334 908 1294 1935 1824 609 -1321 -2824 -2794 -1109 1249
3976 1249 2684 2139 506 -611 -573 -227 17 -1139 -2123 -1788 93 2640 3310 2119 -301 -2294 -2819
3993 -2819 -1247 120 915 498 319 814 1533 1224 105 -1567 -2501 -2029 -314 1266 1919 1663 1093 572
4011 572 -492 -1404 -2042 -1764 -816 856 1664 1516 958 127 -86 -367 -999 -1747 -1816 -795 1226 2957 2730
4030 2730 1323 -994 -2516 -2009 -466 621 439 -179 103 943 2146 1713 -176 -2132 -3046 -2025 275
4047 275 2458 2572 1333 19 -673 -871 -469 -804 -1141 -939 116 1481 1979 1903 681 -886 -1786 -1893
4065 -1893 -1116 -480 596 1480 1808 1549 567 -857 -1459 -1003 -623 -241 -110 443 1102 1758 1671 658 -1346
4084 -1346 -2872 -2620 -722 1156 2128 1545 253 -393 -444 170 -328 -1467 -2012 -1290 636 2261 2577 1643
4102 1643 -539 -1780 -2114 -1026 -87 -146 220 335 1060 1308 917 -158 -1532 -1901 -1475 -368 779 1340
4120 1340 1635 1120 642 -380 -1282 -1480 -1234 -482 700 1653 1136 923 269 -142 -793 -1111 -1689 -1577 -439
4139 -439 1065 2196 2081 989 -758 -1607 -1506 -660 26 288 237 605 1396 1610 1096 -417 -1580 -2332
4157 -2332 -1394 101 1373 1740 1128 521 78 -571 -875 -1075 -1388 -763 158 1287 1592 1066 707 -575
4175 -575 -1056 -1506 -1315 -553 170 1238 1596 1281 421 -875 -1195 -1205 -841 -466 129 313 1255 1720 1419 81
4195 81 -1257 -2021 -1693 -652 683 1679 1204 626 128 -40 -223 -728 -1243 -1328 -615 660 1755 1683 985
4214 985 -331 -1218 -1443 -1011 -439 44 418 938 1177 1030 767 -367 -1156 -1742 -1221 -460 800 1452 1494
4233 1494 1124 580 -313 -942 -1330 -1340 -572 263 1023 1511 1069 500 -107 -944 -1354 -1195 -947 112 796 1594
4253 1594 1353 765 -236 -1055 -937 -888 -659 -287 339 1184 1168 1341 456 -613 -1332 -1613 -969 -109 829 1194
4273 1194 1165 526 255 -385 -783 -1015 -1082 -312 455 1423 1480 1386 323 -548 -1188 -1397 -896 -367 321 857 942
4294 942 1033 725 -29 -875 -1392 -1276 -635 172 868 1295 1243 847 -220 -671 -1081 -1281 -736 123 846 1115
4314 1115 1174 725 272 -368 -986 -1141 -1011 -270 481 1215 1300 876 27 -632 -1306 -938 -594 -162 160 570
4334 570 1226 1092 583 -225 -1107 -1505 -993 -117 571 1064 1293 812 263 -140 -849 -1028 -1146 -615 -58 951
4354 951 1363 1260 677 -215 -985 -1225 -1250 -725 40 965 1012 1251 541 94 -850 -1159 -889 -783 74 225 1037
4375 1037 1028 939 520 -461 -1112 -1299 -747 -64 701 941 694 769 -84 -89 -724 -957 -990 -726 162 1193 1466 1183
4397 1183 215 -681 -1082 -900 -806 -29 199 265 938 1134 570 -7 -709 -1220 -1182 -807 352 941 1191 1136 340
4418 340 -5 -939 -754 -1227 -488 102 700 989 774 419 73 -354 -677 -976 -1133 -297 753 1037 1465 935
4438 935 -182 -875 -914 -783 -495 23 192 811 887 1117 588 -70 -852 -1273 -1068 -112 428 792 1154 811
4458 811 293 -185 -707 -867 -1104 -806 46 804 1214 943 489 -82 -765 -1089 -975 -492 -148 843 976 874
4478 874 561 -35 -474 -1049 -788 -771 -243 553 676 863 811 27 -545 -1017 -928 -737 -157 851 797 820 594
4499 594 324 -170 -814 -972 -835 -386 120 930 1211 980 378 -437 -756 -1119 -1143 -360 162 457 768 693 532
4520 532 -130 -782 -1005 -828 -507 138 555 830 885 421 -87 -598 -867 -1051 -620 82 391 664 938 571
4540 571 252 -679 -851 -907 -523 -342 237 853 865 533 178 -317 -816 -1192 -847 11 415 722 949 517 285
4561 285 -425 -567 -929 -920 -68 324 745 1141 815 32 -228 -734 -813 -869 -298 -14 520 1112 682 381 224
4582 224 -510 -780 -979 -566 -55 667 955 810 473 56 -670 -733 -830 -812 -25 329 620 940 756 387 -271
4603 -271 -820 -1106 -499 -165 268 1010 1008 885 316 -356 -861 -839 -611 -356 133 572 949 501 309 -130 -673
4624 -673 -997 -690 -456 153 488 841 851 429 -25 -707 -757 -678 -617 278 604 781 645 601 -136 -336 -798 -713
4646 -713 -674 -188 453 1147 977 455 113 -677 -601 -873 -637 -143 123 432 635 877 418 -178 -690 -1091 -743
4667 -743 -264 596 774 872 556 159 -69 -430 -711 -639 -478 -226 698 895 1045 584 -331 -835 -1161 -573 -383
4688 -383 265 419 577 887 418 416 -427 -597 -543 -587 -113 547 555 820 502 93 -524 -766 -789 -422 -35 423
4710 423 691 748 613 -32 -206 -478 -547 -792 -444 -45 803 964 793 3 -212 -864 -479 -375 -346 30 377
4731 377 535 713 565 -83 -515 -945 -861 -411 228 758 719 557 332 -134 -342 -646 -961 -601 -248 700 843
4752 843 486 390 170 -567 -509 -534 -497 -62 200 892 803 722 -51 -570 -693 -675 -374 -97 34 713 610 644 514
4775 514 -29 -519 -864 -987 -84 466 921 622 301 31 -320 -160 -389 -399 -456 -56 248 1058 696 553 34
4796 34 -640 -720 -776 -263 159 493 668 591 220 79 -361 -525 -746 -424 -111 249 635 702 831 323 -492 -685
4818 -685 -804 -442 173 641 447 413 80 256 91 -126 -532 -1019 -554 -74 765 1116 706 233 -821 -1035
4838 -1035 -314 -240 59 -46 49 341 547 508 185 -288 -689 -848 -292 117 579 685 384 330 185 -512 -621
4859 -621 -757 -529 103 544 667 657 521 376 -116 -543 -538 -710 -558 23 616 872 476 54 -612 -554 -436
4880 -436 -266 111 -62 151 122 768 674 12 -891 -913 -920 -178 648 744 638 59 128 174 -393 -529 -443 -272 -39
4903 -39 496 619 670 443 -156 -457 -430 -394 -337 -17 417 853 696 282 -163 -308 -551 -434 -304 -267 -181 398
4925 398 792 990 488 -242 -733 -1119 -703 106 627 790 198 17 -17 142 69 -526 -924 -610 -206 593 878
4946 878 676 176 -686 -855 -617 -295 -13 212 273 466 397 450 172 -194 -620 -827 -491 66 506 571 577 496
4968 496 -296 -418 -744 -640 -325 303 260 398 33 415 242 64 -4 -606 -775 -358 479 705 896 361 -146
4989 -146 -504 -153 -256 -283 134 -292 -76 704 652 561 -137 -709 -1069 -600 -138 298 570 540 510 285 -97 -487
5011 -487 -478 -749 -538 182 473 467 425 368 4 46 -362 -442 -489 -103 311 624 517 168 -239 -510 -600 -263 -148
5034 -148 -66 -61 199 593 533 35 -156 -462 -795 -561 2 275 259 345 -47 242 -1 -52 -453 -616 -444 -108
5056 -108 230 630 424 407 -284 -546 -452 -295 -75 -47 623 478 335 -41 -121 -431 -249 -281 -356 -121 106 707
5078 707 751 586 12 -457 -544 -760 34 156 371 430 88 275 227 156 -38 -757 -641 -408 217 597 780 469
5100 469 43 -139 -594 -180 -250 -175 -141 369 441 681 521 -11 -231 -568 -337 -123 65 244 453 393 124 0
5122 0 -236 -414 -977 -199 6 111 618 549 407 43 -158 -508 -534 -616 -90 321 675 582 304 -5 -192 -582
5144 -582 -432 -498 13 79 289 551 248 306 -168 -286 -611 -346 -286 8 360 442 348 114 -48 -94 -477 -455 -145
5167 -145 -11 462 385 510 387 222 -329 -542 -496 -306 -81 136 407 373 562 -213 -250 -115 -47 -216 -121 -125 332
5190 332 577 558 241 -233 -249 -703 -91 -21 277 337 319 302 88 -105 -491 -521 -249 -253 -68 389 629 416 36
5213 36 -209 -343 -268 -276 -140 -74 -177 515 343 462 -33 -306 -628 -303 -187 291 402 378 409 104 98 -203 -400
5236 -400 -584 -175 -288 275 328 399 316 81 -182 -273 -477 -183 -90 118 815 537 363 128 -326 -254 -129 -525
5258 -525 -406 26 341 557 515 246 -154 -246 -570 -416 186 64 357 247 329 298 12 -450 -511 -570 -103 165
5280 165 337 388 415 170 39 -136 -15 -438 -254 -116 159 277 603 259 85 -262 -170 -55 -418 -96 203
5301 203 390 217 602 218 -312 -504 -706 -363 -133 14 425 63 185 63 -77 -462 -358 -367 -167 373 222
5322 222 476 315 86 -505 -91 -328 -289 -130 -177 171 223 433 402 -141 -253 -207 -313 -535 -74 419 418 241
5344 241 370 -108 -277 -81 -227 -52 132 31 41 382 376 363 38 -187 -521 -468 84 -39 409 603 145 -77
5366 -77 -288 -169 87 -211 -252 -79 83 522 584 4 -189 -337 -431 -318 -136 119 248 535 445 253 245 -222
5388 -222 -241 -453 -134 -27 -154 213 215 442 86 -7 -640 -211 -266 -150 404 485 264 105 205 170 144 -275 -355
5411 -355 -292 -102 432 599 472 34 -63 -336 -316 -284 -30 340 318 141 429 187 60 -370 -657 -194 -193 279
5433 279 58 180 400 352 154 -232 -673 -679 -70 37 410 313 55 -91 -249 86 143 -255 -474 -585 77 679
5455 679 619 359 130 -436 -520 -367 -35 -104 -326 -53 245 511 486 73 -81 -240 -556 7 292 493 687
5476 687 44 208 -157 -479 -164 -197 159 124 232 14 71 188 11 95 -277 -377 -205 28 446 752 596
5497 596 72 -426 -546 -346 123 -153 -290 -119 -91 295 352 285 -199 -300 -542 -320 237 291 342 15 -32 124
5519 124 -87 -152 -488 -319 -334 70 238 181 17 130 -217 -212 -224 -632 -353 12 486 329 533 106 -356 -200
5541 -200 -131 101 -71 -153 -118 174 411 544 128 -332 -519 -625 -152 381 586 445 86 81 150 210 8 -385
5563 -385 -432 -95 -162 374 539 61 -26 -304 -169 -234 -260 -91 109 322 110 143 -65 -320 -196 -137 -192 -284 -299
5586 -299 10 404 577 306 -103 -603 -642 -112 142 141 94 -131 20 -20 173 113 -75 -493 -301 -219 332 854
5608 854 553 6 -295 -244 -152 -374 -40 24 120 43 424 129 170 -177 -326 -293 -450 -84 -158 189 316 241 175
5631 175 -256 -412 -273 -123 147 210 100 104 246 272 345 33 -176 -583 -323 119 450 402 47 -128 -282 -214
5653 -214 50 111 -54 -133 41 103 410 357 374 -301 -468 -434 -49 15 190 143 229 260 140 -71 -237 -315 -56 -71
5677 -71 -2 260 -21 79 233 138 -77 -348 -658 -158 152 513 380 30 -226 -75 63 276 -273 -295 -330 -199
5699 -199 176 809 349 44 -594 -547 -380 -50 225 108 100 438 144 304 -28 -295 -285 -319 69 164 355 303
5721 303 434 262 -111 -293 -254 -217 -257 -32 252 92 37 29 20 257 -48 -131 -428 -48 243 541 649 335 -78
5744 -78 -830 -384 79 279 -111 204 -36 60 250 62 -35 -170 -389 -521 34 274 461 414 397 63 -192 -226
5766 -226 -188 -147 -158 206 94 245 163 -52 217 86 48 -167 -228 136 354 538 386 26 -368 -232 -203 -29
5788 -29 343 84 -95 45 152 495 279 -162 -484 -563 -98 404 556 355 48 -204 -109 -260 -203 -172 -233 -393
5810 -393 46 359 363 227 90 -127 -246 -318 -21 32 52 284 46 244 -25 -238 -345 -348 -253 -220 127 48 70 -46
5834 -46 -173 -19 -378 -610 -119 -84 315 273 132 53 55 180 -108 -379 -161 -402 -139 96 510 576 38 99 -304
5857 -304 -541 -295 102 -108 90 112 383 278 -9 -231 -233 -473 -194 129 233 356 -17 -146 94 -88 -271
5878 -271 -380 -254 -63 80 183 32 33 -35 -157 -174 -224 -384 -223 67 314 274 230 105 -216 -37 -177 180
5900 180 11 1 59 -107 430 312 102 -243 -394 -195 -290 113 244 122 104 -230 -220 -148 -14 -234 -392 -126
5922 -126 -27 98 285 489 63 -30 -10 -326 -306 -5 -41 181 -81 -2 -79 134 -296 -91 -100 97 41 299 76
5945 76 412 319 -86 -302 -475 -63 -21 149 192 266 -105 47 100 242 67 14 -497 -236 -16 333 265 107 -189
5968 -189 -301 -269 -95 129 -99 -49 -98 205 222 180 -44 -337 -361 -17 26 329 276 -63 280 177 89 -143 -448
5991 -448 -287 79 240 316 59 47 -113 48 -2 -185 -476 -344 60 301 583 256 139 -198 -291 -135 -6
6012 -6 -12 -70 -271 -370 394 209 181 -78 -462 -255 -123 -1 132 370 5 111 -33 -92 -211 -60 -66 -280 212
6035 212 330 552 304 54 -15 -8 -284 -109 -165 3 413 529 60 15 -161 -94 9 135 -177 -238 -206 -10 130
6058 130 494 -90 -267 -568 -387 213 649 359 -263 -167 -172 -86 379 -72 -385 -467 -246 177 614 147 150 -118
6080 -118 33 -161 -5 -36 -174 11 128 -153 300 20 37 -117 -203 11 -269 -278 195 235 187 88 -157 -281 -232
6103 -232 -104 113 434 68 -180 -59 299 168 153 -465 -453 -569 -160 569 629 98 -201 -105 -174 -132 -129 -90 6
6126 6 -104 128 272 246 142 -346 -415 -244 31 168 191 443 233 362 55 -76 -298 -42 -205 150 191 137
6148 137 -96 -117 238 164 -127 -102 -438 -446 -40 365 557 187 -201 -365 -254 20 -18 39 -61 -210 4 558
6170 558 325 82 -323 -426 -495 -54 293 65 5 -20 -74 6 146 99 -70 -471 -23 -80 348 222 153 3 -53
6193 -53 42 -427 -520 -233 202 329 355 46 -74 -191 -169 -44 -126 -387 -117 -65 410 350 77 -397 -300 16 65
6216 65 286 287 -37 94 110 31 327 314 -5 -403 -244 330 264 380 -78 -99 -312 -116 -80 -218 -129 -149 -36 -87
6240 -87 197 -25 -113 7 -84 -75 -188 -32 -204 98 537 226 91 -140 -454 -62 138 162 252 110 -22 82
6262 82 240 126 70 -228 -586 -283 125 399 270 40 117 -451 -127 -181 -185 -25 -145 68 42 181 -15 -223
6284 -223 40 208 -391 -198 -189 23 458 217 110 -177 -106 -306 -239 -114 -167 -121 16 -93 147 320 141 87
6306 87 -499 -468 -133 168 193 193 88 -125 -67 -125 -13 -105 3 -226 221 190 234 44 163 -78 -237 -197 -184 -193 0
6331 0 20 182 169 -175 -236 -282 54 -64 -157 19 68 256 164 228 165 40 -372 -360 70 199 51 297 38 66
6355 66 -41 -143 -263 -172 -23 -118 11 84 227 180 -42 -90 -320 -91 -161 34 269 184 306 153 -326 -152 -92
6378 -92 -178 107 -110 -66 178 75 429 118 -63 -242 -124 -279 128 253 346 -17 -181 18 104 -140 73 -154
6400 -154 -127 -106 143 249 194 38 54 -298 -325 -189 12 227 143 265 78 128 53 7 -34 -5 -143 -94 52 194
6424 194 70 249 62 -377 -467 -83 121 301 -79 353 -9 -45 296 -148 98 149 -134 63 317 384 285 300
6446 300 247 -223 -323 -252 126 54 333 50 173 95 -240 -162 -192 -187 -275 -208 -82 42 186 271 116 -271 0 -281
6470 -281 -140 333 327 270 -69 62 231 122 -164 -112 -166 -58 57 252 403 -131 241 -41 -188 -189 -349 62
6492 62 -90 100 -115 223 111 -104 126 -322 -208 -261 -55 -40 228 153 383 134 -139 -233 -139 -29 -96 262
6514 262 -85 -277 380 300 39 -201 -386 -277 -173 86 417 280 -243 -72 -244 -247 77 -64 -143 -323 -117
6535 -117 -15 112 57 -51 86 -42 -187 -45 -92 160 128 100 303 -209 -361 -394 139 -159 129 266 -59 -37
6557 -37 252 46 165 -152 -434 -167 -303 126 99 17 236 -113 32 122 -103 -3 -4 177 -35 193 234 243 249 -157
6581 -157 -141 -134 -107 84 -121 105 -8 -44 -79 79 41 -27 -39 -148 169 -10 359 299 38 -287 -50 -161 -191 114
6605 114 272 262 -193 -169 159 111 -128 10 -197 17 114 202 111 118 31 -266 -69 -7 31 -115 40 44 10 149 -49
6630 -49 84 -47 -64 -43 206 27 -66 243 99 253 -142 61 -266 -245 -180 85 328 98 162 -100 -175 120 -64
6653 -64 -554 -229 -57 2 246 465 222 -10 -22 -169 34 58 25 128 96 71 168 267 -53 -279 35 -245 -137
6676 -137 -90 295 65 73 -157 162 -420 -320 -171 232 295 -142 95 -169 -97 139 93 -206 -164 -304 -171 372
6698 372 262 108 -137 -207 -336 -349 -66 129 53 -55 72 182 -47 -76 -227 -474 -307 -220 32 59 55 336 79
6721 79 -25 -31 -434 -210 100 180 84 -20 -94 52 42 66 -28 -249 -260 45 34 395 604 81 -372 -399 -110 -39
6745 -39 280 29 -198 67 280 138 382 20 -336 -256 -195 63 -105 -3 57 224 16 12 118 -85 -185 226
6767 226 23 122 108 100 38 26 -158 -119 102 -271 -134 1 260 336 170 -164 -199 -286 -157 202 3 -182 -221 -8
6791 -8 135 127 153 -59 -62 -132 202 232 242 93 71 99 173 -131 34 -147 -343 -101 16 347 175 -4 121 122 -192
6816 -192 -275 -265 1 103 344 84 -131 -154 -153 15 32 -120 -430 -284 141 494 163 -6 -211 -181 -139 67 223
6839 223 199 -15 -12 27 58 88 193 -175 -271 -170 167 -33 61 223 -232 -37 -50 -54 -37 -39 -73 -58 217 238 148 99
6865 99 -225 -94 -71 45 -171 -34 70 303 196 -14 15 -359 -115 -237 52 54 -90 -119 140 196 -8 -95 -122
6888 -122 -188 -57 234 173 109 -25 -59 224 -137 -75 -9 -271 -96 -48 179 -23 119 33 -142 -211 -26 187 167
6911 167 28 121 136 141 125 -138 -246 -1 -197 -107 9 85 186 -130 363 -36 -146 199 -162 -177 -3 90 -26
6934 -26 227 81 -239 39 126 -53 -147 186 164 73 71 -143 157 -42 -272 -28 -13 368 -90 25 -200 -109 -53
6957 -53 18 -79 -299 -403 233 160 202 46 -163 -84 -183 210 -193 -95 -318 -240 243 299 41 -312 -230 -252 -286 86
6981 86 109 266 54 141 -28 165 -39 -42 -171 -158 45 -121 368 292 -95 -42 -21 175 -66 -69 -144 -72 149 338
7005 338 66 34 -140 -84 -86 -166 -100 -364 -5 158 134 149 -15 -206 -304 -26 57 -3 171 -136 134 55 9 173
7029 173 1 -403 -303 -210 429 537 415 -73 -493 -260 39 -155 -164 -239 -59 234 205 223 -5 0 -89 -86 -206 -81
7053 -81 -69 224 403 120 111 -99 -282 -208 -158 -119 45 -33 -162 8 169 224 292 -375 -469 -223 532 653 321 201
7077 201 -226 -179 -150 79 67 -3 -398 -311 84 451 261 72 -282 -391 12 150 306 120 -34 -291 187 184
7099 184 -113 125 -270 -86 -281 3 -101 37 317 44 292 -196 -315 -198 175 184 171 135 -216 -100 -265
7120 -265 504 -11 -34 -444 -397 177 200 486 206 -355 -368 -352 -38 246 321 33 -348 -21 237 367 186 -206
7142 -206 -352 -179 204 340 324 151 -161 246 -62 66 41 -129 -154 20 134 -57 101 -64 270 222 -58
7163 -58 -147 -539 -142 164 372 332 87 -350 -728 -68 129 202 191 -84 -254 -26 274 311 90 -110 -529 -318
7185 -318 149 352 346 -87 162 -15 -122 230 87 172 -126 23 68 65 63 -1 47 -91 -158 -42 -157 192 189 478
7209 478 147 -116 -165 -10 102 129 131 -115 -7 -187 357 622 206 -336 -302 -79 203 242 279 220 -232 -193 260
7232 260 92 -96 -111 -159 -473 106 305 162 247 -250 -291 -195 -124 -207 -100 -196 177 -68 90 82 -190 -137 -118 20
7256 20 59 -227 30 97 180 -95 -87 -85 -342 -64 272 305 196 -19 -349 -105 249 -20 31 -357 -338 -41 -98 234
7280 234 268 107 -65 -182 -98 -65 77 -13 110 -141 148 88 41 223 -178 4 46 -139 72 -116 318 283 248
7303 248 -146 -242 -90 -200 133 187 82 27 -334 249 197 59 -231 -317 -216 -204 76 -12 -74 80 -150 -152 -101 14
7327 14 38 154 259 77 -8 91 34 8 135 -50 165 -145 -112 127 309 139 44 -159 -182 -246 218 -58 -117 -340
7351 -340 -15 145 211 243 -77 -312 -174 -59 319 265 60 157 -144 -206 -133 -180 159 -215 -96 208 -230 -74
7373 -74 -143 4 79 -6 -111 65 -36 174 243 318 263 -139 -482 -83 -10 -258 39 -3 -488 14 -111 20 105
7396 105 -85 -204 -447 2 336 144 161 56 -137 63 -188 87 56 -130 29 72 193 126 -6 -136 -137 -328
7418 -328 -124 -117 127 14 92 158 -27 -109 -336 -78 198 153 -78 -170 -260 478 248 55 18 -288 -332 -190 85
7441 85 135 32 -228 -59 -218 -149 21 -65 -377 -289 -270 212 193 248 -282 -317 -456 73 -85 168 6 -136 66
7464 66 206 -15 -42 -246 -385 7 -279 9 55 -93 193 106 -106 -220 -30 -136 149 248 190 -21 -72 -131 -138
7487 -138 187 46 -121 -312 -95 135 163 133 17 -18 -224 -237 101 126 -220 -123 -53 49 186 28 -160 -235 -81
7510 -81 74 101 211 181 -197 -7 -106 2 -315 -106 -68 102 -138 -57 65 52 133 -136 227 35 -158 -395 -145
7533 -145 63 370 77 -67 -85 -96 -52 107 111 -162 -71 55 182 182 60 -126 -297 -114 -46 -43 509 183 61 -239
7557 -239 78 2 -229 -298 -89 -91 -87 17 162 307 -157 9 -137 37 32 121 8 -81 177 95 1 -59 -150 -206 46
7582 46 200 392 120 175 118 -45 -12 -201 -103 -23 -156 -122 102 299 215 122 -239 -180 -299 20 73 99 -10 207
7606 207 59 103 -17 113 -57 134 47 -112 255 31 200 18 291 6 -347 -45 -248 403 128 344 49
7627 49 -198 -102 76 162 -131 -137 -414 4 135 115 58 232 -184 -319 -188 85 263 122 -43 -155 -76 234 -72
7650 -72 34 -144 -164 -23 -111 78 162 177 122 -4 -124 -221 25 -61 -73 33 -27 -65 -313 25 36 109 33 -180 -305
7675 -305 78 100 338 153 -174 -470 -366 -66 421 323 -114 -273 -114 12 287 380 -46 -336 -140 -5 93
7696 93 289 111 79 -116 -328 39 310 196 -100 -157 278 -96 -238 26 32 79 -146 -190 -169 -304 57 219 -82
7719 -82 18 -279 -408 -138 -65 213 30 -297 -239 -230 118 591 267 -409 -466 40 502 515 34 -229 -543 -63
7741 -63 -21 499 160 -260 -190 -470 152 376 409 -160 -183 141 39 203 115 -6 -95 15 240 146 198 -132 -477
7764 -477 222 140 -129 -78 105 244 462 332 -65 -576 -411 116 392 523 -30 -720 -472 -179 388 183 -147
7785 -147 -396 -656 -157 702 607 277 -421 -396 -406 -35 356 202 -159 -503 147 151 107 261 -92 -347 -228 -105
7807 -105 353 174 -58 166 174 50 -97 -325 -167 103 287 78 -249 -372 -191 220 349 191 -219 -212 -323
7828 -323 318 510 523 -190 -760 -640 -31 488 582 118 -366 -297 -108 349 424 -159 -404 -420 -176 186 377 134
7850 134 -119 -255 -185 153 184 38 -322 2 -160 112 32 -138 -120 105 -68 -150 -333 -356 60 309 476 133
7872 133 8 -410 -105 54 522 54 -360 -159 -270 398 653 213 -130 -310 -219 214 294 162 28 -432 -48
7893 -48 -98 396 115 26 -546 -114 -26 394 399 211 -174 -229 -140 -181 -129 64 199 275 137 -235 -298 -6 295 -86
7917 -86 284 -210 -59 -121 168 278 260 -166 -492 -432 -135 160 528 3 -273 -301 -173 372 260 -94 -330 -293
7939 -293 -370 363 403 126 -41 -279 50 109 311 184 -33 -9 103 27 345 209 -105 -32 -217 -125 154 -137
7961 -137 231 178 61 97 -265 -204 -271 26 316 122 -339 -102 -75 118 170 79 -155 -237 -180 232 179 214 -89 -46
7985 -46 -404 20 -27 127 -64 -149 -246 172 -31 250 -153 -206 -327 14 -170 183 61 -71 67 261 21 -86
8007 -86 -180 -176 -292 235 -123 -123 -44 102 -57 -8 -4 35 -245 -267 119 120 239 -250 285 -245 13 44 -50 -95 -413 40
8033 40 50 54 76 -195 -196 -131 137 10 51 64 -60 180 -262 -129 -85 -46 -194 -152 76 32 -128 -60 315 204 205 -104
8059 -104 -171 -131 75 194 132 321 -177 -219 -118 134 201 84 -242 37 -13 205 123 99 -138 -444 -87 -112 -112 -2
8083 -2 -80 49 97 -86 289 -151 -164 1 29 172 83 286 14 -88 115 112 71 -27 28 -62 145 74 -8 -103 75
8108 75 241 74 -120 -255 -193 208 104 24 350 -275 -159 63 -68 215 37 5 -2 -21 343 269 -63 -169 -205
8131 -205 -26 192 131 230 282 -260 30 171 41 56 -95 -6 77 219 157 202 -7 -90 -55 64 -160 -370 -250
8154 -250 131 203 56 83 -219 -199 34 -48 115 233 -92 3 85 26 144 247 -162 -106 48 155 51 -9 -72
8177 -72 -37 -205 257 291 42 -236 -282 -194 -118 -143 -186 -56 -200 -121
8191a21
$$ Imaginary data points
##PAGE= N=2
##DATA TABLE= (X++(I..I)), XYDATA
0 0 0 0 0 0 0 0 8 0 0 -8 8 -16 16 -22 24 -32 40 -48 64 -73 88 -105 122 -145 175 -201 235 -270 312 -359 409
31 409 -467 529 -600 676 -762 857 -958 1072 -1195 1330 -1481 1639 -1817 2009 -2219 2451
47 2451 -2700 2975 -3280 3611 -3980 4386 -4843 5352 -5925 6580 -7329 8205 -9235 10475
61 10475 -12000 13924 -16444 19903 -24967 33137 -48533 87949 -418816 -682503 137277
72 137277 567074 698137 372131 81539 -87527 -51465 -123115 -302428 -515259 -447108 -81736
83 -81736 441105 733881 638005 204945 -248021 -521423 -526401 -370760 -139652 87756 313401
94 313401 462204 455887 242792 -71743 -340241 -435936 -368121 -212010 -43995 146086 356750
105 356750 512326 466666 157663 -303446 -646235 -635595 -271195 186701 445892 409437
115 409437 215671 67841 40418 20952 -129957 -381305 -521413 -356495 85522 535864
125 535864 685650 436647 -17380 -372907 -460134 -327877 -142333 -20319 55009 163275
135 163275 307052 379701 271289 -6908 -312635 -471633 -404491 -172411 94556 296555
145 296555 389704 361093 209351 -35926 -291922 -435920 -377280 -145979 118829 277365
155 277365 291487 223197 148542 73968 -53792 -251519 -420823 -406138 -144988 243343 518490
166 518490 497643 206528 -142066 -330808 -305618 -176668 -80645 -50804 -5561 132123 315418
177 315418 389776 240797 -83907 -391087 -486059 -319823 -18723 232474 328097 284304 175597
188 175597 57496 -62460 -188359 -285564 -287785 -162031 45789 237977 327499 286045 146983
199 146983 -33918 -205185 -319682 -325379 -194953 35437 263575 370228 297360 98342
209 98342 -103624 -213661 -223523 -186303 -139491 -68737 59925 231464 350640 307588 84272
220 84272 -206594 -392776 -365833 -161319 78178 221983 240398 187517 123693 58831 -36836
231 -36836 -171147 -285058 -286454 -137215 99132 294231 344251 235534 41458 -137701 -240809
242 -240809 -256497 -197616 -83286 62551 200071 272361 238262 106152 -64439 -200383 -255804
253 -255804 -224111 -122815 17584 163025 266759 276528 167494 -25674 -214439 -303903 -252887
264 -252887 -101429 64536 174880 211789 191660 132978 37471 -90308 -217354 -278098 -218454
275 -218454 -46513 156592 286372 281149 155944 -14432 -152124 -217202 -210689 -148859 -47700
286 -47700 75406 189431 246524 208883 79778 -87605 -219918 -260721 -197936 -64141 86007
297 86007 199458 240845 197150 81868 -65526 -189500 -240614 -199307 -84640 54468 167824
308 167824 220722 199828 111421 -19301 -150676 -234489 -230179 -130790 25024 170124 241395
319 241395 213986 107967 -27385 -141338 -202328 -197735 -130444 -17193 109674 205890 228723
330 228723 160046 23119 -124382 -220003 -225418 -144330 -15231 111286 192931 206316 150413
341 150413 42820 -82248 -182152 -218025 -171603 -58036 79984 186716 220690 170698 57597
352 57597 -72843 -173366 -209267 -170223 -71502 52456 158135 208020 182424 88131 -40339
363 -40339 -155596 -211769 -187136 -91486 36800 148016 201938 182034 97501 -19748 -129341
374 -129341 -193619 -188902 -115018 3538 122846 197696 197220 120507 -991 -119561 -191049 -190935
386 -190935 -121660 -10210 103378 178785 190677 133344 26567 -90779 -175435 -194926 -142031
397 -142031 -36683 82181 171017 196064 148499 45580 -74278 -166006 -194790 -149750 -50380
408 -50380 64871 153069 184973 151805 65892 -44203 -140523 -188998 -168159 -81945 38516
419 38516 145881 195085 168016 77015 -38493 -134363 -178050 -158992 -86967 14370 112449
430 112449 173282 174401 108868 -1702 -114729 -183435 -179770 -106721 4440 109746 170647
441 170647 169035 108778 11935 -88970 -159648 -174588 -125569 -27490 83090 162944 180742 129782
453 129782 29874 -78816 -155832 -174298 -130085 -39859 63509 144634 173465 139479 53797
464 53797 -52836 -140574 -176659 -145823 -60342 46520 135043 172183 145911 67515 -34903
475 -34903 -124424 -168181 -151229 -78569 23830 117644 167579 154833 84744 -15744 -109426 -162465
487 -162465 -156373 -93812 3583 101258 162183 162526 100373 148 -98171 -156852 -155111 -99109
499 -99109 -10883 78645 141376 157265 118833 34318 -69811 -151997 -175368 -125644 -25060 82253
511 82253 149539 155398 106350 27960 -52456 -115508 -145614 -130870 -66847 31804 127896 176377
523 176377 149752 58609 -54284 -138254 -160527 -123179 -48833 34087 102968 140396 134624 80290
535 80290 -9035 -101154 -156506 -149525 -83311 13206 100809 149285 144812 90293 1501 -91768
547 -91768 -154004 -155245 -92289 7154 97574 141757 129334 78141 12171 -53495 -108774 -140963
559 -140963 -128433 -57053 54896 155725 187476 127465 8872 -101554 -149667 -128048 -69650
570 -69650 -11503 34463 76135 115356 130360 90439 -6831 -121185 -185777 -158271 -53797 67599
582 67599 143204 147786 98786 31908 -30787 -82718 -118176 -122495 -81646 204 90464 145441
594 145441 138531 77591 -8412 -86117 -133149 -137480 -94636 -9970 88034 155259 154054 81519
606 81519 -23010 -103291 -125406 -98661 -54661 -15209 24990 77546 129542 141332 78723 -44923
618 -44923 -162223 -197458 -124590 7561 115223 143806 103055 43622 4562 -17689 -49479
629 -49479 -97591 -129410 -100150 -2164 115672 180061 150111 47707 -64274 -129101 -131834 -92577
641 -92577 -36431 22722 78801 117960 117818 68219 -13324 -87523 -121270 -108237 -63953 -7237
653 -7237 52738 109387 140101 116047 27419 -91230 -171287 -160687 -65989 49451 114155 106160
665 106160 60782 28364 20594 6474 -46194 -121674 -155697 -96325 40209 169537 201373 115774
677 115774 -22712 -121085 -131805 -80986 -27507 -5011 4905 37107 91289 125596 95209 -1188
689 -1188 -109266 -161948 -129914 -41577 50153 105786 117697 96015 49693 -16201 -85290 -125961
701 -125961 -112763 -48105 32038 85276 94685 75825 51152 23678 -22716 -89449 -142319 -131366
713 -131366 -37941 93980 179238 159446 51533 -64541 -114850 -89356 -38213 -16694 -25842
724 -25842 -20887 34328 115375 152782 93851 -39157 -159178 -183568 -101825 20881 104226 113310
736 113310 74901 35715 14174 -6741 -46542 -94035 -110792 -71176 12956 94433 128217 104111
748 104111 43223 -24001 -78380 -110957 -109768 -65057 15889 97912 134668 102858 24974 -48076
760 -48076 -78190 -68827 -51238 -45559 -37633 3704 79446 143106 134356 37106 -95487 -173543 -145905
773 -145905 -39651 64298 101890 74562 33477 21213 30387 17699 -40030 -111679 -134956 -73715
785 -73715 42314 137814 152405 85641 -9728 -76607 -93978 -78423 -53104 -24051 15139 63326
797 63326 97839 93401 44975 -24093 -78650 -97607 -82657 -45958 3601 58819 105236 115853
809 115853 71452 -16805 -101713 -132438 -92216 -13900 49419 68798 56582 44906 45649 38047
821 38047 -4913 -77038 -131877 -117103 -26968 86213 148305 123268 38320 -44172 -79583 -69419
833 -69419 -47659 -36194 -27518 2014 55690 103276 104564 46586 -40798 -107118 -117567 -74626
845 -74626 -8888 47993 80241 86970 69973 29449 -26213 -76697 -96636 -75838 -25120 28272
857 28272 64513 76899 70327 47420 5969 -50431 -100497 -111559 -66108 17977 93773 117624
869 117624 81785 15952 -37592 -58895 -57282 -52469 -47704 -27470 19195 78067 112204 89875
881 89875 15155 -69555 -115814 -100882 -43639 18709 58381 70339 65102 49272 21088 -21748
893 -21748 -66753 -91718 -78122 -27969 35712 82728 93296 68597 21379 -30895 -72175 -89541
905 -89541 -73769 -28700 29545 75428 89024 66520 22162 -23965 -57098 -72401 -68926 -44660
917 -44660 -519 52532 91738 93382 51385 -15467 -73786 -95207 -74556 -29140 17724 51072
929 51072 67123 67126 49073 11872 -36890 -78283 -90672 -62841 -6111 52741 86752 83110 49162
942 49162 1699 -42269 -70465 -75369 -56596 -16734 31919 70842 83730 63552 18731 -32904
954 -32904 -70565 -80780 -62196 -22153 25978 64866 80691 67244 27921 -22178 -64171 -81566
966 -81566 -68176 -29586 19047 60235 78895 68774 33628 -13702 -55404 -77019 -70280 -38115
978 -38115 7134 50482 76038 74089 44565 -2591 -49825 -78192 -76180 -44715 3026 47832
990 47832 72870 71263 45589 4501 -37654 -68054 -74693 -54081 -12022 35826 70288 77526 54996
1003 54996 12320 -33599 -66738 -75205 -57384 -18373 28560 65551 77421 58662 18291 -27392
1015 -27392 -60267 -70481 -56592 -25419 13950 51258 73197 69979 37409 -13390 -61223 -82649
1027 -82649 -68310 -26499 21737 55968 66707 55575 30553 -2581 -37415 -64095 -71002 -49102
1039 -49102 -3659 46786 77912 75015 41757 -6008 -46605 -67190 -63943 -40958 -4778 33893
1051 33893 62725 69486 49462 9767 -33118 -63020 -68034 -49694 -14674 25082 58074 72511
1063 72511 59859 21302 -28352 -67250 -76483 -52471 -9802 30762 53676 57384 46175 24573
1075 24573 -5248 -40031 -67669 -70797 -41645 10964 61356 82677 65023 20842 -24828 -52605
1087 -52605 -58089 -47064 -26989 -637 29930 57014 66948 49127 6246 -42871 -73678 -71205
1099 -71205 -39202 5296 43293 61835 59130 37974 4940 -30774 -57203 -63397 -45849 -10040
1111 -10040 28992 56518 63329 47615 15472 -22478 -54692 -68189 -55525 -19014 26429 60917
1123 60917 68575 47658 11087 -24665 -47566 -54244 -46327 -25303 5611 40043 64486 64375 35233
1136 35233 -12077 -54795 -72139 -57237 -20685 18271 44557 53473 47215 29101 1466 -30676
1148 -30676 -56665 -63542 -43490 -2145 41216 66457 62977 33732 -4932 -37647 -54490 -53161
1160 -53161 -36040 -7580 25555 52334 61029 46314 11578 -28393 -56867 -61901 -43083 -9267
1172 -9267 25297 50108 57297 45136 16829 -18597 -48581 -60810 -49116 -18601 19055 48257
1184 48257 58348 47203 20240 -12549 -41198 -56806 -52771 -28389 8320 43707 61805 54712
1196 54712 25069 -12448 -41703 -53601 -46903 -26410 732 28933 50485 56566 40807 5338
1208 5338 -35829 -62624 -61233 -33111 6384 38254 51046 45383 28606 6361 -17684 -40924
1220 -40924 -54656 -48602 -19736 22870 57471 65890 44186 4709 -31891 -50970 -49113 -33208
1232 -33208 -10783 13684 36469 50601 47773 24713 -11423 -44669 -59211 -49201 -20182 14539
1244 14539 42063 54012 47652 24079 -10005 -41457 -56699 -48290 -20444 13012 36379 44350
1256 44350 39192 25816 6201 -19500 -46268 -60041 -47050 -7525 40600 69091 60931 23344
1268 23344 -18701 -41040 -40182 -28358 -18997 -12063 2131 28458 54499 58936 28786 -22728 -65092
1281 -65092 -71837 -40628 6107 39740 47318 36457 21379 8844 -5253 -25221 -45019 -49344
1293 -49344 -29564 8113 43925 58585 46744 17413 -14359 -38564 -49560 -45392 -24157 8503
1305 8503 40656 55555 44070 14212 -16362 -33163 -34681 -29796 -23864 -13331 9990 41621 63055
1318 63055 52956 8890 -44589 -73532 -59261 -14968 26305 41035 31443 17133 13583 15796
1330 15796 6005 -22318 -54082 -60987 -29564 23995 65395 68154 35046 -8829 -36766 -41161 -32116
1343 -32116 -21417 -10982 4760 27104 44676 44332 21849 -11679 -38382 -46545 -37780 -19331 4034
1356 4034 28638 48499 52335 30442 -10780 -48818 -60586 -38910 -1950 24906 29442 21170 16869
1369 16869 22294 22647 1929 -37051 -67419 -59975 -10906 48212 77031 57585 8925 -31824 -40607
1382 -40607 -24987 -10078 -10484 -17816 -9980 19293 51563 58760 27525 -22773 -59666 -61499 -32121
1395 -32121 4985 29954 37248 33990 25593 11815 -9313 -31652 -42761 -34878 -12378 12548 28376
1408 28376 33945 32411 24632 6391 -22965 -51499 -58535 -32492 14994 54423 59961 31236 -6554
1421 -6554 -27006 -22904 -11711 -12332 -24290 -27511 -4258 37655 67520 56424 6766 -48561 -71196
1434 -71196 -49486 -5169 27633 32745 21131 12708 15891 18282 4609 -24573 -49392 -48500 -18516
1447 -18516 22163 48797 48935 28071 1705 -19232 -32507 -38183 -32252 -13081 14428 37421 42168
1460 42168 27425 3891 -13864 -22207 -24702 -27551 -26254 -11370 19177 50011 57822 31404 -15126
1473 -15126 -52118 -55803 -28319 5608 23053 20466 13016 14917 23750 22285 -1011 -36449 -57998
1486 -57998 -45443 -3917 39197 56738 42379 11001 -14721 -25274 -25150 -23199 -20867 -11814 7258
1499 7258 29252 41350 33696 10112 -16761 -34275 -38015 -29172 -11956 10172 32096 43892 36988
1512 36988 11312 -20387 -40270 -38497 -20265 288 12041 16433 20488 27067 27286 11629 -19179
1525 -19179 -47484 -52673 -26870 14294 44777 47396 26286 -60 -15593 -17989 -17499 -20720 -23547
1538 -23547 -14854 8732 35447 47351 33761 1874 -29416 -43530 -36017 -16434 4441 19452
1550 19452 28075 29575 23375 7381 -13431 -30564 -35444 -26001 -6955 13644 28049 33275 28674
1563 28674 13262 -8516 -30174 -40927 -33247 -9581 16999 33953 34533 21878 5363 -8797
1575 -8797 -19127 -26198 -28680 -20870 -1891 22600 39781 38532 18743 -8822 -30327 -36571 -27658
1588 -27658 -11654 5410 18875 27665 29275 20814 3077 -17842 -33192 -34768 -21857 -477 19292
1601 19292 31301 31793 21310 3958 -15638 -30244 -33991 -24197 -4620 16414 30499 32164 21945
1614 21945 5536 -12150 -25752 -30811 -25611 -10955 9268 26817 33914 27945 10709 -10142 -26723
1627 -26723 -32752 -26973 -11488 7919 24432 31966 27635 13092 -6389 -22801 -30059 -27091 -14997
1640 -14997 2047 18902 30258 30983 19473 -453 -21103 -33459 -31390 -16710 3168 19911
1652 19911 28369 27408 17588 2166 -14227 -27118 -30500 -22304 -4493 15166 28515 30590 21373
1665 21373 4875 -12549 -26051 -30991 -24798 -8239 12181 28779 32584 22602 4328 -13191 -23224
1678 -23224 -25153 -20249 -11029 2394 17942 30340 31799 17983 -5899 -28354 -36588 -26948 -7021
1691 -7021 12126 22649 23772 19132 11657 1298 -12279 -25456 -31134 -22078 -1951 20340 33607
1704 33607 30990 15755 -3765 -19430 -26732 -25288 -16207 -1689 14357 26091 27619 18258 2400
1717 2400 -13312 -23086 -25191 -20114 -8860 7163 23567 33123 28179 8989 -15556 -32064 -32025 -16983
1731 -16983 1519 14027 17798 17344 16225 13303 3514 -13729 -30476 -35016 -19631 7388 30727
1744 30727 36786 24051 2961 -13840 -19921 -19073 -15907 -11806 -3996 9988 24337 30405 21818 1397
1758 1397 -20218 -30961 -27960 -14103 2845 16835 24396 24660 16778 2006 -14554 -25769 -25964
1771 -25964 -15753 -526 12354 19937 21368 18758 9801 -4394 -21283 -31939 -28181 -9186 15752
1784 15752 31231 29935 14967 -2597 -13113 -15749 -15408 -15350 -13356 -4099 12824 29021 32430 18128
1798 18128 -7114 -28584 -33397 -21540 -3226 11544 17881 18054 16135 11987 3101 -10249 -23010
1811 -23010 -27771 -18598 -547 17641 27442 24849 13692 -1315 -14462 -23100 -24213 -16398 -1620
1824 -1620 14268 24475 23647 13783 402 -11101 -17660 -20298 -17996 -9563 4621 20512 29611 25418
1838 25418 7302 -14451 -28431 -27089 -14104 1210 11112 14436 15253 15425 12518 2860 -13145 -27279
1852 -27279 -29429 -15797 7506 25817 30213 19767 3033 -10087 -15919 -16642 -15095 -11557 -3391
1865 -3391 9444 21917 26547 18185 533 -17468 -26646 -23558 -11568 2640 14266 20534 20339
1878 20339 14030 2527 -10849 -20765 -22794 -15617 -2635 10498 19162 20995 16804 6488 -7069
1891 -7069 -19341 -25662 -21106 -6165 11622 23645 24106 14167 1209 -8996 -13873 -15660 -15534 -11705
1905 -11705 -1757 13070 25841 27035 13957 -7277 -24353 -28019 -17778 -1781 9719 13846 13812
1918 13812 13225 11462 5644 -7084 -20672 -27120 -19382 -856 18433 27580 22756 8849 -5760
1931 -5760 -14642 -16981 -15479 -11677 -3783 6898 17401 22325 17460 4717 -9872 -20072 -21920 -15671
1945 -15671 -4665 8196 18640 22855 18212 5371 -10560 -21050 -21531 -12889 -1138 7495 11994
1958 11994 14217 15405 12729 3283 -11911 -25850 -27544 -13449 8475 25240 26928 14460 -1076
1971 -1076 -10152 -11001 -9383 -10169 -12257 -8662 3939 20162 28532 20805 690 -20084 -28337 -21088
1985 -21088 -5926 7535 13523 13943 12548 10426 5124 -4566 -15802 -21717 -17385 -4958 9370 18855
1999 18855 20233 14975 5109 -6897 -17763 -22556 -17961 -4568 11200 20917 19889 9834 -708
2012 -708 -6409 -8523 -10786 -14221 -14582 -5913 10839 26759 28743 13140 -10178 -26766 -25860 -11532
2026 -11532 3907 10397 8308 5949 8605 13090 10509 -2789 -19848 -28429 -20171 421 19605
2039 19605 26541 18802 4927 -6353 -11784 -12715 -12800 -10924 -4590 5864 16056 19345 13813 3064
2053 3064 -7868 -14903 -16770 -14749 -7674 3931 16961 24300 19610 3579 -14162 -22140 -17847 -5969
2067 -5969 3398 5637 4755 6887 13331 16402 8435 -10142 -26907 -29163 -12961 11168 26262 24281
2081 24281 9505 -4309 -9432 -7143 -5367 -8568 -12331 -9341 3219 18715 25200 17078 -335
2094 -335 -16445 -22479 -17500 -6976 2836 9848 14225 15166 11151 1861 -8828 -15813 -15888 -9512 -1758
2109 -1758 4674 10026 14471 15842 10996 -1812 -17682 -25732 -19303 -1960 14896 21371 15420 3852
2123 3852 -3451 -3674 -3178 -6756 -13936 -16042 -6937 10427 25063 25213 10245 -9335 -21781 -20215
2137 -20215 -9689 524 5647 6887 8708 11690 11447 5106 -6989 -17683 -19314 -11794 501 11300
2151 11300 16136 15402 10309 2012 -8104 -16437 -18312 -11833 941 11962 15986 12683 5968 584
2165 584 -3212 -7176 -12303 -15757 -11293 1387 16591 24021 18167 2458 -12782 -18751 -14671 -5628
2179 -5628 784 3525 5747 9910 13086 11636 2586 -10528 -19714 -18529 -8169 5025 14418 16479
2193 16479 12697 5733 -2643 -9450 -14377 -14080 -8059 1291 9890 13712 12514 7628 1484 -5267 -11353
2208 -11353 -15842 -14021 -5105 8147 18649 19781 10461 -2753 -12389 -14310 -10306 -4909 -1274 2141
2222 2141 6864 12808 14666 9110 -2924 -15139 -19980 -14385 -2562 8577 14365 13782 9339 3308
2236 3308 -3017 -9495 -13627 -12643 -6539 2799 10556 14059 11993 6294 -881 -7977 -13480 -15158 -10334
2251 -10334 148 11554 17958 15450 5999 -4871 -10870 -11873 -8989 -5554 -2125 3304 9851 14836
2265 14836 13516 4559 -7773 -16446 -16869 -9655 792 9139 12697 12266 8290 2630 -5025 -11315 -13988
2280 -13988 -10686 -2834 5600 10935 11873 10016 5218 -1214 -8666 -14754 -15586 -8254 4561 15376 17819
2295 17819 11044 -224 -7943 -9967 -7594 -5996 -5625 -3628 2447 11742 17398 13739 1094 -12922
2309 -12922 -19556 -15183 -4213 6265 10995 10170 7476 5181 2136 -3491 -9430 -13415 -11131 -3075
2323 -3075 6601 12763 13459 9512 2501 -5044 -11999 -15055 -11778 -2626 8144 14989 13730 6283 -2028
2338 -2028 -6119 -6632 -6180 -7533 -8472 -3841 6279 16803 19229 9708 -6247 -18207 -18547 -8522 3026
2353 3026 8872 7855 4609 4562 6675 5471 -2009 -12231 -17359 -12812 -121 12421 17171 12870 3991
2368 3991 -4185 -8228 -9798 -9683 -6954 -1262 6037 11859 11801 6740 -103 -5272 -8349 -8907 -9071 -6154
2384 -6154 791 10631 17664 15228 3404 -11013 -18001 -13923 -2926 5401 6908 3799 2772 6220
2398 6220 9477 6439 -4582 -16975 -19802 -10399 6484 18191 18075 7800 -3328 -8380 -7222 -4531
2412 -4531 -4762 -6044 -4328 2681 11211 14987 10316 247 -9636 -13939 -11594 -6121 974 7074 11765
2427 11765 12457 7490 -1117 -9438 -12460 -8902 -2928 1709 3176 4096 6645 10193 9606 1143 -11501
2442 -11501 -19779 -16103 -1985 12823 18282 12075 661 -6336 -5478 -1190 -1393 -6449 -10885 -7396
2456 -7396 5198 17325 19462 8660 -7289 -17154 -16113 -6507 2945 6407 5482 4571 5692 6422 3637
2471 3637 -3661 -11300 -13419 -8421 493 8276 11446 10274 6323 754 -5781 -11357 -12633 -8024 1213
2486 1213 9228 11785 8447 2161 -1849 -2578 -3265 -6276 -9736 -8948 -925 10782 17937 14341 1698
2501 1698 -11337 -15966 -10610 -1434 4571 4260 1691 2718 7063 9552 5007 -5440 -15319 -16439 -7292
2516 -7292 5981 14288 13369 6514 -565 -4322 -5243 -5913 -6719 -6430 -2038 4828 10632 11197 6723 -561
2532 -561 -6723 -9605 -9528 -6913 -1785 5168 11004 12661 7573 -1182 -9130 -11163 -7593 -2102 1359 2254
2548 2254 3282 6126 9468 8293 418 -10141 -16915 -13195 -1679 10272 14778 9717 1464 -3662
2562 -3662 -3618 -1751 -2795 -6832 -8979 -4700 5499 14416 15396 6944 -5373 -13203 -12672 -5921 743
2577 743 4235 4856 5126 6141 5866 2456 -3548 -9416 -11132 -7496 131 6362 9995 9610 5759 405
2593 405 -5286 -9879 -10285 -5933 851 7141 8949 6980 2990 242 -1388 -3909 -7357 -9700 -7025
2608 -7025 819 10538 15194 11226 471 -9483 -12446 -7546 -1306 2259 1877 942 3260 7798 9321
2623 9321 4014 -6020 -14683 -14493 -5022 6234 12311 10874 4455 -1447 -3149 -3120 -3827 -6045 -6909 -3518
2639 -3518 3493 10209 11452 6851 -898 -7303 -9483 -7959 -4787 -456 4087 8341 9479 6463 212
2654 212 -5939 -8995 -7170 -3437 -244 1675 3602 6399 8606 6889 -277 -9354 -14282 -10735 -916
2669 -916 8811 11971 7368 942 -2456 -1455 -380 -2697 -7375 -9239 -4386 5470 13640 13631 5090 -5769
2685 -5769 -11899 -10198 -4143 973 3064 2905 3523 5489 6256 3399 -3088 -9012 -10259 -6775 69 5768
2701 5768 8476 8071 5269 1055 -4561 -8916 -9638 -5794 1249 6498 7633 5303 2146 539 34 -1758
2717 -1758 -6012 -9961 -8042 92 10302 15177 10192 -290 -9728 -11284 -5660 726 2512 84
2731 84 -1302 1986 7625 9919 4723 -5810 -13812 -12954 -4422 6113 11324 9250 3526 -646 -2227
2746 -2227 -2536 -3603 -5766 -5990 -2670 3338 8385 9232 5648 -15 -4731 -7395 -7598 -6042 -1817 3997
2762 3997 8933 9546 5098 -1643 -6521 -6958 -4286 -1443 -696 -492 1466 6199 9917 7878 -488 -9976
2778 -9976 -13732 -8985 689 8351 9733 4758 365 -698 355 32 -3471 -7625 -8013 -2751 6004
2793 6004 11659 10412 3387 -4104 -7964 -7221 -4720 -1745 699 3156 5875 6889 4728 -70 -4580
2808 -4580 -7143 -5933 -3419 -532 1964 5143 7686 7555 3318 -4044 -9999 -10229 -4724 2665 7335
2823 7335 6470 3305 695 677 1284 -863 -5649 -9051 -7054 515 9030 12072 7926 -416 -6796 -8101
2839 -8101 -5275 -1687 -75 648 1688 4335 6640 5531 585 -5241 -8878 -7892 -3345 1793 5576
2854 5576 6875 6161 3953 -629 -4883 -7490 -6584 -2837 1515 4427 5105 4191 3260 1835 -624 -4822
2870 -4822 -7925 -7929 -2869 4424 9697 9401 3562 -2411 -5711 -5367 -3548 -2022 -1614 -585 2527 6578
2886 6578 7726 4481 -1622 -7267 -9218 -5827 -875 3557 5599 5690 4399 2235 -678 -4222 -6424
2901 -6424 -6006 -2741 1372 4716 5688 4989 3079 206 -3138 -5892 -7308 -5373 -347 5814 8359 6811
2917 6811 2207 -2187 -4692 -4558 -3585 -2722 -1735 627 4420 7361 6575 2529 -3558 -7782 -7410 -4030
2933 -4030 443 3769 5319 5269 3902 1456 -1962 -4998 -6416 -4872 -1801 2103 4737 5612 4851 3027
2949 3027 -218 -4027 -7254 -7170 -3544 2454 6616 7294 4446 121 -2638 -3343 -3267 -3470 -3481 -2161 1589
2966 1589 6060 8338 5629 -198 -5973 -8111 -6056 -1726 2256 3884 4303 3885 3267 1391 -1905 -5104
2982 -5104 -6395 -4714 -944 2646 5476 5512 4309 1918 -1666 -5132 -6857 -5528 -1231 3692 6670
2997 6670 6103 2646 -721 -2061 -2680 -2880 -3839 -4229 -1634 3662 7887 8369 3665 -3175 -7523 -7327 -3397
3014 -3397 642 2685 2897 2646 3081 3843 1909 -1734 -5860 -7362 -5007 469 4805 6602 5141 2638
3030 2638 -392 -3240 -5271 -5594 -3935 -104 3799 5589 4800 2282 12 -1757 -2614 -4220 -4967 -4061
3046 -4061 265 5637 9011 6775 1021 -5549 -7840 -5158 -782 1728 1619 965 1610 4107 5029 2489
3062 2489 -2969 -8114 -8487 -3452 3372 7518 6998 3178 -639 -2233 -2516 -3023 -3408 -3525 -1370 2256
3078 2256 5454 5930 3502 -296 -3456 -5126 -5088 -3620 -849 2810 6236 6491 4003 -1071 -4781 -5569
3094 -5569 -3506 -790 91 536 1262 3646 5570 5000 393 -6189 -9380 -6780 -273 5718 7270 4436
3110 4436 335 -1692 -1145 -368 -1632 -3977 -5201 -2412 3310 7693 7630 2988 -3083 -6483 -5967 -2937
3126 -2937 -469 1482 2275 3202 4019 3045 614 -2797 -4973 -4874 -2667 145 2337 3987 4807 4274 1861
3143 1861 -2687 -6285 -7230 -3634 1278 5079 5339 2520 100 -416 247 -751 -3293 -5690 -5064 -371
3159 -371 5929 8974 6419 7 -5579 -6732 -3705 -106 1419 740 33 1595 4418 4910 1988 -3102
3175 -3102 -7395 -6920 -2457 2952 5930 5054 2733 671 -860 -2243 -3604 -3921 -3017 -521 3048 4785
3191 4785 4465 2591 82 -1596 -3702 -4593 -4211 -1741 2506 5697 6416 3300 -1335 -4652 -4880 -2290
3207 -2290 -301 -42 -51 514 3289 5423 4480 298 -5797 -8381 -5720 197 5003 5998 3573 270 -984
3224 -984 -418 -120 -1861 -3974 -4467 -1727 3160 6737 6368 2342 -2117 -5098 -5019 -2790 -575 595 1957
3241 1957 3291 3780 2948 650 -2167 -4225 -4121 -2260 -333 1455 3633 4777 4206 1538 -2525 -5759
3257 -5759 -5864 -2916 1246 4135 4230 2073 395 317 390 -726 -3331 -5494 -4457 125 5645 7712 5235
3274 5235 -334 -5049 -5445 -3050 113 1043 67 -29 1537 4358 4924 1600 -3279 -6703 -6012 -1938 2675
3291 2675 4912 4340 2306 485 -754 -1548 -2724 -3486 -2754 -525 2404 4063 3559 2149 359 -1540
3307 -1540 -2980 -4392 -3825 -1686 2458 5385 5588 2781 -1501 -3936 -3455 -1593 -699 -817 -1035 320
3323 320 3257 5698 4659 -41 -5630 -8043 -4930 722 5077 5082 2190 -495 -830 449 716 -1653
3339 -1653 -4490 -4924 -1566 3471 6620 5899 1606 -2590 -4503 -3749 -2026 -657 168 1541 2931 3835
3355 3835 2703 245 -2324 -3699 -3388 -2121 -572 899 2701 4131 4326 1716 -2519 -5551 -5717 -2463
3371 -2463 1821 3942 3244 1383 -103 705 1148 99 -3230 -5589 -4690 135 5412 7382 4531 -1099
3387 -1099 -4735 -4500 -1985 300 511 -279 -467 1802 4008 4166 1248 -3196 -5547 -5019 -1948 1696
3403 1696 3495 3647 2685 1459 -114 -2082 -3382 -3564 -1743 566 2431 2921 2407 2002 1149 34 -2299
3420 -2299 -4766 -4769 -2216 2651 6277 5610 1562 -2456 -3883 -2580 -230 -43 -1194 -2045 -7 3478
3436 3478 5557 4387 -710 -5537 -6770 -3793 1100 4021 3792 1893 345 -10 476 -307 -2606 -4066
3452 -4066 -3262 -351 2817 4545 3852 1746 -1089 -2190 -3494 -3159 -2087 31 2400 4022 3470 1005
3468 1005 -1143 -2521 -2231 -1304 -1319 -1568 -540 2190 4579 4993 1889 -2897 -5589 -4851 -1586 2163 3141
3485 3141 2247 749 596 1279 1553 -644 -3354 -4913 -3218 808 4496 5194 3098 181 -2361 -2938
3501 -2938 -2325 -1740 -962 148 1785 3160 3218 1915 -369 -2361 -2921 -2546 -1662 -322 1205 3241 3820
3518 3820 3194 108 -3122 -4398 -3298 -612 1736 2090 1278 927 1347 1944 648 -1933 -4297 -4743 -1750
3535 -1750 2289 5141 4553 1421 -1198 -2570 -2122 -1130 -921 -1165 -395 1392 3133 3686 1954 -666 -2859
3552 -2859 -3666 -2846 -1003 655 2383 3177 2750 1549 -1060 -2817 -3122 -1784 -616 997 1428 1732 1977
3569 1977 2182 1525 -692 -3372 -4586 -3263 420 3285 4246 2633 333 -1172 -1405 -1542 -1344 -1977 -1618
3586 -1618 -146 2415 4109 3502 921 -2022 -3503 -3227 -2009 -56 1252 2138 2531 2453 1080 -710
3602 -710 -2362 -2623 -2080 -424 1055 1773 2278 2338 1702 259 -1951 -3680 -3743 -1752 1357 3647 3526 1847
3620 1847 -102 -1108 -958 -1198 -1594 -2256 -1539 597 3024 3951 2730 50 -2758 -3234 -2861 -1295 737
3637 737 1536 1768 2258 1722 589 -838 -2298 -2652 -1676 -531 816 1920 2475 2409 1523 -600 -2679 -4023
3655 -4023 -3016 -466 2437 3458 2427 545 -231 -412 -443 -1170 -2648 -2777 -1277 1983 4128 4346 1627
3672 1627 -1600 -3847 -3038 -1114 276 929 688 936 1840 2433 1301 -874 -3284 -3510 -2423 -57 2162
3689 2162 2711 2463 1343 130 -1175 -2386 -3071 -1831 199 1704 2257 2122 1035 332 -358 -796 -2034
3706 -2034 -2758 -2283 97 2843 4156 3167 38 -2513 -3205 -1679 -314 343 157 206 765 2450 2867
3723 2867 778 -2019 -4070 -3760 -1230 1354 2770 2702 1438 237 -257 -830 -1600 -2107 -1802 -355 1160
3740 1160 2467 2096 1520 254 -984 -1536 -2599 -2435 -1114 1414 3355 3554 2017 -883 -2710 -2265
3756 -2265 -744 -131 -1 -589 -236 1946 3093 3085 206 -3156 -4552 -3232 184 3011 3118 1595 -287
3773 -287 -562 -116 54 -647 -2085 -2597 -1081 1822 3505 3573 1285 -1328 -2601 -2561 -1532 -526 321 1106
3791 1106 1924 2118 1148 -21 -1240 -1874 -1931 -1094 -438 202 1613 2584 2645 1229 -1521 -3245 -3317 -1310
3809 -1310 1203 2578 2077 479 108 502 918 274 -2068 -3213 -2822 81 3384 4119 2590 -393 -2603
3826 -2603 -2796 -1215 -112 62 -441 -185 1194 2566 2350 951 -1583 -3245 -2825 -998 1000 1997 1777
3843 1777 1417 1191 -5 -1186 -2092 -2276 -1392 271 1761 1707 1451 792 635 -183 -1323 -2632 -2799 -1247
3861 -1247 1087 3206 3383 1571 -1005 -2356 -1718 -665 -43 -551 -864 -107 1740 3063 2684 -12 -2908
3878 -2908 -3963 -2478 58 2158 2310 1393 246 -58 -61 -353 -1283 -2201 -1790 -377 1620 2756 2606 1002
3896 1002 -442 -1775 -2038 -1796 -1219 196 1401 2271 2047 1044 -719 -1169 -1232 -1067 -1083 -877 -400 1154
3914 1154 2434 2766 1098 -1464 -3222 -2911 -1216 1168 2325 1580 125 -191 808 973 75 -1971 -3276
3931 -3276 -2475 488 2850 3756 2223 -512 -2166 -2042 -1005 -57 -444 -687 -85 1299 2187 2233 460
3948 460 -1506 -2820 -2551 -623 866 1861 1745 1412 1030 -8 -1007 -1761 -1743 -1054 105 1256 1364 1101
3966 1101 1050 876 -123 -1049 -2357 -2526 -938 1316 3102 2618 834 -1045 -1807 -973 -463 -532 -881 -1170
3984 -1170 161 2041 2785 2163 -269 -2699 -3410 -1770 418 2109 1712 941 324 426 550 67 -1467
4001 -1467 -2025 -1824 -204 1858 2456 2088 810 -325 -1494 -1497 -1510 -1023 -107 1062 1732 2216 847 -464
4019 -464 -973 -1208 -1007 -827 -630 -228 1056 2164 2671 1079 -1296 -2891 -2665 -1061 1050 1846 1209 451
4037 451 367 886 1035 -106 -1904 -2766 -1607 262 2438 3196 1619 -167 -1387 -1649 -771 -786 -73 -285
4055 -285 252 1252 1927 1475 352 -1291 -1782 -2067 -838 198 1318 1665 1684 1005 -218 -1024 -1743 -1458
4073 -1458 -513 198 675 836 864 1148 789 338 -1309 -2454 -2259 -475 1209 2669 2063 663 -885 -1463
4091 -1463 -671 -81 -341 -1087 -898 16 2077 2577 1373 -534 -2121 -2506 -1567 168 1234 1237 890 801 830
4110 830 285 -331 -1469 -1914 -1361 -111 1401 1933 1507 683 -120 -1016 -1363 -1348 -902 -24 1126 1795 1439
4129 1439 744 -349 -681 -986 -994 -838 -512 122 1124 2076 1763 507 -1235 -2264 -1981 -595 273 1093
4147 1093 986 543 779 964 536 -421 -1539 -1929 -1304 162 1990 2350 1247 -172 -974 -1086 -1078 -840 -563
4166 -563 -64 656 1342 1585 1164 29 -979 -1335 -1551 -925 215 848 1388 1432 1028 -195 -1139 -1404 -1474
4185 -1474 -742 130 568 671 870 1153 749 -10 -1281 -2027 -1832 -472 1086 2053 1463 848 -199 -731
4203 -731 -711 -635 -983 -651 -91 431 1728 1813 907 -554 -1750 -1752 -1091 -209 474 1064 823 590 644 344 -571
4224 -571 -1187 -1591 -1137 27 995 1625 1345 631 -94 -808 -1093 -1200 -750 3 812 1239 1194 712 347 -668
4244 -668 -1225 -1053 -980 -239 385 1278 1642 1160 290 -583 -1186 -1316 -827 -168 557 973 1161 1047 616 -223
4264 -223 -845 -1279 -1410 -673 322 1130 1493 1000 245 -532 -1037 -965 -813 -854 -192 536 1175 1450 900 141 -902
4285 -902 -1472 -1031 -545 210 1001 998 1207 711 335 -425 -1124 -1308 -811 -178 629 1249 1192 768 94 -549 -1022
4306 -1022 -1243 -912 -305 572 1265 1297 742 419 -281 -796 -1218 -1229 -862 -8 680 1360 1236 618 -329 -1066
4326 -1066 -1455 -982 -216 409 779 905 774 644 1 -516 -1051 -1590 -801 -59 1034 1362 1364 439 -271 -900
4346 -900 -855 -722 -445 -338 268 1074 1483 864 103 -560 -1081 -1429 -870 -388 451 1422 1096 755 248 -321
4366 -321 -761 -1117 -1026 -379 347 640 929 813 405 -39 -973 -1132 -1477 -718 187 1305 1296 984 415 -344 -570
4387 -570 -808 -703 -796 -274 607 1113 1370 877 -71 -729 -1289 -1036 -375 213 715 1128 797 514 319 -184
4407 -184 -774 -1031 -1108 -471 469 968 1267 726 261 -592 -924 -1187 -549 -470 500 916 1203 751 152 -344 -557
4428 -557 -966 -995 -706 36 749 1085 1139 517 -201 -1031 -1162 -1238 -303 270 653 753 758 288 414 -410 -1156 -1290
4450 -1290 -1063 -174 782 1117 1097 311 -219 -487 -1132 -897 -624 -32 293 822 1065 887 220 -405 -889 -1108
4470 -1108 -1036 -8 281 884 951 769 404 -349 -672 -860 -880 -375 125 643 923 838 338 -163 -583 -981 -1143
4491 -1143 -624 325 849 1219 660 360 -193 -429 -921 -958 -412 -110 529 1022 1026 721 -128 -761 -938 -1111 -642
4512 -642 -129 566 556 755 622 279 -268 -1027 -979 -589 -262 204 886 826 891 173 -315 -803 -1071 -951 -232
4533 -232 529 1195 888 811 403 -371 -696 -1052 -709 -668 178 596 726 810 492 -246 -593 -963 -940 -607 127
4554 127 583 622 992 744 -128 -489 -904 -725 -483 -155 323 731 906 779 391 -460 -914 -965 -685 -160 528
4575 528 750 1022 705 -2 -621 -579 -954 -653 -318 291 887 944 1057 453 -212 -769 -954 -672 -347 220 697
4596 697 1010 702 301 -301 -662 -988 -788 -453 53 571 867 947 510 106 -549 -843 -725 -342 128 328
4616 328 849 1024 372 57 -352 -770 -841 -415 8 278 1077 980 447 209 -369 -851 -1048 -724 -284 454 674
4637 674 785 711 267 -422 -762 -760 -785 -639 369 792 1110 739 858 -225 -1040 -1153 -1010 -174 351 399 643
4658 643 526 533 -156 -419 -660 -1067 -666 -243 645 864 979 421 -114 -393 -649 -671 -374 -196 488 804 843
4679 843 761 165 -276 -569 -960 -494 -35 398 875 830 608 299 -307 -647 -723 -459 -259 422 706 833 735
4700 735 307 -174 -485 -735 -736 -499 118 619 855 683 88 -224 -443 -531 -690 -495 -141 545 706 1048 756
4721 756 39 -812 -946 -740 -286 282 537 340 740 249 235 -99 -415 -792 -402 -327 228 772 801 478 -75
4742 -75 -454 -456 -549 -569 -208 237 362 826 600 318 -264 -608 -538 -566 -184 102 305 708 763 514 -156 -443 -1143
4765 -1143 -551 -154 324 418 491 459 214 194 -176 -551 -942 -751 -203 577 1176 865 265 -196 -688 -465 -352
4786 -352 -465 -16 -109 550 750 952 325 -552 -812 -1010 -523 -23 450 735 667 382 318 -519 -380 -529 -576
4807 -576 -354 -1 389 353 633 799 -208 -551 -814 -806 -331 428 535 1097 550 -7 -394 -292 -552 -356 -498
4828 -498 -364 122 606 958 488 -222 -720 -929 -765 -242 569 599 440 255 259 238 92 -264 -754 -1034 -456
4849 -456 581 854 737 221 25 -321 -472 -771 -433 -284 -111 540 804 466 145 -201 -587 -538 -376 -374 -110
4870 -110 411 724 870 600 -197 -845 -840 -677 82 459 320 148 -44 378 247 107 -556 -733 -617 -213 709
4891 709 1129 962 -7 -316 -325 -378 -195 -242 -303 127 494 631 657 424 -356 -534 -581 -359 -255 107 521 727
4913 727 677 144 -352 -864 -737 -202 26 329 -5 311 316 458 255 -79 -864 -1033 -445 219 723 710 306
4934 306 -91 -444 -25 -66 -146 -248 -373 -168 505 1092 676 120 -309 -825 -692 -22 311 586 347 261 537
4955 537 59 90 -349 -769 -534 -431 261 635 692 639 189 -269 -769 -864 -548 -13 385 406 585 331 28 -256
4977 -256 83 -252 -840 -806 -183 510 622 982 189 -505 -618 -668 -400 -210 65 170 139 499 729 358 -25
4998 -25 -744 -830 -666 6 130 721 491 207 -11 -268 -456 -509 -545 -228 -135 503 595 277 192 -468 -186 -607
5020 -607 -650 -296 -7 343 738 808 267 -446 -514 -444 -305 160 173 200 81 243 401 339 -268 -756 -722 -785 193
5043 193 438 770 385 95 -295 -242 -505 -356 -415 -255 0 615 830 545 93 -225 -604 -728 -107 -142 360
5064 360 348 559 491 54 -372 -513 -299 -300 -93 -208 4 662 363 644 -24 -696 -699 -549 -255 203 618 458
5086 458 292 -264 223 -110 -210 -498 -563 -275 155 685 885 280 -339 -390 -604 -351 72 262 151 331 396
5107 396 398 206 92 -569 -529 -355 -364 382 291 534 401 -105 9 -391 -505 -522 -288 -26 323 393 503 103 -39
5130 -39 -130 -581 -567 -237 -11 356 570 571 211 -197 -484 -287 -511 -257 220 312 427 590 388 62 -311 -331
5152 -331 -224 -284 116 575 263 501 271 56 -368 -430 -328 -402 4 145 282 579 180 -128 -31 -430 -491 -213
5174 -213 -196 293 378 616 493 -123 33 -527 -406 -232 -166 254 252 456 303 345 36 -293 -260 -865 -201 188
5196 188 262 670 461 407 -142 -196 -379 -469 -193 -338 177 478 314 225 130 -322 -381 -404 -65 -77 452 356 216
5219 216 369 206 23 -463 -399 -507 -430 201 510 471 256 264 -223 -325 -328 -260 -343 -82 157 422 544 374 -102
5242 -102 -477 -546 -563 -140 341 663 433 420 99 -86 -214 -234 -534 -219 -268 164 660 349 370 7 -140 -423
5264 -423 -457 -367 85 146 410 161 272 19 -146 -49 -363 -586 -280 6 410 550 319 190 23 -438 -504 -501
5286 -501 -181 -56 174 548 390 110 -43 -392 -409 -416 106 265 182 -18 319 167 209 -98 -389 -354 81 54
5308 54 -54 237 249 68 285 -225 -148 -247 -89 -430 223 538 476 402 161 -329 -334 -449 -6 4 106 322 262
5331 262 139 231 21 -133 -596 -314 -217 33 366 544 434 540 -218 -212 -574 -426 -165 -94 355 236 472 314
5353 314 -206 -591 -430 -495 -487 97 461 700 574 129 -121 -175 -14 -30 -42 -295 -59 408 499 286 -144 177
5375 177 -656 -485 -216 -36 283 333 321 583 168 30 -452 -190 -105 -167 94 324 210 433 -8 91 -123 -582
5397 -582 -376 -423 104 588 600 373 -64 -250 -257 -306 -61 -210 -13 145 362 486 393 151 -339 -697 -365 -53
5419 -53 56 272 376 245 278 179 -175 -226 -349 -429 -251 67 626 131 552 122 71 -165 -312 -445 95 99 324
5442 324 507 131 -48 -473 -256 -32 -72 -178 -176 7 659 672 193 19 -508 -631 -276 200 294 274 -20 -207
5464 -207 402 148 141 -295 -263 -309 -160 226 255 445 253 13 -256 -239 -234 -145 25 141 246 261 99 9 -133 -125
5488 -125 -211 -323 -108 -18 323 393 392 220 -51 -603 -353 -196 104 371 11 248 320 370 187 -473 -430 -800 -536
5511 -536 123 315 742 322 -24 -74 -243 -278 -396 -208 -69 193 423 458 140 10 -53 -270 -204 -197 -190 -28 101
5534 101 584 367 -108 -206 -556 -117 95 181 7 183 281 442 377 335 -27 -620 -716 -152 502 538 274 57
5556 57 -235 -149 86 120 22 -331 -330 101 425 584 404 -173 -203 -371 -85 -36 -194 141 265 146 392 126 -190
5579 -190 -367 -371 -189 -203 -54 72 386 316 334 -18 -516 -432 -486 118 542 280 259 -164 -273 158 91 16 -278
5602 -278 -576 -305 108 537 591 -61 -63 -577 -201 -210 125 275 -27 386 282 43 72 -59 -195 -440 -251 32
5624 32 187 60 200 506 -99 -158 -331 -381 -165 62 488 353 12 75 305 224 110 -228 -444 -143 -323 481
5646 481 625 489 71 -511 -634 -148 150 43 85 -14 -68 46 269 245 -321 -346 -322 -288 256 342 374 106 -48
5669 -48 -198 -168 -232 -37 -121 198 95 14 24 -64 20 -23 -83 -443 -484 -302 319 578 637 102 -106 -355 57 -20
5693 -20 143 -60 -265 -156 249 291 358 -92 -667 -737 -378 17 514 311 34 0 -89 -32 141 25 -24 -101 165
5716 165 76 98 452 171 294 -164 -213 -502 -387 68 243 410 105 291 -45 -299 -449 43 -182 -347 -2
5737 -2 50 259 512 64 -276 -506 -545 -100 196 462 130 -176 134 -82 258 156 28 -349 -333 39 256 311
5759 311 172 78 28 -197 -368 -231 -215 -88 278 34 242 51 -8 -67 -176 -105 -233 -95 117 250 460 345
5781 345 -85 -280 -626 -110 -8 125 357 101 -47 195 203 6 -173 -555 -474 -271 232 302 200 66 -243
5802 -243 -339 -27 33 -15 -69 31 121 38 244 411 72 -82 -176 -260 -17 -125 84 534 61 -84 -146 -442 -286
5825 -286 -432 60 193 199 -87 313 144 -110 -81 -76 -254 -322 -4 165 564 302 57 -211 -150 41 -109 -286
5847 -286 -111 -276 169 63 143 239 -210 -258 -306 -147 254 224 230 65 43 345 194 -119 -270 -23 -168 80 121
5870 121 457 220 72 -57 -144 55 -605 -276 355 206 211 303 222 47 -312 -23 -284 -161 49 -19 283 580
5892 580 491 30 -69 -432 -449 -63 88 329 444 195 -81 53 138 -42 -106 -389 -311 169 392 479 -11 92
5914 92 -60 -232 -25 -400 -255 104 61 279 239 308 111 -104 -463 -113 -279 217 244 189 199 224 96 -127 -178
5937 -178 -318 36 -81 131 76 104 293 139 95 -15 -601 -284 326 121 177 283 -2 -207 -168 -214 -63 -127
5959 -127 -421 -21 5 484 374 466 -90 -400 -331 -194 25 232 -127 -7 192 129 177 -143 -313 -456 -387 226
5981 226 -91 284 58 252 26 41 -137 -303 -133 -110 168 96 167 -27 -34 -126 -268 -312 -169 -173 -184 454 350 433
6005 433 338 -314 -407 -330 220 139 94 30 9 -72 232 146 -101 -383 -587 -365 140 377 527 109 -359 -201 -249
6028 -249 -70 -141 -193 -192 117 -17 396 293 -63 -98 -76 -63 -132 4 -119 138 254 145 49 -349 -237 87 207
6051 207 162 -50 -169 101 528 338 31 -135 -563 -506 414 524 353 156 -179 -124 -57 105 167 30 -375 -263
6073 -263 67 354 446 601 -307 -579 -369 -129 211 219 57 185 -4 63 190 -41 -386 -160 -31 -6 267 -59
6095 -59 29 0 120 -36 -372 -476 -75 174 456 332 -54 -265 77 87 139 -83 -166 -501 -265 414 271 415
6117 415 -120 -751 -385 14 348 254 137 -106 -127 259 125 189 15 -327 -382 60 127 159 152 -94 161 -4 -211
6140 -211 -105 -203 5 -21 72 -64 121 5 -24 198 -155 -295 -377 -353 209 269 538 -16 -297 -461 -323 228
6162 228 375 -74 -77 -301 -147 299 455 167 -289 -359 -320 -100 306 264 23 -80 -56 -202 -24 36 -191 -303
6184 -303 55 142 517 311 204 157 -132 -292 -317 -166 61 29 390 290 -40 -173 -249 -115 -232 54 -22 -19 -2
6207 -2 437 379 530 63 -317 -486 -44 85 403 -34 -116 110 158 122 197 38 -72 -242 36 237 293 358 -43
6230 -43 -13 -212 -131 -91 128 -183 85 149 73 160 -33 -135 -214 -115 -134 -265 -185 -72 111 186 -70 -140 -350 -384 -57
6255 -57 445 117 189 -252 -173 241 116 104 -454 -412 -535 -62 347 258 451 9 -259 -371 -78 14 -103 25
6277 25 -199 232 86 8 171 -189 -197 -33 -131 -104 114 181 297 108 -345 -480 -444 -150 -35 320 -84 12 23
6300 23 156 136 187 19 -253 -405 1 179 170 182 94 -208 -276 -67 1 -177 -86 -92 57 144 590 142 -202 -144 -227
6325 -227 -72 180 -4 -107 149 138 212 27 -346 -196 82 -266 60 24 78 118 -82 235 -35 118 -214 19
6347 19 220 214 350 85 43 -102 -50 -126 -291 -84 -271 50 95 84 6 -8 -178 -84 72 -62 123 12 -82 272
6371 272 455 -116 -227 -134 -363 -177 175 50 240 29 309 267 325 41 -139 -291 -123 180 182 384 -192 -60
6393 -60 -348 -86 -188 178 -81 89 73 -163 283 97 -65 -30 -259 104 -26 68 146 152 250 164 166 -404 -197 -152
6417 -152 16 -80 -78 31 281 62 -45 77 -93 -304 -17 46 78 -7 20 -37 -21 -37 149 -92 -157 -186 -141 -174 124
6442 124 304 138 -207 110 -176 41 182 -133 238 184 265 273 -268 -279 -95 18 -184 14 220 168 248 121
6464 121 94 -300 -101 -63 -184 248 244 180 -107 -47 178 7 -93 -116 -162 -236 -259 167 154 29 200 -115 -425 -183
6488 -183 -16 223 203 173 382 77 131 -81 -44 46 -43 -95 -130 -43 76 271 -42 55 -126 -230 -407 -35 -123 132
6512 132 158 -53 -57 204 124 -267 -385 -257 -261 6 409 330 29 -71 -38 -120 131 131 8 -50 -141 187 59 12 -33
6537 -33 -213 -190 -165 -34 -123 -30 210 -16 194 10 -276 -17 18 83 -68 116 260 -68 25 219 109 -133 -149
6560 -149 -82 -17 151 263 241 173 -213 -176 -157 118 19 -371 18 -102 -41 239 -100 -145 -98 -317 -37 -192 104
6583 104 202 257 9 -172 -248 -114 -127 -310 -75 238 79 156 -49 92 96 12 -62 -298 36 43 112 221 119 -202
6607 -202 10 -11 -42 140 -133 108 -101 307 197 120 364 -105 -219 -198 48 -13 298 -163 10 101 -185 -251
6629 -251 57 70 -252 -78 69 25 220 24 62 48 12 -193 -59 -149 116 388 182 69 -158 -221 -445 64
6651 64 19 -194 67 399 335 433 -36 -98 -182 -106 -226 -35 -66 9 250 62 138 101 -213 -250 84 138 57 -9 -266
6676 -266 152 169 332 180 86 -129 -216 -4 456 100 88 130 -210 -74 24 -65 -77 -71 -55 -55 208 254 87 -71 -188
6701 -188 -553 83 101 99 -49 210 -121 95 0 -170 -169 -268 -210 -137 100 -11 374 105 2 -79 -130 -243 -150 117
6725 117 251 108 -129 257 39 202 110 99 -640 -45 166 250 387 391 -36 -205 -77 114 325 71 -79 -104
6747 -104 250 136 238 126 -154 -332 -89 41 341 220 120 -357 88 117 -113 -98 -83 -376 190 -75 233
6768 233 23 -136 -207 -34 -237 -132 -247 -149 331 403 314 131 -178 -366 -60 162 126 -70 -203 127 97 377
6790 377 168 331 -278 -165 -277 264 186 70 -7 47 -191 61 267 -173 -98 -225 9 189 60 133 23 -3
6812 -3 29 -94 -129 73 -144 354 561 93 -22 -157 -229 -148 -109 34 -81 -2 -64 336 55 234 -114 -390 -574
6835 -574 -71 289 104 203 178 -263 -60 76 -102 -106 -203 83 114 447 347 389 -130 -321 -142 -6 -154 9
6857 9 49 -12 314 216 -117 -345 -241 -143 -1 -62 77 47 162 34 81 8 -79 -341 -259 -185 37 80 53 176 287
6882 287 -83 107 -216 -82 -19 68 -50 236 159 11 -133 -133 -25 -62 119 96 107 215 84 66 86 -197 -315
6905 -315 -353 -245 -203 126 -90 -93 -15 -181 178 -95 -134 -178 -267 -253 61 351 92 136 -228 -220 -211 -87 48 -119 3
6930 3 410 171 86 275 -215 -140 -331 -102 -61 97 137 -112 -39 -86 -95 -162 -79 -213 40 224 300 -128 180 170 -80
6955 -80 -95 -91 -203 -196 216 218 139 -26 -79 -148 -86 52 196 84 -65 38 -82 -67 294 -175 -242 -333 -374 -71 146
6980 146 216 391 -100 -83 52 -142 -197 -85 -196 -11 -122 41 127 309 86 -349 55 -56 48 39 107 261
7002 261 124 180 166 -134 -38 -12 162 167 67 27 212 320 222 -93 -217 -393 -17 -35 384 129 -418 -283 -9
7025 -9 49 -107 36 -215 -340 -78 320 147 158 -116 -227 -302 -131 19 72 9 -273 85 -152 -112 20 -208 81
7048 81 -430 -429 115 85 -105 204 170 16 78 -30 -210 -39 86 157 346 -135 -67 219 134 -90 -183 -399 -305 28
7072 28 264 568 -31 -276 -425 -359 138 458 270 -135 -42 -364 36 468 112 -236 -494 -433 -214 130 179 -197
7094 -197 -93 33 -191 28 -101 -59 -271 120 164 -218 82 22 29 130 296 -62 -580 -232 205 319 28 -47
7116 -47 -586 -246 123 121 111 -128 -267 -154 8 369 470 -137 -415 -369 -57 50 540 109 79 -309 44 269
7138 269 335 -333 -347 -342 -90 118 226 191 -11 29 -187 -78 32 -254 51 27 73 280 -34 -63 -265 -163 205
7161 205 80 -325 -140 95 240 234 55 -441 -330 -115 138 276 136 -109 -332 -290 -15 166 72 -169 -306
7182 -306 -86 195 353 332 -193 -364 -294 -106 162 136 -96 -90 -142 -180 381 -78 -1 -218 -259 -62 1 -134 47
7205 47 217 238 -39 -172 -424 -168 -51 350 57 -90 -15 41 297 260 167 23 -269 -395 -165 383 552 214
7227 214 47 -140 -243 -156 129 -158 -119 -235 -112 -11 248 74 -168 -236 -236 61 -75 339 326 227 244 137 -101
7250 -101 -151 -30 -172 113 -91 47 54 -59 491 63 104 -181 -195 -99 -34 49 210 106 126 -192 -133 49 112 134
7274 134 -115 -157 99 -10 62 139 -63 -222 -409 202 -150 -99 122 -120 -10 82 -6 -246 -40 96 -39 71
7296 71 171 6 165 -101 179 -24 -110 -197 -7 233 41 110 -121 84 -129 123 56 77 -29 -221 103 331
7318 331 323 2 -104 -474 -168 -141 -41 124 111 196 169 165 -48 -175 -327 22 -159 -137 -67 7 -227 210 183 46
7342 46 -215 -261 -159 -64 23 -115 162 -36 -173 -102 -2 74 -384 -150 -220 1 -49 242 217 -157 -77 -55 28 -25
7366 -25 79 10 168 -22 231 148 -29 336 38 31 14 221 65 50 350 95 121 -293 -209 -267 289 257 216 -101
7390 -101 -314 -47 207 219 -136 -305 -207 -7 327 98 219 -235 -180 -190 5 103 64 78 292 202 8 64 124
7413 124 -89 -252 -275 -93 75 36 394 299 40 -4 -46 -275 15 -106 -18 404 -401 -62 82 133 56 82 -199
7436 -199 -563 7 49 72 202 49 -286 -103 -232 -63 204 -108 148 -221 -30 320 57 -115 -172 -444 -267
7457 -267 3 214 64 167 38 -121 -60 30 -234 161 -163 207 14 75 226 99 22 -70 -231 -72 -25 -273
7479 -273 284 317 359 -111 -185 -326 -237 177 6 -190 -264 114 76 51 72 166 -198 44 -127 120 400 -66 -37
7502 -37 -226 -22 112 -76 -116 -22 -102 -19 146 180 124 119 -120 -226 -250 56 98 67 294 148 -103 267 72 130
7526 130 -132 118 -29 -83 -69 188 136 141 -175 -38 0 -105 59 189 20 109 -258 -81 195 -179 -142 9 -258
7549 -258 -150 2 361 -104 106 -98 -186 -40 -16 272 -93 20 58 180 187 127 140 -33 -183 -231 49 -111 -42
7572 -42 -208 -68 -78 78 -159 -60 -319 1 57 53 181 370 51 -84 -12 -65 -80 -153 -38 -15 1 100 175 30 -110
7597 -110 -203 73 99 59 -123 -17 -49 -9 -71 -141 -216 -419 -160 18 6 316 -84 -274 -132 -95 141 62 12 -88
7621 -88 62 457 224 2 -50 6 -198 -30 346 129 -328 -25 -285 227 511 120 -287 -252 -211 116 191 30
7643 30 -23 56 -34 -125 -40 232 -95 -113 -66 458 69 149 31 -11 -129 -16 66 -289 -166 57 133 341 -52 -149
7667 -149 -175 -73 -12 202 -151 -244 -102 369 334 112 -91 -545 -331 52 205 526 239 -139 -96 -157 431 259
7689 259 10 -197 -461 -61 247 306 20 -104 -149 -480 -256 8 279 -2 -46 -254 148 -165 70 -142 -59
7710 -59 -124 -170 -80 -79 129 350 425 56 -198 -421 -161 92 298 59 -34 -324 -86 205 457 538 -502 -555 -500
7733 -500 109 552 440 121 -469 -610 -113 233 292 43 -399 -376 245 272 305 179 -300 -492 -286 96 266
7754 266 102 39 -96 -218 -7 183 -123 23 73 188 35 16 -229 -166 259 -14 -48 -384 -258 -319 180 729
7776 729 409 -240 -436 -221 90 348 403 -394 -582 -327 389 545 432 -178 -492 -661 20 211 239 21 -351
7797 -351 -250 -82 20 317 -234 -243 -276 66 229 158 59 -59 -21 -97 109 -236 -162 -20 389 426 -52 -144 -276
7820 -276 176 504 210 122 -273 -541 24 408 656 205 -475 -769 -304 507 523 213 15 -348 -136 448 466
7841 466 149 -381 -524 -122 -246 452 537 -203 -314 -424 -163 51 346 207 -197 -42 -138 227 -84 -180 183
7862 183 22 -143 -359 -96 -73 190 204 120 -90 -582 -443 29 479 288 34 -491 -311 46 422 297 -175
7883 -175 -415 -438 17 520 295 397 -149 -453 -336 344 329 258 -16 -571 101 72 403 143 -273 -544 1
7904 1 16 188 242 14 -125 79 84 -168 -142 -288 114 226 -18 -45 45 -168 186 389 -127 -362 -445 -355 125 425
7928 425 502 143 -290 -315 111 288 78 -368 -410 -279 59 518 365 -62 -322 -382 -24 -57 210 104 65 -72
7950 -72 183 176 221 99 -214 -44 -189 183 -15 -89 237 271 54 -63 -56 -192 -169 375 447 101 -271 -333 68 192
7974 192 349 112 -379 -196 92 356 349 73 -71 -314 17 238 -62 252 -113 -213 -145 -48 59 196 -87
7995 -87 -190 -304 146 440 100 165 -46 273 57 -191 -214 16 13 155 241 125 202 -72 77 187 16 -186
8017 -186 -107 -115 111 179 376 -98 -257 28 142 -38 302 -231 -48 -1 -143 -15 149 -69 -114 -305 -72 166
8039 166 457 158 68 193 -68 11 -257 -146 -138 60 102 128 -104 -71 92 -137 283 -20 -159 25 429 212
8061 212 336 357 0 -415 -240 329 -99 -208 -238 -125 -35 136 41 44 28 -27 -175 -113 107 127 -87 221 45
8084 45 -59 -148 -272 20 -65 -27 -145 78 183 -190 204 -206 323 -227 -109 46 307 175 -44 44 -143 -122
8106 -122 -104 102 -107 118 122 -282 -27 151 18 -328 -167 -158 -190 44 -14 91 -114 -230 91 -50 120 114 -32
8129 -32 26 186 101 -81 180 -76 -7 -34 5 -108 59 93 59 60 -80 -227 -154 79 91 -249 -46 -118 154 177 -162
8154 -162 -132 -12 25 -188 -33 105 21 134 -168 -254 -170 -181 -69 -170 -229 -65 32 -265 59 227 96 112 -173
8177 -173 24 -22 -72 64 -72 10 -13 -120 -208 40 54 -253 1 62
8191F2
##END NTUPLES=NMR FID
##END=
