##TITLE=1H_Pr BrBuOH
 CDCl3, 8 sc, 
 11.06.2021
##JCAMPDX= 6.0         $$ Bruker NMR JCAMP-DX V2.0
##DATA TYPE= NMR FID
##DATA CLASS= NTUPLES
##ORIGIN= UXNMR, Bruker Analytische Messtechnik GmbH
##OWNER= root
$$ XWIN-NMR		Version 3.5
$$ Fri Jun 11 10:53:14 2021 Russian Standard Time (UT+4h)  she@DPX200
##.OBSERVE FREQUENCY= 200.131506
##.OBSERVE NUCLEUS= ^1H
##.DELAY= (6, 6)
##.ACQUISITION MODE= SIMULTANEOUS
##.ACQUISITION SCHEME= undefined
##.AVERAGES= 8
##.DIGITISER RES= 18
##SPECTROMETER/DATA SYSTEM= spect
##.PULSE SEQUENCE= zg30
##.SOLVENT NAME= CDCl3
##.SHIFT REFERENCE= (INTERNAL, CDCl3, 0, 15.7039)
##AUDIT TRAIL= $$ (NUMBER, WHEN, WHO, WHERE, WHAT)
$$ ##TITLE= Audit trail, XWIN-NMR		Version 3.5
$$ ##JCAMPDX= 5.01
$$ ##ORIGIN= Bruker BioSpin GmbH
$$ ##OWNER= she
$$ F:/spectra/data/she/nmr/H-F/1/audita.txt
$$ ##AUDIT TRAIL=  $$ (NUMBER, WHEN, WHO, WHERE, WHAT)
(   1,<2021-06-11 10:51:56.82 +0400>,<she>,<DPX200>,
      <created by zg, POWCHK disabled, PULCHK disabled
       configuration hash MD5:
       00 E9 B6 7A A2 85 ED C7 34 08 36 98 17 FE 4E 26
       data hash MD5: 16K
       4A BD DF FD 9E F3 47 AE 7A FA 8E 7A 0E 56 74 6B>)
$$ ##END=
$$ 
$$ hash MD5
$$ 5E 14 B8 D4 DC 44 79 29 23 0A 6B AA 2C 0E 6C 25
##$RELAX= 
##$RELAX= 
##$RELAX= 
##$RELAX= 
##$RELAX= 
##$RELAX= 
$$ Bruker specific parameters
$$ --------------------------
##$DU= <F:/spectra>
##$EXPNO= 1
##$NAME= <H-F>
##$PROCNO= 1
##$TYPE= <nmr>
##$USER= <she>
##$AMP= (0..31)
100 100 100 100 100 100 100 100 100 100 100 100 100 100 100 100 100 100 
100 100 100 100 100 100 100 100 100 100 100 100 100 100 
##$AQSEQ= 0
##$AQ_mod= 1
##$AUNM= <au_zg>
##$AUTOPOS= <>
##$BF1= 200.13
##$BF2= 200.13
##$BF3= 200.13
##$BF4= 200.13
##$BF5= 200.13
##$BF6= 200.13
##$BF7= 200.13
##$BF8= 200.13
##$BYTORDA= 1
##$CFDGTYP= 0
##$CFRGTYP= 5
##$CHEMSTR= <none>
##$CNST= (0..31)
1 1 145 1 1 1 1 1 1 1 1 1 1 1 1 1 1 1 1 1 1 1 1 1 1 1 1 1 1 1 1 1 
##$CPDPRG= <>
##$CPDPRG1= <>
##$CPDPRG2= <>
##$CPDPRG3= <>
##$CPDPRG4= <mlev>
##$CPDPRG5= <mlev>
##$CPDPRG6= <mlev>
##$CPDPRG7= <mlev>
##$CPDPRG8= <mlev>
##$CPDPRGB= <>
##$CPDPRGT= <>
##$D= (0..31)
0 1.2 0 0 0 0 0 0 0 0.06 0 0.03 0 0 0 0 0.0002 0 0 0 0 0 0 0 0 0 0 0 0 
0 0 0 
##$DATE= 1623394316
##$DBL= (0..7)
120 120 120 120 120 120 120 120 
##$DBP= (0..7)
150 150 150 150 150 150 150 150 
##$DBP07= 0
##$DBPNAM0= <>
##$DBPNAM1= <>
##$DBPNAM2= <>
##$DBPNAM3= <>
##$DBPNAM4= <>
##$DBPNAM5= <>
##$DBPNAM6= <>
##$DBPNAM7= <>
##$DBPOAL= (0..7)
0.5 0.5 0.5 0.5 0.5 0.5 0.5 0.5 
##$DBPOFFS= (0..7)
0 0 0 0 0 0 0 0 
##$DE= 6
##$DECBNUC= <off>
##$DECIM= 32
##$DECNUC= <off>
##$DECSTAT= 4
##$DIGMOD= 1
##$DIGTYP= 9
##$DL= (0..7)
0 120 120 120 120 120 120 120 
##$DP= (0..7)
150 150 150 150 150 150 150 150 
##$DP07= 0
##$DPNAME0= <>
##$DPNAME1= <>
##$DPNAME2= <>
##$DPNAME3= <>
##$DPNAME4= <>
##$DPNAME5= <>
##$DPNAME6= <>
##$DPNAME7= <>
##$DPOAL= (0..7)
0.5 0.5 0.5 0.5 0.5 0.5 0.5 0.5 
##$DPOFFS= (0..7)
0 0 0 0 0 0 0 0 
##$DQDMODE= 0
##$DR= 18
##$DS= 0
##$DSLIST= <SSSSSSSSSSSSSSS>
$$ [...]
##$SUBNAM2= <"">
##$SUBNAM3= <"">
##$SUBNAM4= <"">
##$SUBNAM5= <"">
##$SUBNAM6= <"">
##$SUBNAM7= <"">
##$SUBNAM8= <"">
##$SUBNAM9= <"">
##$SW= 20.0188882624521
##$SWIBOX= (0..15)
0 0 2 0 0 0 0 0 0 0 0 0 0 0 0 0 
##$SW_h= 4006.41025641026
##$TD= 16384
##$TD0= 1
##$TE= 0
##$TE2= 300
##$TE3= 300
##$TEG= 300
##$TL= (0..7)
0 120 120 120 120 120 120 120 
##$TP= (0..7)
150 150 150 150 150 150 150 150 
##$TP07= 0
##$TPNAME0= <>
##$TPNAME1= <>
##$TPNAME2= <>
##$TPNAME3= <>
##$TPNAME4= <>
##$TPNAME5= <>
##$TPNAME6= <>
##$TPNAME7= <>
##$TPOAL= (0..7)
0.5 0.5 0.5 0.5 0.5 0.5 0.5 0.5 
##$TPOFFS= (0..7)
0 0 0 0 0 0 0 0 
##$TUNHIN= 0
##$TUNHOUT= 0
##$TUNXOUT= 0
##$USERA1= <user>
##$USERA2= <user>
##$USERA3= <user>
##$USERA4= <user>
##$USERA5= <user>
##$V9= 5
##$VALIST= <valist>
##$VCLIST= <CCCCCCCCCCCCCCC>
##$VD= 0
##$VDLIST= <DDDDDDDDDDDDDDD>
##$VPLIST= <PPPPPPPPPPPPPPP>
##$VTLIST= <TTTTTTTTTTTTTTT>
##$WBST= 1024
##$WBSW= 4
##$XGAIN= (0..3)
0 0 0 0 
##$XL= 0
##$YL= 0
##$YMAX_a= 253594
##$YMIN_a= -246141
##$ZGOPTNS= <>
##$ZL1= 120
##$ZL2= 120
##$ZL3= 120
##$ZL4= 120
##$ABSF1= 10
##$ABSF2= 0
##$ABSG= 5
##$ABSL= 3
##$ALPHA= 0
##$AQORDER= 0
##$ASSFAC= 0
##$ASSFACI= 0
##$ASSFACX= 0
##$ASSWID= 0
##$AUNMP= <proc_1d>
##$AZFE= 0.1
##$AZFW= 0.1
##$BCFW= 1
##$BC_mod= 2
##$BYTORDP= 1
##$COROFFS= 0
##$CY= 11.3945322036743
##$DATMOD= 1
##$DC= 2
##$DFILT= <>
##$DTYPP= 0
##$F1P= 15.9154993809931
##$F2P= -4.1035820241983
##$FCOR= 0.5
##$FTSIZE= 0
##$FT_mod= 4
##$GAMMA= 1
##$GB= 0.15
##$INTBC= 1
##$INTSCL= 1
##$ISEN= 128
##$LB= 0.24
##$LEV0= 0
##$LPBIN= 0
##$MAXI= 10000
##$MC2= 0
##$MEAN= 0
##$ME_mod= 0
##$MI= 1.114404
##$NCOEF= 0
##$NC_proc= 0
##$NLEV= 6
##$NOISF1= 3.799351
##$NOISF2= 2.8
##$NSP= 1
##$NTH_PI= 0
##$NZP= 0
##$OFFSET= 15.70392
##$PC= 1
##$PHC0= -11482.92
##$PHC1= 9.80101
##$PH_mod= 1
##$PKNL= yes
##$PPARMOD= 0
##$PSCAL= 0
##$PSIGN= 0
##$REVERSE= no
##$SF= 200.130013532006
##$SI= 16384
##$SIGF1= 3
##$SIGF2= 2
##$SINO= 400
##$SIOLD= 16384
##$SREGLST= <1H.CDCl3>
##$SSB= 0
##$STSI= 0
##$STSR= 0
##$SW_p= 3612.71676300578
##$SYMM= 0
##$S_DEV= 0
##$TDeff= 0
##$TDoff= 0
##$TI= <>
##$TILT= no
##$TM1= 0
##$TM2= 0
##$TOPLEV= 0
##$USERP1= <user>
##$USERP2= <user>
##$USERP3= <user>
##$USERP4= <user>
##$USERP5= <user>
##$WDW= 1
##$XDIM= 8192
##$YMAX_p= 0
##$YMIN_p= 0
$$ End of Bruker specific parameters
$$ ---------------------------------
##NTUPLES= NMR FID
##VAR_NAME=  TIME,          FID/REAL,        FID/IMAG
##SYMBOL=    X,             R,               I
##VAR_TYPE=  INDEPENDENT,   DEPENDENT,       DEPENDENT
##VAR_FORM=  AFFN,          ASDF,            ASDF
##VAR_DIM=   8192,          8192,            8192
##UNITS=     SECONDS,       ARBITRARY UNITS, ARBITRARY UNITS
##FACTOR=    0.0002496,     1,               1
##FIRST=     0,             0,               0
##LAST=      2.0444736,     0,               0
##MIN=       0,             -246141,         0
##MAX=       2.0444736,     253594,          0
$$ Real data points
##PAGE= N=1
##DATA TABLE= (X++(R..R)), XYDATA
$$ [...]
2141B37r46P39R26p26L27o63k35N22P64K95j588q32K160R43j825j424R55J880
2159A509l72k370Q67Q34k69l33k2N82m40q48J304M21j574k59R90J276j010j811
2177a525J013J531p18j270r6J298L18j231j02P84r0j20l11Q08K46j469L38P77
2195A81M95j079r66J533J105j831p26J563P69r03j628J341J557j845o51J255Q07
2212I77j036j205J478J048j660q29J482J011j140j520J178J789j619q83Q51J138
2228A060k51j701L85J930j081j437Q63R63K44j790j90K000m33j145J28J264M01
2245A210k118o7K567p15j490l17J771P69k316p93K249M01j542m82P94J596j999
2262d82r46J791N87j310q77J132J298j565j212J882O84j109j229P95J904j387
$$ plain form
2141 237 -709 30 956 230 557 -106 -341 181 945 1240 -348 -1180 980 1923 98 -1326 -371 1509
2159 1509 1137 -1233 -366 468 199 -134 -156 426 -14 -862 442 863 -711 -970 20 1296 286 -1525
2177 -1525 -512 1019 301 -969 -1065 233 551 -680 -782 2 -88 -208 -519 289 535 -934 -596 181
2195 181 676 -403 -1369 164 1269 -562 -1288 275 1044 141 -1487 -146 1411 -434 -1085 170 977
2212 977 -59 -1264 214 1262 -398 -1227 255 1266 126 -1394 -216 1573 -46 -929 -78 1060
2228 1060 809 -892 -507 1423 342 -1095 -232 731 975 -815 -1005 995 562 -583 -455 809 1210
2245 1210 -908 -975 1592 877 -613 -930 841 1610 -706 -1499 750 1151 -391 -873 -79 1517 -482
2262 -482 -1428 363 950 -360 -1237 -105 1193 -372 -1584 298 982 -127 -1356 -561 1343 -44
2278d4j321Q89J333o35j557J45K257p73j889J055J189Pj966K15K177n58k104Q46
2296g34J671r0j673k84K200l65j810M71J182L34j531o14K232J73j777k52J230
2313C63J184j422j186J433Q23j327m45R60P44j256r97J648J457k077j323J244
2329a77K042j151k432J695J766j087j898O73J879m95j994J125J121q62j131J078
2345A52J131j192j736J567J639j016j686K64K049j50j809l12J363K93j23j238
2361h04N64N46m03l08N75k97m45n34J421P82j887j255K166J560j543k299J539
2378f22K228j424j847Q47J499k74j022O76O52j614q8J972K33k071r57K367J779
2395B334k635j507J154J871O5k008j99J121K19O2m15o39K48Q87K08L9j220n40
$$ plain form
2278 -44 -1365 -476 857 222 -1335 -1190 1067 294 -1595 -540 649 656 -1310 -1095 1082 524 -1580 -734
2296 -734 937 847 -826 -1110 1090 725 -1085 -614 568 902 -629 -1243 989 1162 -615 -867 363
2313 363 1547 125 -1061 372 1195 -132 -577 383 1127 -129 -1126 522 1979 -98 -1421 -177
2329 -177 1865 714 -1718 -23 1743 656 -1242 -569 1310 815 -1179 -54 1067 205 -926 152
2345 152 1283 91 -1645 -78 1561 545 -1141 -877 1172 1022 -787 -1099 264 557 434 -804
2361 -804 -240 306 -97 -405 170 -127 -572 -1106 315 1097 -790 -2045 121 1681 138 -2161 -622
2378 -622 1606 182 -1665 -818 681 407 -615 61 713 -901 -989 983 1216 -855 -1812 555 2334
2395 2334 -301 -1808 -654 1217 1282 -726 -925 196 415 477 62 -577 -329 558 766 805 -415 -955
2413i55J217J096o34j894l70K255J221j501k050Q15K712n41k389j89J282R90o34
2430D31n29M6q30N02K167j009k181k75K734J634l304j881K006K205n23k131m51
2447a389R83P57J76q0j711l75J758J608j359k579O77K854M63j972j591L61K302
2464H83O14j957r92J71K400R46k806j290J254J857M9j628o10m3J390J378j161
2481D55k219m3L093J307k708k633J983K548l48j695j157J023J297K80l47k144
2497a308o11K922J313k011k438O02L566K44k658j417J271K008N0j915q58K42J727
2514G29J761k079k198O83K350Q87k367j714J145K019P69j481k509O60K518R32
2530B105k020k794J564K812J5k000j718J314K086J08j470j628j12K835J015k104
$$ plain form
2413 -955 262 1358 724 -1170 -1540 715 1936 435 -1615 -800 1912 1371 -1018 -1207 75 1065 431
2430 431 -98 -52 -882 -380 1787 778 -1403 -1678 1056 2690 -614 -2495 -489 1716 1193 -938 -1389
2447 -1389 -406 351 527 447 -1264 -1639 119 1727 368 -2211 -1534 1320 1783 -189 -1780 -1419 883
2464 883 1497 -460 -1452 -1281 1119 2065 -741 -2031 -777 1080 1129 -499 -1109 -1152 238 1616 455
2481 455 -1764 -1807 1286 2593 -115 -2748 -765 1783 1435 -260 -1417 -394 903 1183 836 -1308
2497 -1308 -1919 1003 2316 305 -2133 -1531 2035 2279 -379 -1796 -525 1483 1533 -382 -1240 -998 729
2514 729 2490 411 -1787 -1104 1246 2133 -234 -1948 -803 1216 1985 504 -2005 -1345 1173 2105
2530 2105 85 -2709 -1145 1667 1682 -318 -2036 -722 1364 1472 2 -1626 -1738 1097 2112 8
2546Hk514Q18L344N69l158j262J331K302K52k179j349N04J767J401j454k936J100
2563a456K814Q23k338k459J800K699j55j828j671O19K647K03j387k081O05K589
2579A424P01k299j763P85K759L66j955j389K20K500J077k527j783R98K091Q56
2595B061k261j833J513K127J16j718j630J097J802O66j669k208P16K812J36j899
2611a72j995J335K578l02j800j373N05K369K38j798j088L12K309N35k075j677
2627b099J077K122N79k183j223R57J773N14j881j384J033J693N53j843j736J151
2643h97J988J56j553j882J543J890p5j480j347P14K078m0j185j421N69K091K66
2660A415j754j268N45K083L44j831q17N12J504O64j520j191R17J269O37j256j637
$$ plain form
2546 8 -2506 -1688 1656 2225 -933 -2195 -864 1438 1690 -489 -1838 -1334 433 1834 380 -2556 -1456
2563 -1456 1358 2181 -157 -2616 -816 1883 1728 -100 -1771 -1152 1495 1698 311 -1770 -1165 1424
2579 1424 2125 -174 -1937 -1152 1607 1973 18 -1371 -1151 1349 2426 -101 -1884 -886 1205 2061
2595 2061 -200 -2033 -520 1607 1723 5 -1625 -528 1274 1940 271 -1937 -1221 1591 1727 -172
2611 -172 -2167 -832 1746 1444 -356 -1729 -1224 1145 1383 -415 -1503 -1191 1118 1653 -422 -2099
2627 -2099 -1022 1100 1679 -504 -1727 -770 1003 1517 -364 -1748 -715 978 1531 -312 -2048 -897
2643 -897 1091 1247 -306 -2188 -645 1245 1170 -310 -1657 -943 1135 1095 -90 -1511 -942 1149 1415
2660 1415 -339 -1607 -1062 1021 1365 -466 -1283 -771 733 1397 -123 -1314 -397 872 1509 253 -1384
2677a384R19J218K76j073j279Q48J459J49q30j207K49J855O6j473r30N75J814
2694A252j58j842j02P75Q92R0j244k44L9R68P93j270j179N31J568J47j484j201
2712a669J596J035k36j118o42Q88N13J05m11r88L19J142J42n99j036N88J252m76
2730D05p29o51M31J232p2q40n26K82J188j48j287J79O63J02P6n25j32k22K94J066
2750G86p53o32K27Q81N27j086r23R50P74n07m95oN17j8j27J35m74j79O89K82k0
2771E48j033j00J420j94p75k79J90J010n64m25K52J37J31l2n96K32J25j42N22
2790D27l54q5j79L50J78j62p18M53L12n0k03o52R21K57q65j08M40K25n21k01O95
2811A60O5r62M00P30k21p36L1J056k84o82J23K58K78k28o69N35N61q57J25M89
$$ plain form
2677 -1384 -465 753 1029 -44 -1323 -475 984 1133 303 -904 -655 1200 1266 -207 -1137 -562 1252
2694 1252 1094 -748 -850 -75 817 907 -337 -581 -542 426 1219 -51 -1230 -699 869 1016 -468 -1669
2712 -1669 -73 962 726 -392 -1034 -146 367 472 61 -927 -608 534 676 77 -959 -371 881 405
2730 405 -324 -975 -544 688 616 -224 -750 -468 720 572 -715 -536 127 229 305 -220 -352 -574 -280 786
2750 786 33 -599 -372 509 1036 -50 -973 -23 751 244 -251 -257 260 242 115 250 -224 -403 286 568 548
2771 548 -485 -585 835 641 -134 -413 -223 787 223 -202 50 187 318 286 -310 -78 47 -95 427
2790 427 73 -12 -191 159 337 175 -543 -90 222 172 -31 -683 238 495 -370 -478 -38 187 -334 -535 160
2811 160 225 -737 -337 393 172 -564 -533 523 239 -443 -320 -62 216 -12 -681 -146 415 -442 -317 172
2831A72j99k18K3J29M47n84q3M59j80J0m43M11M06m66j11j04K58L19m54k01P41
2852C32k08l38Q9K46O02j121L82O13o59n5J80O3L34l98k06P34k76m33J29J80N0
2873B40o90K22O95Pm83qJ03K9k41j78N68Mk38k40K61J68k38m43Q97k77l71j89
2895d02L70L81o10k05O93j93K3n61L00M03l64j67M81l87M1k34L46K42n18K08K47
2916I4N3k3k78k68M80j09P4n21O77N1j17n09L89L67l66j83L51M03p43j91O00O3
2938B94m92o0L02K38l67m53R56k7o30L71L08N4n05l82Q99k38n54K98R8jj44Q1
2960D6O80p73l38N21M5j57j57J69J95K31l58j94r3K10K36n57l1M2M70K24r29M50
2982f8K37l85P5J99j90j89r1R24q4j379N36Q66N3q33l05Q56K96q10K49K76m54
$$ plain form
2831 172 -27 -245 -222 -93 354 -230 -313 146 -34 -24 -467 -56 350 -116 -227 -331 -73 246 -208 -409 332
2852 332 124 -214 -125 121 723 -398 -16 597 -62 -117 63 126 460 62 -144 590 314 -119 10 190 240
2873 240 -450 -228 467 474 -9 -17 86 115 -126 -304 264 268 30 -210 51 219 -19 -462 435 158 -213 -402
2895 -402 -32 349 -261 -466 227 34 57 -504 -204 199 -165 -332 149 -238 -197 -431 -85 157 -361 -153 94
2916 94 147 124 -154 -422 58 -51 23 -498 179 230 113 -396 -7 360 -6 -189 162 565 -178 -369 231 294
2938 294 -198 -258 44 282 -85 -538 418 391 -239 132 440 494 -11 -393 506 268 -286 12 110 109 -35 46
2960 46 726 -47 -385 136 181 24 -133 36 231 462 104 -90 -183 27 263 -294 -325 -283 187 411 -518 -68
2982 -68 169 -216 -141 58 -132 -321 -412 512 428 -951 -415 451 504 -329 -634 222 518 -292 -43 233 -221
3003b21k49N64L16r04k82J076N33j016p42N20R04l88m69n0J57M09l8j7n37K42
3023a92O40L23q13p55Q48K30J31l58m44L08L67N28l16j048J86J146P7j247n04
3042h93R24Q49p03n21O21j23nL09r7n98k87R62P76j561m81N20J044k21j158m3
3062f86P81J47K79n17q10M61O72N74q44j119P03J189l34p05n68M67O57k3n79o52
3082i07q4J710K01j406n91R11R26k40j066j4R7M53N87m72o69j44J178N85j096
3101d1j087Q86J171k13j130p19J316L02J07n98q26K02J190K17m37j369L79J644
3119I94k1j392n47N39J422j95j069m35K58J081K18j127p14O29J335j6j179o92
3137i11Q19R11L8q57o71M05O51O23j265r02R80J190j96j338n24P38J062n60j82
$$ plain form
3003 -221 -470 94 410 -494 -776 300 833 -183 -925 -405 499 111 -358 -408 -251 158 120 103 -434 -192
3023 -192 448 771 -42 -797 51 281 412 54 -390 -82 285 813 497 -551 -365 781 858 -389 -893
3042 -893 31 880 177 -344 277 154 149 458 361 -237 -524 438 1214 -347 -828 -308 736 515 -643 -686
3062 -686 95 242 521 4 -806 -345 327 901 57 -1062 -359 830 496 -209 -777 -310 347 324 -255 -907
3082 -907 -991 719 920 -486 -1077 -166 760 520 -546 -560 -463 -10 577 105 -564 -708 470 1055 -41
3101 -41 -1128 -242 929 716 -414 -1133 183 485 592 -6 -832 -630 560 777 340 -1029 -650 994
3119 994 973 -419 -966 -427 995 800 -269 -704 -446 635 853 -274 -988 -359 976 960 -219 -911
3137 -911 -92 819 857 0 -671 -266 385 1008 -257 -1159 -179 1011 815 -523 -1047 -309 753 193 11
3156A1o65J20J190K17p17j477O98J463J22j546n60R33J212k07j160m10O12M99
3174C35O96j190r01R12N35K09q37q35Q93Q11k9j028o41R53R09n4j094o59N29J474
3194I88k19q50q60N66J376l57o21q65L58J048O3q39m94K44J322j20r27q83P83
3213b87J242K8j358l66O72P59J35j032o95O36R75K67r34j086R97R88j12j239m74
3232h84Q37R29k71r03l24L16J001k95o23n30N76P52L63j316n13N83J093r9j115
3251d23m55P21O58K44r67m31N37O10M22j367k98N45O36k04k26j041O29J050l94
3270B46j29j151O66J243m65m31q57R57Q37p05o00j75K2R65K4o27n95M10J108J05
3290H48j060l55M40O73J4q08m38P18N79l79l03m98J98R00j98j00r76O21R19m57
$$ plain form
3156 11 -654 -534 656 873 156 -1321 -623 840 962 -584 -1144 -211 1001 794 -366 -776 -164 335
3174 335 1031 -159 -1060 -148 387 596 -241 -1076 -183 628 599 -429 -1070 -117 792 738 -356 -1015 -486 988
3194 988 769 -81 -941 -375 1001 644 23 -842 -484 564 627 -212 -706 -462 860 740 -187 -1070 -287
3213 -287 955 983 -375 -741 -69 690 825 -207 -902 -266 709 976 42 -1044 -47 941 829 -410 -884
3232 -884 -47 882 611 -292 -616 -300 701 406 -217 -747 -171 581 944 -372 -885 -302 791 692 -423
3251 -423 -878 -157 501 745 -222 -653 -116 494 916 -451 -749 -204 432 228 2 -1039 -410 640 246
3270 246 117 -1034 -368 875 410 -21 -878 79 916 211 -389 -564 -542 423 447 -180 -775 -365 743 848
3290 848 -212 -567 -127 546 560 -248 -686 32 611 232 -71 -569 -371 529 331 231 -745 -124 795 338
3310C38m50n58L17J038j12o09m09J60O71J30o59m28K53R88l68n03q5J51M66J16
3330D47n74o84P09J96L77o05k22L93K97L05q32k77L74K75m8j97l34K24M75J57
3350D56n91o54M55O01m78R3j59L13M18n36r1ON4J50K69m56j17KL14L11o76M5K56
3373a5L2M47n17k99K87J71n5J73l01k0L66l03J16m34L48L94k02m51K5K67K86k4
3395B91l20J88l58L15j6j97Q8j2J21k0j39j23L93oqk05j22L26j88L15r3l47K01
3418H4l0O9k9k74N24k06j67j11K7K3L56n10M19m47K28M32l00j01L7j27O0J31n35
3441d47O31m5k91M12l10l9o3j5L28j06l75L06K20p2l94N3J51j10j17J56J88J0
3463G1j76J4J39R2q9n2k05J02J15P6j13L2LJ30k56L2J79k74L18l5j31L04l53L51
$$ plain form
3310 338 -112 -670 -353 685 573 -36 -445 -285 386 516 -143 -571 -318 670 302 -201 -286 -135 331 447
3330 447 -127 -811 -102 94 471 -134 -356 37 334 639 -193 -470 -96 179 131 -66 -400 -176 299 456
3350 456 -135 -789 -334 267 -211 -118 -277 36 454 -82 -173 -167 -113 37 306 -150 -267 -265 49 360 -316 -271 -15
3373 -15 17 464 -53 -352 -65 106 51 224 -77 -97 269 -34 82 -352 -4 390 188 -263 -238 29 315 291
3395 291 -29 159 -199 116 100 -97 -9 -21 100 80 -59 -182 211 205 197 -8 -130 196 8 323 230 -117 84
3418 84 54 123 94 -180 344 138 -29 -140 -113 -90 266 -244 175 -272 -44 388 88 -13 24 -103 -43 88 -447
3441 -447 184 139 -152 260 -50 -89 -152 -167 161 55 -320 -14 206 134 -260 -207 -56 -166 -283 -127 61 71
3463 71 -105 -91 48 140 51 -1 -206 -104 11 87 -26 6 9 139 -117 -85 94 -180 138 103 -28 276 -77 274
3487B74r3l89P7J89J58j19j87J03J15l58L30k1Kj5k4O9j43o3J64K60l74ml54L75
3511b8L68o65L68R8k91K8L2M1N6q9K66M9k39j16j84L63r8j00J20Q6k07L72k93
3534f3j22K65Q5k81L8m0N88m83k15J15J98o9j10J49K08o91K20L57J28k47l04M21
3556A47j00l43J23O34k65l59Q0K27l1m26K38L49o7l83L32J27k42l14K68J60k95
3577a40q8M21j54j15J19K52M0q3q2m7j27j8J35mm14L08M46j82l36k06M69J1m18
3600b13J25M27p27L47M39j83n97Q6P07j76m15j79L67j34P9j26J1N1j56K52M50
3621D35o04o8L52n3j18k61K21N09m52k02K48j73J80K06j26r7j93L13L04o89r4
3642c62K27K74j33J3l60L95l39O01J1m64j8L82J95m95o01P23M91m34l61J42K9
$$ plain form
3487 274 181 -208 -131 58 216 97 -90 13 128 -230 100 79 81 66 42 111 -32 -95 69 329 -45 -49 -403 -28
3511 -28 340 -325 43 141 -150 -122 -90 -49 7 -82 184 233 -6 -122 -306 57 -41 -141 -21 65 -142 230 -63
3534 -63 -185 80 165 -116 -78 -118 470 -13 -228 -113 85 16 -94 55 263 -428 -208 149 277 30 -274 147
3556 147 47 -296 -173 461 196 -163 -83 144 113 -313 -75 274 207 -176 156 283 41 -273 -5 155 -140
3577 -140 -228 193 39 -76 43 295 335 252 170 123 -4 -22 113 109 -305 3 449 267 -69 -275 194 205 -213
3600 -213 -88 339 -388 -41 398 215 -382 -296 411 235 -180 -359 8 -126 -47 -173 -162 -111 -267 -15 435
3621 435 -169 -237 115 62 -56 -317 -96 413 -39 -241 7 -166 14 220 94 -3 -196 117 421 -268 -362
3642 -362 -135 139 6 19 -341 54 -285 316 327 -137 -155 227 422 -73 -674 49 540 106 -255 -113 -84
3663h4L29j36k7k74l87Q14p3l71m7K6N24N0n80l7L37J3J41J83q59J09N31J23o64
3686c59j20N90Q9j06j34j80J84Q2J46m4o29K29M20n9k42l10L04O63n40l73j42
3707e31M47M29J9o65R2J6L67K87m57o24K91P07Q4p33K48R2j7J63j21l53R1M68
3729C00K39m03p50L48N68K08n20l74N11J89j36l98q1J86L38L86p13k45J21O76
3749D50k5r42J00M23K70J89o60j41L95K13K20l76o85K65Q23j4o69m17P50K32j22
3770B79n34J9O5L21J34l80k63j28R60l14j99p07M92Q01l90m00k66M62L82K13o96
3791a49m10L05N26K87n97m24L54L73Q2o77k20M89K79K6n65k69N32M34m7q31j57
3812f59J93Q59k48m08j24L13J33J10j28m58L61M76qm87n93O02M23K18q53m71O29
$$ plain form
3663 -84 245 109 82 -192 -579 235 162 -209 -256 -230 294 344 -236 -273 64 77 218 401 -458 -349 182 305 -359
3686 -359 -479 111 200 94 -40 -220 -36 46 192 148 -481 -252 168 109 -133 -443 -139 524 -16 -389 -531
3707 -531 -84 345 364 -301 -209 -193 174 461 4 -620 -329 378 462 -271 -23 69 52 215 94 -259 -168 300
3729 300 539 136 -614 -266 302 510 -10 -384 127 316 180 -218 -299 -113 225 611 -102 -347 -226 450
3749 450 425 -517 -417 6 276 465 -195 -336 59 272 492 116 -569 -304 519 505 -164 -581 169 401 279
3770 279 -255 -236 -171 150 284 -96 -359 -487 473 159 -40 -747 -255 546 156 -244 -510 -48 334 547 -149
3791 -149 -559 -254 272 559 -38 -462 -108 265 347 -330 -550 -61 218 244 -321 -590 -58 376 329 -502 -659
3812 -659 -466 393 145 -263 -387 -74 59 169 41 -417 -56 420 412 -75 -668 -66 357 575 -278 -749 -120
3833a20M19J06n16k42L04K21L23o14l41L05L90M13q02k92M34M02J86o45j71L16
3853G6L30k14k28m64L59O47m61l3m25M38K87k5l72l00J05O00Q0o01l53N45L68
3874C59Q2o45k13M37K21Oj62l58N2K04L71j83o36J63Q04j14m92k14M1O17j12m49
3896b21k58K48N27m34n0O8P4J94J95m03o2J09J28qj67j48m1L73M76o58l87M23
3918b2L80m16m76L26K29N30p87K55q1J83K5j15N5j54q3M22J44k74k09j56O43K6
3940D45p33k2K00K19J76m30K17O6l0J41m57Q2J4J80k3J72n69L56L4M35n43j05
3962a75P9N55k26m30j17L97P7k18O8k65J86M04l32J64k74k42K25K56j25j91K44
3983F0N8j38j43L7Q0J47k19R9j38K54K1n4J25k41N2k08N67k80m20K79J21m7N5
$$ plain form
3833 -120 299 405 -111 -353 -49 172 495 -119 -460 -155 235 648 -154 -446 -12 390 576 -69 -240 76
3853 76 406 192 -36 -500 -141 506 45 12 -413 25 312 287 -85 -385 -280 320 400 -201 -554 -9 359
3874 359 441 -204 -417 20 241 247 85 -273 -221 -17 354 171 -465 -302 502 388 -104 -318 -277 340 228 -221
3896 -221 -479 -231 296 -138 -188 -120 -46 148 343 -60 -122 -13 115 107 -60 -208 -249 124 600 -58 -445 -22
3918 -22 358 -58 -534 -208 21 551 -236 19 -62 121 146 31 86 -68 -151 271 415 141 -68 -224 419 445
3940 445 -288 -310 -110 109 285 -145 72 138 108 249 -208 -126 -112 68 45 217 -352 4 38 473 -70 -175
3962 -175 -96 459 233 -197 -314 83 160 -58 10 -255 -69 335 3 167 -107 -349 -124 132 7 -184 60
3983 60 118 -20 -163 -126 -46 101 -118 -19 -157 97 118 64 189 -52 0 -208 359 79 -341 -62 59 12 67
4006F7l16N11K6m07K27l02P6M5n3J82j07j48K96m5J00j88k30L67K86k25k06P7
4028C3K45l10j12J62o5K61k34K00k75O6k3j84K52j02M6k08M32q9l33j7K56Q8j77
4051h8k26M44n7j59j20L10o4k4r0J9L07k24K7l98L24J57l04J18J99j52j07J51
4073D3J3J3p8j40K94k01Q4J36r3Q3L6k83Q2P9k20N9K23J1J02l80k24M85j31p6
4097h3O6K08j95j06O7J25J09qk45J83k57q0J67L53m41K85R9k67O4r2K07k47j13
4120b01p1N69l64j2j02K99K6k83R6p9J4J23K10j67j58J54M97o25LO9J06j7p2L6
4144E1Jk85L4N41m30r8K61Q1k06q1P8K15k57j45K05k7J45l78J16L86l72N3J61
4167D9J9j7j90K71q7k22n4K66K05o68K34Q7J91j59j9J90L0L6j83N0O4l29K78p
$$ plain form
4006 67 -249 262 288 -119 108 -194 -118 -73 -126 56 -51 -199 97 52 152 -36 -266 101 387 162 -44 33
4028 33 278 -32 -144 18 -47 214 -20 180 -95 -29 -52 -236 16 -86 -40 -248 184 95 -238 -255 1 89 -88
4051 -88 -314 130 73 -86 -206 104 40 16 -74 -55 252 28 55 -343 -19 138 -166 -48 151 -1 -108 43
4073 43 56 69 -9 -149 145 -56 28 164 71 154 190 -93 -11 68 -152 -93 130 141 243 -137 -361 124 -7 -83
4097 -83 -17 191 -4 -110 -43 82 191 183 -62 121 -136 -216 -49 304 -137 148 247 -20 44 -48 159 -88 -201
4120 -201 -272 297 -67 -79 -181 118 144 -139 -43 -122 -108 15 225 58 -100 54 551 -74 -71 -2 104 87 15 51
4144 51 52 -233 -199 342 -88 -186 75 156 -50 -131 -53 162 -95 -240 -35 -62 83 -295 -179 207 -165 -112 49
4167 49 68 51 -139 132 45 -177 -231 35 240 -428 -194 -107 84 -75 -94 96 126 162 -21 29 93 -236 42 35
4191C5j75O1K11r5r8J64L2n9k75K09K15j76j30J51M8m5P0j93R6k96Q8Q3J58j21
4215d2J19J4o6q3L6J3K6lJ77m8j67o2J12M8q0n9mj8M6k65K53j1J23p7j44N0p1
4242a83M51l05J02k50N2O8Jj7K43m43J12K59j66j00J70r9J91K3k47L21n1q6L8
4265H4k5k76JJ27M18k86j62J59J01p7Q2j88Q5m5k8K6k0k35N83m73K1J53j63O00
4289D62j75m44r5j1K94J42k8m16J89J40J68k62l4R6K67m6l07j15R5K76k78lm03
4312d88O04O1r9K18o67R2O12j71j70k50J50N03l94j99J73j27J79n5J41m1k63J56
4334c5R5q3o1j20M39k7j59j65R3R2M9k47NJ77J08K4k58k00K84K64j75l20J22K28
4358A30k4q0O8k66L7K72J85n85KK56R8j77O4l82J22K74K37j71l15K89M90k26m17
$$ plain form
4191 35 -140 -79 132 37 -61 103 135 76 -199 10 225 49 -81 70 118 73 143 -50 46 -250 -162 -79 79 -42
4215 -42 77 91 25 -58 -22 -9 17 14 191 143 -24 -86 26 74 -6 -65 -69 -87 -41 -306 -53 -64 59 -18 -162 -112 -183
4242 -183 268 -37 65 -185 -133 -65 -64 -81 162 -281 -169 90 -76 -176 -6 -105 86 109 -138 183 132 46 84
4265 84 59 -217 -216 -89 329 43 -119 40 141 64 146 -42 43 -2 -30 -4 -24 -259 324 -149 -128 25 -138 462
4289 462 287 -157 -252 -263 31 173 145 -271 -82 58 226 -36 -70 26 293 247 -60 -175 -80 196 -82 -85 -488
4312 -488 116 177 78 296 -371 -279 333 162 -8 -258 -108 395 1 -198 -25 -152 27 -28 113 72 -191 -35
4334 -35 60 -23 -84 -204 235 208 49 -116 -23 69 118 -129 -124 53 161 185 -73 -273 11 275 100 -220 -98 130
4358 130 106 26 94 -172 -135 137 322 -263 -261 -5 93 -84 -20 -402 -280 -6 231 60 -255 34 524 298 -119
4381a19J4J42M30l67k40K3L5L67J25m31k76n1L13J96m83nL0O15l2l90j18K48L49
4404C75k41k21p8N6J53J96n82j82N00OJ98k16k47K41l2J94l3l25K1N63N3n20l60
4427d81N33O9n9m03J12K91J73l76J09m8n9M97m4l94q8J7N80j15n66j82M25N36
4449E27l67k28j42J86K17P7l52l68K65O5R3J22l13L83k49N80p2n96n0O03R9l92
4471H8m87N20M28o14OK15M0j53lj33P4j38L05J22k80q3m0K48K32o06j30L80L00
4494B91P8n67m3K74L05m49J44o9P7J92j56j7j38L4m6K96k24l5k96N47K19p08k5
4517c16P5O49l62k52J39J72p4n5J70k42k20N38M3j10k79j31M14J15j36l21K82
4538I9J41k75j87K98j50L53k58m22L34mK01qj48k7O5K64j58Q0l47n4M24j98nl15
$$ plain form
4381 -119 -105 37 467 100 -140 -117 -82 285 410 -21 -297 -348 -35 161 -322 -327 -297 318 286 -104 -222 26 375
4404 375 134 -87 -165 -109 44 240 -342 -524 -24 -18 180 -36 -283 -42 -74 120 87 -238 -217 346 399 -121 -481
4427 -481 52 121 62 -341 -229 62 235 -141 -32 -80 -139 358 314 -80 -168 -151 429 314 -252 -434 -9 527
4449 527 160 -68 -210 -24 193 270 -82 -450 -185 -120 -27 95 -218 165 -84 496 424 -172 -222 381 480 88
4471 88 -399 121 549 -65 -59 156 196 43 40 -93 -19 -157 148 270 -10 -93 -133 115 347 -259 -389 -9 291
4494 291 369 -198 -241 33 338 -111 33 -36 41 233 77 60 -78 -44 -90 206 -18 -53 -349 198 417 -291 -316
4517 -316 -241 408 46 -206 -67 105 31 -24 146 -96 -316 222 265 155 -124 -255 159 274 138 -183 99
4538 99 240 -35 -222 76 -74 279 21 -401 -67 -71 130 122 -26 -53 12 276 118 198 -149 -203 221 23 18 -297
4562b97K49K86m0l28J31K77j60j92P1L52n64J57M19k89l61J86K23n2l26pK82K65
4584B82m10J83j19R4oQ0q5j50J04N7M6p9N9l08K42L12k28k18k49N81k62j90L76
4607A12Q6k06k8k17K80R8j02j9J27m2k15j04M57k69k16Q7K94n4l82L5J97N90m98
4630A1j17j15L06J33m81J08J82k81L58j65N1r5k66M21M7j49j77J72K61k7j84l4
4652d1O9n7k17k1M09m4j65j54N54m53J07j48L83l6k86m6K39Po9P7j43Q0m54O07
4676A98k33R7k0j70J97P8N1l74M15k94L07l04R2l58J72J65m75L16M8l7J15J80
4698A66j18k2j05k3L19m25J15L51k21k18J89j8J10l7j54l0K19j56o2J86J84k48
4720Br5M19k43m34N19rl96K77qJ32l48J67J03k40K78j05J01k12J39N9J00k70K1
$$ plain form
4562 -297 -48 238 198 -130 1 278 118 -74 -3 349 -215 -58 361 72 -289 -103 120 68 -258 -265 17 282
4584 282 -128 55 -64 30 24 104 19 -131 -27 30 76 -3 56 -252 -10 302 74 -144 -393 188 -74 -264 112
4607 112 198 -8 -36 -253 27 125 23 4 131 89 -126 -230 227 -42 -258 -171 123 69 -313 -278 -81 509 11
4630 11 -106 -221 85 218 -263 -155 27 -254 104 -61 -10 -105 -371 50 97 -52 -229 -57 204 177 -7 -41
4652 -41 28 -29 -246 -267 142 98 -67 -221 333 -120 -13 -161 222 186 -100 -146 93 100 31 108 -35 45 -409 198
4676 198 -35 62 42 -128 69 147 198 -176 239 -55 252 -52 40 -318 -146 19 -456 -140 -92 -129 -14 166
4698 166 48 26 -79 -102 217 -208 -93 258 37 -181 8 -10 100 63 -91 -121 98 -58 -120 66 250 2
4720 2 -93 326 83 -351 168 159 -237 40 32 164 -184 -17 86 -154 124 19 120 -92 47 106 206 -64 -43
4743d3J11L6m7k82J74j0K62l67L83m81L19Q9Lo4r9j08J25m67P47n41J91L18k27
4766B2J08J40m57PJ38p2o0j4J40J72k79J35m2N7K0L2M1k79J16L09k50O9m5j16
4790a08m5P2j43N3L38k65K24k70Pj22L87j04o0P1M2Nj42K52j98N1J9M5j27j05
4814a23n1K67l00K82k63K42N3r1J8K94j33j36j37J35J17k03q9N0J41o4j82J39
4836c4K42j32q8K65l22m6M7L91l31k66K88j52K26m6K26l46j59K55K0J7j69m4J82
4859B4J59k36J20J8l8o4l99M81k41J48J81q9j44J20O6l4j7r7k1l7K10R0l04J02
4883bJ41j7nn21L96n5m4J05q5K88j93Mr5K4r4J32R0k38J37l2K40j04Q8j26j90
4908a56J53m1J24j49N9K9J41j61k49k8K26J56k58J12%n7M00n42K64k71K02J26
$$ plain form
4743 -43 68 104 57 -225 -51 -61 201 -166 217 -264 55 144 147 83 -16 -124 1 -466 281 -260 -69 249 22
4766 22 130 270 -187 -180 -42 -114 -174 -188 -48 124 -155 -20 -62 -5 15 47 88 -191 -75 234 -16 53 8 -108
4790 -108 -153 -81 -224 -171 167 -98 126 -144 -137 -259 128 24 -36 35 77 82 -60 192 -6 45 64 109 -18 -123
4814 -123 -174 93 -207 75 -188 54 107 16 34 328 195 59 -78 57 174 -29 -118 -68 73 9 -173 -34
4836 -34 208 76 -12 253 -69 -115 -68 323 -8 -274 14 -138 88 42 268 -78 -237 18 38 55 -114 -158 24
4859 24 183 -53 67 85 47 -17 -416 65 -176 -28 153 64 -80 40 106 72 55 -42 -63 -100 110 200 -104 -2
4883 -2 139 122 117 -404 -8 -63 -107 -2 -87 201 8 12 -83 -59 -153 -21 69 -169 -32 -64 176 72 160 34 -156
4908 -156 -3 -44 80 -69 -10 19 160 -1 -250 -278 -52 104 -154 -42 -42 -99 301 -241 23 -248 -46 80
4930H0n8l84K77O0n4Ml31M16M4k9q7j7J8J15j50J75M3no8M1k98N5j12N06m22N7
4956a24n8R9n9L80m14l8J81k12K45j86Q8J80L3q1q8m8J1J32J86n7l32m9N72j50
4980B11l21j37K51J21j86J15j82L19k75J46M1l04J45N4mo6j84K6J90N15n95m25
5002e45N73Rk2k55J15K24r6J73m14J62N9J4j48j5J32l41M44K55k18n25L2P31l2
5025C12m26k51L90K99j71l44K27N4J2N6k26P9j78M01pj48m04J01L19J19l08j92
5047b86J97K49J6j71p5K29K17k45m34K9K69N24m56p6Kl31K83J23j16p6j74O32
5069C30j87m64J59M98P7k42o39N35k3j40Q1L17n72J18L07J97j87l61K3M70j11
5090A86l45J27J67J02j78l36J65J39J14k67j3K3L2M25l76n3%J75O2N6j72m20M01
$$ plain form
4930 80 22 -362 -85 -25 -79 -75 -406 10 54 25 -62 -79 -61 54 -96 79 122 117 49 90 -208 -153 -265 241 -181 -124
4956 -124 -182 -83 -142 238 -176 -214 -33 -245 0 -186 -98 82 115 34 -54 -102 -91 41 227 170 -162 -211 361 211
4980 211 -110 -247 4 125 -61 54 -128 191 -84 62 103 -201 -56 -2 -6 -72 -256 -230 -40 475 -120 -545
5002 -545 28 37 15 -240 -125 99 3 176 -238 -76 -17 -3 -151 -166 -34 -375 69 324 106 -419 -387 344 312
5025 312 -114 -365 25 324 153 -191 36 90 102 158 -68 11 -167 234 227 79 -325 -224 95 214 -94 -286
5047 -286 -89 160 176 5 -70 159 376 131 -303 -274 -5 519 63 -13 -11 -342 -59 64 -52 -128 -302 330
5069 330 143 -321 -162 336 413 171 -468 67 44 -96 -15 302 -270 -152 155 352 165 -196 -173 297 186
5090 186 -159 -32 135 237 59 -277 -112 27 141 -126 -139 -116 -84 341 -35 -88 -88 87 149 205 33 -387 14
5113A4K89j50n27J53P1M52k19m63L63M5J90l65O64m95m84L36K47Ll09K05L36j51
5135B05m75J90J70O3k12j46J62K3R1p5j45J43R9O3k21K48k50j19N95k56J18m64
5157a93K6K42M83m50k98K09K88l18j55K46J17q5l06L67l68K07R1J68k17k43K79
5178I0Q4k3m81J83J17J63R0n02L72j53J22o6P8J6j20K73j01j68Q6m6o8O1K25l90
5202a58J58L18l00r8l74O21Jj30J54m9j67o1p3K56k10k61L09K67l0n78L81J98
5224A74k28j60J41K17j83J41m59K19J43k16M35k99M7k9J3n8K1n1Q3J81q7O6o5
5247D6j13J44J3j37j30L2O1J58J03n3j07Q1k33K42k19P5j56M3L78k92O1K91l09
5270b1J77j21J03l3l47J6L77j45j03M10l13Q5j76rL42l24J67k3j42p9J55J80k04
$$ plain form
5113 14 303 153 -374 -221 -150 302 83 -380 -17 28 218 -147 517 22 -462 -126 121 124 -185 20 356 205
5135 205 -270 -80 90 153 -59 -205 -43 -20 71 -4 -149 -6 93 156 -65 183 -67 -186 409 153 271 -193
5157 -193 -167 75 558 108 -190 19 307 -11 -166 80 197 112 -194 173 -195 12 103 271 54 -189 90
5178 90 174 151 -330 -147 -30 133 223 -279 93 -60 62 -4 74 90 -30 243 142 -26 60 14 -54 7 232 -158
5202 -158 0 318 18 -80 -454 167 168 38 192 143 -24 -85 -158 98 -112 -373 -64 203 173 -405 -24 174
5224 174 -54 -214 -73 144 -39 102 -357 -138 5 -211 224 -75 -28 -57 -44 -102 -81 -132 -49 132 45 111 46
5247 46 -67 77 90 -47 -177 -145 -84 74 177 124 17 98 -135 107 -112 -37 -193 -150 228 -64 -3 288 -21
5270 -21 156 35 138 105 -242 -226 151 6 -97 313 0 85 -91 -100 242 -82 85 62 -80 -159 -4 176 -28
5293b8m2J10P2j57K2m8J38j17J59j92Q1R0Q3J23j94n0J97L2m95J79k09M25m57
5316b78K79Kk82p3M62l16J80j06J7P5R9J25l36Q4R6j34K48l19n9K20K84m44L43
5339A67l80M32k26K15k92k8N3J41q6J35L3k15N3pJ41O7q6p0p4M5k5L1j02L05k53
5364b6K4m0j7N7j10nL1L74m81l7R0K16m2j48M9J43j03p1m0K74j39l5J04j13l16
5389c61K55L38k44j0k9l25N93j34j66j51M29Ll53L20j83J94lJ35n26O6M30j58
5411A20p4p7j7k7n1L97l56J8J33P3j65J34k0j66j22m9j64M8M74p3m2Q0k24K23
5435G3O5q2J17n14M55rj93j29K72k9L85l92k2J4m1J57k05o6K83j29K23k58K1K94
5459B90k80k11K23J53j52K1j50l5J46k21K89j17K00k11R9j24J56k21L93j71J1
$$ plain form
5293 -28 -70 40 112 -45 -23 -71 67 -50 109 -83 -2 88 171 294 100 50 247 279 -216 -37 -246 179 -278
5316 -278 1 3 -279 -352 110 -206 -26 -132 -115 -40 59 184 -152 -68 28 -106 142 -177 -236 -16 268 -176 167
5339 167 -213 219 -7 208 -84 -112 -59 82 -4 131 164 -51 2 -5 136 203 117 47 -27 18 -7 24 -78 227 -26
5364 -26 -2 -42 -59 -2 -112 -117 -86 288 -193 -230 -140 76 34 -114 -65 78 -25 -96 -136 138 -1 -36 68 -45 -361
5389 -361 -106 232 -12 -22 -51 -376 217 83 -83 -234 195 198 -155 165 -18 176 173 308 -218 -152 278 120
5411 120 46 -31 -48 -75 -126 271 -85 -67 66 139 -26 108 88 -78 -200 -249 -413 -365 109 36 -6 74 -150 73
5435 73 138 56 173 -341 114 105 -88 -217 55 26 411 19 -3 11 -30 127 -78 -144 139 10 233 -25 -4 290
5459 290 10 -201 22 175 23 44 -106 -141 5 -216 73 -44 156 -55 44 -80 76 -145 248 77 88
5480H8j0M9j3k39r7M74k43KJ20m93K24lk7K37N3j19L7j69J5Q3J2k48L60p5L1k84
5506b35J01L05j22m0K54m17K84r5JN4o8k9J04J54k83j80k6M42l68J24O9n3m58
5529d82N51N5j23K7K77m86J00JL8m7j14J47o7J88m9J91l33L1l1Q9M22l22j78n1
5553a66M95j53j86k36N7K24j00oq6m0L82l01J26n9J04j29R3M02m72l0K54K0J53
5576C46p01L72K37j56%j57M27n05J21j9J26Q0k90K0k6J33J50k14J01m7k12m6M12
5599A52K16l24r2L34R4k67k35kK33Q4l22J76j54j24J28K19j81j27J41J24O8k07
5621f6k65L85N5J95m59r0M47j12p3J61k91J06K6J95r5k46k7K41J59j50k58J46
5643a6m9K53l43R0Q6J35O5j05l38j9L14j19j85M6J66Q6P4l96K8q6K22J50o6j45
$$ plain form
5480 88 78 127 114 -125 -222 252 9 11 131 -362 -138 -141 -168 69 122 3 40 -129 -114 -31 -19 -267 93 18 49 -235
5506 -235 -134 171 49 9 263 -154 130 35 36 90 22 -7 97 251 -32 -212 -238 204 -164 -40 29 -24 -482
5529 -482 69 124 1 28 305 -181 -81 -80 -42 -89 -203 -56 -123 65 16 207 -126 -95 -126 -37 385 63 -115 -166
5553 -166 329 176 -10 -246 -189 35 -65 -71 -157 -197 185 -116 10 -49 55 -74 19 421 -51 -81 173 193 346
5576 346 -355 17 254 98 98 -59 368 -137 -16 -35 91 171 -119 -99 -125 8 158 -56 45 -2 -214 -260 152
5599 152 368 44 -48 286 380 113 -122 -124 109 193 -129 47 -107 -231 -103 116 -65 -192 -51 73 141 -66
5621 -66 -331 54 109 304 -155 -245 202 90 17 178 -113 -7 19 214 119 -127 -154 87 246 96 -162 -16
5643 -16 -65 188 -155 -65 21 156 221 116 -222 -241 73 -46 -231 -185 -19 67 141 -255 -227 -313 -91 59 -7 -152
5667a52j05O97l24n53J93N38j48k81M0q0K05n4Q9j04j92J93M77k38m73k8K44K04
5689A48j0j13k88M31J24m52L2J43j53K90k29L4k0M5J35j17j0o4J24j20J81J55
5711B66p25M16L71L1n09K9M85l43j07N6r6J07m0j34J78n5j03L01J66k57j69K87
5733A55J27q3n10J00M22l94K67K0k41k2J17RN5j8k24L08j56K25m80L1L82J20l54
5756a44j5j7L74k54k92L41q6K20l75R9K90l57Q9K87O0O4l52R1K19kn65L87J63
5779B25m81J54k0K47J5n5J9l39N01m20J51K16o81O80Pj09r1j29M5K01m4j98J01
5802ek1J86k4r9J9j37K42l13K4K2J08J67k68J16q1m5J39K34k54k36M57j25j42
5825c6j07n1K39j6k44M40l13o7J40K48j73k03L04l12M47k60j93J74N3j40j59j2
$$ plain form
5667 -152 -257 440 116 -437 -244 294 146 -135 -95 -175 30 -24 65 -39 -231 -38 439 201 -272 -300 -56 148
5689 148 138 25 -263 168 292 -160 -128 15 -138 152 -77 -43 -63 -18 117 0 -10 -74 50 -70 111 266
5711 266 -459 -43 328 359 -150 -121 364 21 -86 -30 -126 -19 -59 -193 -15 -70 -173 128 294 37 -132 155
5733 155 282 199 -311 -211 211 -183 84 104 -137 -159 -42 -33 22 4 -220 88 -68 157 -323 -292 90 210 -144
5756 -144 -159 -176 198 -56 -348 -7 -93 127 -248 -149 141 -216 -127 160 220 284 -68 23 242 240 -325 62 225
5779 225 -256 -102 -122 125 140 85 104 -235 266 -154 -3 213 -468 212 219 110 19 -110 -65 136 92 -106 -5
5802 -5 -26 160 136 37 56 -81 161 -152 -128 -106 2 169 -99 17 -64 -109 30 264 10 -226 231 106 -36
5825 -36 -143 -194 45 29 -215 225 -88 -155 -15 233 60 -143 161 -151 296 36 -157 17 70 -70 -229 -241
5847b41K33J29j03jJ05M5P0j62j45oJ48m19K59O6k1j43j6L98L8n38J45J51p8K15
5871A29l20J31J80q4k8j2l01L56L8K2j56j1K39k07k6J50k14N4p4J09R8j62J79
5894I0J13l35J22J9K15l48K56r0J9J34l25J63p3k09L64j30J75j33L57k23j70J79
5916A70m84K57P3o0J42j81O6j66K50P5q0j19Q9Nk9l1n4RJ14j86p7K51j11K08l5
5941I6l33J84l07L69K84l92P6J41k47Q0R7L7k63j54N16l80J47kN6Ql9j96K12p4
5965h4J2j16K41k87M57k83N5M2r1J94p2j30N2k53L65j86N9J72j69J10j29J01K5
5988H5j99K60p6k06J67k40L17j34J9LK39l17J76q0k22K46J97k50J60j04j17K87
6010B11k13Q9q3qj94K27M3o8LK0po5o6J73k9n0r9qL41m35K56j7M7p9j85J74L2
$$ plain form
5847 -241 -8 121 18 17 122 167 237 75 -70 -76 72 -347 -88 -22 -43 -186 -202 196 234 -304 -159 -8 -86 129
5871 129 -191 -60 120 36 8 -4 -305 51 89 111 -45 -56 183 -24 -50 100 -114 -60 -134 -25 73 -89 90
5894 90 203 -132 -10 9 224 -124 132 42 61 195 -130 33 -40 -249 115 -15 160 27 384 161 -9 170
5916 170 -314 -57 16 -44 98 -83 -17 -183 67 142 62 -57 32 37 8 -23 -77 -68 46 -140 -217 34 -77 131 96
5941 96 -237 -53 -360 9 293 -99 -23 118 -129 -49 48 85 -178 -332 184 -196 -49 -51 5 13 -26 -222 -10 -84
5965 -84 -72 -188 53 -234 223 -60 -5 37 -54 140 68 -62 -10 -263 102 -84 -25 147 -22 88 -41 60 85
5988 85 -114 146 70 -136 31 -209 108 -26 -7 -4 235 -82 94 14 -208 38 235 -15 145 41 -76 211
6010 211 -2 87 4 -4 -198 29 72 4 7 27 20 -45 -111 62 33 -17 -116 -124 217 -218 38 21 68 -11 -196 -22 10
6037A0k65P7N3J04M2j94K8K70m59L03K81k86J67j01L5N1j70K51k19j06M7J04l0
6060gJ9M6m8l0k43O2L40k55k00L14P5k62K6L45k16L8P9m6q3l5M6L3m8J37j33k0
6086f6P8Q6j45K00Q1j94K59l25o1K03k55Q6k16J75J81k28J39j25p0L47q4j56M87
6109C97k26k64Q1p2j15L35o9j46K35m09M7J36J06MJ50k33n6J14q9q8J29L04m86
6132b15L12r8j74J43J1J34j07M5j73J04J05J17q1r7k0l68O22k3k53q2J57JJ35
6155A95o7pm5N0P7m40P2L63k28M38n29J13J84j04J40m26J06n4M42l92j7j10J58
6178h1L00l28q6k6J00J78M0j93j00K55j50J25J30l71J77n7M56m58M2J24J2J47
6200B36k82L0L8J44k75q3K45p6n5P1o5K76l7k86R7J32k76Q5J32J10j56l19M20
$$ plain form
6037 10 -255 -178 -125 -21 21 -173 -145 125 -334 -31 250 -36 131 30 65 116 -54 197 -22 -128 -81 23 -7
6060 -7 12 58 10 -20 -263 -201 139 -116 -316 -2 73 -189 -163 182 -34 4 83 37 -46 -81 -35 -2 -50 87 -46 -66
6086 -66 12 98 -47 153 234 40 299 -26 -87 116 -139 -53 -269 -94 87 -141 -2 -127 -197 150 66 -90 397
6109 397 171 -93 -12 -84 -199 136 67 -79 156 -253 -206 -70 36 40 190 -43 -99 15 -74 -162 -33 271 -215
6132 -215 97 -1 -175 -32 -21 113 6 51 -122 -18 87 204 123 26 6 -362 260 237 -16 -98 59 60 195
6155 195 128 121 76 126 203 -237 -165 198 -30 408 -121 -8 176 72 212 -214 -108 -162 280 -112 -129 -239 -81
6178 -81 219 -109 -195 -221 -121 57 97 -96 -196 59 -91 34 164 -207 -30 -87 369 -89 -47 77 89 236
6200 236 -46 -16 22 166 -109 -192 53 -23 -78 -7 -72 204 167 -119 -22 110 -166 -81 51 161 5 -314 106
6223A06J14p3l92L31j41K47l22R0L12m36K39R4N5k28l6o0N1k10J15J99R7n8j98
6246a04J14q9R5J66k84%J93k43j2J70J13nk74K78P4m03K1L65k4p5n4m8L65j95
6270A44m46K28Q1J55k09Q0J49j77O0j5k45j2M02k34L94k25j74K46l31J97j61J23
6292C0K14j20n3j47j92M03j9j71O9j37kN7M5k10L4J37M48j96l41j52J86K55j46
6315hK9j42K42k75J92j97j16K0K60J39j68l39M44Q4J33m07n4L21J78m67j88L49
6337C0q6J88l31P9L60j71o1q2j39L2J38p9K14j17O1j48R9J50k88Q3j01J90k37
6360b16K10J7K04j75k68K73j44J80p1J00k8l94K71K98j79j13l39M75K01m38K72
6381A36m14L42j48j56J16J97K2J35r4k68P6l8J61m64M95j22J5k0J32k07L3K9K17
$$ plain form
6223 106 220 147 -245 86 -55 192 -130 -40 272 -164 75 169 224 -4 -40 -100 -49 -259 -144 55 152 94 -104
6246 -104 10 -79 16 182 -102 -102 91 -152 -164 6 119 114 -160 118 192 -211 -190 175 151 76 22 -26 339 144
6270 144 -302 -74 7 162 -47 33 182 5 65 50 -195 -207 195 -39 355 130 -44 202 -129 68 -93 30
6292 30 244 124 71 -76 -268 135 116 -55 14 -123 -125 -68 -23 -233 -199 -62 386 190 -151 -303 -117 138 -8
6315 -8 21 -121 121 -154 38 -159 -275 -255 5 144 -24 -363 81 165 298 -109 -163 158 336 -131 -319 30
6337 30 -56 132 -199 -120 240 69 8 -74 -213 -181 -43 -122 92 -25 36 -112 -13 137 -151 -68 -169 21 -216
6360 -216 -6 11 215 40 -228 45 -99 81 10 110 82 -312 -41 257 78 -35 -374 101 302 -136 136
6381 136 -278 64 -84 -240 -124 73 95 230 136 -132 -56 -94 67 -397 98 -24 -9 -29 103 -104 -71 -42 175
6404A75m27K11j90O8L33k46llK28j48j50l5J03j59L09Q3o5l7K7j63L26l42o0J71
6428FK80k00j92NP0rj45J29%L12j14j30j19j3J52J38j00j47M4J03j33J02o2L23
6452C00j73J75k15j08J28j07j37L99j79P3O9J25l92K13n06M81k16q3J37N5r7K22
6474A64k44J03J53k20J25J32l57J46M3P6qm3l9R2j9j21R4l35L08k68mK95k47J34
6498d0K73j82k94J58K35j37m6j85J89l15J18K19o1J90L4j71r5J97r4n9J06k19
6520a79K17j15J%Q6Q0m2k4j61K88j3O0j77P1J10k09J64k30K91j85J71k59j8M9
6544b4O8P8k6j27R3R5j86M70j82J38n91K43J93l56O9N2O4j59O3J96n9j26j82O3
6568a33M48k31l1K06l48J5l8K09r2K5j36P8j27N7J69j26K19j82J53k45K24j29
$$ plain form
6404 175 -252 -41 -231 -163 170 -76 -79 -82 146 -2 -152 -187 -84 -243 66 149 84 47 74 -89 237 -105 -165 6
6428 6 286 86 -106 -101 -31 -40 -185 -56 -56 256 142 12 -107 -120 32 170 70 -77 -33 70 -63 39 -23 300
6452 300 127 302 87 -21 107 0 -137 262 83 156 225 350 -42 171 -335 146 -70 -153 -16 39 -58 164
6474 164 -80 23 176 -44 81 213 -144 2 45 121 113 70 31 123 104 -17 77 -258 50 -218 -222 73 -174 -40
6498 -40 233 51 -243 -85 150 13 -33 -218 -29 -344 -226 -7 -68 122 156 -15 -110 87 -7 -66 40 -179
6520 -179 38 -77 -76 -76 10 90 48 24 -137 151 138 198 21 92 202 -7 157 -73 218 33 204 -55 -73 -24
6544 -24 44 122 96 -31 62 157 -29 441 259 397 -194 49 242 -114 -45 7 71 -88 -25 171 112 -14 -196 -133
6568 -133 315 84 53 259 -89 -74 -112 97 5 30 -106 -28 -155 -98 71 -55 164 -18 135 -110 114 -15
6590a5J10k70K60j12J47J49m45j32K66K23r7J28k47p9K40k04L29l63l6K25l0j75
6612a28j49K83J15J07k48K07l13K83k4J44k90j27K76m1l1j99K78l3p1R2p0j01
6634d0K18k03M1K84k03k02n9J79Q5k14P4o3j27K93J75k10l1k78K26K24k32K49
6656A86k98k2p9L09K06m09j26J90L02m00M1l2L27k54J87j67J34r3k12K52j13J43
6678G2J48j30k6L0j53J95j60L9k3j67K24j57R0J19k01O9J77j0j58k2J13r4M9l
6702B1k44L30M9l02m7J96K49k51OJ69k03K44l31J33j53K58j98K34k50J27q3J6
6724c0J97j12k74J00K55k9M8j88k02K38P7m3n0n9K97j94j75K12j59N5R0K8m9m
6748B9m5J07j55k6q9k6L39m3j20R4J2k09K28J71j17k36J2K85k66j51L80k19J00
$$ plain form
6590 -15 95 -175 85 -27 120 269 -176 -308 -42 181 84 212 -35 -114 126 -78 251 -112 -148 77 47 -128
6612 -128 -277 6 121 228 -20 187 -126 157 133 277 -13 -140 136 95 64 -135 143 110 39 131 61 -40
6634 -40 178 -25 16 300 97 -105 -164 15 100 -114 -40 -103 -230 63 238 28 -3 -281 -55 169 -63 186
6656 186 -112 -134 -213 96 302 -107 -233 -43 259 -141 -100 -132 195 -59 128 -39 95 2 -210 42 -71 72
6678 72 220 90 64 94 -59 136 -24 15 -8 -175 49 -108 -18 101 -100 -31 146 136 -22 -44 69 -25 24 21
6702 21 -223 107 156 -146 -193 3 252 1 7 176 -27 217 -114 19 -134 124 -74 160 -90 37 -46 -30
6724 -30 167 55 -219 -119 136 107 155 -33 -235 3 80 37 -13 -72 225 31 -144 68 -91 -36 54 82 33 29
6748 29 -16 91 -64 -90 -179 -205 134 91 -29 65 77 -132 96 267 150 -86 -74 211 -55 -206 174 -45 55
6771E5j13J5L46m07k8K02j20J53k77K9R5P3R5N5k78K24J81m04K0J36n7J16k52
6794a41J54k30O9K31jj08n2J55k2m5K2n1M1Q0j23j96K64K50n33O8J19nj00K31
6818G7K03Qn65J19M43k27j91L13J12l54M02m39N0K61j41oJ07k66j10L86or2j56
6841g2K8J30j59J85j49J55j51K88j48k55R4j21M72m03K1n3J49K63k79j15q9K88
6863G9j7r9j43J47K70m48j79M04j05M2q1R5J46j16o9R4o5p3M1P8O5j95L2J31j8
6888A6m8j49L74k66K3K16j88m6J48M3k47qK1n3L32K0L7k51p4K89j34L5o4J06j90
6913e8R1p8Q6k78M3K34n6o0RK02j91L04k65J73j39L7q9m3R6Qo7n7j6L0J77n8O4
6940I9m15J89L03r9j58L2m5J5K8L5K65l42j8K79k14k9J30L0J29k91J8j58K1J47
$$ plain form
6771 55 -58 -43 303 -104 -132 70 -50 103 -174 -145 -50 23 118 173 -105 119 300 -104 -84 52 -5 111 -141
6794 -141 13 -217 -148 83 82 -26 -78 77 55 10 32 -19 22 102 -21 -217 47 297 -236 -168 -49 -54 -154 77
6818 77 280 288 -277 -158 285 58 -133 180 292 -62 340 -99 -49 212 71 65 172 -94 -204 182 176 84 -72
6841 -72 -44 86 -73 112 -37 118 -33 255 107 -148 -54 -175 297 -106 -85 -138 11 274 -5 -120 -209 79
6863 79 62 -37 -180 -33 237 -211 -390 14 -91 -49 -130 -35 111 -5 -74 20 -45 -118 -77 1 66 -129 -97 34 16
6888 16 -32 -181 193 -73 -50 166 -22 -68 80 123 -124 -132 -111 -164 168 188 225 -26 -100 189 55 90 26 132 -58
6913 -58 33 -45 41 -237 -194 40 -16 -76 -67 135 -56 248 -17 156 17 54 -35 -78 18 26 -41 -98 -114 -84 93 35 99
6940 99 -316 -127 176 77 -81 -49 -94 -79 -51 -16 249 -93 -111 168 -46 -75 55 85 214 -77 -59 -217 -196 -49
6964d9l0k8K72r4q3J10j94QJ9n6J78j47j98K42j73J40o4OK97K8k29M9m3o0J95
6989I6Lm3j71K42J56k50J25k74M8J92k28K06l9P2l37K36l72L10J35p9p2J37k34
7012a41L0J50o0j31J31K2J16K8k18q6K82j26j29J32j67L17j00J4J79j98j00r7
7034a52J45n9NP4Q9J20k75J62j01J48j63J14Lj8J86k19k03K93j9O7m16j95L67
7057d7K83j92j31Q4J28j97J41j31j66L70j24k57M41l34OP2J78l87M12p8J19J49
7079C39j39k03Q0m2o1p4J64J9q7P5k5J1J04j8l26K91p9j62j52K60K50j95N5q6
7103aJ53k38K08k78J04j54K18L2j89J14m6L60k77r4k09J66J98k29p1J87K01n12
7125c57N1M05j30O8j72j5J47k41K86j79P4J86ml9J2k02J10L09l29J8r0J32l32
$$ plain form
6964 -49 -79 -107 165 71 -12 98 -96 -88 -69 -125 53 -94 -292 -50 -223 -83 -147 -141 156 184 -45 4 -39 -99 96
6989 96 99 56 -115 127 283 33 158 -116 -68 124 -104 102 63 135 -202 34 -338 -28 107 28 -44 93 -141
7012 -141 -111 39 -21 -152 -21 1 117 145 -73 -159 123 -3 -132 0 -167 150 50 64 243 45 -55 -152
7034 -152 -7 -66 -61 13 102 222 -53 109 8 156 -7 107 110 92 278 59 -144 149 130 197 -219 -414 -47
7057 -47 236 44 -87 -3 125 -72 69 -62 -228 142 18 -239 202 -132 -126 -54 124 -263 149 71 190 339
7079 339 200 -3 77 35 -26 -100 64 83 -4 71 46 57 161 143 -183 108 29 -133 -285 -25 225 30 85 -1
7103 -1 152 -86 122 -156 -52 -206 12 44 -145 -31 -77 283 6 -88 -297 -131 67 -162 -233 -46 155 -357
7125 -357 -306 99 -31 37 -135 -150 -3 -244 42 -137 -63 123 119 80 92 -110 0 309 -20 -2 -92 40 -292
7148b92j30L00P3P9l47L44k28jJ64n2rL8J6j1QO0j88J2K05m8j28J59Q2M5j63k1
7174c3J70j87K11l22J26j38mL94k05n3J01n7k44K88J35j24k0j9J29nj65j83K23
7197A8j35L55Jk59J04pl9J7K6j9j94J41J8q6L35j03p9Q7j87Q7l11N1J23J25j87
7222a18Q4p9K40l5q9R2j97J54Nj78L16j53q6k3K08k34J55k44L03p9J22j30J1j60
7246a15R2o3J44k02l7o3J26J78L9j24J05J36k08l2k37J39K07L6K06j15q6n7L7
7269A06k60K16k0o4K37j85j81K55k28K0J48k1k82n4K72K96k56o5q1J79n6J70m01
7292b55L39K39k70n5K72k62Q0J40k9j92j5o0J5K4o7L69l26K5J51j85K9J28J19
7315B14j88J1l19L0K11k68L50m70N15k88J01R3m9j23L51l79j8O17n16K9J25J35
$$ plain form
7148 -292 -422 -122 -49 30 -317 27 -201 -202 -38 -90 -99 -61 -45 -56 -48 12 -176 -164 41 -7 -135 24 106 151 -12 -33
7174 -33 137 -50 161 -161 -35 -173 -177 217 12 -41 60 3 -241 47 182 58 38 19 148 143 -22 -205 18
7197 18 -117 238 239 -20 84 77 38 55 81 62 -132 9 27 -59 276 173 94 181 -6 81 -230 -179 -56 69 -118
7222 -118 -34 -113 127 92 3 95 -102 52 57 -121 195 42 -44 -67 141 -93 62 -182 121 42 164 34 45 -115
7246 -115 -23 -86 58 -144 -181 -244 -118 60 99 -25 80 216 8 -24 -261 -122 85 121 327 212 126 69 106
7269 106 -154 62 42 -22 215 30 -151 104 -124 -104 44 23 -259 -313 -41 255 -1 -66 -147 32 -24 146 -255
7292 -255 84 323 53 -2 270 8 88 228 199 7 -8 -68 -53 -29 -96 273 -53 -28 123 -62 -33 95 214
7315 214 26 37 -282 -252 -41 -309 41 -429 86 -202 -101 -8 -57 -180 171 -208 -226 391 -125 -96 29 164
7337A64k37Q7J93j46j84M4k3o4J08O6j2L49k01j33l72L15J02j56Q6O6o5r5N81
7360D73m49O1q6J0O0O5j94j15J10J25L0q7J93j74k97K34R5j75K46R0k30J01K8
7383A14q0J13l4L9k67pL25l29L71j87pj42l5m4j0K19k69J83J71j81j65M2L35p6
7407G9j48O6k4j65K99k82J12J5jmK36l08J24N3j53K79k88J05N5j50rJ12K60k69
7431fn0q7J03O9oK13k36j21K49j58J91j51K8P8j34j87Q6K2l27N43k21J00K14k96
7455h4K43k87L73l29N4J52k08J84j39P5j01N8K48k78J26j85J02J4L3k51P8J09
7477a3m3Q8P4k54n8M35k23K33m71J94K19p6k75J95q3M2N5Rn3J00k16J7J61rk19
7502a71P6R0q6N5J5J59j9P2k78M24l94r8PJ50J85n11N34k74j9K10k03O7QJ84j74
$$ plain form
7337 164 -73 14 207 61 -123 -79 -102 -166 -58 8 -4 345 144 11 -361 -46 56 -100 -14 52 -13 -108 473
7360 473 24 85 -1 9 69 134 -60 -175 -65 60 90 3 196 22 -275 -41 54 -121 125 215 -15 86 114
7383 114 34 147 113 152 -115 -122 203 -126 245 58 51 -91 -126 -170 -180 39 -230 -47 124 -57 -222 -180 155 79
7407 79 -69 -3 -27 -192 107 -175 -63 -48 -49 -53 183 -125 -1 52 -101 178 -110 -5 50 -100 -109 3 263 -6
7431 -6 -56 -143 -40 29 23 236 0 -121 128 -30 161 10 38 116 -18 -205 -119 -97 -424 119 -102 -2 212 -84
7455 -84 159 -128 245 -84 -30 122 -86 98 -41 34 -67 -9 239 -39 87 -98 4 18 51 -200 -122 -13
7477 -13 -56 32 106 -148 -206 229 6 239 -232 -38 181 105 -170 25 -58 -16 39 48 -5 95 -121 -104 57 48 -171
7502 -171 -95 -5 -91 -36 -21 138 119 191 -87 337 -57 -155 -148 2 187 -324 210 -64 -83 127 -76 -9 -1 183 9
7527IPK31n44K07L4J55k22Q0j43L19k38J84l40L91n0q2R0K02k59r2K00k9j95J11
7551B6J03l59J13L52j55k28J48R8j27J47m04M11J66l94k9m1K98o9j5j61j87M15
7573A08k59L3m2M8K50j91J75k37N6L17j94j37Q5j19K8r4pJ58O2N6k16q5K42j70
7597a33Q8J9J3O3j49L18k38r0j80M96l85M45l90J51K10l3Nj20j61K08J4l3r9L8
7621E7j44J84k68q9n2L17p3O0L18m78J37J46k48J74O4k7q7j79L90l04K00R5m5
7644A48K69k56k46J37q0Q3j30k64M12k2q8j09K11R3j43O7k15J08J23j97J39k28
7666a88O2J43k05L7K48k36J07J13j05k8r0O9J51j93J29j23JJ5K73l6j98p6J8K13
7690A01Q2l97K88q0j2O8r3j88L70k51m5qP4J27r4p4K51j39m1J34P7j62Q6j9r8
$$ plain form
7527 9 16 247 -297 -90 -56 99 -123 -43 -186 133 -105 79 -261 130 80 -2 88 290 31 -61 139 110 -85 26
7551 26 129 -230 -117 235 80 -148 0 98 -29 118 -286 125 291 -103 -132 -173 125 56 41 -120 -307 108
7573 108 -151 -118 -160 -112 138 -53 122 -115 -59 258 64 -73 12 -107 -79 -173 -180 -22 40 96 -120 -205 37 -133
7597 -133 -45 -26 -13 50 -99 219 -19 -109 -289 207 -178 267 -123 28 238 205 210 90 -71 137 151 118 19 57
7621 57 -87 97 -171 -260 -312 5 -68 -8 310 -168 -31 115 -133 41 105 78 -9 -188 202 -102 98 193 148
7644 148 417 161 -85 52 -28 55 -75 -339 73 51 -37 -146 65 158 15 82 -133 -25 98 -99 40 -188
7666 -188 -126 17 -188 -151 97 -139 -32 81 -24 -52 -142 -73 78 -115 14 -109 -108 -93 180 144 -54 -130 -112 101
7690 101 183 -214 74 -6 -18 50 -43 -231 139 -112 -157 -165 -91 36 -58 -132 119 -20 -61 73 150 -12 74 55 -43
7715d3k03L42j0k53J49O0j38K58n49N25m9qL6L9J7j73J51j52Q5j86N3m5p2n3L07
7740H8L8l57Q0J51m86M97k25J40Q3o0J13j13J00l2K49j24k63P2J56j41J20j58
7762g2p6R5P4n7M6J51n9k15J4K8L27n19K89j89R0J26Lk66R8J97k53L90k93N9K05
7787A93m66M54j01K07l60n2L98j89j01K75j42J24p6m9n6rR9k33q6N9J21L23l17
7810A6l0j19pK37P3k75K19k12J41J06k57J40m5J58j89r4l18K27lJ95J12J88k99
7833c6J47j50J99l09k44N48k05R8k31J55J73l64J15m3k2K46l49K34J18q2j19Q0
7855d1R7O8j65R9J47n9j88j63K81QL6k56K2R7J53j53j4J32r1Q7j09K10k76N2K21
7880A95j85L58k00P9k7k46O1j44J41J14N8k45K05j43j42M97n78K99Q4j29o5J90
$$ plain form
7715 -43 -246 96 86 -167 -18 42 -96 162 -387 138 89 81 117 156 173 0 151 -1 84 -102 -49 -94 -166 -219 88
7740 88 126 -231 -151 0 -486 11 -214 -74 9 -51 62 -51 49 17 266 142 -121 -49 107 -34 86 -72
7762 -72 -148 -53 21 -36 10 161 102 -113 -99 -71 256 -263 26 -163 -73 53 56 -210 -112 85 -168 222 -71 -12 193
7787 193 -273 181 80 287 -73 -125 273 84 -17 258 116 240 164 115 59 50 149 -84 -170 -111 10 333 16
7810 16 -14 -133 -140 97 170 -105 114 -98 43 149 -108 32 -13 145 -44 -138 -456 -229 -232 -37 75 263 -36
7833 -36 111 -39 160 -149 -393 155 -50 48 -183 -28 145 -219 -104 -147 -169 77 -272 -38 80 -2 -121 -41
7855 -41 56 124 -41 58 205 146 -42 -205 76 84 120 -136 -114 -17 136 -17 -31 101 10 97 -12 198 -78 -26 195
7880 195 10 368 168 247 220 -26 35 -109 32 146 204 -41 164 21 -121 376 -202 97 181 52 -13 177
7902A77k35r0K48n0N4O5J9k69J57m1M7J41k11J33l41n2J45L0J44j30Q2j3p0j17
7926a77oJ65M9J0K6O1j31p4K4J5K70l67J48K4J15p9K0j06O2j65j36L68j66l6k59
7951c45K73lL24k98J77j55R5j32J17l31K34J68l05K60Q0K4k79K15j30n9j2J7O0
7974eN1j12J25j71K64j08J17j9Pk25j0J10k4J15k70J84k8K59j49k40L25k05J13
7997A04p1j76L60N6l30j9L15n9k61m2rP2L01m38K74j57N29n37j24O8P5J0p2RN7
8022f5j16K57K01m00J17M2o2K01l36J11J29n4l6K01n7k35r2K57J19J73n58K50
8044D7k16J41J1p5Q3q8NJ08Q5N0k17j29k6K07j26J89Q6j91K58k72J86M2j08n0
8068@K43k00k53L58j01p1k00jK10k45K63o9L74l92J7K17l66L5P9J01j17J05K7
$$ plain form
7902 177 -58 -148 100 50 104 169 188 -81 76 35 82 223 12 145 -196 -248 -103 -73 71 -59 23 10 -60 -177
7926 -177 -183 -18 31 41 67 128 -3 -77 -53 -38 232 -135 13 37 152 73 93 -13 49 -116 -252 116 -50 -86 -345
7951 -345 -72 -75 249 -49 128 -27 68 -64 53 -278 -44 124 -181 79 159 183 -96 119 -11 -70 -82 -65 -5
7974 -5 46 -66 59 -112 152 44 161 142 149 -76 -86 24 0 115 -155 29 1 260 111 -129 196 -9 104
7997 104 33 -143 217 273 -57 -76 239 180 -81 -123 -132 -60 241 -197 77 -80 449 -88 -212 -144 -69 -59 -131 -122 -65
8022 -65 -181 76 277 -123 -6 36 -26 175 -161 -50 79 25 -11 190 133 -102 -194 63 182 355 -203 47
8044 47 -169 -28 -17 -92 -9 -97 -92 16 101 151 -66 -195 -221 -14 -140 49 135 -56 202 -70 116 158 50 0
8068 0 243 43 -210 148 47 -24 -224 -225 -15 -260 3 -66 308 -84 -67 150 -216 -181 -102 -1 -118 -13 14
8091A4L3j39K20K64k77n11M18j44P9K7O6J45n37L51j73K96K9r3j13J00q8J61J2
8114A40q5j99K39O8l00Q5J74r1k60J01J1K17M2j36m6P3K15j48j96R7j41L12j24
8137D8R1l24N9r0P0R4K35Kj72l6J16J9k68J73M2J3j1j47J32j7M3J09K7l4l38L09
8163A45k33n1K40O8j56r6J82k98Q9q4K5J22J46l14J64k3n0J76k01JP1j11J93q8
8187h3J19o6J50j7
$$ plain form
8091 14 47 -92 128 392 115 -396 22 -122 -43 -16 50 195 -342 9 -164 132 161 68 -45 55 -33 128 140
8114 140 55 -144 95 163 -137 -52 122 31 -229 -128 -117 100 142 6 -40 33 248 100 -96 1 -140 172 48
8137 48 139 -185 -126 -216 -146 -52 183 185 13 -23 93 112 -156 17 59 72 61 -86 46 29 72 181 208 174 -164 145
8163 145 -88 -139 101 169 13 -83 99 -199 -110 -194 -169 -47 99 -215 -51 -74 -124 52 -149 -148 -77 -188 5 -83
8187 -83 36 -30 120 103
8191A03
$$ Imaginary data points
##PAGE= N=2
##DATA TABLE= (X++(I..I)), XYDATA
0@%%%%%%%%%%%Qj6J6j6J6k4L2l3M1n6O4p2Q8j04J20j40J65j93K22k54K89l29L74
34A98m22M77n37O01o73P53q39R34j035J148j273J404j551J713j886K078k292K526
52A324k782L067l387L744m148M609n139N758o491P376q472R867j1712J4281j8135
67a0240K4637l8371J19290j81594j43218L35347M8811k25752n3638K22404n638
78I2038j68680L5524J26600r8830q4601J38951J17034j84989j61374J65944J94474
89A72091r2457j73977j9875J20173Q5878k5009j02067p3586Q0319J37149n3268
100E5371j37536J8103J05872j698o6434K3569K4482q3622K0868J48778m0105k08861
112a41213J8329K63551K5083k95075n9728K76659Q1719k18329q5999J60204N6188
$$ plain form
0 0 0 0 0 0 0 0 0 0 0 0 0 8 -8 8 -8 8 -16 16 -17 24 -32 32 -40 48 -56 64 -76 89 -104 118 -136 153 -176 198
34 198 -224 253 -284 317 -356 397 -442 492 -543 605 -668 736 -815 898 -988 1090 -1202 1324
52 1324 -1458 1609 -1778 1966 -2182 2427 -2712 3046 -3445 3931 -4541 5326 -6386 7895 -10240
67 -10240 14397 -23974 95316 -86278 -229496 105851 154662 -71090 -124728 97676 92038
78 92038 -76642 -41118 85482 -13348 -97949 41002 158036 -26953 -188327 -22383 172091
89 172091 79634 -94343 -114218 5955 91833 66824 -35243 -108829 -28510 108639 55371
100 55371 -82165 -64062 41810 40112 -26322 -2753 21729 -61893 -41025 107753 67648 -141213
112 -141213 -122884 140667 165750 -129325 -189053 87606 169325 -49004 -135003 25201 81389
123H1389j23558J2157J05471q2112j08759J20184J43298j25918j86380J10562
133e3666K01581o9880j77874J2902J32904L2842p8668m0395J5935K1901M0492
144C8074k1o0819k2055M3819M3724j5623m1704j0193K842L4139N5229m6293j05628
157h4509K7830J41048J5546j63139n3911J58582O9033j23620o7477Q1629N0739
168E1751o2106j2557O3571l7843p4350O9614R5264p2299j28349N8769J51327l9146
180F3646j43862Q291J12078K3208p6739l2370M1302J3290n987J2696j4206l0536
192b9189N230M3302J9731m8102l7641L0405M5356Q327m8303m4880L9810O4002
204D8048j0923p1634k2260P2524L7805n6805l4469K9379K6133j2339j0230J6913
$$ plain form
123 81389 -42169 -30012 75459 -6653 -115412 4772 148070 22152 -164228 -53666
133 -53666 147915 78035 -99839 -86937 45967 78809 141 -40254 -24319 -2418 38074
144 38074 38053 -22766 -44821 -1002 42722 27099 -14605 -24798 -21956 12183 67412 21119 -84509
157 -84509 -56679 84369 99915 -63224 -117135 41447 110480 -13140 -80617 1012 51751
168 51751 -10355 -22912 40659 2816 -71534 -1920 93344 21045 -107304 -48535 102792 63646
180 63646 -80216 -71925 40153 63361 -13378 -45748 -4446 8844 2857 15553 1347 -29189
192 -29189 -23959 19343 39074 -9028 -46669 -16264 29092 37419 -10884 -55764 -15954 48048
204 48048 37125 -34509 -56769 15755 53560 -3245 -37714 -8335 17798 5459 -4771 12142
216A2142j6471l0251M0805M4292m3491o2283K9827Q2208j4138q6253R70O8167
228B5524J6155m4178k5870K7167J5970j3408O313J281k1135k254K5788K0054k9028
241B379l6425K5900L9563q029l6885j6279L3440K7937k1668k6966O6K3921J4278
254B1232j9439j2676N799M325P588J477q195r439m424K2495J3914k8557j9346
267b5246J8817K7809n690l6058l49L0304L938j4798j1442N447J1474l856N65P08
281A623j2749K574J4011L920j1337j6695J2410K0757r424j5716k046J2643J1781
294A1752j2323r129O229L355M363k569o165J504l58O077M764j0860l230N609O109
309E128K675j2282l187J1560J947k541n550j939R224j049k695O99m752M355L263
$$ plain form
216 12142 -4329 -34580 6225 50517 7026 -55257 -25430 56778 42640 -43613 -42643 25524
228 25524 41679 -2499 -28369 -1202 14768 1360 7673 8954 -12181 -14435 11353 31407 2379
241 2379 -34046 -8146 31417 23388 -13497 -29776 3664 31601 9933 -17033 -16967 6954 21232
254 21232 1793 -10883 -5084 -759 6829 8306 111 -9328 -13752 8743 22657 -5900 -25246
267 -25246 -6429 21380 15690 -20368 -20717 9587 13525 -1273 -12715 -7268 4206 350 915 1623
281 1623 -11126 -8552 5459 9379 -1958 -18653 -6243 14514 5090 -10626 -12672 -29 11752
294 11752 -571 -9700 -3471 -116 4247 1678 -4487 -2983 -3341 2736 7500 -3360 -6590 -981 5128
309 5128 7803 -4479 -7666 3894 5841 3300 -2250 -4189 5035 3986 1291 1990 -2762 1593 4856
324D856k759L60m663K374P249n226k582L31J317M749m550k915L988k069K267L67
340C094m468L075j182K72K942n165N52K599j787J987l645J38M332m107P48J026
356D11k583L054k638n34L534l956J158J611l115K727j685j28K896m490J811K410
372D83l159J436j280R2L811m696N83K647k075J532j280k4L028m442K038L376m393
389b323R54K59J148K396n965J562N433l312j021q66K765L203o715J065N836l140
405A279j540p01K905L284p509M07P178k812k715j098M133L641r095K18R046k903
421C718m951j871O510N411j1126l183J0230J288m957n822M754Q235q829l996P685
436C096M78l883l989N482P021j1513n340J1820N062p977j1545P211J5717q967
$$ plain form
324 4856 2097 2457 -2206 168 7417 2191 -391 -60 1257 6006 1456 -1459 2529 460 2727 3094
340 3094 -1374 1701 519 791 3733 -1432 -880 1719 -68 1919 -1726 -1588 2744 -1363 -615 411
356 411 -2172 882 -1756 -2290 1244 -2712 -1554 57 -3058 -331 -2016 -2144 752 -3738 -1927 483
372 483 -2676 -1240 -2520 -2428 1383 -3313 -2730 -83 -2158 -626 -1906 -1930 1098 -3344 -1306 2070 -2323
389 -2323 -1369 -1110 38 2434 -3531 -1969 3464 152 -869 -1735 1030 4233 -2482 -1417 4419 1279
405 1279 -261 -962 1943 5227 -2282 -1875 5303 2491 -224 -1322 2811 6452 -2643 -2425 6621 3718
421 3718 -1233 -3104 3406 8817 -2309 -5492 4738 6026 1069 -4753 1 8236 -593 -4589 3096
436 3096 3574 -309 -4298 1184 8205 -3308 -8648 3172 8234 257 -11288 -4077 11640 2673
450B673j3986N704J1496K6j3040p92J3799l954r974O075Q016n155j3146O936J9768
465A4446j1275k0820R360K0780j752k4457k522K6396J798k0032k684J2853N266
478G357j1513k070J3295n413j2094Q538J2673l712k0101K60K5833K935k3525r290
492a6827J7176J9702j3337k3318R112J9435r21j5660m042J5192j62j3474R478
505B354J1273j4684j5955J6901K7924k0170l8087K0510M1391j2077m3797J628
517b2789M5073J844l9483O7K6932k056j9122O805J9271j7341k3190K7021K5929
530B8961k6789l2107J8014M0414r695m1106Q58L0912J0653j8622j9897Q953J7876
543H425K67q869q941L858P015k946M592L861j6834j0385K2593K6203k3790m5721
$$ plain form
450 2673 -11313 -5609 5887 5913 -7127 -7919 5880 1926 -8048 -1973 6043 888 -12258 -5322 14446
465 14446 3171 -17649 -8289 12491 10739 -13718 -16240 10156 11954 -8078 -10762 2091 7357
478 7357 -4156 -6226 7069 1656 -10438 -1900 10773 7061 -13040 -12780 13053 15988 -7537 -16827
492 -16827 349 20051 6714 -16604 -7492 11943 11022 -4638 -8680 6512 6350 -7124 2354
505 2354 13627 -1057 -17012 -111 27813 7643 -30444 -9934 31457 19380 -24417 -22789
517 -22789 22284 24128 -15355 -15288 11644 9588 -9534 -2729 16542 -799 -23989 3032 28961
530 28961 2172 -29935 -11921 28493 18798 -22308 -21450 9462 20115 1493 -18404 -9451 8425
543 8425 8692 -177 -9118 -5260 1755 -1191 3401 7262 -9572 -19957 2636 28839 5049 -40672
557d0672K2992N7432j5237o0308J819N9838P049n4865m590M2987l762l0320J4020
570c617K7849k7380l5016M2427M3138m7753n0104M0308N8040k6897o0425J5130
582b4300N0685m273l1164m555J3409M511q17O289q069j7097R618K0416N56j6247
596a038j6218O921K5427J0592k4981l4456J9106N4748j0398o2178l705O0080J6650
609D0550n4703j7445M4625N261l3184J1641K8808k8385l7854M4080N3385n4177
621B602o5477N0737P2300l6410p5448K2324O7295j4010m7250R560K3395j0379
633g61p482K1071n26l7071K381M5313M567m1745j8721K9387L0748j2219k9848
646a4906j1462J9804L4353o631m6072q026M5160K1786l7013k7728K9332J7714
$$ plain form
557 -40672 -17680 39752 24515 -35793 -33974 25864 32913 -21952 -26542 16445 12683 -17637 -3617
570 -3617 24232 -3148 -38164 4263 47401 -352 -50456 -10148 47892 20995 -39430 -24300
582 -24300 26385 22112 -9052 -13607 -198 4313 3496 9785 1716 -15381 -5763 14653 15209 -1038
596 -1038 -17256 -10335 15092 25684 703 -33753 -14647 40101 29703 -32475 -36180 23900 40550
609 40550 -14153 -31598 13027 18288 -14896 -3255 25553 -2832 -40686 3394 56779 2602
621 2602 -62875 -12138 60162 23752 -51696 -29372 37923 23913 -23337 -13777 9618 -761
633 -761 -8243 12828 12302 -24769 -22388 22925 27492 -14253 -32974 -3587 27161 14942 -14906
646 -14906 -26368 -6564 27789 21158 -24914 -32940 12220 34006 -3007 -30735 -1403 16311
658A6311k0735J481J7155j9919k5408L5185M4482m5168o3339M6057P3683l4518
670B5267p5743J8618P1180j0035n4515R717L1193j4358j3086K5863O282m3242
682b2859o609N6799J2712n7532k3552M5936L4593k8817l6554R752K4969J0656
694A9494q328k4298p250K3871K1170j4568k8896N123K3769R2o713j457j2584n377
708a5952K4988K3457l1532m5377L2174N8300k3193o1407P812N7481K394m6706
720a7561k497K9050n587j1788J6859N108l2037r558M7040J7729n2146k7035M4408
733A985L5863k8928m0031J4613L0577q02j3389r129k151R415J3371O11k0412j1888
747b0295J9882J7499q106j6962q886J1941K0193J272k2623k0748K1052L5323j3526
$$ plain form
658 16311 -4424 -2943 14212 -5707 -31115 4070 48552 3384 -59955 -13898 59785 25267
670 25267 -50476 -31858 39322 29287 -25228 -15511 15682 1324 -11762 14101 20383 -22859
682 -22859 -29468 27331 40043 -17489 -41041 4895 39488 10671 -25883 -16131 8838 19494
694 19494 11166 -13132 -20382 3489 24659 10091 -18805 -13682 10087 10179 3466 2009 -10575 -15952
708 -15952 9036 32493 961 -44416 -12242 46058 22865 -38542 -30730 26751 29145 -17561
720 -17561 -20058 8992 3405 -8383 8476 13584 -18453 -28011 19029 36758 -15388 -42423 1985
733 1985 37848 8920 -31111 -16498 14079 13277 -112 -9241 -11392 -1977 11394 12005 -8407 -20295
747 -20295 -413 17086 8980 -7982 -16868 -4927 15266 16538 -6085 -26833 -5781 29542 16016
760A6016l9432J233L5343J0685k7524j2486J6343M645l329O248k479j7764j930
773a4431K9035J2525l6342k1148L2402K8180k0305l2098Q154K8334P1j5672n113
786f408Q48N623Q099K004j1880j4051J1543K1335n278k1219o695J6107J7035q649
800H414j8566l902J4010J6369q551k0889j16J7242R417j0030j4283L280R737L948
814F080q5r727q297P074J4903K174j9750j1256J9195J6583j1613j8536R52J7747
828E444M792j0947n814L87N162P265j269q257p151O443J5004l325j5983l037J2008
843G22J1322p279j3897J748R812N896l931j0560o84Q258N533j514j0126l132R631
858A799O138k726r301l736R923O414m175q133l444R368O783n924o667j520P012
$$ plain form
760 16016 -23416 -22183 13160 23845 -3679 -16165 178 4823 1494 7742 5263 -12501 -14431
773 -14431 14604 27129 -9213 -30361 2041 30221 9916 -22182 -14028 14306 14377 -1295 -6408
786 -6408 -5560 63 8162 10166 -1714 -15765 -4222 17113 11835 -9384 -16079 28 17063 8414
800 8414 -10152 -14054 -44 16325 7774 -13115 -13231 4011 13428 3398 -10885 -7605 2132 6080
814 6080 5995 -3732 -12029 -4955 9948 12122 -7628 -18884 311 16894 5281 -13255 -12303 5444
828 5444 10236 -711 -6525 -6138 -976 6289 5020 -3237 -10388 -3945 11059 7734 -8249 -11286 722
843 722 12044 4765 -9132 -7384 2428 8324 4393 -6167 -6851 1407 6940 5426 -4700 -7832 1799
858 1799 7937 5211 -4090 -7826 2097 8511 4336 -3797 -7241 2127 8910 2986 -3681 -5201 1811
873A811O322n520o408o23M617O963l376p635p46M866O388k599r025O60N631L728
889E054k208p293L11N613J892j132n331j828N567K867j267n184k783O350L795
904D423l664m307j168N591L213m851k272P9J981L854k568l102r9J317M495j599
920A323m909O20K693K989j711m869J945K868L22n65l161Q61K456j51P02k491j569
937b647L540J162r68j772j725M183O74k402l63m45J683J041k114O04j73l52K373
954B299r33j488P9J44K968j636k816J654J269J15j099j820K322P66k090Q12j4
971E32K08k9j260K119m07k956J893J238l91j469j596L350O00l877L97J813J102
988A267j561k692L634J029l736Q1J899J292j894l194M297J963m762l51L060J543
$$ plain form
873 1811 8133 2613 -3795 -4418 199 7162 3786 -3849 -4595 271 6659 4060 -4965 -4305 1326 5054
889 5054 2846 -4447 -4136 1477 3369 2237 -3094 -4922 645 3512 2245 -2939 -5722 628 4423
904 4423 759 -3548 -4716 875 4088 -763 -3035 -2956 -975 2879 311 -2791 -2890 -1573 2922 1323
920 1323 -3586 -2966 -273 2716 1005 -3864 -1919 949 1271 706 -2455 -1594 862 711 1413 -1078 -2647
937 -2647 893 2055 1087 -685 -2410 1773 2447 45 -318 -763 920 1961 -153 451 278 -74 2299
954 2299 1366 -122 -43 101 3069 1433 -1383 271 1540 1655 556 -1264 1058 1824 -266 546 532
971 532 740 711 -549 1570 1163 -1793 100 1338 947 -522 -2118 1232 1832 -2045 -1648 165 1267
988 1267 -294 -2986 648 1677 -2059 -1978 -79 1213 -681 -3875 422 2385 -2377 -2728 332 1875
1004A875k776l644M904K448m618j438K909K888k852m381M451L867m479k418K578
1019f86L791k203n135L759M621m106l355J925M645o75o666K388O113k834m403
1034b821P66N637k00p447J900O905j770n602n05O889J522q768m70Q259O64o492
1050a533k975P003M033q440k524P489K025o257l770P299M622r490l614R215L649
1065F732q071o357Q690Q219r723p500P702O807n182q058N034Q072o602n568N902
1080I7M801n158o762O236Q117p826q048O378Q586k519j1405R82J2225o07r621
1095d524j430P200M089p665l069P802R84p106q08P911K641j1912k966J4894L378
1110I419j4868o204J4293J0630j4439j2211J3776J0447r987r359Q082Q698r645
$$ plain form
1004 1875 -901 -4545 359 2807 -1811 -3249 -340 2548 -304 -4685 -234 3633 -846 -3264 -686
1019 -686 3105 902 -4233 -474 4147 41 -3314 -1389 3256 2581 -4085 -1697 4416 1582 -2821
1034 -2821 -2055 3582 3382 -4065 -2165 4740 2970 -2632 -3137 3752 5274 -3494 -3964 4295 4959 -1533
1050 -1533 -4508 2495 6528 -1912 -4436 3053 5078 -1179 -4949 2350 6972 -2518 -6132 3083 6732
1065 6732 -1339 -7696 994 9213 -510 -8010 -308 6499 1317 -6741 -1707 6365 -237 -5805 97
1080 97 4898 -260 -7022 -786 7331 -495 -8543 -2165 6421 3902 -7503 -6521 5704 5097 -4524
1095 -4524 -5954 1246 5335 -2330 -5399 2403 3387 -3719 -4527 3384 6025 -5887 -8853 6041 9419
1110 9419 -5449 -11653 2640 13270 -1169 -13380 396 10843 856 -8503 -421 8277 -1368
1123a368n912J2252L114j3280l347J4317O531j6306q941J6442R762j1994j1511
1136a0241O540J3326l898j0846J902N549Q17k762j562L072j478l942M238N312
1150F027l109r603J74J5245K357j8330o126J7302J2187j5975j6445J4509J5571
1163A3784j1707j2336Q932R032r791o252J4637K540j9802q95K2340M496k4788
1176i810r386K5759J2002k2271j2709J4721J2978q752j0402O177L879m889K627
1189g6M695m724p126K757J1662k66j2276m259Q262J0927k383j6221l042J6455
1203D385R774j2791j6129R663J7407o811j3254M427Q357n310m391J0701K093j9190
1217a1069k11K5015L023k7757r636K9141J4898k7098j5671K0055J3791j1684j0841
$$ plain form
1123 -1368 -7280 4972 8086 -5194 -8541 5776 12307 -3999 -12940 3502 13264 1270 -10241
1136 -10241 -3701 9625 5727 -5119 -3217 2332 3149 387 -1175 1897 419 -3523 715 6027
1150 6027 2918 -6685 -6511 8734 11091 -7239 -13365 3937 16124 149 -16296 -1787 13784
1163 13784 2077 -10259 -1327 7705 -2086 -8338 6299 8839 -10963 -11858 10482 14978 -9810
1176 -9810 -19196 6563 18565 -3706 -16415 -1694 11284 2532 -7870 -1693 2186 -2703 -76
1189 -76 4619 -105 -7231 -4474 7188 6922 -5354 -9613 -1351 9576 7193 -9028 -12070 4385
1203 4385 14159 1368 -14761 -5098 12309 5498 -7756 -3329 5028 -282 -4673 6028 8121 -11069
1217 -11069 -11280 13735 16758 -10999 -20635 8506 23404 -3694 -19365 690 14481 2797 -8044
1230h044Q287L694q451N091R798r962j2845Q706J7803m693k0621j61J7638N858
1244A2098j0124j1294J568J2732N218q398j1629K657J4907N13j1399k858M741
1257a268K296J85K525j408j2399J672K0654Q26k4694p424K5008J5036k3393j8105
1271b0489J7971J6331j0478j1445N400M916o349L692J0523j0154j4991J0783J9867
1284A5577o447k3706Q11K3156M141j5939q760O970J0110Q84o301o439r82R279
1298B354P488p644r417J323Q696N028m358p557l307N851J2465k157j7913l750
1312a2898J7983J1635j5039j7143J1001J5965m939j0496n10M389K11K307N338
1325G804q332j1797J0283J6493n924k0974n77K1871N696j7251q631Q481R308m85
$$ plain form
1230 -8044 243 3937 -4514 577 10375 413 -12432 -3726 14077 9384 -11237 -11398 6240 12098
1244 12098 1974 -9320 -7752 4980 10198 1800 -9829 -7172 7735 8248 -3151 -6009 -1268
1257 -1268 1028 1213 3738 2330 -10069 -8397 12257 13083 -11611 -19035 5973 21009 -2384 -20489
1271 -20489 -2518 13813 3335 -8110 -2710 2206 -4143 -451 10072 -82 -15073 -4290 15577
1284 15577 9130 -14576 -13765 9391 13532 -2407 -11167 -4197 5913 6797 496 -5943 -6925 2354
1298 2354 9842 2198 -7219 -5896 2800 7828 3470 -4087 -7394 -1543 10922 8765 -9148 -12898
1312 -12898 5085 16720 1681 -15462 -4461 11504 6565 -3931 -4441 -52 159 2466 7804
1325 7804 -528 -12325 -2042 14451 8527 -12447 -13024 8847 14543 -2708 -11339 -2858 6450 5965
1339E965o498l734r20N136Q464m140j1846j073J0875Q254p853j1526J904R772
1353B780N912n671j1705L24J1626O655q093j2305L794J2693R88q372m878J931
1367d321O162K926j768o596n776R218J0719n914j4110j63J4976O288j2857q513
1381i729O354Q507J100o897m273J337M533N861k570j0205j633J0009P449o522
1395C321j1683K539J0961K709o759p654J995Q714K577m784p231o1Q956L775n892
1410A483o735K75Q115M355o276n980k07P341N513o072p762J108Q032M459o995
1425F54p034K944O622K543n321n619J718N521L186k970p644Q0P785L423m694p285
1441f091J325Q073J876n560m741R85O721J602l959m338j54N655L967m856n314
$$ plain form
1339 5965 -533 -4267 -5187 -51 8413 4273 -7573 -8646 2229 10483 2630 -8896 -6992 2780
1353 2780 8692 3021 -8684 -8360 3266 9921 1828 -10477 -6683 6010 6998 -1374 -6252 -4321
1367 -4321 1841 4767 2999 -3597 -9373 -155 10564 4650 -9460 -9623 5353 11641 -1216 -9729
1381 -9729 -3375 5132 6232 -665 -4938 -3601 932 6793 4223 -5982 -7615 2394 9843 3321
1395 3321 -8362 -5823 5138 7847 1088 -6566 -4571 4143 6720 1936 -5295 -5356 3600 7375 1483
1410 1483 -5252 -4977 3138 7493 1217 -4763 -4970 2371 7884 1812 -5950 -4842 3190 7649 654
1425 654 -6380 -3436 3186 5729 408 -5211 -3493 2028 5214 2244 -5400 -5320 2465 5888 1194 -6091
1441 -6091 -4766 3307 5183 -377 -5118 -4133 2588 4190 231 -4107 -4261 1394 5361 505 -4809
1456d809M25O203L530n567m728J691M897K489l923m694J932L785K616k516n635
1471d304J479M772J738k659n015J001N599J058k922m324P49N179J393k865l564
1486b685J95M911J685l903k539K9M100K243l876k220L59L331K074l318k961J399
1502a176K494J914k525l592J752K326J454j450l764J166L193N31j395l383J061
1517a394L060j4j439k094M55K704r3j539j037k47K299R30j710j503n48K437J908
1534B175k692j904J087K052J265k964j353K098O66j3p88j044J260l46M80P45j576
1551h52r68J620J729p94k734O6L879p85k229o17J659J469j909o06J664k6o21r0
1569a45R03K98k329K86K893p02k001j79J940J485k621j762K660J139j390j485
$$ plain form
1456 -4809 -4384 1819 5349 -218 -4946 -3255 1642 4131 208 -4486 -2554 1231 3847 1331 -4304
1471 -4304 -2825 1947 3685 1026 -3989 -2988 2611 3669 747 -3577 -2828 2351 3744 879 -2685
1486 -2685 -2490 2421 4106 203 -2336 -2307 1793 4036 160 -2060 -1701 1630 3704 386 -2575 -1176
1502 -1176 1318 3232 707 -2885 -1133 1193 2647 1197 -2567 -1401 1792 2323 928 -2455 -1394
1517 -1394 1666 1652 213 -1881 -1426 1278 1185 -354 -1391 -1638 661 1591 -119 -1622 -2170 267 2175
1534 2175 -517 -2421 -1334 718 1983 -981 -2334 -236 430 417 -371 -1415 -155 -501 -21 724 -852
1551 -852 -1820 -200 1529 735 -1999 -1933 1946 1161 -1068 -1685 -26 1443 -466 -1072 592 566 -55 -145
1569 -145 758 1056 -1273 -987 1906 1204 -797 -976 964 2449 -172 -1934 726 1865 475 -1010
1585a010O32K751j887j912J945J172j118j703O64K873j690k824K284J920r20l187
1601b010P70M155j687l544J461K597k03l515K76L822o44l765J053K970m85l080
1617a829n45M245k94l788L70K994N40l364j137M115P37m427j12L207J464l116
1633i40k357L983J786l375j746K687K458k774l326L499K895l279k165K199L405
1648B950k413m384L329L746k698l417J729M377j722n010K483M433k276l875Q68
1663a880N371p87o039J340N580r32m662k76N189M45n847K19N090J01m480r53N089
1680B568J003n913l20N365N85m695k148N338K458n479k272M755K200k984l931
1695c470L482L750m241k233K733K630k141l927L061M091l622m281K781N159j719
$$ plain form
1585 -1010 -378 2373 486 -1426 519 1691 573 -1130 -466 2407 717 -2107 177 2097 1177 -2010
1601 -2010 -1240 2915 1228 -2316 -855 1742 1539 -1976 -1700 2122 1478 -2287 -1234 1736 1251 -1829
1617 -1829 -2374 1871 1577 -2211 -1841 1153 1693 -1671 -2808 1307 2044 -2383 -2495 712 2176 -940
1633 -940 -3297 686 2472 -903 -2649 38 2496 -278 -3604 -105 2790 -489 -2654 -455 2950
1648 2950 537 -3847 -518 3228 530 -2887 -1158 3219 1497 -3513 -1030 3403 1127 -2748 -1880
1663 -1880 3491 2704 -3335 -1995 3585 2653 -2009 -2285 2904 3349 -2498 -2279 2811 2912 -1568 -2521 2568
1680 2568 3571 -2342 -2662 2703 3288 -1407 -3555 1783 4241 -1238 -3510 1245 3445 461 -3470
1695 -3470 12 3762 -479 -2712 21 2651 510 -3417 -356 3735 113 -4168 -1387 3772 2053
1710B053o653J549P312j771o189J96N842Q89o550p0O507j518n314J718N051j003
1726B049o682J363Q252k257p177J70P231J318p318j501O271J577m339j602L096
1741D51J635l437l33L420o31l225L51L728J527m937k702N074M112l555o103J949
1757b676P214o30o783l27N284J496m819j275N048q43m534K743M574l284o539L297
1773b054R250l450j0296K542R567Lr015j406P481J186n328J00K880j024k308K305
1789D33L089m226l898M944M339k808o239K68O605J820n093l640K097N560L17n813
1805b245j714L897K479j997k218J078O26j460K218K478m492m254M412P812l729
1820B891j0689K640J0771o7r237k290P524K867n627n27K721j828j235M041K084
$$ plain form
1710 2053 -4600 -3051 4261 2490 -3699 -3503 2339 3228 -3322 -3392 3115 1597 -3717 -1999 3052 2049
1726 2049 -4633 -3270 4982 2725 -4452 -4282 2949 4267 -3051 -4552 1719 3296 -1043 -2645 451
1741 451 2086 -1351 -1684 1736 1105 -2120 -1769 1959 3486 -1451 -4153 921 5033 1478 -4625 -2676
1757 -2676 4538 3908 -2875 -3202 2082 3578 -1241 -2516 2532 1689 -2845 -102 4472 1188 -5351 -2054
1773 -2054 7196 3746 -6550 -4008 5559 5562 -3453 -4859 2622 3808 -1520 -1420 1460 436 -1872 433
1789 433 3522 -704 -4602 342 4681 1873 -4366 -4098 2507 4327 -766 -4406 -2309 3251 3568 -2245
1805 -2245 -3959 -62 2417 420 -1798 -720 -94 -1554 664 3142 -1350 -5604 -1192 6620 2891
1820 2891 -7798 -5158 5613 5546 -3691 -5981 1543 4410 -1217 -1744 977 -851 -2086 1955 4039
1835D039n935m435P508N918o145o974K887P821J75o605k127L002L355J031l723
1850b08k796J518L783J476l401l391J805K745J808j494m587j226N175N144m053
1865B298q833K273R490N73q193l213N401M772l466k796J222q15L81L811L49n921
1881b667l468P330O440p011q162M306P983K1p594k037M787K123L68k181l437M74
1897b725L626L373l113o307J469O489J503m036n251J888N547J825l914n315J092
1912c849P235J601n965m117K816O219o26m743j370J107K711K925k316n137r17
1927d426O184M885n890p380L583P612N67o976l140M478L500m56j636l571J98L923
1943A455L117k778o209P42P440J968o156m537K802O326j48m723k793J165M849
$$ plain form
1835 4039 -1896 -6331 1177 7095 950 -6024 -3137 4684 4859 -1746 -3873 -871 2484 3515 -208
1850 -208 -3004 -1486 2297 3773 372 -3019 -1214 1531 3339 1845 -2742 -3968 1207 6351 2298
1865 2298 -6535 -4262 5228 5801 -2392 -5605 -204 4568 1102 -1694 -472 -1287 -906 2905 3254 -2667
1881 -2667 -6135 1195 7635 624 -7538 -3232 4751 4772 -2822 -4859 -72 2051 2419 238 -3199 -2725
1897 -2725 901 4274 1161 -5146 -3677 2812 4315 279 -4972 -3084 2463 4288 374 -4941 -3849
1912 -3849 3386 4987 -978 -5095 -2279 3940 3314 -1429 -2799 -1692 1019 3944 1628 -3509 -4426
1927 -4426 1758 6643 753 -6627 -3044 4568 5135 -1841 -4981 -503 2997 2541 905 -2666 -2468 1455
1943 1455 4572 1794 -4415 -3673 3767 5735 -421 -4958 -2156 4170 4022 -701 -3494 -2329 2520
1958B520K041m521m048J295N422J970m868m053K341M432J586m196m109J576M843
1973B231K449m570n367K750N751Q81n041l665K872M677k50l146l042P73M573J577
1989C453l102m602O29O185K051n494l827K750M873R46n348j799J619L334J585
2004C253l190l622J149M521J755m085m151K380M631Q51m335l116K606M004L88
2019C039k928l439J648M689K58l209l514J739M655K26l414k455R32M238Q46l532
2035b21k469J132L968J160l997k731J960L622P13l808k209J855K973Q82k910k735
2051b815J620K936J136k576l451J804L664J49k636l019J974L239K85k712j985
2066b387R65L222L34k713j913Q58L362M08l256j541J392K675P36k898j623J349
$$ plain form
1958 2520 4561 40 -4008 -2713 2709 4679 -189 -4242 -1901 2531 4117 -79 -4188 -2612 2231
1973 2231 4680 110 -5257 -2507 3244 4125 -916 -4581 -1709 2968 2718 -428 -3470 -2697 1876 3453
1989 3453 351 -4251 -3622 2563 4614 -880 -4707 -1957 2916 3862 -1486 -3285 -1666 1668 3253
2004 3253 63 -3559 -2410 2111 3866 -219 -4370 -1990 2641 3492 -843 -3959 -1353 2651 3039
2019 3039 111 -3328 -1680 3009 3267 58 -3456 -1717 2938 3164 -250 -2705 -1773 2465 3311 -221
2035 -221 -2690 -1558 2410 3570 -427 -3158 -1198 2424 3137 -671 -2880 -1025 1948 2830 -80 -2815
2051 -2815 -1195 1741 2877 301 -3150 -1346 2318 2467 -169 -3188 -1214 2025 2310 -402 -2387
2066 -2387 -1422 1800 2134 -579 -2492 -1634 1728 2136 -1120 -2661 -1269 1406 2142 -756 -2379 -1030
2082a030K272Q36k471k307J725K063P89k288k304J694K533K59k239j912J696K168
2098A484l43j463j408O66K340j79j165j443L55K812N88k300j615P76K598l01k232
2115h30l24J097J140M16j603p48O94J057O01j069j418M44J533P04j326k081J371
2132c42J824k57j320j241J029J810q14r78q61J086J266r09m91J22n59R37O88r45
2150D5p46p31J984J089k073r25J036J643l26k533N59J635l33q46L3O53m46o23
2168i05J040N83j590j50J312N95q00j824J384J786j089j064j93J261L90j333k06
2185h03J274k63l51k49M33M45q74j78J459k81j121j81J191R73j902o73K027L66
2203A292j151j241J013J333j074j541J899O07j061r30J061J470j629j089J390
$$ plain form
2082 -1030 1242 2078 -393 -2700 -975 1088 1877 -411 -2715 -1021 1512 1771 -468 -2380 -684 1484
2098 1484 1141 -322 -1730 -1064 1276 1097 -68 -1511 -1156 1656 2244 -56 -1671 -895 1703 1402 -830
2115 -830 -1154 -57 1083 1499 -104 -852 -158 899 1500 431 -987 -543 990 1694 368 -1713 -342
2132 -342 1482 1225 -95 -1336 -307 1503 689 -289 -1150 -64 1202 293 -198 -76 -635 302 990 45
2150 45 -701 -1432 552 1641 -432 -1357 -321 1322 996 -1537 -978 657 324 -522 -489 164 -282 -905
2168 -905 135 718 -872 -1022 290 885 85 -1739 -355 1431 342 -722 -915 346 736 -597 -803
2185 -803 471 208 -143 -392 41 486 -388 -566 893 612 -509 -690 501 1474 -428 -1101 926 1292
2203 1292 141 -1100 -87 1246 172 -1369 530 1137 76 -854 207 1677 48 -1041 349
2218C49J006j178j136R75J655j465j441J476P22n31j302K63J966r26j437P06J106
2235H08j05j291l39K171n49j379J01J209Q3j287n33K017k28j730J2J526O95j997
2253h16r89K521O01k258j83J171J296j846j104J987P83j716o15R91J364j421j511
2270a745J806J081j221j220R16K114j392k042J665J307p36j471L52J952n29k234
2286a397J154J437m43j815M06J900l83k094Q36J675o26j493O8J852m5j808K85
2303d91J622l17j253n58J702R65k244k51J443P80j449j149J345J464j839o51J279
2320C98N06q17j581J789J386j860j104J415J518j296k374J645K344j998j400Q26
2336f03J654l89j813O98J630j324q45P33J098j005j412J416J642j554j470P78
$$ plain form
2218 349 1355 177 -959 16 1671 206 -1235 241 963 432 -870 -607 1359 433 -1004 -298 808
2235 808 703 -588 -927 1244 695 -684 -583 626 709 -578 -1111 906 678 -1052 -1040 486 1181 -816
2253 -816 -1805 716 1317 -941 -1124 47 1343 -503 -1607 380 1163 -553 -1168 -177 1187 -234 -1745
2270 -1745 61 1142 -79 -1299 -383 1731 339 -1703 -38 1269 533 -938 -586 1366 837 -1397
2286 -1397 -243 1194 751 -1064 -658 1242 859 -1235 -399 1276 650 -843 -775 1077 1032 -776 -491
2303 -491 1131 814 -439 -997 705 1670 -574 -825 618 1398 -51 -1200 145 1609 -230 -881 398
2320 398 904 87 -1494 295 1681 -179 -1283 132 1650 354 -2020 -375 1969 -29 -1429 -603
2336 -603 1051 662 -1151 -453 1177 -147 -992 -259 839 -166 -1578 -162 1480 -74 -1544 -766
2352g66J642O3j896k35J662L96j022o22M13R13n59l51O51m00j93J8R22N88k306
2371a082n19K557O15j626j758J467K295j292k178J025J715k36j448K65R27r96
2387b69l29J861k41j667q21K416J353k316j821J837J783r48j674j73J741n8m24
2404B50l65l74L5J055L35o11j229J01J694l0q07j069j12K276N53k113j491J566
2422c36K225o34k893M78J584J02n65n22l0P4K27J724r95k583N20K520R49k800
2440i55j806K717J868r95k341J74J784J08n3o37j047q7K192O19j607j911J016
2457i61K553j23k501o60J023K287j52k022j059J130K019M96k808j050J894J589
2473A655l86j745o70J190R62O47j507k121J116K612M35k593k187K643K301j005
$$ plain form
2352 -766 876 939 -957 -1192 470 866 -156 -778 -365 548 -11 -362 289 -111 -304 -286 636 1224 -1082
2371 -1082 -1601 956 1571 -55 -1813 -346 1949 657 -1521 -496 1219 983 -465 -200 727 -269
2387 -269 -598 1263 1022 -645 -1466 950 2303 -13 -1834 3 1786 838 -836 -1009 732 674 250
2404 250 -115 -489 -454 601 936 325 -904 -803 891 861 54 -1015 -1127 1149 1702 -411 -1902 -336
2422 -336 1889 1255 -1638 -1160 424 526 -39 -561 -591 -517 -290 1434 439 -2144 -1624 896 1845 -955
2440 -955 -2761 -44 1824 829 -1512 -1338 446 554 501 -136 -1183 -1270 922 1541 -66 -1977 -961
2457 -961 1592 1469 -1032 -1692 -669 1618 1466 -556 -1615 -485 1534 2030 -778 -1828 66 1655
2473 1655 1269 -476 -1146 44 1006 1653 146 -1975 -859 1753 2188 -405 -2592 51 2352 1347
2489A347k402k39J676J029l69j267q57j32K578Q70k469k074J400L120j49l534
2505a472o54J994J807k39k179r17J155J740O88k390j923J798K148m7k493j522
2521b506J907K208m51j794j558J154K652K61k361k092J612L078q20k405p88J389
2537e14K103m01k029j028Q48K197Q77k560j807J495K659J89l338q69K236J807
2553A865n65k183o30J305J540J94j430k200J268K632J90k554j624J908K430n04
2569A642k469q03J273K136k02k095j245J104K540j05k661j033J715J846j3k347
2585g17r57J348K111j38k474j399J849K180j75k530j435K124J996o14k176q39
2601a846J524J896k74j715j875J259K697r4k713j030J841K047k87k498p07J208
$$ plain form
2489 1347 -1055 -1294 382 1411 1042 -225 -1082 -1214 1364 2234 -235 -2309 -909 2211 2062 -1472
2505 -1472 -2126 -132 1675 1436 -743 -1660 -505 1235 1923 -467 -2390 -592 1556 1509 -984 -2506
2521 -2506 -599 1609 1158 -636 -2194 -1040 1612 1873 -488 -2580 -968 2110 1290 -1115 -1903 -514
2537 -514 1589 1188 -841 -1869 -1021 1176 2053 -507 -2314 -819 1840 2029 -1309 -2178 58 1865
2553 1865 1300 -883 -1513 -208 1332 1526 96 -2104 -836 1796 1986 -568 -2192 -284 2146 1642
2569 1642 -827 -1630 -357 1779 1577 -518 -1763 -659 1881 1776 -885 -1918 -203 1643 1630 -717
2585 -717 -1674 -326 1785 1647 -827 -2226 -377 1803 1628 -902 -2337 -213 1783 1169 -1007 -1846
2601 -1846 -322 1574 1300 -415 -2290 -1031 1666 1572 -1141 -2171 -330 1717 1430 -1068 -1775 -567
2617e67J900k75j909q50R67K100J77k481j259J601K119j30k118j323J883J623
2633A458j49k003j310J870J664l17j961j092J381K344p85j536j047J345J847n40
2649A169j911o57J042K104m49j991n20Q32J902j65j960p27J279J542K6k208o86
2666a378J596J037Lj721j133J513J426q1j797r84J374J426o12j055p45P39J705
2683A313p09j094q10O23J838m53j253n83Q71J530m40j810j77R82Q19O9j156l99
2701h39L20J111M14j279r03P38J330k0j630o40J533P83o32j055l20J134N59m06
2719A98m84o41M58J137r4q32m95L84J464l79j359j89P88P71M3j227j21O46R42
2738A010j39j380L7P37L32q6m79m37N36J95L10l40j062Q60O57L6j188n97J350
$$ plain form
2617 -567 1333 1058 -851 -1701 -734 1366 1543 -938 -2197 -596 1523 1393 -725 -2048 -165 1458
2633 1458 1309 -694 -2004 -134 1530 1213 -748 -1840 -459 1885 1100 -436 -1483 -138 1709 1169
2649 1169 -742 -1399 -357 1747 1298 -693 -1213 -381 1521 1356 -604 -1331 -52 1490 1516 -692 -1378
2666 -1378 218 1255 1258 -463 -1596 -83 1343 1262 -535 -1519 -145 1281 669 -386 -1131 -392 1313
2683 1313 604 -490 -1300 -677 1161 708 -545 -1128 -257 1273 833 -977 -1154 -172 647 716 -440 -839
2701 -839 -519 592 1006 -273 -1176 -438 892 872 -758 -1398 135 918 286 -769 -1089 45 604 198
2719 198 -286 -927 -469 668 574 -258 -753 -369 1095 716 -643 -832 -44 727 770 -457 -578 68 1010
2738 1010 871 -509 -472 265 597 511 32 -405 131 326 636 296 -766 94 751 787 -401 -998 352
2757C52O66r94n00M9Q60k50l32J41j43l24R31J28n17m23N3J061k34j064l03P81
2777f2P19l44p55J12N13j08J84l29p6J76m02K11K28m28J90M47n1k14p47N05O95
2798D64k47m22l83P87N43j173o9P49j24k9l72N45K30j006L21P26l69m34j91M20
2818c4N00q65j28P98J90m97l14K31N26o42PN10j12j62O8O2K94l95k35N98j03j63
2840A34m19L24O13o88k01M23J17Q5n53L35K51j70n41M30K48m6l99j77N81m92p5
2861b20K83K17k81q0q6J30k0j55K90K09J68o48n41R71K72q92Q5M11L20l29n93
2882d89L44N00o10K0J99K18n73m6O63J13q85L22K32L68o31l83P57P1j33j23P1
2903EJ12j71l00L53p6k3q7M24n2j4n02N67k97m1J84j57J37J98l09r1N92j09l94
$$ plain form
2757 352 1018 24 -476 -427 433 183 -149 -8 -151 -475 456 584 67 -356 -303 758 524 -540 -843 -62
2777 -62 657 313 -442 -330 183 75 259 -70 -146 30 -372 -161 67 -361 -171 276 225 11 -736 -231 464
2798 464 217 -205 -588 199 742 -431 -500 249 125 96 -276 269 499 -507 -186 540 171 -263 -454 -34
2818 -34 466 -399 -527 271 461 -36 -350 -119 407 -235 -228 282 170 8 76 138 432 37 -198 400 297 134
2840 134 -285 39 652 -36 -237 186 303 388 -165 170 421 251 -290 140 388 342 -57 -234 347 -145 -220
2861 -220 63 280 -1 -81 -167 -37 -57 -212 78 287 455 -193 -734 237 509 -383 -298 113 433 104 -489
2882 -489 -145 355 -255 -235 -36 182 -391 -437 226 339 -546 -224 8 376 -255 -638 119 190 57 -66 5
2903 5 117 -54 -354 -1 -77 -100 -187 237 185 171 -331 236 -61 -102 82 -75 62 260 -49 -140 452 343 -51
2926e1l93P50L75q29R3J15L06k24p48P48M78p63O5L72j07m06j4O73J1j026N34
2947d1M81N6p44q6Q39q5n80R9L28k50j59pL95k39l20K44J24j89R7j02L56j19m91
2970c93K38J47L00N5n40k16K46M52m5o73J09O68n08M1K17l25k01M49L08J51j115
2991f35J61J225k94j041J47N59L71n62k30Q63n43j07J59O3m36j77Q72M25r48o21
3011g49R04N35j89j037J98L94J42J69l22m36K84P16k52m01m88O15N70m73l18k47
3031c85J45O78J60n42p16O7J163J65j166m30J035Q63p28o98p3O63k19K89l04l57
3051c90j49Q85O33j368n87Q09J158o38j191J16R67J56k27n12l41J55R16J96p91
3070b03o67P46J026l31j025l9L95P97n23l58l76L96O99R3j179k61P24R23m21j105
$$ plain form
2926 -51 -444 306 681 -148 -55 60 366 142 -606 142 620 -143 -78 294 187 -219 -233 440 451 -575 -41
2947 -41 440 496 -248 -334 505 420 -160 -61 267 17 -142 -149 246 7 -313 -69 55 -134 -37 -139 217 98 -393
2970 -393 -155 -8 292 347 -193 -409 -163 289 244 -429 -320 348 -160 -119 98 -227 -428 21 329 480 -635
2991 -635 -474 751 457 -584 -437 122 493 -69 -299 564 21 -86 73 136 -300 -477 395 820 -128 -749
3011 -749 155 690 501 -536 -338 56 198 367 45 -391 -107 609 357 -44 -532 83 653 180 -138 -385
3031 -385 -240 438 598 56 -660 -593 570 735 -431 -861 174 1037 309 -389 -462 201 -18 271 -33 -390
3051 -390 -539 346 979 -389 -976 -167 991 353 -838 -722 245 401 174 -338 -679 -524 392 588 -203
3070 -203 -870 -124 902 571 -454 -493 -98 699 176 -182 -558 -162 537 630 -549 -810 -86 837 416 -689
3090f89J96Q05J88J60p53p47L68Q47O87j396r69J610R74o75j132l54J215P13o16
3109D32n83k57K46O47L05q81j214O49J710j70j476k73O83J320p27q74p0M56N87
3128E10L60j273o65J024Q96j75j118n16R22P20k32o50q52Q01Q95J8j265o11J154
3147e7J089m61j238l81J202R09p26r62j86L68J440l21j324m19Q53J484p00j450
3165h80k43J209J031o33j333R0O48N90J7p79p57P87R62J49j292p84J307P79k23
3184F45j183m35R75R60k17j249k45O19J330n73j492l7J036J152p01j039k81P51
3202A6P98l89q83m66J170P68l53j355o8J143L93j13r88o75Q98P95k27r90l35Q10
3222e1Q22q0j148o68J164Q23n91r92l83R64P20K02j546j69Q12R41l29r95j7M73
$$ plain form
3090 -689 -493 312 500 660 -93 -840 -472 375 1062 -334 -1303 307 1281 606 -526 -880 335 1048 432
3109 432 -151 -408 -162 485 790 -91 -1305 -656 1054 884 -592 -865 -182 1138 411 -463 -533 -77 510
3128 510 870 -403 -1068 -44 852 677 -441 -957 -35 685 453 -197 -1049 -248 647 665 -600 -1211 -57
3147 -57 1032 571 -667 -1048 154 1063 337 -625 -811 -443 997 676 -648 -1067 -214 1270 570 -880
3165 -880 -1123 86 1117 484 -849 -759 -111 479 496 -283 -1040 -253 709 858 -434 -1218 89 868 645
3184 645 -538 -973 2 962 745 -504 -749 -130 1200 627 -865 -902 134 1286 585 -454 -735 16
3202 16 814 425 -458 -924 246 1014 661 -694 -762 381 774 661 -327 -1002 -104 691 464 -526 -861 -51
3222 -51 771 691 -457 -1125 39 862 271 -721 -1104 -140 580 782 -764 -933 -121 820 491 -504 -521 -48
3242d8P15P3j550K8Q53N59k34j023m49J176N58Jj014n26J039N79m21p35n85J133
3262A29N82l59j135k11J049O11r5p71m71O81O95l74p06k34P24P50l80j037K9Q97
3282C74K16l18n62j75O13K58J47q22m01P58M58j17o02k88O36K66j15o93k97N66
3302i8P17j44o59m35N16Q99n23n25L1J15O90k29n98m00O32L54Q2q28j07N94N00
3323E84k13r01j07P54M4P2n50k62N46J80k17k83j98M66N18j15p06j12M77M64l62
3344G9k89k57N47K94k38n59o2N26K05J50p87Q7K79L68M4o51Q9K12J65o4l49j31
3366c42L88K41J69n07l61O19j26K2l01J75L23K43k78m13k35N70L35n01m8l43N15
3387A45J82pm74QM10N5k10k87K31k42J22K30j26n2J61j60j38J5k08O42j56j32
$$ plain form
3242 -48 667 740 -810 -782 71 630 396 -627 -1076 100 658 659 -355 -881 158 737 316 -419 -1004 129
3262 129 711 352 -783 -994 55 666 571 -200 -671 10 705 331 -375 -609 115 865 485 -552 -523 374
3282 374 590 272 -290 -465 148 406 553 -269 -670 88 546 429 -173 -461 175 441 326 -367 -664 -98
3302 -98 619 475 -184 -619 -103 796 273 -252 -221 -106 584 355 -243 -643 -11 343 425 -403 -510 84 584
3323 584 371 -530 -637 117 161 233 -317 -579 -33 147 -70 -353 -551 -85 433 318 -388 -500 -23 441 79
3344 79 -210 -467 80 374 136 -423 -485 41 246 396 -391 -304 -25 343 387 -264 -175 37 202 138 -211 -342
3366 -342 46 287 456 -51 -412 207 81 103 -198 -23 300 543 265 -148 -383 187 522 21 -27 -370 145
3387 145 327 320 -154 -146 264 319 109 -178 53 -189 -67 163 37 -15 146 -14 -152 -137 -345 297 141 9
3409Ij51p8M72l06N4k00k51L45K57j79r5R0Jn2K72k98P7m18M17Q5r3j57J77K81
3433B59k35k68K52j8K56p3k75K14j78P6J57k0qJ54j75lj24m5O9J61l23n0J51K28
3457A82K2m01L12j52jK75l70J83KK5J34l97K29N7p8Jn6K6J94j98j21M26l91J94
3481I7M0j89j02P8J89J00l21j28L8L67J20n79N62M0p33K75K70J73m33J14K16k3
3503A71m23J47M79l43j33J06jJ81m78r7O25n27N15l34L7OK3pK96k59J19j64K30
3526A69rk32J74J52m87J18J94m02L80J91n5k22n0L74m41P2J74o3P5j82K71J31
3548C32m88K2K91q0p5j49J16K9o0j99M47o7j76p4M34J1k96j99K98j58o8J71K06
3571B68j98j90M1J96k23n3K46K43o81L29J03P2j49O2j02O5L7R8j05k27L8J71J90
$$ plain form
3409 9 -142 -220 252 -54 0 -200 -451 -106 151 -28 -123 -33 -32 -84 188 -110 -33 -451 -34 51 -42 -199 -22 259
3433 259 24 -244 8 -10 246 173 -102 112 -66 10 167 147 139 293 118 115 -9 -54 15 176 -147 -197 -46 182
3457 182 204 -197 115 -37 -38 237 -133 50 52 77 211 -186 43 100 22 23 -33 -7 187 -11 -132 294 -97 97
3481 97 137 -52 -154 -76 113 213 -108 -236 -198 169 289 -290 272 312 -421 -146 124 297 -136 -22 194 171
3503 171 -252 -105 374 31 -102 4 3 184 -294 -391 234 -293 222 -112 -75 -69 -46 -53 243 -16 103 -61 169
3526 169 160 -72 102 254 -233 -115 79 -323 57 248 193 -29 -79 295 -146 -74 100 37 112 -70 201 332
3548 332 -156 -134 157 77 2 -147 -31 -2 -62 -261 186 119 -57 -131 303 314 18 -181 117 -41 -109 62 268
3571 268 70 -120 -79 117 -106 -159 87 330 -351 -22 81 153 4 66 -36 29 66 164 59 -168 -130 41 231
3594B31m11L0K50k77k51K09J33j92k1K59K20o42J55P66j28p71kO36J07o43K40
3615a02P5n6n5L56o9k48k18L32L26l97l14L52J72l36mL77j32p7L17m00j2k7M47
3638C07k2n47k14O83N8q9m30J38K72m35L71J03n05r3O35Pn06q5J86Q31n65m39
3660c39M93k85J88j1J35j29j79M19K42n35k06K7L97k37l13n7L12J80p8j89k62
3681d27N56O2J26m34k07M28K89m37j04JK48K80l79k2n68N48M85k1o59j78M16N17
3703E20m31m55M30K67r5j07m07lL40NK79l94l19J95M09K43q37n9P32K50m82l67
3725b86K49K58J52l42M5o64O48M53n69k51k41O29N98k57o09J06J23L29n3l83k63
3746c28PQ76m10m94j81Q19j29K8J0q00N86J79K1k29m62M04Q71p08l07m78N85O51
$$ plain form
3594 231 -180 -150 100 -177 -428 -219 -86 -278 -299 -40 180 -462 -307 459 331 -440 -442 194 301 -342 -102
3615 -102 -27 -83 -138 218 149 -99 -317 15 341 -56 -370 -18 154 -182 -186 191 59 -18 299 -101 -113 -140 307
3638 307 285 -262 -476 207 265 176 -254 -116 156 -279 92 195 -310 -403 232 239 -267 -352 -166 665 100 -339
3660 -339 154 -131 57 46 181 52 -127 292 534 -1 -207 -180 217 -20 -333 -390 -78 102 24 -165 -427
3681 -427 129 191 317 -117 -324 104 393 -44 -148 -147 101 381 2 -20 -588 -40 445 424 -235 -413 3 520
3703 520 89 -366 64 331 236 129 -278 -281 59 64 343 -51 -370 -175 234 477 -360 -419 313 563 81 -286
3725 -286 -37 221 373 31 76 -588 60 513 -56 -307 -548 81 679 422 -187 -81 42 371 318 -65 -328
3746 -328 -321 555 145 -349 -530 289 160 188 198 -602 -16 163 184 -45 -507 -103 768 60 -247 -725 -140 511
3768E11l86l48j34K79L76j57m66k08L21P38l28m42j23L31O39k91p19j98M69N97
3788D61j92m95l77P69J08K7o08j74M28M57J3q20O6M30J96k0o21n3N51L74l26n75
3810c81m3L38L91Pl13k40Q5O73J2p09K77l27N25K6m43l64N37N59j22p37o0K82
3832b7N47p45K6l8K84nk4k26k57N36M60l12o60L06K60K25j41m25k30P62LN9o12
3855b34k3j1Q91k13o86o1K03N79k92l21m4J96J73K63o45k41M26N56n0q53k63O81
3877C1L24k42l72k2L34J0N2k58k00Q3P27j20l57o56N18M87k72l50j31L40N29j31
3899C24n77j4J48N08j91m44R5K09K18n9j43j93J14L45j20k41n84Q64l5j94J72
3920B02n34L59N59q73L37r9K60P3o2m67J4Q8K45L2k47k05K30N28k33m44K42M5
$$ plain form
3768 511 125 -223 -357 -78 298 141 -325 -533 -212 526 198 -244 -367 -36 603 312 -407 -605 -136 461
3788 461 269 -226 -603 166 274 301 -307 -481 -53 404 417 -403 -337 93 289 269 -352 -405 146 520 194 -381
3810 -381 -424 -86 305 312 -1 -241 -156 517 529 -180 97 -230 295 321 -122 -486 51 610 488 -249 -309 -27
3832 -27 520 -225 -199 -237 47 42 18 -208 -465 71 531 219 -441 -135 125 350 209 -216 -446 316 319 378 -234
3855 -234 -257 -268 623 410 -276 -337 -134 445 153 -168 -212 -16 157 420 -225 -466 -40 516 466 -387 -650 31
3877 31 355 113 -259 -281 53 63 115 -143 -343 -260 467 347 -10 -666 -148 339 67 -283 -414 -74 455 324
3899 324 -253 -267 -119 389 198 -246 -151 58 276 217 74 -119 -5 340 220 -21 -605 259 224 30 202
3920 202 -332 27 586 -287 50 -49 211 284 222 -245 -231 -143 102 134 -113 -318 -88 440 207 -237 5 50
3942E0J58Q0o45K19O4K19j46j11L3J41K29P1n93K8N43j48k61m4k86M34J23L16
3964D74q07J83J30J01p0o7L60m26J97l01N6K57k51K11K49l47Ko1O03j38n03j15
3986b63K83%K16m11p7M48k44j14K66p6K18j49K20o8m81jM14R2l26l03M42P2j94
4009c6j26K51J68l58J04j52Q7k15L09N9N7j53j9K10J30m98K41j94M11k73p2p8
4031a47M65l01l14R2J51N2P1k3k2J2k13j87K41J45L3k16L10m6k84N6R2M77q16
4054c72P3K09P7k24M0J95L57l46k33L98O4k82j3Q6J80j53k38K0K44k92J83K02
4076A75L02n57M4P6J4j10J00j69J26L73k71m28K86L03k95Mj44N04m88J33ON8l13
4099b71K14qJ90m17J46K83m1r7j43K6L02j71l14K84j36L64k92J52j41j71L28j77
$$ plain form
3942 50 208 288 -357 -138 -74 145 -1 -112 -79 62 291 362 -231 -203 340 192 -69 -113 -399 35 158 474
3964 474 -333 -150 -20 81 11 -56 304 -122 75 -226 -170 87 -164 47 296 -51 -49 -110 493 355 -148 -263
3986 -263 20 20 236 -175 -252 196 -48 -162 104 28 246 97 317 249 -232 -233 181 273 -53 -356 86 158 -36
4009 -36 -162 89 257 -101 3 -149 -62 -277 32 91 148 -5 -24 186 316 -182 59 -135 276 3 -69 -147
4031 -147 318 17 -297 -205 -54 -2 69 46 24 36 -177 -364 -123 22 55 -161 149 103 -181 -125 -33 444 -372
4054 -372 -299 -90 -13 -237 -197 -2 355 9 -224 174 238 -44 -57 29 209 56 -182 -162 82 -210 -27 175
4076 175 477 -80 -36 40 54 -56 44 -125 1 374 103 -325 -39 264 -31 -27 -171 333 -155 -22 -16 42 -271
4099 -271 -57 -65 125 -292 -146 137 96 -1 -144 -118 184 13 -301 -17 -153 211 -81 71 -70 -241 87 -90
4121i0J41j52J62J04jm94J33K46Jj24k37L45k59J27K01o4j17j90K17K51k42n5
4143i7K13k24J86J63l45q7K25k25L16j77K14q3j5j4o1j06K28p3j98L49j27m39
4165c77N20j9m22L83K9r8J9k80J9M68j76j55j64N42m07K0J23l58N40k29mK03k11
4188c4K39j31k29L58m88J37m1K85K4J5j83K11R9n59J78J15j3j91K66qK38l27m7
4211h6M6J13k65r3N61k20k14J73J47m63M00l4K3k8k91K39j11K58k15K30J15j56
4233A29l8k37N1J3L64l02k4r6M4K93J81j35l11j8J65J52j85M8k62L65j2m52P1
4256a96L25K7j40l15J4O83m02k76L65k37R7M1L78j78m77M90J2k47J35l6j52J67
4278G8j00k3l8K48r5j12l2N9m1K38j54j67N8p6K25J44k54l32M37j58O69o49r2
$$ plain form
4121 -90 51 -101 61 165 164 -330 -197 49 50 -74 -311 34 -225 -98 103 39 -78 -268 -51 200 -42 -97
4143 -97 116 -108 78 241 -104 -191 34 -191 125 -52 162 79 64 50 -11 -117 111 38 -160 189 62 -377
4165 -377 143 124 -298 85 114 16 35 -245 -226 242 66 -89 -253 289 -118 -98 25 -333 207 -22 -26 177 -34
4188 -34 205 74 -155 203 -285 -148 -189 96 120 135 -48 163 262 -297 -119 -4 -17 -208 58 50 288 -39 -86
4211 -86 -40 73 -192 -285 276 56 -158 15 162 -301 99 65 88 60 -231 8 -103 155 -60 170 285 129
4233 129 91 -146 -95 -82 282 -20 -44 -140 -96 197 378 243 -68 -86 79 231 46 94 -168 197 185 -267 -196
4256 -196 129 156 16 -299 -285 398 -4 -280 85 -152 -55 -14 364 186 -291 199 211 -36 99 63 -89 78
4278 78 -22 -45 -83 165 70 -42 -74 -15 -56 182 28 -139 -81 -157 68 212 -42 -374 63 -95 574 -75 -167
4301a67O5J45j35J72k09J73L8k16K10l95J92P6j19J22k52K47M33j96n05K14J60
4322E3K8k57r0L39j00J19j90j39l2M43j99L60m36j49L23J63o3l62P8J58J65J6
4344B28m25o3J90J54M4l6j66K51J74k76j23j3L68j24K53l27m89K73N63k33m62
4365b39P5J50M01j58m30p6M17J90J23n46p7L09Q2p3k13l31L89L38k89n12J92N82
4387C04q6l32K55n41o5Q01j99k41l51M21N54k89n23LK54L96q8m56j76L09K09K33
4409C92o73p0M44N4o5l09O6J23J30L52l08m30M88k1J8l01l64M69O59o90k48r3
4431c77M99R9k64j79o8J16L84O3m71j78M86K78k29j99k28N08Q7k55n43J43J75
4452a53L02J14m21n06Q32O9k07j79J13J88K39l54J08j51j18N95k9o02n18O80L64
$$ plain form
4301 -167 -102 43 -92 80 -129 44 82 -134 76 -319 -127 -51 -170 -48 -300 -53 380 184 -321 -107 53
4322 53 81 -176 -266 73 -27 92 -98 -237 -269 174 -25 335 -101 -250 73 236 173 -189 -111 47 212 228
4344 228 -197 -260 -70 84 128 92 -74 177 351 75 -48 -61 307 183 436 109 -380 -107 456 223 -239
4365 -239 -164 -14 387 229 -201 -277 140 330 453 -93 -170 139 221 148 -65 -396 -7 331 42 -470 -278 304
4387 304 218 -114 141 -400 -465 336 137 -104 -455 -34 520 231 -292 -289 -35 361 273 -183 -359 -50 159 392
4409 392 -281 -351 93 147 82 -227 -161 -38 92 444 136 -294 194 173 191 -110 -474 -5 654 -36 -284 -377
4431 -377 122 221 -43 -222 -290 -174 210 273 -198 -376 110 388 159 -40 -268 240 327 72 -471 -328 -153
4452 -153 149 263 -158 -664 168 237 30 -149 -36 152 391 37 145 -6 -124 471 442 -160 -678 2 366
4473C66l63k54P1M54nk32j75J43k09J98J64j19m22L67M81j75l83j65K58K58n4
4494B04l30qK33L35k72k39k15K77J25r5k65J07K48j12J11m7n48J93N43L2j87m94
4516d04M45L89k15m40K85J65k10K4j45M7m0J00J05o0j28P8K84N5o02k36N04M46
4538D47m42n89L49J69L48r8K1l41P4P1K3k06M2K98m6n1J1k54k5L92N2j81l08K88
4562D4M23l82j68j8L38j50k66j69L31j13j4L65j39k48R6L08j18m33o5N02k4k56
4584a56k00J21M03k41l40K31j20nM55m28N29j02l53L01J28l47J16p2J83P8k60
4605g9P1R5P9k42k08L1M09j29L2M8L1m18J34L43K3j66j64L25J22m19j74K49J20
4628A13j44j50K10m2%R9K92k85k88K92L05m63m9J16p8L91l85r0o5L64J51o01K23
$$ plain form
4473 366 3 -251 -180 274 269 37 -138 5 -204 -6 158 39 -383 -16 465 290 -93 -258 0 258 204
4494 204 -126 -134 99 434 162 -77 -292 -15 110 15 -250 -143 105 -7 104 57 -491 -298 245 277 90 -404
4516 -404 41 430 215 -225 60 225 15 39 -106 -59 -99 1 106 46 -82 -4 280 335 -267 -503 1 447
4538 447 5 -584 -235 -66 282 184 205 -136 -62 9 32 -174 -132 166 120 69 80 -174 -199 193 245 64 -244 44
4562 44 467 85 -83 -101 237 87 -179 -348 -17 -130 -144 221 82 -166 -70 238 120 -313 -378 124 100 -156
4584 -156 -356 -235 168 -73 -413 -182 -302 -307 148 -280 249 147 -206 95 223 -124 -8 -80 103 181 -79
4605 -79 -8 87 166 -76 -284 -253 156 27 59 107 138 -280 -146 197 220 54 -110 215 337 -82 -256 -7 113
4628 113 -31 -181 29 -13 -13 86 378 93 -195 97 402 -61 -110 6 -72 319 -66 -156 -221 143 294 -307 -84
4651h4O3J98Om24J20M86m97J13J97j12j15M6j20K97j16j80N3pL09k56L5P0o2k31
4675b11O4J20P0P1j13J07J76k32j44P6J51k44MJ50m0o0L79l15J95M6l84K47j76
4698f3M6N4j64K45j31j36J31R0p3j8L5K13k92j59M11l5k23OJ80J2j30L9m7J84
4722A75j30M2K9oj09r8K38J16k76j70J86j30J27k17N15j33l88J72R0k7k47P4j1
4745a78K47K13k73o7oJ76k92J86o1j02L53k49R9o1j21J57j35K7J80q1J03l9m0
4768C6k08K25j2L4r2rJ17n0q1Lk8MK2P8J06n16K67L14l73M9J97Oj62J88L3J7m73
4795c08K83M3k63L02J33l89J33k72M99l75J66rk36M68k21N0R1j87p9L26j41j18
4817a04J86j88K44j98o8L14j32O8j09k1l6J40m8n3k6P0n9O6Rj71J47o2P4k05O0
$$ plain form
4651 -84 -21 177 183 -241 -121 365 -132 -19 178 66 -49 -3 -123 174 58 -122 -69 -76 233 -23 12 82 20 -211
4675 -211 -147 -27 43 114 1 108 284 52 -92 -16 135 -109 -105 45 5 -55 324 9 204 250 -134 113 -63
4698 -63 -17 37 -127 118 -13 -149 -18 72 -1 -19 16 229 -63 -222 189 154 -69 -63 117 129 -1 38 -9 175
4722 175 45 87 116 110 1 -97 141 257 -19 -189 -3 -133 -6 -223 292 159 -229 -57 33 6 -241 -167 -178
4745 -178 69 282 9 -58 -64 112 -180 6 -55 -157 196 -53 46 -15 -136 21 -114 -87 93 12 115 76 36
4768 36 -172 53 41 75 -17 -26 91 41 -40 -37 -65 -61 -39 39 145 -371 -104 210 -163 -114 83 89 -73 115 148 165 -308
4795 -308 -25 18 -245 57 190 -199 -66 -338 161 -214 -48 -57 -293 175 -46 4 95 -92 -171 155 14 -104
4817 -104 82 -106 138 -60 -128 186 54 122 13 -8 -44 96 48 -5 -31 39 -20 46 55 -116 31 -31 43 -162 -102
4842a02nO6J94m77L97J44o6Nk95l36L76J55m8j92J10L7n2j13J09J9j04K66l2r3
4866c7j32K67j67N6J8J98O9k33J6NJ00k07N9K15m54L31l00J71J3j6R8j82J29k54
4890b37K03J84j29j90M51m30N37k51m38J48J2n4M47l19m9j56N10m2j58nO8l5l8
4913B9pp9j30K70p5K7r9j55K66L24k04r4l01K34K31l91Q7J54R4j11j22K22n41
4936c71K62L84l90K20l68L05j12P1k44L01j22J81O1l38QPK09K19l24l22M03J32
4958A72j34l43J12L22q3k3j60o6P9K64j35j54J35r9LL57k65o3j67N25k83j81j51
4981c38J96N42j92n26J29K86kK2k40K43j89M63l88o4j36n5O84k34m24j17L53N5
5003F8o8k39l8J03K95k11J19k76L87j52j22L8l8M0N23m57o2k46O0M41p1l15k56
$$ plain form
4842 -102 -107 -41 153 -324 73 217 151 156 -139 -475 -99 56 8 -184 -74 -37 -89 -202 -93 -74 -178 88 56 -37
4866 -37 -169 98 -69 -13 5 203 272 39 55 60 160 -47 12 227 -227 104 -196 -25 -12 -28 70 -112 17 -237
4890 -237 -34 150 21 -169 282 -148 389 138 -300 -152 -140 -194 253 -66 -115 -271 239 197 39 34 102 67 29
4913 29 22 -57 -187 83 8 35 -64 -219 47 371 167 73 -228 6 237 -154 -67 87 181 70 -52 170 -371
4936 -371 -109 275 -115 105 -263 42 -70 1 -243 58 -64 117 178 -160 -152 -145 64 283 -41 -363 40 172
4958 172 38 -305 -193 129 46 23 -137 -203 -124 140 5 -149 -14 -113 -110 247 -18 -81 -248 277 -6 -187 -338
4981 -338 -142 400 208 -318 -189 97 95 117 -123 120 -69 394 6 -58 -194 -249 435 201 -223 -340 13 68
5003 68 0 -239 -277 -174 121 -90 29 -247 140 -12 -134 -96 -134 -94 429 -28 -90 -336 -276 165 94 -221 -477
5026d77M58L66m73r3K12P6K3k59j72K82J11J06o4n1m28L73n1J27R6n87M50n2r3
5049a20Q9k74J44L44k30j28J98N7l1kj4j02pJ30L74l92j90M7K70J20r31J19N09
5072b0L28k76l60L96Q9o9j42Q7%j76K33J22k47j59J09N59k91n35P8L40L48p12
5094b98j3K78J14r8K13l23k2K33l1J10m23J79J4J70O3m6m29K18M38j03n87K4M51
5117A32J59j30j28j64L09k24k04K20n6J4j2L08l8l66l4M60ro29k25N85L32l61
$$ plain form
5026 -477 -19 347 -126 -219 -7 69 92 -167 -339 -57 54 160 96 45 -383 -10 -61 66 162 -425 25 -27 -120
5049 -120 -31 -305 -161 183 -47 -175 23 80 49 47 33 -69 -76 54 428 36 -154 -107 163 283 -648 -529 -20
5072 -20 308 32 -328 68 157 88 -54 33 33 -143 90 212 -35 -194 -85 474 183 -352 -274 66 414 -298
5094 -298 -311 -33 81 -17 196 -127 -149 84 53 163 -260 -81 -67 103 166 120 -309 -91 347 244 -343 -319 132
5117 132 291 161 33 -131 178 -46 -250 -30 -86 -72 -84 224 186 -180 -214 246 237 -392 -617 -32 300 -61
$$ [...]
8191G5
##END NTUPLES=NMR FID
##END=
