##TITLE=1H_Pr BrBuCl2
 CDCl3, 8 sc, 
 11.06.2021
##JCAMPDX= 6.0         $$ Bruker NMR JCAMP-DX V2.0
##DATA TYPE= NMR FID
##DATA CLASS= NTUPLES
##ORIGIN= UXNMR, Bruker Analytische Messtechnik GmbH
##OWNER= root
$$ XWIN-NMR		Version 3.5
$$ Fri Jun 11 13:06:18 2021 Russian Standard Time (UT+4h)  she@DPX200
##.OBSERVE FREQUENCY= 200.131506
##.OBSERVE NUCLEUS= ^1H
##.DELAY= (6, 6)
##.ACQUISITION MODE= SIMULTANEOUS
##.ACQUISITION SCHEME= undefined
##.AVERAGES= 8
##.DIGITISER RES= 18
##SPECTROMETER/DATA SYSTEM= spect
##.PULSE SEQUENCE= zg30
##.SOLVENT NAME= CDCl3
##.SHIFT REFERENCE= (INTERNAL, CDCl3, 0, 15.7039)
##AUDIT TRAIL= $$ (NUMBER, WHEN, WHO, WHERE, WHAT)
$$ ##TITLE= Audit trail, XWIN-NMR		Version 3.5
$$ ##JCAMPDX= 5.01
$$ ##ORIGIN= Bruker BioSpin GmbH
$$ ##OWNER= she
$$ F:/spectra/data/she/nmr/H-F/1/audita.txt
$$ ##AUDIT TRAIL=  $$ (NUMBER, WHEN, WHO, WHERE, WHAT)
(   1,<2021-06-11 13:04:59.35 +0400>,<she>,<DPX200>,
      <created by zg, POWCHK disabled, PULCHK disabled
       configuration hash MD5:
       00 E9 B6 7A A2 85 ED C7 34 08 36 98 17 FE 4E 26
       data hash MD5: 16K
       8E 71 B5 D7 BB 3B 54 E5 A0 D5 29 7F 8B 95 B0 C2>)
$$ ##END=
$$ 
$$ hash MD5
$$ A4 36 D2 96 88 F5 75 17 8D DF 7C F8 A7 48 54 05
##$RELAX= 
##$RELAX= 
##$RELAX= 
##$RELAX= 
##$RELAX= 
##$RELAX= 
$$ Bruker specific parameters
$$ --------------------------
##$DU= <F:/spectra>
##$EXPNO= 1
##$NAME= <H-F>
##$PROCNO= 1
##$TYPE= <nmr>
##$USER= <she>
##$AMP= (0..31)
100 100 100 100 100 100 100 100 100 100 100 100 100 100 100 100 100 100 
100 100 100 100 100 100 100 100 100 100 100 100 100 100 
##$AQSEQ= 0
##$AQ_mod= 1
##$AUNM= <au_zg>
##$AUTOPOS= <>
##$BF1= 200.13
##$BF2= 200.13
##$BF3= 200.13
##$BF4= 200.13
##$BF5= 200.13
##$BF6= 200.13
##$BF7= 200.13
##$BF8= 200.13
##$BYTORDA= 1
##$CFDGTYP= 0
##$CFRGTYP= 5
##$CHEMSTR= <none>
##$CNST= (0..31)
1 1 145 1 1 1 1 1 1 1 1 1 1 1 1 1 1 1 1 1 1 1 1 1 1 1 1 1 1 1 1 1 
##$CPDPRG= <>
##$CPDPRG1= <>
##$CPDPRG2= <>
##$CPDPRG3= <>
##$CPDPRG4= <mlev>
##$CPDPRG5= <mlev>
##$CPDPRG6= <mlev>
##$CPDPRG7= <mlev>
##$CPDPRG8= <mlev>
##$CPDPRGB= <>
##$CPDPRGT= <>
##$D= (0..31)
0 1.2 0 0 0 0 0 0 0 0.06 0 0.03 0 0 0 0 0.0002 0 0 0 0 0 0 0 0 0 0 0 0 
0 0 0 
##$DATE= 1623402298
##$DBL= (0..7)
120 120 120 120 120 120 120 120 
##$DBP= (0..7)
150 150 150 150 150 150 150 150 
##$DBP07= 0
##$DBPNAM0= <>
##$DBPNAM1= <>
##$DBPNAM2= <>
##$DBPNAM3= <>
##$DBPNAM4= <>
##$DBPNAM5= <>
##$DBPNAM6= <>
##$DBPNAM7= <>
##$DBPOAL= (0..7)
0.5 0.5 0.5 0.5 0.5 0.5 0.5 0.5 
##$DBPOFFS= (0..7)
0 0 0 0 0 0 0 0 
##$DE= 6
##$DECBNUC= <off>
##$DECIM= 32
##$DECNUC= <off>
##$DECSTAT= 4
##$DIGMOD= 1
##$DIGTYP= 9
##$DL= (0..7)
0 120 120 120 120 120 120 120 
##$DP= (0..7)
150 150 150 150 150 150 150 150 
##$DP07= 0
##$DPNAME0= <>
##$DPNAME1= <>
##$DPNAME2= <>
##$DPNAME3= <>
##$DPNAME4= <>
##$DPNAME5= <>
##$DPNAME6= <>
##$DPNAME7= <>
##$DPOAL= (0..7)
0.5 0.5 0.5 0.5 0.5 0.5 0.5 0.5 
##$DPOFFS= (0..7)
0 0 0 0 0 0 0 0 
##$DQDMODE= 0
##$DR= 18
##$DS= 0
##$DSLIST= <SSSSSSSSSSSSSSS>
$$ [...]
##$SUBNAM2= <"">
##$SUBNAM3= <"">
##$SUBNAM4= <"">
##$SUBNAM5= <"">
##$SUBNAM6= <"">
##$SUBNAM7= <"">
##$SUBNAM8= <"">
##$SUBNAM9= <"">
##$SW= 20.0188882624521
##$SWIBOX= (0..15)
0 0 2 0 0 0 0 0 0 0 0 0 0 0 0 0 
##$SW_h= 4006.41025641026
##$TD= 16384
##$TD0= 1
##$TE= 0
##$TE2= 300
##$TE3= 300
##$TEG= 300
##$TL= (0..7)
0 120 120 120 120 120 120 120 
##$TP= (0..7)
150 150 150 150 150 150 150 150 
##$TP07= 0
##$TPNAME0= <>
##$TPNAME1= <>
##$TPNAME2= <>
##$TPNAME3= <>
##$TPNAME4= <>
##$TPNAME5= <>
##$TPNAME6= <>
##$TPNAME7= <>
##$TPOAL= (0..7)
0.5 0.5 0.5 0.5 0.5 0.5 0.5 0.5 
##$TPOFFS= (0..7)
0 0 0 0 0 0 0 0 
##$TUNHIN= 0
##$TUNHOUT= 0
##$TUNXOUT= 0
##$USERA1= <user>
##$USERA2= <user>
##$USERA3= <user>
##$USERA4= <user>
##$USERA5= <user>
##$V9= 5
##$VALIST= <valist>
##$VCLIST= <CCCCCCCCCCCCCCC>
##$VD= 0
##$VDLIST= <DDDDDDDDDDDDDDD>
##$VPLIST= <PPPPPPPPPPPPPPP>
##$VTLIST= <TTTTTTTTTTTTTTT>
##$WBST= 1024
##$WBSW= 4
##$XGAIN= (0..3)
0 0 0 0 
##$XL= 0
##$YL= 0
##$YMAX_a= 631111
##$YMIN_a= -667944
##$ZGOPTNS= <>
##$ZL1= 120
##$ZL2= 120
##$ZL3= 120
##$ZL4= 120
##$ABSF1= 10
##$ABSF2= 0
##$ABSG= 5
##$ABSL= 3
##$ALPHA= 0
##$AQORDER= 0
##$ASSFAC= 0
##$ASSFACI= 0
##$ASSFACX= 0
##$ASSWID= 0
##$AUNMP= <proc_1d>
##$AZFE= 0.1
##$AZFW= 0.1
##$BCFW= 1
##$BC_mod= 2
##$BYTORDP= 1
##$COROFFS= 0
##$CY= 11.3945322036743
##$DATMOD= 1
##$DC= 2
##$DFILT= <>
##$DTYPP= 0
##$F1P= 15.9154993809931
##$F2P= -4.1035820241983
##$FCOR= 0.5
##$FTSIZE= 0
##$FT_mod= 4
##$GAMMA= 1
##$GB= 0.15
##$INTBC= 1
##$INTSCL= 1
##$ISEN= 128
##$LB= 0.24
##$LEV0= 0
##$LPBIN= 0
##$MAXI= 10000
##$MC2= 0
##$MEAN= 0
##$ME_mod= 0
##$MI= 1.114404
##$NCOEF= 0
##$NC_proc= 0
##$NLEV= 6
##$NOISF1= 3.799351
##$NOISF2= 2.8
##$NSP= 1
##$NTH_PI= 0
##$NZP= 0
##$OFFSET= 15.70392
##$PC= 1
##$PHC0= -11483.55
##$PHC1= 10.60101
##$PH_mod= 1
##$PKNL= yes
##$PPARMOD= 0
##$PSCAL= 0
##$PSIGN= 0
##$REVERSE= no
##$SF= 200.130013532006
##$SI= 16384
##$SIGF1= 3
##$SIGF2= 2
##$SINO= 400
##$SIOLD= 16384
##$SREGLST= <1H.CDCl3>
##$SSB= 0
##$STSI= 0
##$STSR= 0
##$SW_p= 3612.71676300578
##$SYMM= 0
##$S_DEV= 0
##$TDeff= 0
##$TDoff= 0
##$TI= <>
##$TILT= no
##$TM1= 0
##$TM2= 0
##$TOPLEV= 0
##$USERP1= <user>
##$USERP2= <user>
##$USERP3= <user>
##$USERP4= <user>
##$USERP5= <user>
##$WDW= 1
##$XDIM= 8192
##$YMAX_p= 0
##$YMIN_p= 0
$$ End of Bruker specific parameters
$$ ---------------------------------
##NTUPLES= NMR FID
##VAR_NAME=  TIME,          FID/REAL,        FID/IMAG
##SYMBOL=    X,             R,               I
##VAR_TYPE=  INDEPENDENT,   DEPENDENT,       DEPENDENT
##VAR_FORM=  AFFN,          ASDF,            ASDF
##VAR_DIM=   8192,          8192,            8192
##UNITS=     SECONDS,       ARBITRARY UNITS, ARBITRARY UNITS
##FACTOR=    0.0002496,     1,               1
##FIRST=     0,             0,               0
##LAST=      2.0444736,     0,               0
##MIN=       0,             -667944,         0
##MAX=       2.0444736,     631111,          0
$$ Real data points
##PAGE= N=1
##DATA TABLE= (X++(R..R)), XYDATA
0@%%%%%%oO%Qj6J6k0K8m0M8n6P2q8J08j32J52j80K20k56K96l46M01m61N29o07
31c24O90p83Q89j003J129j271J426j592J774j978K199k437K698k985L299l642
47a911M016m424M875n371N916o521P197p951Q798r765J0875j2161J3677j5493
61h243J7713k0504K4133k9061L6175m7386O7690j15733M26714K79613j145271
72e14160p6514Q92519K66890p40104k09789M63332J10517k94679J25111J56249
82A79372k96324j88499M44678K74312m63759l90467L80865M15538j64274l72882
92a81440o2145K18425K38125K435l01020k52186K82800M13196j85351m56547O6801
103b16907L84357O180k48235L2334Q0532j71777N2791L63263r5729n52224L1296
$$ plain form
0 0 0 0 0 0 0 0 -6 0 0 8 -8 8 -12 16 -24 24 -32 40 -48 60 -72 80 -100 120 -136 160 -186 215 -246 283 -324
31 -324 366 -417 472 -531 598 -673 753 -839 935 -1043 1156 -1281 1417 -1568 1731 -1911
47 -1911 2105 -2319 2556 -2815 3101 -3420 3777 -4174 4624 -5141 5734 -6427 7250 -8243
61 -8243 9470 -11034 13099 -15962 20213 -27173 40517 -75216 351498 631111 -514160
72 -514160 -590674 301845 568735 -171369 -381158 82174 192691 -101988 23123 179372
82 179372 -116952 -305451 139227 413539 -50220 -440687 -59822 355716 191442 -181440
92 -181440 -243585 -25160 212965 215400 -85620 -337806 -55006 358190 172839 -283708 -216907
103 -216907 167450 173630 -74605 -42271 38261 -133516 -80725 282538 186809 -365415 -334119
114c34119O90588Q8923p26449k06693O41004K74496m72893k61977K96623J50148
124A39651j67273L2835J12847k19360j42992L44193K40286l79327l46439L22417
134f3162L97577j91543l62849L7921K49356P5406q3342j08187r0221O6046K17637
145A44639K4060k59439j21503K16122J84674j17657j73956M222Q4221Q5911N4772
156A26066j14423j96840P0231L03410K1471l41253j13803K98970J69901k00810
166B2920j64515R5145R1814k3094K9538M732j56466m3755K45849J26189k75814
177d7457k16943K45160K72097j65339k70272O6985K11780O521j15462k6266P611
188c1585q017P4135P3813j01058j46227O9252J96585l720j99034o9303J44822
$$ plain form
114 -334119 356469 445392 -281057 -487750 153254 427750 -45143 -307120 -10497 139651
124 139651 -27622 5213 118060 -101300 -244292 99901 340187 -39140 -385579 -63162
134 -63162 334415 142872 -219977 -182056 67300 142706 59364 -48823 -139044 -72998 144639
145 144639 168699 -90740 -212243 3879 188553 70896 -103060 -98838 -14617 71294 126066
156 126066 11643 -185197 -114966 188444 209915 -131338 -245141 53829 223730 22920
166 22920 -141595 -46450 45364 22270 51808 56540 -99926 -143681 102168 228357 -47457
177 -47457 -264400 -19240 252857 87518 -182754 -115769 96011 102532 -12930 -39196 -31585
188 -31585 -39602 34533 108346 7288 -138939 -69687 126898 123178 -75856 -145159 -337
199c37J27496n8655j48076l1550J20178J00934n8970j33410n987J18738M8900
210G9261o6122n9174N440L0157L3552L3453m1027j06164J6180J56500L8370j71734
222e1308j01924J52119J47320j05422j54922M5693J29485K666q3502j5899K8403
233g291l276J7784M0467l3213q1199J4131J15320K3360j23488o2453R7816R5877
245I3835n0236j11432L688R7413L2449n8586n2413J8244M9072P759k0441j7609
257h257j5380J2312L5633J3211l6426n0789K6505P6464n306p8828k7612O6527
269H054N6556m8411o2711K1091M8701P864l0099k0778J0946Q495J1052J1504k5090
282b826k6962J7252L8740N195m8542k3541M3708L1437k1656l7399k639L8342J2463
$$ plain form
199 -337 127159 68504 -79572 -111122 9056 109990 51020 -82390 -88377 30361 79261
210 79261 13139 -46035 -40595 -10438 23114 56567 15540 -90624 -74444 82056 120426 -51308
222 -51308 -153232 -1113 146207 40785 -114137 -68444 61041 63707 -19795 -35694 -7291
233 -7291 -10567 7217 47684 14471 -66728 -52597 62723 86083 -37405 -99858 -2042 93835
245 93835 43599 -67833 -64145 33268 65717 7131 -45282 -27038 22034 29793 9352 -8257
257 -8257 -23637 -11325 24308 37519 1093 -49696 -23191 53273 47967 -30861 -58473 8054
269 8054 64610 16199 -46512 -25421 23280 31144 1045 -19733 -8787 -292 10760 22264 -2826
282 -2826 -29788 -12536 26204 31399 -17143 -40684 3024 34461 12805 -24594 -27233 11109 23572
295B3572k3995j4503N29J5412J2358r177j1504q153P915K2810m689k2102o373
308a7900J3456K1213p922k5326L085J5582Q194n854j5913K013J0762L572R89j1632
322e681n421J1524O227q79r759p267J2926O732o362n565k216P295N273n568j346
337h7k886J499P828k702m467q69L23P507j281o890J444J962K266j6l833J590o61
354G27q1L644k571j915Q54J37L312j889l520K253M75Q7j89j279J108j848M26L221
372B952k579k412P35K102J911l619k264L392N20r55j033j6J140k337J302L358
388B197m386k658L247L999j019p755J359Q707k019o552n80O642K533r072q1Q975
404C537k001o528R37P344N47j0607J066J1891k282j0978M21J2875K038j6362j667
$$ plain form
295 23572 -423 -14926 -14397 1015 13373 4196 -7308 -15461 -7546 15264 10575 -11527 -17900
308 -17900 -4444 16769 8847 -16479 -13394 2188 10382 4528 -11385 -9372 1390 4962 5951 -5681
322 -5681 -11102 422 6649 5770 -3989 -11256 1670 8402 2040 -3525 -5741 1554 6827 1259 -87
337 -87 -2973 -1474 6354 3652 -815 -1684 -1361 6146 4865 -2025 -581 1381 3647 3631 -202 1388 727
354 727 646 4290 1719 -196 658 795 4107 2218 -1302 951 1426 1513 1324 45 1153 -695 -269 2952
372 2952 373 -2039 -1304 798 2709 -910 -3174 218 738 -217 -1250 -1266 -126 -2463 -1161 2197
388 2197 -2189 -4847 -1600 2399 1380 -6375 -5016 3691 1672 -4880 -5460 1182 3715 -5357 -5438 3537
404 3537 1536 -4992 -4055 3289 3836 -6771 -5705 6186 3904 -7074 -6653 6222 8260 -8102 -9769
419i769J8082R59j5735m263J6337P935j8691p702J8626P503j5496r551J4919J1453
433A4607j7257r254J7975Q197j7298j1035J8705J5963k1652j9194K1598K1761
445B3116j6769k7531J3049L1735j1412l0464Q184K6441l385k6213L535K6354r273
458G367k5108J2635K7272j3626l4923J3755M2931j3484m5627O413M5820L120m5666
471a9121r486M1420J0719l2053j0663K2641Q842k0210k543K1644n339k2735N773
484a1111K6456J385l3892r898L6658J8834l0568k9442J9697L9730j1327m0467
496b3945L643L3387L935k6568m152K3644n599k2539K0202K4115k8687l4367L2616
509d315N0992l4804o1414L0539O3250j8255n9446P218N1612m762l7062J1555J8022
$$ plain form
419 -9769 8313 9272 -6463 -10726 5611 13546 -5145 -12847 5779 13282 -2214 -11765 3154 14607
433 14607 -2650 -11904 6071 14268 -3030 -14065 4640 20603 -1049 -20243 1355 23116
445 23116 6347 -21184 -8135 23600 12188 -18276 -10092 16349 12964 -13249 -9714 16640 7367
458 7367 -17741 -5106 22166 8540 -26383 -12628 30303 16819 -28808 -22395 23425 26545 -19121
471 -19121 -28607 12813 23532 -8521 -19184 3457 12299 -7911 -10454 11190 5851 -16884 -11111
484 -11111 15345 16730 -17162 -27060 9598 28432 -2136 -31578 -11881 27849 16522 -23945
496 -23945 -20302 13085 17020 -9548 -13700 9944 4345 -18194 2008 26123 -2564 -36931 -4315
509 -4315 46677 11873 -49541 -19002 44248 25993 -33453 -26235 25377 20615 -16447 -4892 13130
522A3130k0376o927L3351P626m9319j3712N9984K0420n5732k9171M0374L6677
534C6325k3973l3785Q884J8781N827j356j4453j1267J0205J9379Q52k1143q352
547a4076J0085P785J2828k012l6406j1785N0876L3715n6923n6965N7358O9698
559F4178n2113o8635M2072N9891l9738m5260M9964K5566o9307r040R1224M685
571E3487j13759j2063J30496K4524j33166l6826J19857M4331r6581m2799P2612
582A0113K8590n1899n901L8116j5760l5318K9924M2262l2909n0177K3196N0019
594C0256J153l9997l0358J9596N4402J0093o6978m3412P1584O8672o7345p9961
606g2295N9195P8640n5069o7302O3604M9086q4198l0708J10498K3141j37775k8894
$$ plain form
522 13130 -7246 -14173 19178 26804 -22515 -36227 23757 44177 -11555 -40726 -352 36325
534 36325 12352 -21433 -12549 6232 12059 10703 -3750 -15017 -4812 14567 15419 -5724 -14076
547 -14076 -3991 3794 16622 14610 -21796 -33581 17295 51010 -5913 -62878 -5520 64178
559 64178 12065 -56570 -14498 45393 5655 -39605 10359 35925 -33382 -42422 48802 53487
571 53487 -60272 -72335 58161 82685 -50481 -87307 32550 76881 -19700 -62499 10113
582 10113 38703 -13196 -19097 19019 3259 -32059 -2135 40127 7218 -42959 -19763 30256
594 30256 31409 -8588 -38946 -19350 35052 45145 -21833 -65245 6339 75011 7666 -72295
606 -72295 -13100 65540 10471 -56831 6773 55859 -28339 -59047 51451 74592 -63183 -92077
618i2077J61059M1346j70892n3381J61561O1787j39649o0800J14306M5842r1623
629b2521j9362P3931q520o5957K9134O9606m0192p7527L8167P8486k1108o8217
641c4080o032M6772L0358j5855m2923k2907M5403N7259m0816p7491L0665Q1388
653E1741k0566p5545K1553O1756l7611m4370O2788L2444r1030l2650J16477M3976
665H8963j34835n5710J36470O3555j22746o3753J02076N2560q3457k7446O9864
676B5541m613o2929L1960O6545m8972p6630N4878Q3927m8660q0115L1598O5152
688C7682j1954m0551N42R503N42K2775N447m5354j6181N3753K8110m9517l3585
701c8788L8215K5175k2185m188Q284k1700m744M8315J1974o9338k4603P9527L5386
$$ plain form
618 -92077 68982 110328 -60564 -113945 47616 109403 -30246 -91046 23260 69102 -22521
629 -22521 -41883 32048 23528 -42429 -13295 56311 16119 -61408 -23241 55245 34137 -34080
641 -34080 -40112 6660 37018 21163 -21760 -44667 736 57995 17179 -60312 -29647 51741
653 51741 31175 -44370 -22817 38939 1328 -43042 19746 52190 -38840 -71490 44987 88963
665 88963 -45872 -101582 34888 98443 -24303 -88056 14020 66580 -16877 -44323 25541
676 25541 20928 -42001 -10041 56504 7532 -69098 -14220 69707 21047 -59068 -27470 37682
688 37682 25728 -14823 -14281 -4778 -4236 18539 23986 -21368 -37549 16204 44314 -5203 -38788
701 -38788 -573 24602 2417 -1771 6513 -15187 -19931 28384 40358 -28980 -53583 25944 61330
714F1330p6244l9821O3457L5726n0183k0421M1015m404l7222K9252M1013m6787
726c289n3841N5711O7559n5112p4418M5412O9054k9374n6880J8369L7500j7030
738C661j4596K2440n079l1332J3149M1948j0364n0648J888M9960Q751l6728k0328
751b7278J6866K6209L892k1606k2649Q636L6093M480l9076j2753L1335J6068k0525
764c08j1860J3393j276j1264J9039J4397l3648k3481M0620L7697m1038m8940L5175
777a1494N2671k4134m8171J2524L9126o874k5816Q603J1912j4453l036K3053K206
790A6117l1421p099L5598J5368l2052k3271K1026K8734p524k7930m440J9503J4237
803A6846q615j8052j018J4943O769p056q247n40L758M473O103n130j6210O14K2009
$$ plain form
714 61330 -14914 -54735 8722 44448 -5735 -26156 14859 10455 -26767 2485 43498 -3289
726 -3289 -57130 -1419 66140 11028 -63390 -17978 51076 21702 -35178 -16809 20691 3661
738 3661 -10935 11505 6426 -24906 -11757 30191 19827 -30821 -28933 21027 29778 -6950 -27278
751 -27278 -10412 15797 19689 -1917 -24566 -15930 20163 24643 -14433 -27186 4149 20217 -308
764 -308 -12168 1225 -51 -11315 7724 22121 -11527 -35008 5612 43309 2271 -46669 -11494
777 -11494 41177 17043 -31128 -18604 20522 13648 -12168 -3565 8347 -6106 -9142 13911 16117
790 16117 -15304 -22403 13195 28563 -3489 -26760 -5734 23000 15476 -12454 -16894 2609 16846
803 16846 8231 -9821 -10839 4104 10873 3817 -4430 -4970 -1212 3261 9364 4234 -11976 -11362 10647
818A0647Q884k3476j9272K0807K4281j2951k5133L538K1338L191j4350m391N127
831a760J278K268L140l889j0190J227J6242L238j7965p963J3049J3839o944j6487
845a0917J272J2874M703n720r060l22Q020M672k134p969l886Q694O936l233q677
860d747l946R198P646n234q435j370Q182P177o466p868J029O242N937n363p307
875e325J455N513M618l265q211J134O732L196k971p895J397P115J653l399n266
890c519K32O429J477l163l655r11N282K792l568m068r02O248L174n895m073K486
906a634M119J683m953k200K528J393J910k216l842J117L138K010k221n121J855
921b434N096j31l797k186K445L136j703j676m05K63K088J83j404j562k18L124
$$ plain form
818 10647 19531 -3945 -23217 -2410 21871 8920 -16213 -12675 8663 11854 -2496 -6887 -1760
831 -1760 -482 1786 4926 1037 -9153 -7926 8316 11554 -6411 -14374 -1325 12514 5570 -10917
845 -10917 -9645 3229 7932 2212 -6848 -7170 850 5522 3388 -4581 -8467 227 7163 3930 -4747
860 -4747 -8693 505 8151 2917 -5518 -6888 1294 8471 2005 -5863 -4834 1408 7345 1982 -5325
875 -5325 -3870 1643 6261 2996 -5215 -4081 2651 5847 2876 -5019 -3622 3493 5146 1747 -3519
890 -3519 -3287 3142 4619 1456 -2199 -3110 2172 4964 1396 -2672 -3574 2674 5848 -47 -4120 -1634
906 -1634 2485 4168 -785 -2985 -457 936 2846 630 -3212 -2095 1043 3053 832 -4289 -2434
921 -2434 2662 2531 -1266 -3452 -1007 2129 426 -1250 -1655 -1392 696 879 -525 -2087 -2305 819
937H19J119l065j743J596K981p17l344M74K030r3nq97lM29l59K063q01k508R67
956a057J953O99k813j293L263J705k637j388J580K147j375k492K250J264k163
971c57m75J477J671j906k842L833K183l957k249L254L715l142n203M116M700l688
987A130m552K668N731l010o045L542N577l471n533K278O860k603q076L433P927
1002E856l358p691J766Q952j618r875K150R000j215q996k08R563N31j0236j50
1017e529R462J029r115k874J0216K828r852l476R193M161q073n635Q726N625q914
1032b228n111Q065N714p971o564R009O605r045o588P975Q575p752j0149P771J0533
1047H839o941r898N041J0427l988j0687M628R586m719q231M155Q736m175j0554
$$ plain form
937 819 1938 -1127 -2870 -1274 1707 990 -2354 -1880 150 57 52 -845 -848 -419 -778 1285 484 -2024 -1057
956 -1057 896 1595 -1218 -2511 752 2457 -180 -1568 12 2159 784 -1708 542 1806 -357
971 -357 -832 645 2316 410 -2432 1401 3584 -373 -2622 632 4347 1205 -3998 118 4818 1130
987 1130 -3422 -754 4977 1967 -4078 -536 5041 1570 -3963 -1685 5175 2572 -5504 -2071 5856
1002 5856 2498 -5193 -3427 5525 3907 -5968 -3818 5182 3967 -5029 -5237 4326 4857 -5379 -5529
1017 -5529 3933 4962 -4153 -7027 3189 6017 -3835 -7311 1882 6043 -2030 -7665 1061 6686 -2228
1032 -2228 -7339 726 6440 -1531 -8095 914 7519 -1526 -8114 -139 8436 684 -9465 -1694 8839
1047 8839 1898 -8000 -2959 7468 3480 -7207 -2579 7007 2288 -5943 -1788 6948 2773 -7781
1061g781O550J0129o343j0369M793J1648l568j2835L861J1236l279q254J398P892
1075E078k174q103N244O818o964n938O253Q057n856j0940N613J1838m403j0859
1089f336K94J0236L354j0115l454P069K320l580k403L556J862p622J084J0412
1103F677j977j3043o94J7086N151k1914q007K2655J0463k0068j4027J8047J5490
1116A5839j8200j2025J7714P590j7402n936K1367N180k7057m427L0758N685l0679
1129a1593j0810K9705J5906k7381j7162K1822J5709j3778j3967R149J0610q719
1141e09n380R422K882j0105n290J1426J1784j2127j8623R071K5125j481l1339
1154a5144p367L4827J5527l3997k1537K9232K5403k5429k3513K3650J7625k4923
$$ plain form
1061 -7781 -1231 8898 2555 -7814 -3021 8627 5059 -7776 -3915 7321 4042 -4212 -2814 5078
1075 5078 2904 -5199 45 6863 -101 -6039 214 8271 2415 -8525 -2912 8926 4523 -6336
1089 -6336 -6042 4194 7548 -2567 -6021 1048 3368 -212 -2615 941 2803 -4819 -3735 6677
1103 6677 4700 -8343 -9037 8049 13200 -8714 -16721 5934 16397 -3671 -17698 349 15839
1116 15839 -2361 -14386 3328 10918 -6484 -12420 8947 14127 -12930 -17357 13401 19086 -11593
1129 -11593 -22403 7302 23208 -4173 -21335 487 16196 2418 -11549 -2400 8210 -509
1141 -509 -5889 3533 6415 -3690 -8980 2446 14230 2103 -16520 -7449 17676 16195 -15144
1154 -15144 -22511 12316 27843 -6154 -27691 1541 26944 1515 -21998 1652 19277 -5646
1166e646j1042K9234O879l6950n768M5145P293m9992j2304N0136J8895m6250k3569
1179c3939L8485K3298k8422j8800J8820J1923j4149l191J3315l386j5479M767
1191f758J8116l54j9671p506J7114J6105q464k4413l936K9450J5871k8031k6125
1204b8602K1957L2285j5585l1314J1186K3976j0440j4572J5178P221k5533l398
1216a7641L7999M019m7150r349N1060J7678m8869k4207M1299K5085k9721j9282
1228a9079J7567R373j0227L405R740j5798j3402K2457J9528k1442k5021J4602
1240h297K6364m726k0669n121Q631J1918N220j1936j7566N544K5788L183k6451
1253h118j0368J9286J2833q075q823k261j649Q100J6379q337l0110K972L7963
$$ plain form
1166 -5646 -16688 12546 19425 -17525 -23293 21852 29145 -20847 -33151 16985 35880 -10370 -33939
1179 -33939 4546 27844 -578 -19378 -558 11365 -2784 -5975 7340 3954 -11525 -6758
1191 -6758 11358 11004 -8667 -16173 941 17046 8582 -15831 -19767 9683 25554 -2477 -28602
1204 -28602 -6645 25640 10055 -21259 -10073 13903 3463 -11109 4069 11290 -14243 -17641
1216 -17641 20358 24377 -22773 -32122 18938 36616 -12253 -36460 4839 29924 203 -19079
1228 -19079 -1512 7861 -2366 1039 10779 -5019 -18421 4036 23564 2122 -22899 -8297
1240 -8297 18067 13341 -7328 -12449 -3818 8100 13320 1384 -16182 -10638 15150 18333 -8118
1253 -8118 -18486 800 13633 5558 -3265 -5526 -7175 925 17304 8967 -21143 -18171 19792
1266A9792O918l9446j6250L3887K0120k3217j6613J0798O779l137P211L215k2583
1279a2526r214L2920J8629l4480k8304K7648L5184j7750l3942O832K3913K202
1291A1112j0217m921k813o88J2826J1057j6579k0531J1887K4909J16k3808j2195
1304a9845J5914J9103j194j9632j5295J5199K5794n044k8487p368K4886J5661
1316A9692j6511j4781N044P005M086M881n565j7725j644K9217J2784l3686k3262
1329c0465K7469L2943j6514l5823M862L0083M066j6892q511K567N949O921M374
1342A1029j1302j6669R463K4079m13k4998j2026J9791K1602r845k2572m975J8341
1355A505J6934r630k1700j751J7830J2949j0470j6498M80J1687Q826j544j3558
$$ plain form
1266 19792 26710 -12736 -28986 4901 25021 1804 -14809 -4011 2768 -369 6842 10057 -12526
1279 -12526 -21740 11180 29809 -4671 -32975 -5327 29857 12107 -21835 -15003 8910 11112
1291 11112 895 -4026 -6839 -7527 5299 16356 -223 -20754 -8867 16042 16158 -7650 -19845
1304 -19845 -3931 15172 13978 -5654 -20949 -5750 20044 15000 -13487 -20855 4031 19692
1316 19692 3181 -11600 -6556 449 4535 9416 3851 -13874 -15518 13699 26483 -7203 -30465
1329 -30465 -2996 29947 13433 -22390 -17528 12555 16621 -271 -8782 -6215 -266 6655 11029
1342 11029 -273 -16942 -7479 16600 16187 -8811 -20837 -1046 20556 10711 -11861 -16836 1505
1355 1505 18439 8809 -12891 -14642 3188 16137 5667 -10831 -10351 1336 10162 8618 -4940
1368d940r428Q978J8818J593k3848j2898K1610K1138j1773k5547J99K3262Q292
1381A5456j3626j2830J106J2040Q509l946j3196p595J2002J7007m951k0934n455
1394a6413J8078J5130j0330j9081l7J6154J0293q227j5938j330J3948J0750o900
1407F097j5965j471J3963J0209p103j4937j934J3533J0390o444j5227k833J4378
1420B656J1025q360j5183q79J4799R119r198j2905l48J2395Q967p466j2867j640
1434i885J2532R771q071j3850L39J2879Q081q486j2674J502J1508O658p063j1474
1448h233j08J1509P258o503j2494k29J2561O554p659j1458J087J1774M907p396
1462A570r299J002R746N414o686q878k94J0113O095o874r521R13R844N182p117
$$ plain form
1368 -4940 -14368 -5390 13428 15021 -8827 -21725 -115 21023 9250 -16297 -16098 7164 15456
1381 15456 1830 -11000 -9894 2146 10655 6709 -6487 -14082 -2080 14927 9976 -10958 -16413
1394 -16413 1665 16795 6465 -12616 -12653 3501 13794 5567 -10371 -11701 2247 12997 6097
1407 6097 -9868 -11339 2624 12833 5730 -9207 -11141 2392 12782 6338 -8889 -11722 2656
1420 2656 13681 5321 -9862 -10741 4058 13177 3979 -8926 -9274 3121 12088 4622 -8245 -9885
1434 -9885 2647 12418 4347 -9503 -9164 3715 11796 3310 -9364 -7862 3646 10304 3241 -8233
1448 -8233 -8341 3168 10426 3923 -8571 -8800 3761 10315 2656 -8802 -7715 4059 8966 1570
1462 1570 -7729 -6727 3019 8433 1747 -7131 -7425 2688 8783 1909 -7612 -6699 3145 8327 1210
1477A210q853J653R173M305o605p739J712Q002L992n600q047J579Q088L722n370
1492A222p568J558P825L170n516o604J662P862K070n167n485J027P022K682n175
1507E85n227J057O852K511n525m841J818N865K100n112l967J611M686K056l751
1522G18m273J525L953K402l169n236J672N014J774m090m549K131N522k86m257
1537a149k271K767L671j432k349o35K60J600J726j430k367j714M162L564m150
1552B53m629K266M998L50n784j350M804J179k348j502J007J455j452J5J963j887
1568f62j497J367K765l69m351m72N327N37m077j861L021L535l254l017K889K371
1584B252j777k209R47L051k435k670L156K401k725k510K270M221l250m254L230
$$ plain form
1477 1210 -7643 -5990 3183 7488 883 -6856 -5144 2858 6850 1250 -6797 -5218 2870 6592 1222
1492 1222 -6346 -4788 3037 6207 691 -5913 -4251 3611 5681 514 -4971 -3944 3078 5760 585
1507 585 -4642 -3585 3267 5778 253 -4588 -2770 3095 5195 83 -3884 -2273 2413 4469 718
1522 718 -3555 -2030 1923 4325 1156 -4080 -2408 2606 4380 290 -4259 -2128 3394 3108 -1149
1537 -1149 -3420 -653 3018 1586 -763 -1398 -1138 462 2188 758 -1609 -3323 839 4403 253
1552 253 -4376 -2110 2888 3238 -2546 -3896 908 2087 -261 -1763 -756 699 -753 -738 1225 -662
1568 -662 -2159 -792 1973 1604 -2747 -3219 2108 2645 -1432 -3293 -272 3263 9 -3008 -119 2252
1584 2252 475 -1734 -787 2264 -171 -2841 315 2716 -9 -2519 -249 3972 722 -3532 -302
1599c02L828k258m126J445M609j359m577K149L421j495l435J288L613j618l918
1614b735K524K746j507k793J104L297j309l817K032K872j279l265J007L607j029
1629A455l532K71L576o3l524K34L140m8l459M47L519n01l620J95M226m35m866
1646b985N24M697j09n052m79O016J56n824m21N492J201o296j201O766J169o480
1662b826j374O323K123o721k681P253K530o839k751O486L379o436l890P299L553
1677E428o789m346P168M815p253n742P684N921o573o700N501P834n352p887N145
1692a146P620m484p806L579Q659l246r757L680R763k352j0243M78J1533N27j1839
1707e034j849J0995L741j0583n185J0514M890r761m675J0147L450j0109m012J1948
$$ plain form
1599 -302 3526 1268 -2858 -1413 3196 1837 -2740 -591 2830 1335 -2100 -812 2801 1183 -2735
1614 -2735 -211 2535 1028 -1765 -661 2636 1327 -2490 -458 2414 1135 -2130 -1123 2484 1455
1629 1455 -2077 -1806 1770 1707 -1817 -1583 1557 1509 -1950 -1503 2016 1515 -2105 -1910 2316 1881 -2985
1646 -2985 -2461 2236 2127 -2925 -3404 2612 2768 -3056 -3477 2015 3216 -3080 -4281 2485 3654 -2826
1662 -2826 -4200 2123 4246 -2475 -5156 2097 4627 -2212 -4963 1523 4902 -1534 -5424 1875 5428
1677 5428 -1361 -5707 1461 6276 -977 -6719 965 6886 313 -6387 -886 6948 1596 -6291 -1146
1692 -1146 6474 1990 -5816 -2237 6422 3176 -6581 -2901 6862 4510 -5733 -5255 6278 6805 -5034
1707 -5034 -6883 4112 7853 -2730 -7915 2599 7489 -2272 -6947 3200 6650 -3459 -7471 4477
1721D477M009j3003m900J3024P114j3496q718J2474J0190j0979j0301P989R907
1734G787n724q817M881O650m460m996M436M806m624o037N674O813m771q777K528
1749d631J0533N55j1537l240J0474O217q346q315O976Q067o005o124N553L926
1763D103o031k959Q495L153j2434k865J4150N093j4466q507J3954J0746j1875
1776E57j0018P559Q508m044n514K686J356l347K715N018n072o320L543R048j712
1791D963r661j136P969L473l444n451r61N270M285k104p119j364P161L952n113
1806G20m056P58L117K138R4l026n376K371J0420m46j2565l415J1994P234r996
1821c4q182O126O216k419j884K66l101j780Q110N617j1519r807J1612J3254q250
$$ plain form
1721 4477 8486 -4517 -9417 3607 10721 -2775 -11493 981 11171 192 -10109 -2120 7787
1734 7787 2063 -6754 -1873 4777 317 -4679 -243 4563 -61 -6098 -424 6389 1618 -7159 -4631
1749 -4631 5902 6457 -5080 -8320 2154 8371 25 -8290 -1314 6753 748 -5376 177 4103
1763 4103 -1928 -4887 3608 6761 -5673 -8538 5612 10705 -3761 -12268 1686 12432 557
1776 557 -9461 -1902 6606 2562 -2952 -266 1090 -2257 458 5476 404 -5916 -2373 6675 4963
1791 4963 -4698 -5834 2135 5608 2164 -3287 -4248 1022 5307 3203 -3916 -5280 1881 5833 720
1806 720 -3336 -2578 539 2677 2771 -255 -5631 -3260 7160 6714 -5851 -9266 2728 9962 -34
1821 -34 -8216 -2090 4126 1707 -177 89 -3012 -4792 3318 8935 -2584 -12391 -779 12475 4225
1836D225j5435L941J4701l19j0081k667M847J909J051R15m224n694M414J0070
1850G653j964j1348k796R959P362o300r053k7Q570O124n195j0246N69J0855M309
1865H472q231p394M359O611kk462k347k773J036Q321K571j1574q605J2292J3321
1880A3595q528j6745L545J6832Q68j2655m482O965M648j207j245k984m187L770
1894a810R723j539j2556l446J1687Q995q886j1353K828J1135L665p978q294K931
1908d898R121L359p199p617K399Q956J750n205n729P0O201M872k635q730l042
1923h327J0168Q270p452j2125K051J3416K892j0952o105N529O926O13m830m259
1937d185p80N654O548l750j0228l73J0578O150q294j0133L841J0242J730p111
$$ plain form
1836 4225 -11210 -7269 7432 7113 -2968 -5635 -788 1121 2172 3087 -1137 -6831 -2417 7653
1850 7653 5689 -5659 -8455 1504 8866 2566 -6487 -6514 2056 8180 2985 -7261 -6692 4163 8472
1865 8472 241 -7153 -2794 3817 3815 1353 -994 -3767 -2731 5590 8161 -3413 -12018 274 13595
1880 13595 5067 -11678 -8133 8699 9567 -3088 -7570 -605 4043 2836 1591 -1393 -5580 -1810
1894 -1810 7913 6374 -6182 -9628 2059 11054 2168 -9185 -6357 4778 8443 465 -7829 -4898
1908 -4898 4223 7582 383 -7234 -4835 4121 5871 666 -5063 -4993 1208 6080 3445 -5285 -8327
1923 -8327 1841 10111 2659 -9466 -7415 6001 8893 -2059 -8164 -2635 4291 4904 74 -4185
1937 -4185 -4965 689 7237 3487 -6741 -7114 3464 9614 1320 -8813 -4972 5270 7000 -111
1951a11o833K886Q071K522n586p677J821R096L360p248o969K307Q636K717o776
1966B16o298J891Q014L649o948p300K656Q771K746p472o449L413P263J925o043
1981C4n729K078O982K776n495p051K414Q275K452p287o320L624P933N72n898m997
1997e637K658O552J768n201n892J742P882K179p065n351L144P648P17o778m039
2012e673L333N899J283n981m323K980N798J442n682m822L306O049R99n766m449
2027e607L385N971N49n271m143K967O134p6m952l349K625N508K87n029l021K090
2043a932N366N51m877l328K378N365M20n017l228L074M715J97m917k721L212L986
2059C244k60m018k715K919L963J73m157k834K614M290m32m066k060K573L799l89
$$ plain form
1951 -111 -6944 -4058 4013 6535 949 -6728 -4907 4189 7549 301 -6668 -4361 4275 6992 216
1966 216 -6082 -4191 3823 7472 524 -6776 -4120 4651 7397 -75 -6524 -3111 4152 6077 34
1981 34 -5695 -3617 3365 6141 646 -6405 -3991 4284 6736 -551 -6871 -3247 4686 5258 -640 -5637
1997 -5637 -2979 3573 5341 140 -5752 -4010 3872 6051 -1014 -6365 -3221 4427 5144 -1634 -5673
2012 -5673 -2340 3559 4842 -1139 -5462 -2482 3316 4758 -924 -5746 -2440 3609 4608 -1158 -5607
2027 -5607 -2222 3749 4298 -973 -5116 -2149 3985 3909 -1043 -4392 -1767 3741 4028 -1001 -4022 -1932
2043 -1932 3434 3985 -892 -4220 -1842 3523 3943 -1074 -4302 -1228 3487 3684 -1233 -3954 -742 3244
2059 3244 2984 -1034 -3749 -830 3133 3306 -851 -3685 -1071 3219 2787 -1279 -3339 -766 3033 2644
2075B644l690k106K409L422k35l586j771K161L402m04l599j816K481L157p95l191
2091a517j181K221K244o3k593j390J498K349O25k862k130K046K841k57l355j358
2107b882L125J862j455j872n58J786J111o70j291m86L00K389r4j686j635J380
2123f76K755p79k290o27J588J758n51k421QJ724R97q06j873M58J420k18j38o9
2141B60o89K99M29Q90o84k317J449K220p68k281m28K931L29k277j02J083Q4m33
2159eKM03l09j009J199R82j465j037Q05J506k73k024O22J367j39q52k51N29K51
2178C02l78j06J88k92J48j42L30k16o01K22Q01J26q90k07P19P81j355o75J573
2197C28M39j387n10J352J175k072o17J695P27j522j225J725J487k350q15K320
$$ plain form
2075 2644 -1046 -3152 -743 2679 2444 -1142 -2913 -752 2650 2246 -1353 -3169 -688 2469 1674 -1517
2091 -1517 -2698 -477 1767 1704 -889 -2279 -781 1568 2193 -669 -2799 -753 2088 1831 -1524 -2882
2107 -2882 243 2105 650 -1222 -1780 6 1117 447 -844 -1330 -1030 1359 1265 -421 -2056 -676
2123 -676 2079 1300 -990 -1617 -29 1729 1178 -1243 -1235 489 1486 680 -1193 -735 685 467 329 260
2141 260 -429 -130 299 1189 505 -1812 -363 1857 1089 -1192 -1620 1311 1640 -637 -739 344 428 -5
2159 -5 -3 400 91 -918 281 1263 -202 -1239 -434 1072 799 -1225 -603 764 625 -227 -478 51 302
2178 302 -76 -182 6 -286 -138 -280 50 -166 -767 -545 256 382 -508 -715 4 785 -570 -1245 328
2197 328 767 -620 -1130 222 1397 -675 -1292 403 1130 -392 -1617 108 1595 -755 -1570 750
2213G50O47j605j510J955J429k311j008K234R69j962j140K032J668k194j572J799
2229A81J624j497k070J660K292j578k284J306K623j081l123J076L066n61l354
2244a720L41L267L88l762l84L682J22l226m73L180O11l402p09L633Q73l742j130
2261b451L527J738l848j746L799J722l461k290L348K692l223k728K853K862k635
2276A59l039K376L319k325l697K196L429j382l658R49L967j089l657J102L074
2291A724j20l612M17L191k74l323M20L325jl370l48L755J99l223j030K928J925
2308B583l070j604K382J975k108k035J851J895j593k087K008J969j884k116J594
2323b40K591j724l016J976K810j376k824P09K910q55j967O41J459m90j383Q77
$$ plain form
2213 750 1397 -208 -1718 237 1666 -645 -1653 581 1550 -412 -1552 480 2148 -46 -1618 181
2229 181 1805 308 -1762 -102 2190 612 -1672 -366 2257 1176 -1947 -871 2195 1634 -1720
2244 -1720 -1379 1888 2276 -1486 -1870 1812 1934 -1292 -1765 1415 2026 -1376 -2085 1548 2421 -1321 -2451
2261 -2451 1076 2814 -1034 -2780 1019 2741 -720 -3010 338 3030 -193 -2921 -68 2794 159
2276 159 -2880 -504 2815 490 -3207 -1011 2418 1036 -2622 -1673 2294 1205 -2452 -1350 1724
2291 1724 1604 -2008 -1591 1600 1326 -1997 -1577 1748 1747 -1623 -1971 1784 1983 -1240 -2270 658 2583
2308 2583 -487 -2091 291 2266 158 -1877 -26 1869 276 -1811 197 2166 282 -1834 -240
2323 -240 2351 627 -2389 -413 2397 1021 -1803 -1094 1816 961 -1006 -365 1094 604 -779 98
2339I8J103j682q97K027Q95j702j265R85K350q47k250N80J095L02m51j239M12
2356d86P06K64q3j113j69P97P62p8r72p29Q52J289k87j692o53K126J045j780j178
2375a379O92J365n28q21J125m31j287J469J317j231k430J210L262n37m408N88
2391b024L222P18k763j093K103R43j559M87N45j375l01J628J584k454k205K315
2407b29K994j381l297l54L332J511k416k092J064K146N80k016j443J335J097k7
2423H04n76m13m9n70J423J459k560k247K323L655j647m401L00M831M37l875j476
2440b582K867J310j555m25M59o41l40J812Q26k510k249K878L213k338l311N57
2456b029L760J061l297k066J206K643L70j904j712Q50J978P85j705j565M97J464
$$ plain form
2339 98 1201 -481 -1378 649 1544 -158 -1423 -438 1912 1065 -1185 -605 490 792 341 -898 -486
2356 -486 220 484 401 -712 -881 -84 678 600 -372 -1101 -249 1040 753 -939 -1592 534 1579 -201 -1379
2375 -1379 -687 678 150 -671 454 23 -1264 205 1522 291 -2139 -929 2333 1796 -2612 -2024
2391 -2024 1198 1916 -847 -1940 163 1106 -453 34 579 -796 -1097 531 2115 -339 -2544 -229
2407 -229 2765 1384 -1913 -2267 1065 2576 160 -1932 -868 1278 1858 -158 -1601 -266 831 804
2423 804 228 -185 -234 -804 619 2078 -482 -2729 -406 3249 1602 -2799 -2499 2332 2769 -1106 -2582
2440 -2582 285 1595 40 -385 74 -567 -907 905 1731 -779 -3028 -150 3063 725 -2586 -2029
2456 -2029 1731 2792 -505 -2571 -1365 1278 1648 -256 -1968 -1118 860 1645 -60 -1625 -1128 336
2472C36J132j117j668o26K456K096j482l927M10M635M60l402k124K359K608r55
2488A191j892l92K49J326J080q53k361l73L056K103l109k960J841L316L1k951
2504f98j443J357K210N56j446k395P58K332J257k673k616J782K986L74k837j818
2520b314J473K532L90k206k351J127L424L69l055k100J561L299l42k620j267J255
2536h25K622J01k689j648J435K812P44l620k090K714K460m84k936j287K134K023
2552A466J99j989k317J648L183J54l003k445K196L325p10l327r12K282K451q99
2568A302k497j069J449K845o8k901j745K183K616J02l713j159K305K678k29l518
2584a419j423K739K422n47k865j282K560K205p63k775r48K149K294j049k275j260
$$ plain form
2472 336 1468 351 -1317 -1943 513 2609 1127 -2800 -2390 2245 2705 -697 -2821 -462 2146 1191
2488 1191 -701 -1093 -844 482 1562 709 -1652 -2025 1031 3134 25 -2935 -1094 2222 2253 -698
2504 -698 -2141 -784 1426 1982 536 -1859 -1101 1231 2488 -185 -2801 -1019 1967 2341 -496 -2314
2520 -2314 -841 1691 2081 -125 -2476 -1349 2075 2444 -611 -2711 -1150 2149 1807 -813 -2080 -825
2536 -825 1797 1898 -791 -2439 -1004 1808 2552 -1068 -3158 -444 2016 1532 -1404 -2691 -557 1466
2552 1466 1665 -324 -2641 -993 2190 2344 -659 -3104 -908 2417 1707 -1620 -2532 -250 2201 1302
2568 1302 -1195 -2264 -815 2030 1962 -939 -2684 -501 2115 2217 -1496 -2655 -350 2328 2099 -1419
2584 -1419 -2842 -103 2319 1772 -1093 -2375 185 2390 1627 -1148 -2096 53 2347 1298 -977 -2237
2600b237K012L091j196k983r07K413K609j372l111l19K260J898r65k760l26K196
2616C03J637m26k881r27K572J995o24l408o38K789J869j318k639m82K489J925
2632B236j350k316o83K034K157r45k768m64K064K130j186k763O0K021J851j436
2648F42k519J95K062J424r95k549QK159J502j135k453j65K363J601j441k327k12
2665a840K547J259j383k292J16K158J434j562k001M8K449Q78j408j872K05J886
2681F22J378j370k145r8K272J691j835k279L59K813L55j567j585O81J264Q23n82
2698G97k099kJ865J211q79k696L66K670N97j752k004J066K111K6j471r52M13J197
2716D64Q42j127j498K37J852Q64j934j200N30J576K19r67j343L95J258J250j290
$$ plain form
2600 -2237 -225 2866 1670 -1313 -2220 193 2802 1430 -1681 -2000 260 2158 1193 -1567 -1893 303
2616 303 1940 1514 -1367 -2294 278 2273 1649 -1759 -2397 392 2261 943 -1696 -2178 311 2236
2632 2236 886 -1430 -2113 -79 2078 1133 -1635 -2099 -35 2095 909 -1854 -1794 227 2078 642
2648 642 -1877 -1682 380 1804 809 -1740 -1732 427 1929 794 -1659 -1824 539 2140 699 -1628 -1840
2665 -1840 707 1966 583 -1709 -1593 565 1999 437 -1564 -1516 933 1811 403 -1469 -1264 622
2681 622 2000 630 -1515 -1613 659 2350 515 -1764 -1405 1408 1763 196 -1389 -708 556 1379 797
2698 797 -1302 -1304 561 1772 893 -1803 -1437 1233 1830 78 -1926 -860 1251 1277 -194 -1146 -733 464
2716 464 1306 179 -1319 -1082 770 1634 -300 -1500 -970 606 825 -142 -1485 -1090 168 1418 128
2733A28j865Q94J666K75j419j036R31J241l29q29n47k3J698L58r48j668M65K137
2751A129J59j816p62J357N20j05q19p5k10P38Q26l18j310l72J749R74j997r44
2769a276J260J261p46j266J90J049k67N7k19m42J29O19J56m09m78n4J100m6n76
2788D2p96L67J104J19r37o70P15J018p25p51K47P54J7q04O1N76o19m25J152K1
2808D66j132m16J627P19j389j373J645J502j728j115N70J310k52j409M01J047
2824D73m55o65N82O84m17j110P09Q47p81q09N08R81J27j399K30R03J78j091l03
2843h08J092K64r22k27Q65J83m97o41O12Q26p29p23Q38N23m39q48N95J135q95
2862B04p56L28J055m00p54OJ173k75r96O8J197Q2j259k41J175l21m23J08M50K6
$$ plain form
2733 128 -1737 -843 823 1098 -321 -1357 -426 815 486 -343 -890 -913 785 1143 195 -1473 -1008 1129
2751 1129 1288 -528 -1290 67 587 482 -337 -412 -622 116 942 624 -686 -1058 691 1665 -332 -1276
2769 -1276 -16 1245 499 -767 -577 472 205 262 43 -399 -270 349 505 96 -382 -436 664 618 42
2788 42 -754 -387 717 836 -101 -771 -56 962 237 -514 -267 487 504 -300 -239 337 -282 -707 445 466
2808 466 -666 -1082 545 1264 -125 -1498 147 1649 -79 -1194 -624 686 434 -975 -574 473
2824 473 18 -647 -65 619 202 -908 -199 648 -133 -942 -434 547 674 -725 -495 408 586 -505 -808
2843 -808 284 548 -374 -601 264 447 -50 -691 -79 747 18 -705 133 656 217 -631 -36 1099 204
2862 204 -552 -224 831 431 -323 -317 856 581 -415 -347 850 932 -327 -568 607 286 -137 -29 421 447
2882D47j053M95Q46n37j134P49P66k00r34J45O45J99n75l69L95J22K38n03p1l8
2902c67N07L86m63p51N75K82Rm91J21M07p6m48k6K74J10j78K16J42l34KJ15j8
2924fo5j76K11L6l2K0k19p5M90N5o40K8O09M42j060j11R19L86j295p4J057O8j268
2947g00K95J291n46j177O24J154m43j293M59J150m63r94J69J310k5j145J51N50
2965C67O6l11k59K59O6k00M21o3n19L79n6k2M4n37J09L43O27l23j118J73J239
2986F85O8j306o99J975L49j507n40J028O85j254L10P26n61q27O33J300j123j384
3004a442Q56J602j87j797J0J288L74r51m47J47K08M68M04o99q18O31J031J4j112
3023d20m13R53O35m6r70m16M33J286J4j917m15J397J442p92k032N83J281M29p84
$$ plain form
2882 447 -606 -111 735 198 -936 -187 579 379 -555 -410 235 434 -141 -510 -115 7 245 -258 -329 -367
2902 -367 140 526 63 -688 -113 169 178 -313 -192 215 139 -309 -335 -61 49 -129 87 229 -105 -103 12 -6
2924 -6 -71 -247 -36 0 -32 -12 -231 -306 184 239 -401 -373 236 678 -382 -493 426 812 -483 -557 500 568 -700
2947 -700 -405 886 340 -837 -213 941 498 -795 -336 814 351 -643 -474 836 811 -334 -183 367
2965 367 433 122 -137 122 188 -12 409 346 -173 206 150 128 172 -365 -256 87 714 391 -727 -554 685
2986 685 753 -553 -1252 723 1072 -435 -975 53 738 -516 -206 520 -41 -868 -235 1065 -58 -1442
3004 -1442 -586 1016 829 -968 -958 330 704 -247 -694 -547 -339 129 533 -166 -984 -353 678 692 -420
3023 -420 -833 120 755 709 -261 -677 -244 1042 1056 -861 -1276 121 1563 771 -1261 -678 603 1032 248
3042B48o71j42L50Q49N77j637j167J591K135j500k039J81J963O26j400l55j66
3059e57Q73O60j79j421o77J073J994j142j807j60J848J241j033j906J07J416J007
3076A337j61k085q91K074J697j254k229%K136O89j094j401k83J478J339o73k226
3093a547j07K032J665j639k265N91K008Q94j533j482K34J449J234j106k050k80
3109a902K247J966j832k649P97K462Q39j810j972P45J938Q97j091k062k57K481
3125G97J246j454k299J35K324J392j827k197L45K277J696j941k439M76K737J334
3141B602k299k228M94K817R15k202j590K10J823J857j768k479r6K892J851k468
3157C31k949Q77L511N52k354j900P65K253P31j755k156O80K428J123j939k657
$$ plain form
3042 248 -423 -565 -215 634 1211 -426 -1593 -2 2133 633 -1406 -1225 738 1364 -36 -391 -557
3059 -557 316 976 797 -624 -1301 -228 1766 624 -1183 -1343 505 1746 713 -1193 -1086 330 1337
3076 1337 1176 -909 -1800 274 1971 717 -1512 -1512 624 1313 219 -1182 -1465 13 1352 679 -1547
3093 -1547 -1654 378 2043 404 -1861 -1270 738 1632 99 -1383 -1149 300 1534 428 -1622 -1902
3109 -1902 345 2311 479 -2170 -1373 1089 1928 118 -1854 -1109 829 1726 635 -1427 -1684 797
3125 797 2043 589 -1710 -1575 749 2141 314 -1883 -1538 739 2435 494 -1945 -1469 1268 2602
3141 2602 303 -1925 -1431 1386 2301 99 -1491 -1281 542 2399 631 -1848 -1944 948 2799 331
3157 331 -2618 -1741 1770 2322 -32 -1932 -1167 1086 1817 62 -2094 -1414 1014 2137 198 -2459
3173b459R71K918Q70k385k076O88K783R61k403k014N82K576J409k612k334R26
3189a599K760J227k562k101J070K394P90j918k443Q87L084Q99k604k358J054L293
3205A873Kj856k144J215K487K27j990j762P71K634R58k638j955J061K676O49k410
3222b02k121J303K614N46k474j709J433J930P62k249j948J229K281P49k194k385
3238b435J345L152p1k392j766J025K755K45k070j719J153K444J89k429j384J140
3254h18K561L45k782j055N76K548M54k431j322J059K070P81k415j674J438K393
3270A728j00k238j302J138K121j0j651j504R97K079K04j783j481J117K495n14
3286A296k075j118J534J950l56j856p80Q09J704L58j822j242J081J893n8j738
$$ plain form
3173 -2459 -1488 1430 2300 -85 -2161 -1473 1310 2271 -132 -2146 -1564 1012 2421 -191 -2525 -1599
3189 -1599 1161 2388 -174 -2275 -1205 1189 1979 61 -2382 -1495 1589 2488 -116 -2474 -1420 1873
3205 1873 1875 19 -2125 -910 1577 1804 -186 -1948 -1177 1457 2415 -223 -2178 -1117 1559 2208 -202
3222 -202 -2323 -1020 1594 2140 -334 -2043 -610 1320 2082 -167 -2115 -886 1395 2144 -50 -2435
3238 -2435 -1090 2062 1991 -401 -2167 -1142 1613 1858 -212 -1931 -778 1666 1855 -574 -1958 -818
3254 -818 1743 2088 -694 -1749 -1173 1375 1829 -602 -1924 -865 1205 1986 -429 -2103 -665 1728
3270 1728 1628 -610 -1912 -774 1347 1337 -314 -1818 -821 1258 1462 -321 -1802 -685 1810 1296
3286 1296 -779 -1897 -363 1587 1231 -625 -1405 -596 1108 1466 -356 -1598 -517 1376 1318 -420
3302d20j277J414J528j2j558r66J019J332Q5j332j193J044J790j94j718j048J492
3319a4J386q86j155m44Q60J342j25j373p87P88J486J31j822m74P81J655p07j112
3337d70n34Q34J038J07j383n87Q85R14p0j176o70J204P78l72q78l74N86N58K98
3356F88n08r87L75J270m2j170q34J046R83l11j164r3R09N59l43n17l40K90O08
3375D19M1o81m64L35Q05J6q38k34L70M72K91r73k56P59M06j87p62k98R52K62j28
3396C07m33k85N08K24k94N8n3j29N36L0k41m91K10N53Jo58p1K07K09M39r14K10
3418g7J98R4R9m56p0J91KL09q7m20N20k29j79J91k49O0J93j06oj81M8K00K0k34
3442a69K2j34N13l23k98M02K33n13j6J72L92k98o35O70K14l12j42L1L03l7m03
$$ plain form
3302 -420 -1697 -283 1245 1233 -325 -1291 -272 1060 1145 -187 -1380 -336 1454 1260 -458 -1506 -14
3319 -14 1372 486 -669 -1113 -253 1089 964 -409 -1196 -408 1078 1209 -613 -1087 -306 1349 642 -470
3337 -470 -1004 -170 868 975 -408 -995 -110 804 734 -442 -1112 92 870 498 -380 -754 -168 390 688
3356 688 180 -807 -432 838 796 -374 -1208 -162 821 510 -654 -747 162 721 378 -139 -479 -189 419
3375 419 460 -221 -685 -350 455 471 -367 -601 -231 241 532 -441 -697 62 468 281 -481 -779 173 435 307
3396 307 -126 -411 97 321 27 85 32 -97 439 469 228 -263 -53 500 501 -157 -228 -21 188 627 -287 -77
3418 -77 121 215 314 -142 -212 -21 -19 290 203 -217 303 74 -105 86 -163 -103 90 -16 -22 -203 -155 45 65 -169
3442 -169 -147 -281 232 -91 -389 13 246 -267 -283 -111 281 -17 -652 18 232 -80 -222 -191 112 75 -328
3463c28J00J25%Q0j91M71m99K21L86j76j46l62J51L05L1l90J40J33J14j16n19
3484d70M33M1M06q24L7P94l67l39N06K62l17n24J60J052o47p18M57N74l10m50
3504b44R3P38l59o40O21J56n4m36J53M86p70k56R07J92n62l39M75J40k19k76M00
3525B06k12j01K31j02M9P2j68J12k45p1O59o38j86N92K28p17M3M32J54q19m1Q09
3547B87J22q06m5Q13j76p87K10R50o18m88K35R25l88j111N89Q72o38n71K40R55
3567E70k88n46M64j19l98J91L47q6k67q8O01m01l01M96J02m04K12J44k98j95K76
3588A2N45n56l06L42L44m23r7L06l0n51P85K65m66p95O01N88j68r63K32J090m98
3609B57m69k07O64k49R0M55l21m38J89L81Q6p96k24Q86L28n50l23J34R6M5O9m7
$$ plain form
3463 -328 -228 -103 -103 -23 -214 257 -242 -21 365 189 43 -319 -168 137 168 -222 -82 51 165 49 -470
3484 -470 -37 4 410 -414 -377 417 50 -289 217 479 162 -362 -202 850 203 -515 -58 516 206 -244
3504 -244 -151 587 228 -412 209 365 311 -125 28 514 -256 -512 395 587 25 -314 161 301 82 -194 206
3525 206 -6 -107 124 22 71 143 -25 87 -158 -229 430 -208 -394 198 426 -291 -248 184 338 -481 -522 287
3547 287 409 -397 -442 371 195 -592 -382 568 -50 -538 -303 622 234 -877 -288 584 -54 -625 -385 570
3567 570 282 -264 200 81 -317 -126 221 135 -132 -220 381 -20 -321 175 277 -127 85 229 -69 -264 12
3588 12 557 1 -305 37 381 -42 -139 167 137 -414 371 636 170 -625 -24 564 396 -567 -335 755 257
3609 257 -212 -419 245 -4 86 541 220 -218 -29 352 438 -358 -582 304 632 82 -241 -107 -11 34 103 56
3631E6n25L95O30j56r41J28M75L64k34n42j15J70K93N60q23m92M10J245m78j153
3651g33k43J216J96p82K84k34L44K16K23l90p83L98J143k89j170k88J007N26o52
3670a1k22k6L57K51j06m17k58Q3Q69K43j038k74R06M06l72p23l75Q38O53l16q31
3691c63o30R31R45l54j061k37J074M52n43o45J15J59O04J36r93l82O06J102l65
3710E51j117k81R14P02o10r35m7R10M88j72r53m28Q10R02q9j386j96J305K04j86
3730C86r87m19R21R22l69j068m32J237Q21p39j022P2J036Q04j025m12l96N86J183
3749A099m73j395j17Q20J050n96j280R6O79P52n90p00L19N36L39j03j344K71Q87
3768B50N09j80j048m63J233N29n10o22n16J100P39r01p44q8R77Q33j042o07j22
$$ plain form
3631 56 -469 -74 556 400 -541 -413 62 426 192 -350 -465 -295 -2 558 -265 -757 -347 898 420 -733
3651 -733 -976 240 436 -346 -62 -296 48 264 487 97 -686 -288 855 566 -604 -892 115 641 -11
3670 -11 -233 -259 98 349 243 -174 -432 -349 520 763 -275 -549 357 763 391 -332 -707 131 784 468 -363
3691 -363 -993 -62 883 529 -532 -769 305 757 214 -431 -316 -157 447 583 -410 -792 -186 916 551
3710 551 -566 -847 67 769 159 -776 -823 87 575 403 -550 -978 -168 734 645 -741 -937 368 572 386
3730 386 -601 -1020 -99 823 454 -614 -1046 191 1012 273 -749 -677 359 1163 138 -274 -670 -84 1099
3749 1099 626 -769 -886 -66 984 388 -892 -796 -117 635 45 -655 -336 200 539 436 -908 -637 250
3768 250 759 579 -469 -932 301 830 320 -302 -818 282 1021 120 -624 -712 265 1098 56 -551 -673
3787f73J059O43p54j006l2R68O37m82j202K77P57N72n52j104K06J055M25o21j161
3806i88L73J093K14o86q02N3P61P82p83q68j71J415N48q46q70L32P34M57q85o15
3826g52M78N90M98p49q52K43O27J096r09j360J38J328P35j243p18O89N61J54l34
3845B20r88L33P14M42n41r27J75J073J91p97o23O4P14P06q18n95M27O87N54j108
3865i7q58Q92O43J48j152j31O30K53J1l87l08K4M99O12k92j433M53J383k40r55
3885c05m10N69R74l67n89j75N0P83j00p25j90J56N25J64p01k39M27M11K47p97
3905b92m78J63J204j63o55o27O90P43m80m77l08Q87o9j14l1n24K44L84N52n46
3925A03r16M91J035l82p21k03O62K55l83l84M52K45j78k2j83k77J98N89l4k53
$$ plain form
3787 -673 386 1029 275 -731 -763 205 842 360 -842 -565 192 764 212 -892 -686 369 794 173 -988
3806 -988 -615 478 692 6 -796 -743 18 800 17 -851 -1022 393 941 95 -775 -443 291 748 -137 -752
3826 -752 -274 316 814 65 -787 -544 83 1179 270 -1090 -952 376 1111 -132 -850 -161 400 554 220
3845 220 -768 -435 279 721 180 -747 -572 501 692 -105 -728 -664 50 756 -62 -657 -230 457 1011 -97
3865 -97 -955 -63 580 728 -424 -555 75 328 339 -48 -356 -332 167 779 487 -946 -493 890 650 -305
3885 -305 -715 -146 828 461 -128 -303 -253 530 430 -295 -485 -329 196 360 -341 -580 -153 258 505 -292
3905 -292 -770 -607 597 434 -221 -848 -158 585 105 -372 -680 207 138 24 -7 -531 -287 97 649 103
3925 103 -813 -322 713 331 -390 -593 69 324 -59 -443 9 254 76 54 -129 -406 -208 381 347 94
3945I4j79J68M22J17j107k27R23K83j67p74K74O30K93q27j89Q2M55o4k98M28k55
3966H2j16K28K07n17l56O93L03q2q55n9Q79Q1m61l77N77j1q5j62k77qK29M0K56
3989B09m8p16L23L81O3m06m05P43N83q28k71K9O04r4p16M74L10j92l67N17l9l05
4011a51j67M00K03n69j21M13M81n87j06K32N84m87l33J25L61K34n61r7K60r0Q4
4032A08j60J14p7P5l2K27P2j71l75N16K74m63k39J11M48m83k88J02L71j44j86
4053b00L62L59o95r0K84N35o05l34O02K50p60k60O84O25r04m39O05L47k98l32
4073b64N11o8l48J32o7P9jM8OQ1k09J77Rl3l3k03J11J28J29m40j16L82J91k14
4097a2l90L17M68n00j66J48K04n5n26N88K82k13o16O15K75n17l04O52k6m33J00
$$ plain form
3945 94 -85 83 505 622 -485 -712 211 494 327 -447 -173 457 750 -77 -266 -184 271 207 -91 337 82
3966 82 -34 194 401 -116 -472 221 524 442 -413 -472 407 488 27 -350 227 216 131 -31 -308 -316 -87 -47 209
3989 209 161 -555 -232 149 212 -194 -599 144 727 -101 -372 -343 261 167 -549 -75 235 43 -324 193 154 -151
4011 -151 -318 82 285 -284 -405 8 489 -98 -204 28 612 125 -208 -83 278 512 -49 -146 114 24 108
4032 108 -52 62 -15 60 28 255 327 156 -219 297 571 108 -131 -20 428 -55 -343 -241 130 -14 -200
4053 -200 162 521 -174 -264 20 555 -50 -384 218 468 -292 -552 132 757 -147 -586 19 366 68 -264
4073 -264 247 179 -169 -37 -104 -25 -26 22 28 109 -100 77 86 53 20 -183 -72 56 185 -255 -371 11 202 -12
4097 -12 -402 -85 383 -117 -283 -135 69 14 -512 76 358 145 -471 144 419 -98 -402 250 224 -209 -109
4118a09J49M95n52k51M13J33m55K29k2R4l0J9J19l99q6M25Rr3j90K86k89J57j86
4141a34k3J59qJ71l55j13K80Q6On59L77O14k03o84K49M51m51j26J90J15O7j87
4163g8J66J78m89k03M78O44p66j48J80J47l19j72K69J10j78K46j16K5m16L96K37
4184A91n11J65K94j6kj80J88j64m4j9J81p4j92L91m1l69N0L45j7j68j6j55L02
4207A39p8j09J95m18r4N90J57o71m1O36K65o92k13M18K16l32J73l90L46k78K39
4228E8M51p19j11M22J53p4l96L6M51K53m16k39J19Q5L38k36n32K53J81K1j12l75
4250c89K82K23K45l88P4l64M42J63p4o18O3O27kl75m32O64M48k96l68l55L40M72
4272C82j63k12m02J6M02J63k73m17L69N84k49k22j25R4J55J32o23m2M73J43K06
$$ plain form
4118 -109 40 535 -17 -268 145 278 -177 52 30 124 94 113 232 -167 -253 172 181 88 -102 184 -105 52 -134
4141 -134 -157 2 -6 165 -190 -303 -23 63 69 -490 -113 501 298 -386 -137 314 -137 -263 -73 42 109 -78
4163 -78 88 266 -223 -426 52 696 -70 -218 -38 109 -210 -382 -113 -3 -181 65 -51 -26 -442 -46 191
4184 191 -320 -155 139 123 121 -59 129 -35 -79 -98 83 9 -183 208 167 -202 -152 193 176 8 -8 -163 139
4207 139 61 -48 147 -271 -365 225 382 -289 -330 306 571 -121 -334 84 300 -32 141 -249 97 -181 58
4228 58 509 -210 -321 101 254 180 -216 -180 271 524 108 -131 -12 73 411 175 -357 -104 77 98 -14 -389
4250 -389 -107 116 361 -27 47 -317 125 288 214 -404 -341 286 284 -91 -523 141 589 293 -75 -430 -90 382
4272 382 219 7 -395 -379 23 186 -87 -504 -135 449 200 -22 -147 -53 102 234 -389 -431 42 185 391
4293C91p26k07N10K32J41m15m07O57L41Q9r54j93N20O10K50j253j06M69O52j11
4313D90p85k92N89M17J27p53j25J89P42j21r50J39M64M59l3j022P1M40N97l93
4333B50n77l57P87M87k11n80l15N46M56j63q59j22Q25N73m87j185L11Q78L32k69
4353C20n91l13M64J022o53r77J71L75Q68l82p61k75Q14P67l98r66l43Q10J031
4372I83o22j121J79Q56L95q74k96M6N22L48O2q98m71R59J279j043j046r5J274
4391D37L99o52q70J6J073K76m16r01K13P50N84m09j041O4N96P47n20r58J37Q27
4411C52O12n71j426J51J372O13j004j056O74R44R3p71n50nN06O15l17q69n9J078
4431C82O82r02j071K20J255L50j195r73J011P01J62p59o31M82Q50J85q38o61J63
$$ plain form
4293 391 -335 -542 -32 200 341 -74 -481 176 517 606 -348 -541 -21 589 839 -414 -520 -51 601 490
4313 490 -295 -587 2 419 546 -207 -332 -143 599 478 -472 -333 131 590 557 -465 -394 46 643 250
4333 250 -327 -684 103 590 379 -201 -516 30 486 323 -536 -658 167 740 253 -932 -621 257 589 320
4353 320 -271 -584 -120 902 249 -728 -557 -182 686 304 -457 -732 82 849 451 -515 -858 -48 983
4372 983 361 -760 -581 275 670 -204 -500 -454 68 416 478 -420 -891 68 1347 304 -742 -837 437
4391 437 836 184 -686 -670 403 679 263 -638 -425 325 909 500 -541 -477 119 866 346 -612 -475 352
4411 352 964 393 -1033 -882 490 1103 99 -957 -283 661 754 -17 -567 -572 -66 549 232 -637 -696 382
4431 382 1064 162 -909 -689 566 916 -279 -1252 -241 460 622 -137 -768 -286 564 749 -89 -750 -587
4450e87J192J86p99p24N0J025L66o79r45J90J400N64j707o21P40J212j77q18m53
4469e85N66K84R9N8r37k65Q90J165j109j367P59J543M8j758m59P60J367n43p72
4488b56m0K16N86k1m80n14J18R58J95o27o46K89Q77O6q27q13O89J216l12r53n33
4509h12R62M72l61q20r9N68K54J26j74n03o9Q51M95q31r81O25J320l27j406j82
4529h92P80R44q88k24j47K34P27k29k43n11Q1P27M25q45p57M97R61k0j002n32
4549i14O61R10k38j007l81R45N29j61p22J40O1K11K89l29o83N62O26Q1p01q54
4569i75P13J075k91j119NR33J70o37j92J70J89J42J79l79l45qQ91K21q96m33L08
4590b79Q01p2q26m90R85K80k74l93L3O09l3n41J33O1P5j6J66j16n20J16N73N09
$$ plain form
4450 -587 605 791 -8 -732 -682 343 709 30 -915 -725 675 1239 -468 -1089 -349 863 686 -132 -585
4469 -585 -19 265 364 422 -515 -780 110 1275 166 -1201 -442 1101 1149 -609 -1068 -308 1059 516 -256
4488 -256 -296 -80 506 485 5 -509 -391 567 762 135 -511 -222 655 721 -106 -919 -230 986 674 -279 -812
4509 -812 150 622 261 -559 -658 -90 164 290 116 -387 -456 395 890 59 -922 -297 1023 696 -710 -892
4529 -892 -112 832 -56 -280 -427 -193 534 305 62 -449 -368 359 784 -61 -818 -321 640 620 -382 -914
4549 -914 -253 657 419 -588 -969 -24 505 344 -378 -238 -177 34 323 -6 -689 -127 499 580 -121 -975
4569 -975 -262 813 522 -597 -592 341 511 -126 -318 -148 41 183 362 -17 -362 -370 521 742 -154 -587 -279
4590 -279 522 450 -376 -866 119 399 125 -268 -235 374 341 -200 -67 -6 69 53 219 103 -417 -301 272 781
4612G81j174k71M21R89r37m38J85R65o59oL41J15m64J51M83m37l87M1Q07R8j072
4633d68j51P39L41m94m29R0P49j34m47r0J16N16n17K02J71k98j3r1L35om90j22
4655d91O59M03p80k03O05Q6j57n45O22L10l13k10J73K6l11j54Q13j12p34J33L22
4676A42M28l38l50ML61k29p5o7L42j71j72L14j96q9K68k23K58j25j53o8L14M4
4698B19l99k64M47K74k64p2mK21k1l78J99J4j23N9L53rm16n1J5M81l65j94L02
4721B4L0J34n03L65p2J35j07J36k61l18N76P8j49n56P58m11j3K63l03J86J04p
4743H9J98o29L50p1L42n30j99L62L90j04k80J68j76M8Q9J42j69k55L47J55j01
4764A66n67L66J24J44k10j95M7J95j78J00J78k72J43L4M9k45J45K95p5l34m3j0
$$ plain form
4612 781 -393 -664 -243 746 -191 -629 -444 521 -138 -144 197 312 -152 -1 482 45 -342 -301 506 604 -468
4633 -468 -619 120 461 -33 -462 -372 377 243 -204 -294 -178 338 -179 23 194 -104 -117 -208 127 121 -369 -491
4655 -491 168 571 -209 -412 193 279 122 -423 199 509 196 -14 159 185 -126 -280 533 421 -313 -180 142
4676 142 570 232 -118 -114 247 18 -57 -124 218 47 -125 189 -7 -96 172 -51 207 82 -71 -139 175 219
4698 219 -180 -444 3 277 13 -59 -63 158 137 -241 -42 -28 -151 -92 261 252 -164 -215 -200 281 -84 -278 24
4721 24 54 188 -315 50 -22 113 6 142 -119 -437 139 217 68 -488 270 -141 -154 109 -194 -8 96 89
4743 89 287 -342 8 -63 279 -251 -450 -88 302 198 -82 86 -90 -42 47 189 20 -235 112 267 166
4764 166 -401 -35 89 233 23 -172 -125 70 -108 -8 170 -102 41 75 124 -121 24 319 244 -90 -133 -143
4786a43M63n1j90l2n41P76j70j03j11k28N73q8o29K1L28k2N9M43o61P2J95K12
4808A73k18k11j09K46K98l30r0J54k06K11N3Q2l9J64j7k63j35K0K93o1k15J01
4830i9J12o3J58k8M5k75K76k3N4l30Q2J78L39p58L30m3P2L4k69L4K57j44J36K9
4854A04m09J41L08q8l18K44J5K24m10L09R4l88L10k41O2o6J12K09k50J06J63k53
4876b2J80l47J9L32J2l27J47k7K0J27o8j49K19j76K5n4p5j19K91j58L8J8N8K8
4900hp5k26k3K57M12m26J5p8j78K43J54k06J74j34L23J3o1n97L36K94n5J52n61
4923b55j6O09m9o74K75Q8L75k6o74K14P1K58J38k76l86Q5O64l44K2l00K66M25
4945D90k74l42K10J21R6j98k82r6M86P8p6l37r9J38J97K4k82j47M36P2n9j40m46
$$ plain form
4786 -143 320 269 79 47 -494 282 112 9 -102 -330 243 155 -474 -453 -125 -147 -88 355 -306 -234 -39 173
4808 173 -45 -256 -365 -119 179 -151 -241 -87 -293 -82 -29 53 14 178 161 -102 -237 -217 76 15 -200 -99
4830 -99 13 -50 108 80 125 -150 126 103 157 -173 -91 87 426 -332 -2 -45 27 61 -208 -174 83 -61 75 104
4854 104 -305 -164 144 56 -262 -18 -3 221 -189 120 214 -174 136 -105 -43 -109 3 212 -38 68 231 -22
4876 -22 158 -189 -170 162 174 -153 -6 -33 -13 114 46 -103 116 -60 -35 -89 -164 -283 8 -150 -112 -94 -36 -8
4900 -8 -83 -309 -332 -75 337 -89 -74 -152 -330 -87 67 -139 35 -99 224 237 176 -421 -85 209 154 306 -255
4923 -255 -271 338 289 -385 -110 -22 353 327 -347 -133 -62 196 334 58 -328 -243 421 77 99 -201 65 490
4945 490 216 -126 84 205 301 103 -179 -275 211 289 213 -124 -223 -85 112 136 -146 -293 143 215 156 16 -430
4968d30O16M04l45l67k52O16p6l21Qj66L89J7J62k37n84J59P56k99m06j20O53
4989A77J71n32Rl03O06L10o52j19M0M09L35l68m50KL45K39K42o69o5L28N68q5
5011E38j250M02O14J32m74l74K01O40j44m21J23oj01K75J61k65r35R47P09k91
5031D81j036J39P11N53q74n14P14QK17m12n1k48K75K68k07k99j84K67N76j70n10
5052b96l21O38O26j91j146J35Q29L22n97p16M86J017n85n30K83L07k20m2P36r00
5072a65m46M80Q70n03r75O6J049J74r62k45O38K1R0j27k37L6M40p5l1n40R0P90
5094D38k09m17j20KN74J32j81p38K38Q19j21o25l59N82M35j51k18l04L48j73K95
5115B47k5k12p31Q28N38n53r44L02J191k75r34J20N00K66k61OP2j53j75K22K35
$$ plain form
4968 -430 186 590 245 -122 -374 242 166 -155 -147 -313 76 93 255 18 -566 -407 349 50 -356 -476 177
4989 177 348 -184 -175 -478 128 438 -214 -333 -293 116 451 83 -367 -365 -20 219 461 -208 -273 55 623 538
5011 538 -712 -310 304 436 -38 -412 -211 429 285 -136 -13 -19 -120 155 316 51 -884 63 772 481
5031 481 -555 -416 295 848 -26 -540 174 182 399 -13 -64 -312 -37 231 24 -275 -459 -192 384 214 -296
5052 -296 -617 21 647 456 -690 -555 274 596 -1 -717 -231 786 201 -329 -46 261 41 -1 735 -165
5072 -165 -611 -131 739 236 -739 -673 376 550 -412 -657 -19 2 92 -35 -272 -236 204 129 98 -442 -352 438
5094 438 229 -188 -308 -306 268 400 219 -519 -281 538 417 -208 -567 15 450 299 81 -223 125 -48 247
5115 247 222 10 -721 107 645 92 -852 -550 641 366 -568 -448 52 318 57 63 135 -18 -193 29 264
5136B64p51j57Q71N08q55l78M92K59J22m57k04R9L83K28n65j51L71J84k96rJ0
5157c2j71L26J69q4l67j92N89J44l16p05P24L53k51n56r4Q23k63k08L16l8l76
5178b09l23Q41J23n41n50J140J30o18l45K95N03k00l74M8L90j41p5j98J13M5j26
5199g2n7M56j70k65qM28j02l56K5L67J55n98l98R21K77m53m57K18N12j75n05K76
5221A9K75l04k73N44p0n48P6N12J12q1n99K32K55Q6l74k9L09j66K79n44L89N4
5243A54l67j00N01j96j33j08L67J54j79j40O4nO0k39L82k3l94K1J73P5k65K56
5265E8K77k79k06m9J81K79m24k62K66L44m66K73L5n6k23K68J24J45l15R8j2Pj16
5288e3J40q1J61k14j29K95J79l8j81q5J78j64J66j68n7K55K25m82J9N5P5J5l32
$$ plain form
5136 264 -487 -644 227 735 -120 -498 -6 253 375 -82 -286 -187 196 424 -141 -292 79 263 -33 -42 -32
5157 -32 -203 123 292 208 -159 -351 238 382 66 -639 85 438 187 -369 -463 360 97 -111 205 167 -209
5178 -209 -532 309 432 -109 -659 481 611 -7 -352 -57 446 246 -128 -80 310 169 94 -104 9 54 -72
5199 -72 -129 327 157 -108 -116 312 210 -146 -121 246 401 -197 -595 326 603 150 -307 -89 423 248 -257 19
5221 19 294 -10 -283 261 191 -357 -281 231 343 262 -337 -105 150 236 -138 -167 142 -24 255 -289 100 154
5243 154 -213 -313 188 -8 -141 -249 118 272 93 -47 17 12 72 -167 215 192 -202 -181 -8 67 -198 58
5265 58 335 56 -150 -199 -18 261 -163 -425 -159 185 -281 -8 27 -29 -252 16 140 285 -30 68 56 63 -53
5288 -53 87 6 167 -47 -176 119 298 260 79 -6 172 8 174 6 -51 204 429 -53 -34 21 96 111 -221
5311b21M99l08K15k26K0p9r4J77Q6j8j32R2j19k47N03j57j89O9O0mj86K22J8M9
5335C0O9K6Jk66OL87r4k36l7j38K39K79k11k8J97l76k2L39j49j19k75M67j46Q1
5359B4j27L18j44k13K53p2r3k21K26R3Q6l54K16l8J35j92M6N9J86j92j25K08M2
5382A21n9k44K38j36J55k43L3o7M06j58oj29K63j77M7p8K03k38l8J33K16l79J58
5405B1M2j70J65j09N6j51N2j5J67k86L3K12J45j51j65mK36j46j40K76ro7j38J01
5429d5L9k83K96J45m9j3J9j54R1j82J26K30m33J05Q8K46n30L17k29N31n69M70
5451B16j78M1j56J12J59K1k58Q3r2q2J16J85K03m94J62K00k87L30R1k48j97J47
5473G4J96k44o9J69J37j01l56J42J16m0k71L09k8J28j01k25J44p6J2K85k3l62
$$ plain form
5311 -221 278 -30 185 -41 -21 -100 -194 -17 69 51 -81 11 -108 -355 148 -9 -198 -129 -69 -73 -259 -37 -19 30
5335 30 99 125 126 -140 -134 253 159 -77 -114 -252 -13 266 55 27 224 -152 -174 165 16 -103 -378 89 -57 24
5359 24 -103 215 71 -142 111 39 -54 -275 -49 44 130 -224 -8 -46 89 -103 -57 2 188 -4 -129 79 121
5382 121 62 -182 56 -80 75 -168 -135 -202 204 46 40 -89 174 -3 44 -34 169 -69 -107 26 242 -137 21
5405 21 63 -107 58 -51 5 -146 -94 -109 58 -228 -195 17 162 11 -154 -158 78 -68 -208 68 59 -8 -146 -45
5429 -45 -6 -289 7 152 103 90 109 -45 46 -136 -10 220 -213 -108 -20 226 -304 13 -216 315 -254 216
5451 216 38 79 -77 35 194 215 -43 40 -52 -134 -18 167 370 -124 38 238 -49 281 372 124 -73 74
5473 74 270 26 -43 126 263 162 -194 -52 64 24 -247 62 34 162 61 -164 -20 -96 -84 201 178 -184
5495a84K2J10J78L1m75J74K64p6j6J07l15K16Q4j36O0k41J90M7K3j14k21J45L04
5518A77j8k60m28M83L53k15l33J99j14L03j42j27j24r4K73J21o2k23K6M04R2j50
5540A41l42J87L01k07k50J60K76J58l80k64p4N91p9p6r7k63j5M43Rm56K8j06M48
5563A33J54l61k01K76N06l89o68L27M01p8j85O6l7J28k3K16j67m44K55K04K29
5584C42r12L71M06J66j58m16J48K09J03l79P3j11L06r6k86K72k90J46K70l1j21
5605A2m70M53L14k30n78N2M63L72o36O0J09L41k77q7o4K28j42k0L68l62l52L93
5627e3N24j33p63J58O49P6r19J65M80Q8j83Mq9j31L55k92K6j52J99N0o1O5l45
5650b82kL08K80k34n06L60L78O9l79o96O47L14j25l63M12j96k00K66J43k93l00
$$ plain form
5495 -184 -162 -52 126 157 -318 -144 120 44 28 135 -180 36 120 -16 44 -197 -7 40 63 -51 -272 -127 177
5518 177 159 -101 -529 -46 307 92 -241 -42 -156 147 5 -122 -246 -340 -67 54 -8 -231 -205 199 291 141
5540 141 -201 -14 287 80 -170 -10 266 424 44 -220 -294 297 218 142 45 -218 -233 210 219 -237 -209 -315 133
5563 133 287 -74 -275 1 507 118 -550 -223 178 100 -85 -19 -56 72 49 265 98 -346 -91 113 342
5584 342 -570 -199 207 373 215 -201 -53 156 259 -120 -47 -158 148 52 -234 38 -252 -106 164 133 12
5605 12 -458 -5 309 79 -499 -447 16 388 -248 -188 -79 262 -15 -102 -166 62 -80 -100 268 -94 -446 -53
5627 -53 471 338 -425 -267 382 458 -461 -296 184 272 89 93 4 -127 228 -64 -38 -190 9 59 -2 63 -282
5650 -282 -284 24 304 70 -436 -76 302 371 -8 -704 -57 257 132 -231 181 -15 -215 51 194 -99 -399
5671c99M80O44j074k83N45L29mo72L64N66k30j04k66k00M08p0K71k72l60q8O23
5692B08nl12j58L52Q2L4k00n57L26M57M8m66P6M3K32j64k17NK59k47L26P7m79
5715b80j90P10M14p21m84M21O38l63m44O4L75J82k54j04j01l8K25K36p1q47N98
5736c4L15p7m17j07K92N24l99k58n1J46K36j37O3m81N27qj39j70n5K21Q5O4l1
5759A09l66j5N14M24o78n23P84L61o05m71J64M94J89n77J02J65j58m2K01M0n15
5780d03K45N31l74j39j17M78j19J33m84L37L26l35r9m09K59J59R0l21L10n14L53
5801i3L14j49l47j53M84L8J06l04j30L19J23q5j75j98L39O5k27J39m34L93Q4l6
5823G3k37q4K38J81j07j71J08K40q2k15q6J31J50J30k7m50J67K14r4j26o4O4J53
$$ plain form
5671 -399 81 725 -349 -632 -87 242 238 -434 -70 496 266 162 -104 -304 104 34 305 33 -327 -415 208
5692 208 203 -109 -267 85 167 201 1 -556 -230 227 275 -191 -115 -72 160 -4 -221 -216 43 -204 122 199 -280
5715 -280 -470 240 654 -67 -551 -130 508 145 -299 -235 140 322 68 -36 -137 -175 50 286 215 -632 -34
5736 -34 281 204 -213 -320 -28 496 97 -161 -212 -66 170 33 96 -385 142 134 -5 -175 -230 -9 76 140 109
5759 109 -257 -272 242 666 -12 -535 249 610 5 -466 -302 192 381 -196 -94 71 -87 -129 72 112 -403
5780 -403 -158 373 -1 -140 -257 221 102 235 -249 88 414 79 -20 -429 -170 -11 79 -242 68 -446 -93
5801 -93 221 72 -275 -428 56 94 200 -104 -234 85 208 123 -52 -250 89 154 -73 66 -368 25 109 73
5823 73 -164 -248 -10 171 64 -107 1 241 159 -56 -142 -11 139 269 242 -208 -41 173 79 -47 -111 -47 106
5846A06m3On1j51M8J72R8l29q8L75J4j21j9O8k42K82m4j20J09j00K16p0m86K93
5870g7K53K3k54n2L14q3m0j30Jr2J86j6L8p0k16J56j13K37j72k5P8R3r7P2l9R4
5896F9L8r6n1k29L67J66k69k5J98o7j30J75k88N6J03k7J25o2K32l04m4K91n8r8
5920G2q2q7Lk6m1J84Q9p7Q5l09K17k17J48R7%P6p5j96K28n9Q5p9J6L8L3k10J32
5947D5p1J16j6Jj8k71K07j12K71j87R2l33K70p8RJ36P5k24J03j00K20r8k43K33
5971B7Q3j0j11j47l1K52p5P6k32J6K12j71L18l40q3mJ60J72l35l1M78m11K77r5
5995en5K90m60M39l30K09k00j05M88k82J27k46J21K16l05J94n2R7L3j10R8J91
6017C53k84M2p2pm14M03J49j3l39J81o0M51m68o3K18L2j5l78K61k89M39j11k89
$$ plain form
5846 106 63 69 18 -133 -85 87 185 -144 -232 143 157 36 17 85 -157 125 81 -39 70 -30 186 116 -370 -77
5870 -77 176 199 -55 -107 207 124 84 -46 -45 -137 49 33 71 1 -215 -59 -172 65 -107 -132 -54 39 -58 14 -25 69
5896 69 107 11 -40 -269 98 264 -5 -30 168 101 -29 146 -142 -86 17 -10 115 53 285 -19 -63 228 170 72
5920 72 -10 -97 -94 -120 -161 23 112 35 120 -189 28 -189 -41 56 56 132 57 -139 89 30 115 36 52 90 123 -87 45
5947 45 -26 90 74 75 57 -214 -7 -119 152 -35 57 -276 -6 -84 -75 61 136 -88 15 -85 135 37 -206 27
5971 27 110 100 -11 -158 -189 63 -12 64 -168 -152 60 -111 207 -133 -216 -220 -60 112 -223 -254 224 -187 90 -5
5995 -5 -60 230 -230 209 -121 88 -112 -217 271 -11 116 -130 -9 207 -98 96 44 141 174 64 162 353
6017 353 69 111 39 32 -382 21 170 157 -182 -1 -61 390 -78 -141 77 109 94 -284 -23 -312 127 16 -273
6040b73M19p8L2p6L0Jk29L6J22J19m0j13p7L66l71J72j43L19k69n4j46K63j90
6063a80M25k33J17p7Q5l8j34j32K46P6o8k04j47M19k88q0K40NR0j77j38on7O20
6087C64l95Qk05J96J00N8j33K8R9k17K07J4j06j35K10q2K3k18J61K95l52R7r2
6110g5K18n5m4K8j87J1K07J10l79M8M3lj74R1K56k91j28M02q3j7r4L29k80j12
6134a79L4M31j94k80K06L2K34k16l88K43J44n0l6r8m8J13j49K98J66m81L68l42
6156a92J61Lm46L17M71j91j75j54K29J42j12n3m2P9l0M8J59l43q9J02o8J66j93
6179b11j3L48K80o76J18R4p4J80k35J71J23j31p7j91L27J43j23o8J26j48k1L60
6201C02l35P4k21K90J07p8k26m75O41pP4l05n0K07p6R4O3k11n3K32K07j28m22
$$ plain form
6040 -273 146 68 100 24 54 55 -174 -138 -16 103 63 -50 -127 239 -132 40 -103 216 -53 -107 -253 10 -180
6063 -180 245 12 129 52 137 99 -35 -167 79 155 87 -117 -264 155 -133 -213 27 32 122 -55 -193 -199 -256 364
6087 364 -31 -23 -228 -32 68 126 -7 21 120 -97 110 124 18 -117 93 11 34 -184 -23 272 -80 17 -75
6110 -75 143 88 44 72 -115 -104 103 213 -166 -118 -75 -78 -252 -161 95 -196 -324 78 -5 -22 -116 213 -67 -179
6134 -179 -145 286 92 -188 18 50 284 68 -320 -77 67 17 -19 -117 -165 -52 -201 97 263 -218 150 -192
6156 -192 -31 -28 -474 -157 314 123 -52 -206 23 165 53 0 -42 37 7 55 214 -129 -218 -116 -184 -18 -211
6179 -211 -224 124 404 -272 -154 -60 -134 46 -189 -18 105 -26 -103 -294 33 176 53 -15 111 -37 -58 302
6201 302 -33 41 -180 110 217 139 -87 -562 79 72 146 -159 -209 -2 -78 16 79 -132 -185 47 254 126 -296
6224b96K45M32l82l06L14L44k12k93j04j09K79L48l79Nj58N1L41qm11J94J17K21
6246B33j54j01J72j26L24l67k20J25K81j31M4l71L02M9j50K96j20j89k37M64L54
6267D78n79p3J24L32l23l44N16J82k59m15J96J82m8n1K20jl68lL10l6k72j5M91
6290B44o5m24J23LJ85Q1q1l27L56K50j07j04k85K53O9j68L1J7k23L2K24J59n15
6313b72J09K40N31o43k15J60J81P1m35J59J91P1j53J86k78j44J80J24K81m67j75
6334b98J90M46l23k41pK90N8l81R8J24J59p4J22k25j50K09J64k31k02r3K77L46
6356B58l88M6k7L17J18j85l91j02N80j34j01n3k0O0q8K36k50q8M12k99J35o8J92
6379A60R3N0l29j49M4L71n5j73j75J35j71L19l8j41j60K51L22k25k00L6J05k45
$$ plain form
6224 -296 -51 381 -1 -307 7 351 139 -154 -258 -367 -88 260 -119 -114 -272 -221 120 112 -299 -105 12 233
6246 233 79 -22 150 24 348 -19 -239 -114 167 36 80 -291 11 60 -90 206 86 -103 -340 124 478
6267 478 -101 -174 -50 282 -41 -385 131 313 54 -361 -165 17 -31 -82 138 137 -231 -234 76 40 -232 -247 244
6290 244 179 -245 -122 -119 66 147 66 -261 95 345 238 134 -151 102 171 3 34 51 -172 -140 84 243 -272
6313 -272 -163 77 608 -35 -250 -90 91 162 -273 -114 77 148 -5 181 -97 -241 -61 63 344 -123 -298
6334 -298 -108 338 15 -226 -233 57 115 -266 -168 -44 115 41 163 -62 -212 -3 161 -70 -272 -365 -88 258
6356 258 -130 -84 -111 206 324 139 -252 -354 226 92 -9 -62 -82 -22 -110 126 -124 -212 200 -99 36 -32 160
6379 160 253 303 -26 -175 -131 240 185 12 -163 -28 -199 120 82 -59 -219 32 354 129 -71 -35 70 -175
6401a75O1q6M59k43o7mk75K35K0K45j17l19L35J86J3m36J0M0P7R7j00m31M62l2
6425d5j73r4J22P1j5Q3q1J0n3J53O4q9j82J68l2K61j51l78L18J94J2k21%J03j44
6450i9M36Rm22j2J54Q8k50K5l5n0K86j33j42p3L98j6j95k04J02K90jj58r7j33
6474b32J85J54l3K29m57L29R6l33m8J18K3J16l05J25J00j27J71j99K02k86J94
6495B2J02j46q5o3P1l5L04m62m0N36n13J43N5N9P5L0j08N7k05L18q6K4k0k63M08
6520A78k18L14k55r6J66J11l03o3m6K56p5l2L76m53J71j79K35LL4q0j71K51l47
6543b23J76k00L16L4l43L97j09Q5j04J7j40k3M16k82J35l14J03Q8mO0l03J99J15
6566I6J03k9N1j8j28M1m5j08K14k52M72l55j26qJ49K40m16Q6Q6l6Q0k05l6K96
$$ plain form
6401 -175 -114 -200 259 16 -51 -55 -330 -95 -75 170 53 -266 69 255 268 -168 -158 -118 -41 56 -44 -475 -13 -45
6425 -45 -218 -312 -190 -119 -134 -51 -132 -122 -175 -22 42 -47 -229 -61 -93 168 17 -361 -43 151 163 -58 -58 45 -99
6450 -99 337 346 -76 -88 66 154 -96 -71 -106 -156 130 -3 -145 -218 180 164 -31 -235 -133 157 156 -2 -99 -232
6474 -232 -47 107 74 303 -154 175 271 -62 -110 8 31 147 -158 -33 67 -60 111 -88 114 -172 22
6495 22 124 -22 -107 -170 -99 -134 170 -292 -332 204 -309 -166 -111 -52 23 53 -55 2 -203 115 29 53 33 -230 178
6520 178 -40 274 19 -77 89 200 -103 -166 -212 44 -31 -63 313 -140 31 -148 87 90 124 44 -127 124 -223
6543 -223 -47 -247 69 103 -240 157 48 133 29 46 -94 -117 299 17 152 -162 -59 29 25 85 -218 -19 96
6566 96 199 170 221 203 75 116 71 -37 177 -75 397 42 -84 -92 57 297 -119 -33 53 17 97 -108 -144 152
6590A52m3l0Rk83M5J89m2P0m02J82J92Q4rk26j50M76l34o8K17J28r1n3P8l6j34
6615g9J54o3j61P9o8J40KJ08k61R7N0j82M7j62M46j95m2O9M5j60q3K38q1N9J2
6640IL81l68Q3j1j24J05j65l8O1K52k73k0M2k5J65j74K87k03LJ08k89L50j94K05
6664A67l37K50l21J26oj55M91p8k75j39J72K45j98L6J42j59J19n7J05j81j01K9
6686a25p6Q3K24k34R7j13k13L82j81K82j28J19q8l65j12R45m39j89K82m04P4J05
6708g4p9L39l78J3J60j9J13k34L96j15l29K78k43K95j37J49l78L45l8k20J73j4
6730Co8L11l78L17p9k61J26N8j2J59k15K1J45j55j38J93J52q7k53N0Q0J49r6m9
6754b7J65l99J78Q9P7J02k61m3M61j63k71l8J14j9K18j57R0K6j98K02j77P2J01
$$ plain form
6590 152 109 79 88 -195 -150 39 -3 67 -335 -153 39 123 114 -112 -262 214 -120 -188 29 157 66 13 91 55 -79
6615 -79 75 12 -149 -70 -138 2 4 112 -149 -52 -2 -184 -137 -299 147 -48 -90 -21 24 -136 -219 19 -62 -3 9
6640 9 390 22 105 94 -30 75 -90 -128 -67 185 -88 -108 -66 -91 74 -100 187 -16 -13 95 -194 156 -38 167
6664 167 -170 80 -241 -115 -121 -276 215 137 -138 -277 -105 140 -58 -22 120 -39 80 23 128 -53 -154 -125
6686 -125 -201 -118 106 -128 -31 -144 -357 25 -156 126 -2 117 29 -336 -448 497 58 -131 151 -253 -179 -74
6708 -74 -153 186 -192 -179 -19 -38 75 -159 237 122 -207 71 -172 123 -14 135 -243 102 64 -156 17 3
6730 3 -65 246 -132 185 106 -155 -29 29 17 176 -39 -18 127 -28 -166 27 179 92 -161 -111 -31 118 22 -27
6754 -27 138 -261 -83 6 83 185 -76 -119 342 179 -92 -130 -16 -35 183 26 116 142 -56 146 -31 41 142
6777A42j97J83o7k49N1L61j31n6k3K79m8M4j95j8OL04k75k38J88l78K39Q3j92
6800a87J29KM4J35K7k93J56K56j85n9L0O2j39q3Q4R3j21O7l7M8J30p5K30k91K00
6825B23k93R0L35m14p5J29j01J75p7J2O8j74O3l1K4K0OoR9q5j08K66j19l4l2q2
6851a21J20N1M2k07nK5K65k70kJ86r8j36L95m1l24j0J08M9J21m77O2L00J12k31
6875h6N6L9O4j28o3r3J47l8q3K67k21j53L39K21l83n2M11r8k23O0j56N4J1o3L0
6900a41J32j18R9L01j59q7Q0p1p6J88n28N06m5j24J2K3j46J66L67l98j98J36J81
6923A00k63L4O0J59k78L23j14j65l05M82K10k18p6j06M09j44J9j43K75k24R6j91
6945f0j66J17MK14l17r0L43m0K20k90j49L37j4Q6k97J03L3J20k4n26L47j7J57
$$ plain form
6777 142 -55 128 61 -188 -137 224 93 37 14 293 245 289 94 76 82 386 111 -127 61 -317 -78 5 -187
6800 -187 -58 -56 -12 123 150 -143 13 269 84 25 55 117 -22 -105 -21 72 -49 18 -19 29 159 84 314 23 223
6825 223 -70 20 355 -59 -134 -5 -106 69 -8 4 72 -102 -39 -70 -46 -26 -20 -26 73 -12 -120 146 27 -7 -39 -121
6851 -121 -1 50 92 -115 -120 -95 170 -100 -102 84 -14 -150 245 204 -120 -130 -22 27 148 -329 -267 33 145 -86
6875 -86 -30 9 73 -55 -118 -211 -64 -102 -185 82 -139 -292 47 268 -115 -167 244 146 -77 -17 -173 -119 -108 -171 -141
6900 -141 -9 -127 -28 273 114 27 107 36 -40 148 -380 126 81 -43 -31 -8 -154 12 379 -19 -217 -81 100
6923 100 -163 -129 -69 90 -188 135 21 -144 -449 33 243 25 -51 -157 252 108 127 -16 259 35 131 -60
6945 -60 -226 -109 -105 109 -208 -298 45 5 225 -65 -214 123 109 195 -102 1 34 154 130 -396 -49 -66 91
6968I1l5k90K54pl91N60m79M25j54J40q9q5R9j62L52m34J60K7k16L10j38N2j45
6991a55M45j17l02J58p3k27N48j03l18L9J30J16M1l56K23k30J64P7o6j33M59m58
7013a38J05J32o6J33l35J81L7N9j20j43M26j86j98J83J24j41j8j98K58l00K17
7034A2J03l66M03k25K5q9J86J30l30O5Q4J87j54R9k02k3m1K24K3nj11j71J17K8
7058c1K9k96K07J17m8j43K23q7k39J62J59m4k5PKM9r9j19J3M44l91L1M8q8L21
7083B02m38L56m27L03J74k81K8J14j71j8J69j40K82k49J35j45Q2KL1p9K24l15
7105a61K83p8j89K0p6L54l18L59k13K64k07j05Q7J05o8k13J38j30j73K86J24j94
7127a05N3j23L79k22J73k59P3j29K67j3k06n9K45j24j24J75P4k91K68J57n3l08
$$ plain form
6968 91 56 -234 20 13 -378 182 -297 128 -26 114 25 -60 39 -123 229 -205 -45 -18 -234 76 -62 -10 -155
6991 -155 290 173 -129 29 -44 -271 277 174 -144 -105 25 141 182 -174 49 -181 -17 60 -6 -139 320 -138
7013 -138 -33 99 33 166 -169 12 49 108 -12 -155 271 85 -113 70 194 53 35 -163 95 -205 12
7034 12 115 -251 152 -73 -48 -137 49 179 -151 -86 -2 185 31 130 -72 -95 -136 88 111 106 -5 -176 -59 -31
7058 -31 -2 -298 -91 26 -22 -165 58 -29 -268 -106 53 9 -16 -9 -7 42 -57 -176 -163 281 -110 -79 -31 -119 202
7083 202 -236 120 -307 -4 170 -111 -83 31 -140 -158 11 -129 153 -96 39 -106 -24 -22 9 -70 154 -161
7105 -161 122 44 -145 -125 -201 153 -165 194 -19 245 38 -67 20 125 57 -156 -18 -148 -321 -35 89 -105
7127 -105 -52 -175 204 -18 155 -104 -31 -160 107 94 -112 -171 74 -50 -174 1 75 -216 52 209 156 -152
7149a52J32K09l78L43k64L5J62j89O3L5Q8k1k29N5J5J48k40K40l2j39J71r4j19
7172a61K17k05j9K90l87K66p1P6K5j9j81L96j83l11L54r8O5O0Q4j70l5J65n8L28
7196D28n00L01l13J60k5j74P4K56l35j8k1kJ68J70l2j39k2J28j5k50q9J7J80O5
7220A2j24J89P0r1oj35K45j00j31K84k04j05J22l58M64q3j76J77j9J96l38M1J14
7243D4K23n49J24J26J03k30Q3Nk7K88k95M19k90j61J49J84j08Mj18R8j11J8j55
7266a76J56N0j2j15n2J80j37Q9j4n9J73K10j81J84j48j18r3J41L3j43j65J67J07
7289G7R1n8j93K50k91K28j23q9l20N79j67m4Q7p5K42l02Q0j04L08j91M9j10Q8
7312A2k8p0j05N8j2L32l9j8r6l13M87l37L9M09m34J73r5M7n5j71M94r9l06R5q4
$$ plain form
7149 -152 -20 189 -189 154 -110 -75 87 -102 -39 -4 84 63 -166 -111 -96 52 -188 52 20 -119 52 -42 -161
7172 -161 56 -149 -168 122 -265 1 -70 6 31 12 -169 227 44 -267 87 -11 54 114 198 28 -7 158 100 428
7196 428 -72 229 -84 76 51 -123 -49 207 -128 -146 -167 -169 -1 169 137 -2 -24 104 89 -161 -250 -233 -53 12
7220 12 -112 77 147 56 50 -85 160 60 -71 213 9 -96 26 -332 132 49 -127 50 31 227 -111 -70 44
7243 44 267 -282 -158 -32 71 -159 -76 -71 -98 190 -105 314 24 -137 12 196 88 92 -26 72 -39 -21 -176
7266 -176 -20 30 18 -97 -149 31 -106 -17 -31 -90 83 293 112 296 148 30 -63 78 111 -32 -197 -30 77
7289 77 168 110 -83 167 -124 104 -19 -108 -428 151 -16 -60 27 -48 194 -108 -28 -132 176 -15 34 -76 12
7312 12 -16 -86 -191 -133 -145 187 148 130 34 -279 208 -129 -90 319 -115 58 -37 10 -45 -216 278 179 -127 -32 -116
7337a16K24K7j16J32j73p2q8K80l30K47N9k93J61m5K09J0J47l17n5q7L03j43q5
7360a21P6n9N7M8K52k95r6K00K22l40l6J25j27K0P2L03m29K08j41J12j09J34j32
7383e6L2L6j33K37k45O0r2Q5j23L13j89p9K31j7J37j25k76L61k94J32j11j56L30
7406E8p7j80M45j52k03J28l19J63n2o4J53M26m33j27P0M69l1l61J85J60k42k09
7428a93%J48J17n9J63k16j30J75J3J24j55Q7j04K34k30K6p3L6J10J55l09qj0P
7452i2J85P6k75Q1K3q8O1J28k64K62P9m86L4L91p6K68n10J5L82j47J97k89J5J5
7476a5j20J01J90k77J21m0N7k6j69P1L54J5o52O48m63M53j45l66M19m7J31l15
7498g5K5l01L11J43K9j21j76mR6J65Q7k20JP2o9j49J65J78l54L38k86J20J82j67
$$ plain form
7337 -116 108 135 19 151 -22 -94 -182 98 -232 15 74 -219 -58 -103 106 116 263 -54 -109 -196 107 -36 -121
7360 -121 -45 -104 -47 1 253 -42 -138 62 284 -56 -92 33 -94 -74 -2 301 -128 80 -61 51 -58 76 -56
7383 -56 -24 12 -121 116 -129 -69 -161 -76 -199 114 -75 -154 77 60 197 72 -204 157 -137 -5 -116 -272 58
7406 58 -19 -199 246 94 -109 19 -300 -137 -189 -253 -100 326 -107 -234 -164 305 274 -87 98 258 16 -193
7428 -193 -193 -45 72 13 176 -40 -170 5 18 142 -13 74 -30 204 -26 0 -73 -37 73 228 -81 -89 -99 -92
7452 -92 93 169 -106 -25 -2 -90 -29 99 -165 97 176 -310 -276 115 39 307 -203 -188 194 47 244 -45 -30 -15
7476 -15 -135 -34 156 -121 0 -40 17 -9 -178 -107 247 262 -390 258 -205 248 103 -263 156 109 240 -75
7498 -75 -50 -351 -40 103 132 11 -165 -169 -73 92 179 -41 -40 32 -37 -186 -21 157 -197 141 -145 -25 157 -10
7522a0k6L2q4R9J90q6j14j43NMM7N7r3K73J07l56Q8k04L44l29N1m4l1R8P6J48
7548I9l43K78J84l59r5M84j86L6l01O4L07k80J79j07j16J41l96N84l10J88j02
7569e1k88K61L58k10k53j38K85r1L27l76N7oJ84N9k14l3J51q3j16K60l13M1L83
7592A94j40k92M37R0k87j37J58k53P2q4J97l7k1J09l5m4j74k32N40J67l69L21
7614A80r6j80K58k66J1M1J20k93N21q5m84K53M7L93n65L1M47k50k00L37m99K92
7636A3Q7o3J15m09L65p3l27J64P3J90j79J03N9l78N63r0l28NN6L0Q9q5L7M7l29
7661b65J92K49j48j10O1J10J93n24J48L8R4j85L8M0K39j50J29nk60j26K06J9L1
7684A4P9n4r3r3J64j67pJ48K52m48L1o6K81%J46j36j24K43l25K02k42K42Q7l71
$$ plain form
7522 -10 -36 -4 -88 11 201 115 1 -142 -137 -133 -86 -29 -122 151 258 -98 -10 -214 130 -199 -148 -192 -223 -125 -49 99
7548 99 -244 34 218 -141 -236 248 62 98 -203 -139 168 -112 67 -40 -156 -15 -411 173 -137 51 -51
7569 -51 -339 -78 280 70 -183 -321 -36 -127 200 -176 -119 -125 59 118 -96 -129 22 -61 -177 83 -230 -189 194
7592 194 54 -238 199 289 2 -135 23 -230 -158 -242 -45 -82 -103 6 -29 -73 -247 -479 61 228 -141 180
7614 180 84 -96 162 -104 -93 -52 68 -225 296 211 -273 -20 27 420 -145 -114 333 83 -117 220 -279 13
7636 13 100 37 152 -257 108 35 -292 -128 -55 135 -44 59 118 -260 303 213 -115 -110 -54 -24 65 -20 17 64 -265
7661 -265 -73 176 28 -82 -21 89 282 -242 -94 -56 38 -147 -109 -69 170 20 149 144 -116 -242 -36 -17 14
7684 14 93 39 -54 -147 17 -150 -157 -9 243 -205 -174 -240 41 41 187 51 -73 170 -155 47 -195 47 134 -237
7708b37N98k68J07p0o7j97%J81l7m2j45NoL14k20K60k20K42k81J41k34K21JNm3
7733Hl05L29j17L0J78j01J87k67L47k08j79j47K52rn3j54Q8J86k93J34j16K33
7755B3j56N7q4j3K8K42P6l8r2L0P7l78j8L89j77n2K38pj05k51R2J80k70J21J00
7780A2k04j7M7J94q0k16J89R1k8m5j1K96j33j33o3k0J67k06j05K65K36k78Oo9
7804a05NL49j55P4J3l28L53r1L6l42K0J96j28J08K8P3j23o5j89j08K52J41P2k
7828H4k25J30pj3o4L6j23J25M79l34l2nK50k51o9J04q1o2L1Q2k15J27lLj4n2M9
7855e0K52l51K78p0NK03k00m7P8j22K1K0j19j22J13J61k49j00J01n0K19M3j5K10
7879B09k7j6j63R6j58K45j49j00j14nK1M08j74j90M09m34L6J74j6k49K2K87p4
$$ plain form
7708 -237 361 93 200 130 63 -134 -134 47 10 -32 -177 -172 -178 136 -84 176 -44 198 -83 58 -176 45 46 51 8
7733 8 -297 32 -85 -55 123 22 209 -58 289 81 -98 -245 7 -2 -55 -209 -121 65 -228 -94 -210 23
7755 23 -133 -76 -160 -173 -145 97 173 135 43 73 150 -228 -246 143 -34 -86 152 145 40 -211 -119 61 -209 -88 12
7780 12 -192 -209 -162 32 -48 -264 -75 16 -12 -57 -68 228 95 -38 -101 -121 46 -160 -265 0 236 -42 -36 -105
7804 -105 -100 249 94 168 181 -147 206 115 151 -191 -171 25 -103 5 33 106 -17 -82 -271 -379 -127 14 86 84
7828 84 -141 -11 -18 -31 -95 -59 -182 -57 422 88 56 51 301 50 -19 85 4 -58 -27 55 -160 -33 -36 -33 -47 -99 -50
7855 -50 202 -149 129 59 64 267 67 20 98 -24 -3 17 -102 -224 -111 50 -199 -299 -198 -248 -29 14 -1 209
7879 209 182 166 3 99 -59 186 37 -63 -177 -182 -161 247 73 -117 292 -142 -106 68 52 -197 -175 112 38
7902C8J3j38o6K55K35m44M2j28o4J92K01k08K05j18J8L8M5k3O5j64q9J76m22K98
7926d3K10j73j26J23r8J77l7j99J08Lp5J9N2J16k11Q4J47m6m2j28Q6J07j17J02
7950C9j07J16l0n4Q0l1k31M42j67k56K95p2p0j11K52j19k3r5L73j90j66kJ84J79
7974B36l62m7K3J27J44j15J3j03P9o3N5P8j64J74j41n9N5K87j47j28L9R0q0J00
7998I1k73J40M7Ok0p2J95k97J38j16K25k93J38J53j45J2RO4j18O5j08J09j23Q6
8022h7j33L69m6l53K23J08j58o4N3K7L18k08l16M46m19L55k58K09j32K00k02O
8044f2J42L5J62m21M83k43o6Q5K37n79J54K55j17m10L06J45j00J06k44K28l59
8065b63M47k59J0l8J6J08k15L13k57J79J6R4l73J47J52J25n6l83R9J6J49J6o6
$$ plain form
7902 38 51 -87 -153 102 337 -107 -65 -193 -257 -65 136 -72 133 15 33 71 116 93 158 -6 -95 81 -341 -43
7926 -43 167 -6 -132 -9 -107 70 33 -166 -58 -55 -130 -111 -59 57 -154 -70 77 31 -11 -139 -53 54 -63 39
7950 39 -68 48 18 -36 44 13 -218 224 57 -199 96 24 -46 -157 95 -24 -47 -142 231 41 -125 -127 57 236
7974 236 -126 -173 -150 -23 121 6 19 -84 -5 -68 -13 65 -99 75 -66 -125 -70 217 70 -58 -19 71 -9 91
7998 91 -182 -42 5 11 -9 -81 114 -183 -45 -161 64 -229 -91 62 -83 -71 -62 2 -116 -51 -159 -50 -173 -87
8022 -87 -220 149 103 -250 -27 81 -77 -141 -88 -61 257 49 -267 179 -240 115 -143 66 -66 134 -68 -62
8044 -62 80 115 277 -144 339 96 30 115 352 -227 -73 182 65 -345 -39 106 6 112 -132 96 -263
8065 -263 184 -75 -65 -103 -87 21 -194 119 -138 41 57 151 -222 -75 77 202 146 -237 -138 -122 27 43 -23
8088b3J2L2j77J62m4J46m0K14O5l35k52M51k54J90j00j61K17m02J79j15L39j85
8110h1L24j55l14J27R0k7N5j20J38J87l22K54o7k44K07j90k47L65O9L9o8k24J54
8133e0P9n7j99K33O0M8l3k07N1J01P7K6j49K8K4o8k8N4l88N28j42m7k1pM4J03
8159F0J18j19k07J05O6j47J17j94K80n4M5k08J20j70K39j79K36j11k1J34J55k94
8181b9J47k13p6L32K6k80R1K0l0l5
$$ plain form
8088 -23 -11 21 -156 6 -38 108 68 282 347 12 -240 211 -43 147 47 -114 103 -299 -120 -235 104 -81
8110 -81 243 88 -226 -99 -9 -36 19 -101 37 224 -98 156 89 -155 52 -138 -385 -20 49 88 20 -204 -50
8133 -50 29 -28 -227 6 66 114 81 -126 -75 26 103 129 -20 8 32 -36 -64 -10 -398 130 -12 -59 -80 -87 -43 60
8159 60 178 59 -148 -43 23 -124 -7 -201 79 25 70 -138 -18 -188 51 -128 108 -3 -24 110 265 -29
8181 -29 118 -95 -171 161 187 -93 -2 18 -12 -47
8191d7
$$ Imaginary data points
##PAGE= N=2
##DATA TABLE= (X++(I..I)), XYDATA
0@%%%%%%%Qq%qJ6k2L0l2M0n6P2q8J04j26J50j76K11k50K91l39L96m58N25o02O89
32C67p85Q92j010J138j279J437j611J799k004K230k476K744l037L359l713M097
48B148m516M976n483O041o654P338q102Q956r920J1021j2293J3774j5524J7637
62I399k0251K3578k7969L4072m3209N8531r0485K68980n03817l76773R16051K29031
74D77138n71097k30123M41465q872k80883J94941K80231l94005l04033M32969
84C7731M26092m17494m80934K81445M70774j08958l39840r2385J67387K00071
94A43889N4195k22508k51279J62574L82634q9237l85599J3821L02710N263j78970
105f2507O1553O6333k15963J4237L95903k4303n49232m1678O43893J47745o61150
$$ plain form
0 0 0 0 0 0 0 0 0 8 0 0 -8 8 -14 16 -16 24 -32 40 -48 56 -70 80 -96 115 -135 156 -183 213 -245 280 -322 367
32 367 -418 474 -536 602 -677 760 -851 948 -1056 1174 -1302 1442 -1595 1764 -1949 2148
48 2148 -2368 2608 -2875 3166 -3488 3850 -4252 4704 -5216 5805 -6488 7286 -8238 9399
62 9399 -10852 12726 -15243 18829 -24380 34151 -56334 212646 -291171 -667944 248107 477138
74 477138 -93959 -324082 117383 108511 -172372 22569 302800 -91205 -395238 37731
84 37731 463823 46329 -434605 -153160 317614 208656 -131184 -223569 -56182 143889
94 143889 198084 -24424 -275703 -113129 269505 180268 -205331 -191510 111200 116463 -62507
105 -62507 -954 65379 -150584 -136347 259556 235253 -313979 -355657 288236 435981 -225169
116b25169k29488N87335K56619m50478k17350L11755J14134k21254L9912J91221
126A57237j91974k15708K91245K80672l13107l50866K69360L77407j76417l32085
136b04236O5547K27303K0237r0521m5651m7168J2922J53151M9163j95367j11118
147a65738J70572J48217j04245j36325K8384O5331L3150M3154n8188j55278L3162
158i7804K41730K8613k82980r4187K66533J32410k03902j28379J25958P7511p0238
169d735J1048N2367j12440p2352J89619J23329k25273j87335K16257K32980j71590
180E1875k37677J04519J99504m3166j32675J5530N2031k9487J9927O9815n8028
191A2168j17748N0175J57136j0862j68752l8147J39768Q2543p8309j09581Q940
$$ plain form
116 -225169 -454657 132678 389297 -61181 -278531 33224 147358 -73896 -33984 157237
126 157237 -34737 -250445 40800 321472 8365 -342501 -73141 304266 127849 -204236
136 -204236 -138689 88614 108851 18330 -27321 -74489 -61567 91584 140747 -54620 -165738
147 -165738 4834 153051 48806 -87519 -59135 6196 39346 82500 24312 -130966 -97804
158 -97804 143926 172539 -110441 -204628 61905 194315 -9587 -137966 -12008 65503 -4735
169 -4735 6313 58680 -53760 -126112 63507 186836 -38437 -225772 -9515 223465 51875
180 51875 -185802 -81283 118221 75055 -57620 -42090 9941 -19546 381 70196 12168
191 12168 -105580 -55405 101731 90869 -77883 -116030 23738 106281 27972 -81609 -72669
202g2669J04990N1209o9407r0454K3259R9782J2133p4782k7891L4133J9306j71
214I438J6807j2447o9868M748J17507K4503j41159o9070J40004J11384j17332
225A4515j29235P7751J21567l4906r5712J0478N9084j2227j9193L1735p176n7574
237d0893P226Q4387J2854j01649l9255R6183O5094o7276q6356L0187R1424Q52
249E2778p2820k5394M1390L9043j7626l0920K993O817K917J4242L241k1538k7032
262c1909K0216N2664j3574o4358n251O1654L1687n4896m8431M1354M6416j8000
274A7572l6851m036K6839P673j2211L578p377j4058J5484K1586n023l3015r466
287b9305M0599J7313l2717k3253J4009L2075p32l2448l298J7850Q972j590j3397
$$ plain form
202 -72669 32321 83530 14123 -76331 -53072 46710 58843 -15939 -43830 -9697 9609 9438
214 9438 26245 13798 -56070 -51322 66185 90688 -50471 -119541 20463 131847 14515
225 14515 -114720 -36969 84598 49692 -46020 -35542 23542 11315 -7878 23857 16681 -40893
237 -40893 -33667 50720 63574 -38075 -77330 18853 83947 16671 -69685 -39498 51926 52778
249 52778 -20042 -45436 -4046 34997 17371 -13549 -10556 -3739 -822 13420 16661 -4877 -31909
262 -31909 -11693 40971 27397 -36961 -42212 19442 51129 -3767 -52198 -10844 35572 17572
274 17572 -19279 -23315 3524 11197 -1014 2564 -4813 -18871 -3387 18199 13176 -19839 -29305
287 -29305 11294 28607 -4110 -27363 -13354 18721 17989 -14459 -17757 93 9065 7475 -5922
300e922l478O987L926Q152o976j5458O425J2696N547j0402j7189J1932J7011o148
314G103j0051o058R080J0891p527n427p50J045R291j579p610r42R82R029N54j2456
330d425P13O736L263r69r221J961O689j605J91m148k015O022m2j104k550l396
346c900O639K174n284k289O34N044P30o521L73K324R91Q28m111m72K484k35J737
363A146k436l149L074K283J05m141k477N831J386l270j630o9L325M63k702P06
379a555r17J51K726Q4j824l411K535O347l523o100K653M878R35n761j857P072
395B433j77m910J341L653l01n850J355R634l775r315L369Q675Q43j1400j856J3300
411G019M52j1216m91R963K022j2234j632J6058j154j6036j22J6166M445j9004
$$ plain form
300 -5922 -9400 -2413 1513 9665 2689 -12769 -6344 6352 11899 1497 -15692 -3760 13251 7103
314 7103 -2948 -9006 74 10965 3438 -1989 -2739 -1694 7597 6018 -1592 -2534 -1552 7477 8031 -4425
330 -4425 -3712 3024 6287 5318 -3903 -1942 4747 3142 3333 -815 -2830 3192 3150 2046 -504 -3900
346 -3900 2739 4913 -371 -2660 -2026 3018 3748 -2773 -2400 -76 915 1743 -2368 -2840 -356 -591 1146
363 1146 -1290 -4439 -1365 918 1023 -3118 -5595 236 1622 -1648 -3278 -3347 -22 441 -2261 -1555
379 -1555 -2472 -2321 405 489 -1335 -4746 -2211 4136 613 -5487 -2834 2044 2979 -2782 -4639 2433
395 2433 2256 -2654 -1313 2340 2039 -3811 -2456 7178 3403 -5912 -2543 6132 6975 -4425 -6281 7019
411 7019 7471 -3745 -4236 5727 7749 -4485 -6117 9941 8787 -7249 -7371 8795 13240 -5764
425e764p577K1126P795j8723r702J5158J2657j5491j2017J6370Q596j5975q410
438a1957J5912J2331k0250j5942K2722J8925k0680k4602J6413L0328j3433l2426
450b2659R800L0001n118k7161J951K6012m841k4863J0189K4373j3345k9056J4441
463a0276L8138j5221m4808J1960M6504k462m7004p118M5371J1340l7615j1555
475b2746K6376J1259j9679o946J9482j475k0815P526K3510l581l0502m662L6860
488A4607J3955l5036k4224K5951L6057j5725m2231P581L8314J403k9922o496K4886
501I120R52k2514J3374K1566k5037k7818L1628M2427l4892n7152L3763O3779k5127
514B4069o1941J1111N6856l603m5933P050K7030j5568j0549K6376N182m1645j0062
$$ plain form
425 -5764 -13341 7785 15580 -3143 -12845 2313 14970 -521 -12538 3832 12428 -3547 -11957
438 -11957 3955 16286 -3964 -19906 2816 21741 1061 -23541 -7128 23200 9767 -22659
450 -22659 -12859 17142 12024 -15137 -13186 12826 7985 -16878 -6689 17684 4339 -24717 -10276
463 -10276 27862 12641 -32167 -20207 26297 23835 -23169 -30287 15084 26424 -11191 -22746
475 -22746 3630 14889 -4790 -11736 7746 6271 -14544 -7018 16492 12911 -17591 -22253 14607
488 14607 28562 -6474 -30698 -4747 31310 15585 -26646 -19065 19249 20652 -9270 -15766 9120
501 9120 10072 -12442 932 22498 -2539 -30357 1271 43698 8806 -48346 -14583 49196 24069
514 24069 -37872 -26761 30095 26492 -19441 -12391 14639 -929 -11478 14898 20080 -21565 -31627
527c1627N6708J6721o0318k5071M9227L4019l1979l7675J6027K7663q76r546j2432
540i159n962J4341J6270n221k1897n613J7466R628L11o305k5607l401M5396K1491
554D1738n4765m6605N8375O5474n5584p0998M6755O5454l9085n3232M2743L5502
566C5772n8432j5840Q0423M565j02916p059J23816J8174j34154l0933J28448M1478
578H3342j08407m5557Q4204L7749o1316j7749M3759n784l5041K4372L8224l3287
590D509m6776K9810N1671j1984m6638j6047L1059M3542n431o1833k7394P0410
602A4898N7802p0071p6614O3266Q1087n6361p3991N7730N8612p3126l8999R6878
614D1111K5452j24919k4774J51189L4449j68350m7555J68207N7973j51253o3099
$$ plain form
527 -31627 25081 41802 -18516 -43587 5640 39659 7680 -29995 -13968 13695 12819 3273 -9159
540 -9159 -15121 -780 15490 10269 -11628 -17241 225 9853 10164 3859 -21748 -25149 20247 41738
554 41738 -13027 -59632 -1257 64217 8633 -62365 -15610 49844 10759 -42473 270 35772
566 35772 -22660 -38500 41923 46488 -56428 -63487 60329 78503 -55651 -86584 41864 83342
578 83342 -25065 -70622 13582 51331 -9985 -27734 16025 10241 -24800 -428 37796 4509
590 4509 -42267 -12457 39214 27230 -19408 -35455 -4396 39146 33715 -28118 -55512 14898
602 14898 72700 2629 -73985 -10719 70368 14007 -59984 -2254 56358 -16768 -55767 41111
614 41111 66563 -58356 -83130 68059 102508 -65842 -113397 54810 112783 -38470 -101569
625a01569J26951N5252j02736l3322Q1495M780o8343K0207O6410l6111p4123M1153
637a9956P9428l1660p4315P380N8722J9639l2528l7947l218M4991M1221m3571
649H186o9331L5759Q0967k4317p9691J9135O9497k7600n2979M9292L6867p6455
661c0670l0633J03866L7849j27117n0181J37849O0596j31075o4454J12194N9926
672G8150r1966m0817P5670J1275o5276J9108O3824m1687p1026N3333Q1077n2946
684A8719q3720M1098P3611k1235n3787M831K5717J221P034J748l5814j0264N1380
697B0539K2191n2712l2231M4871L0668l0304j5905J4343q499n126L5356O945n9722
710b9586j8386P6428L0263p9633l8215P0123L8872n6253k9591M4743Q774l8503
$$ plain form
625 -101569 25382 80634 -22102 -55424 26071 30851 -37492 -17285 49125 13014 -61109 -19956
637 -19956 59472 27812 -46503 -39123 19599 39238 6710 -31237 -34455 10536 51757 8186
649 8186 -61145 -25386 55581 31264 -48427 -29292 40205 12605 -40374 8918 45785 -30670
661 -30670 -61303 42563 80412 -46705 -96886 40963 101559 -29516 -93970 18224 78150
672 78150 -13816 -54633 21037 32312 -32964 -13856 49968 8281 -62745 -9412 71665 18719
684 18719 -65001 -23903 49708 28473 -25314 -20483 5234 6455 13489 15237 -20577 -30841 20539
697 20539 42730 -9982 -42213 2658 33326 3022 -12883 1460 -7039 -12165 23191 30136 -29586
710 -29586 -47972 28456 58719 -20914 -59129 10994 49866 -6387 -35978 8765 17539 -20964
722b0964J7281L7975l8961m6770N2454O0719n6684p1773N1379P2528l7257o4078
734d4151K2780M7977j6192k5932J8576L745k5871J0330L6340j2546m6954O521
746b5377N1809L386m4684j4915K7056K4902o650k4914j3508J5419L0332j633l8961
759a7738q831L6126J5203k5757j5549J6946O015j1893J0392J2213k7377j7725
771b7975L7699L0506m1365m4487L9310N1963l0278n1131J7878M3958q313l2675
783a4910O781J8534j1814o016J8472J411k6893m399L3944J1465l5266j9094K7165
796f20K6531j4538k9369R56K4544R932j3767j7461L219J7504M467j1217q585K912
810e492O886K702N16m731j1628L593J9506L611k3174j4197K2316K2652j7229k5476
$$ plain form
722 -20964 -3683 34292 -4669 -51439 1015 61734 5050 -66723 -15344 57184 19927 -44151
734 -44151 -21371 26606 10414 -15518 3058 6803 -19068 -8738 27602 15056 -31898 -25377
746 -25377 26432 29818 -14866 -29781 -2725 22177 15527 -9387 -22895 -7476 22856 21223 -17738
759 -17738 -26569 9557 24760 -997 -16546 400 6415 -5478 4914 17127 -10250 -27975
771 -27975 9724 40230 -1135 -45622 -6312 45651 15373 -35758 -17880 26078 17765 -14910
783 -14910 -8129 10405 -1409 -7425 11047 12458 -14435 -18834 15110 26575 -8691 -27785 -620
796 -620 25911 11373 -17996 -17040 7504 17436 3669 -13792 -10573 6931 11398 181 -8404 -5492
810 -5492 1394 4096 4612 -119 -11747 -8154 11352 14963 -8211 -22408 -92 22560 5331 -20145
824b0145P913K3648J073j8882l964R851L000r65R52l840o350K757J3566J041j7977
839h322n386J6240J1151j0223j5878M342J5123J705q818p687K847R517K536n783
853A364o186j257Q685O058o237p952n18R323O111q003q041K089Q447N212q086
868A009p904M265O946K804o027p135L453O552J858m312p188K539P681Q23m589
883G75o016J839Q471k37n636l088J061O364N94n097k412M51N259K445n654l644
899d525J738N393J964o660l487M491L912n38m374k389M010K005m51j530l405J823
915b023L549M77k645l863K086N545j354m306r37L171L103k351k699O31R61J659
931A004L36k278o79K50K632J094l838j063K713K059o92l340P30K567n59l60r44
$$ plain form
824 -20145 -12232 11416 12489 -6393 -10357 -506 2494 1529 2481 -1359 -7709 -4952 8614 9655 -8322
839 -8322 -13708 2532 13683 3460 -12418 -8076 7047 8752 -66 -7753 -4906 4611 7147 1364
853 1364 -4822 -6079 2606 8664 2427 -5525 -6043 3280 9391 1388 -6653 -4564 3883 9095 1009
868 1009 -6895 -2630 4316 7120 1093 -6042 -2589 3963 5821 1509 -5679 -3140 4541 5364 775
883 775 -5241 -3402 5069 4832 -804 -3892 -2831 3533 4127 -970 -3382 -2931 2328 4773 -881 -4525
899 -4525 -2787 2606 4570 -2090 -5577 -1086 2826 2288 -2086 -4475 -465 1540 1089 -441 -3846 -2023
915 -2023 1526 2003 -642 -4505 -2419 3126 1772 -2534 -3471 -300 2803 452 -2247 -1616 -655 1004
931 1004 1340 -938 -1617 -1367 1265 2359 -1479 -2542 171 2230 1538 -1802 -1072 1495 936 576 -368
948c68P2R05R1O23l34k221J208K113m06j845j607L138J923l397j523K165J592
965B129q15k895J650K302k363j137J977Q82j709k353L248K387m263k026L170L155
981C339k751m774L535M991m014m543K849N230k664o375L066O385l550n602K936
996a942O143k505p611L365P835l779p489K569Q303j683r349J784R665j963q664
1011e321J98R095R07j0115m60J0126N14r056k109R481L220j0087l061R500L695
1026F527q397n006Q591N499q822m957Q418M963p560o277Q509O606q992o445Q448
1041A105P344p565r398P725J0608p724r772N543J0114l945j0804L812J0670m958
1055B755q828M617Q111m270r580N532J0579p042j0158O280J0453m211j2394L605
$$ plain form
948 -368 -296 609 700 1323 989 -1232 -24 2089 1683 -162 -1769 1369 3292 -105 -1628 537 2129
965 2129 1314 -1581 69 2371 8 -1129 848 1730 21 -2332 916 3303 -960 -2986 184 3339
981 3339 588 -4186 -651 4340 326 -4217 -1368 3862 1198 -5177 -2111 4274 724 -4878 -1942
996 -1942 4201 1696 -5915 -2550 5285 1506 -5983 -3414 4889 3206 -6143 -4359 5306 3343 -5321
1011 -5321 -5123 3972 4879 -5236 -5696 4430 4944 -4112 -6221 3260 6480 -3607 -6668 2832 6527
1026 6527 -1870 -6876 1715 7214 -1608 -6565 1853 6816 -744 -7021 1488 8094 -898 -7343 1105
1041 1105 8449 884 -8514 -789 9819 2095 -7677 -2134 7980 4035 -6769 -2957 7713 2755
1055 2755 -6073 -1456 6655 2385 -7195 -1663 8916 1874 -8284 -2004 8449 4238 -8156 -4551
1069d551J2480l892j0051K524P987j875p678L397P680o561o170O767O638n811
1083H84r957O130J1864n851j1400K397J0576J904j0404l474Q710K963n521k033
1097c212L233K231n518k61R345k270j1672J209J4785L145j9744o618K2745Q999
1111A6397k1628j2562J9287J5674j8013j4739J8444J0015j7915o110J8974N385
1123A3209k4027m675K9292N043l1413p779L0325J3481k8670j7341K5227J6773
1135A9445j7772j4775J0940J2199q039q507Q803L881r751l499J0530Q689j2213
1148f9j5332J1674K1727o071k8136l509L4105J1488l4964j8846L1597K4097k7375
1161C86k5132K4390K1000k4402j4204K6954Q645l3198o078M1558O084m8038r578
$$ plain form
1069 -4551 7929 4037 -6014 -3490 4497 2622 -5056 -1659 6021 -540 -6710 57 6695 884
1083 884 -9073 -2943 8921 3070 -8330 -5933 4643 6547 -3857 -7331 1379 4342 -1179 -3212
1097 -3212 21 2252 -3266 -3527 5818 3548 -8124 -6915 7870 11015 -8729 -15347 7398 16397
1111 16397 -5231 -17793 1494 17168 -845 -15584 2860 12875 -5040 -11150 7824 13209
1123 13209 -10818 -15493 13799 18842 -12571 -20350 9975 23456 -5214 -22555 2672 19445
1135 19445 1673 -13102 -2162 10037 1998 -6509 2294 6175 -3576 -7075 3455 12144 -69
1148 -69 -15401 -3727 18000 11929 -16207 -19716 14389 25877 -9087 -27933 3664 27761 386
1161 386 -24746 -356 20644 -3758 -17962 8992 17637 -15561 -21639 19919 26003 -22035 -31613
1174c1613N0406J5717m8796k1560M2817K3714l3404k1461K3079J5454j5398p802
1186h847J3402n69j4202N046J6763l347j9088l221J8826J2161j3461k0706K847
1199a4396K7484R716k9316k1263K5316K9865j8372l2539J2492K8782j0219j9510
1211a1960J2317J0253j9492m789L1846K887m3265o004N0077J3398n0830k1604
1223c7166M6309K4797l5403k2884K3147J5079j3409k726Q796r674j1302J9853
1235E417J6627k3193k2394J8469K6449r787k4525l55J5115R183j809j2835j2151
1248a5789R672K2426j298k7173p233K3720J2407j4168j1335K307M345N598Q921
1261A2400r077k3967O809L4873J467l9554j2110L7559J9455k9290j9349J6743
$$ plain form
1174 -31613 18793 34510 -14286 -35846 6971 30685 -2719 -24180 -1101 14353 -1045 -8847
1186 -8847 4555 3986 -10216 -5170 11593 8246 -10842 -14063 4763 16924 3463 -17243 -14396
1199 -14396 13088 22804 -6512 -27775 -2459 27406 9034 -23505 -11013 17769 7550 -11960
1211 -11960 357 10610 -8882 -13671 18175 21062 -22203 -28207 21870 35268 -15562 -37166
1223 -37166 9143 33940 -1463 -24347 -1200 13879 470 -2256 6540 -3134 -14436 5417
1235 5417 22044 -1149 -23543 -5074 21375 11588 -12937 -13292 1823 11006 9197 -3638 -15789
1248 -15789 -6117 16309 15011 -12162 -19395 4325 16732 2564 -8771 -6464 -2119 3479 12400
1261 12400 3323 -20644 -13835 21038 22505 -17049 -29159 8400 27855 -1435 -20784 -4041
1273d041J2353n953k85K177j4876n675K8259J4136l4792k3669L1747L2991k3411
1286H961l5614J2474K9579j602j7445m554L387L065Q457N623j5530j6411J5482
1299d128K3562o404k5156o536K0678J6456q931j9860p451J8127K1417j0686k7853
1312a6765j535K7209J2623k1378j6416J1147J1548N32j531o156j1135K662K4302
1325A5107O571l2299j8608L2010K8511k2525l5434J0606L4046k21k3644p278R590
1338c568Q228K716j444r944j0963J1465K1167n782k5521n595K3157J7714j5725
1351E905k2858K146K1269J1568j4361k0371M047K0728P760j4490j6189N673J5227
1364F054M705p141j2107l881J2068J4782m242k2309p246K3462J7533j7039k3799
$$ plain form
1273 -4041 8312 2359 2074 4251 -10625 -16300 11959 26095 -8697 -32366 -619 32372 8961
1286 8961 -26653 -14179 15400 13798 -3647 -8201 -4814 -1749 6708 12331 -3199 -19610 -4128
1299 -4128 19434 13030 -12126 -18662 2016 18472 9541 -10319 -17770 357 21774 11088 -16765
1312 -16765 -18300 8909 21532 154 -16262 -5115 6433 6965 5434 -722 -11857 -9195 15107
1325 15107 21678 -10621 -29229 2781 31292 8767 -26667 -16061 17985 17764 -5880 -13158 -3568
1338 -3568 4660 7376 5932 -4012 -14975 -3510 17657 11875 -13646 -19241 3916 21630 5905
1351 5905 -16953 -14807 6462 18030 3669 -16702 -12655 8073 15833 1343 -14846 -9173 6054
1364 6054 10759 3618 -8489 -12370 -302 14480 10238 -12071 -19317 4145 21678 4639 -19160
1377a9160N609K5256N081j9311j1778P697J3489M369q728j1820j383J3270J2943
1390A5534r215j9806j25K0398J0760j4643j8147N450J8258N610j2489j4042L759
1403h698J5918O079j0559j4550K692J6095O201j1135j3338K404J5033O774j0822
1416B094j3420K412J5081P880j2162j3751L369J6248M959j2419j1833M366J3715
1429F539M822j0762j1557L428J3279O110j1232j2404M238J4165M287j1455j0805
1442a1347N379J2763K489r683r587L846J1652L779r021j0180K954J3155L400j0483
1456h84r301M392J2237K296j0299p310M378R908K401q623p715L444J0246L087
1470H257q750p856L934R615L012r307p294M796R362J356q325o381M440Q490J149
$$ plain form
1377 -19160 -13551 11705 16786 -2525 -14303 -6606 6883 11252 2524 -9296 -10679 2591 15534
1390 15534 6319 -13487 -13612 6786 17546 2903 -15244 -9794 8464 14074 1585 -12457 -8698
1403 -8698 7220 13299 2740 -11810 -9118 6977 13178 2043 -11295 -8891 6142 12916 2094
1416 2094 -11326 -8914 6167 14047 1885 -11866 -8497 7751 12710 291 -11542 -7176 6539
1429 6539 11361 599 -10958 -7530 5749 11859 627 -11777 -7539 6626 10913 -542 -11347
1442 -11347 -5968 6795 9284 -399 -9986 -6140 5512 9291 270 -9910 -6956 6199 9599 -884
1456 -884 -10185 -5793 6444 8740 -1559 -8869 -4491 5417 7818 -805 -8520 -5076 5170 8257
1470 8257 -493 -8349 -4415 5200 8212 -1095 -8389 -3593 5769 7125 -1200 -7581 -3141 5349 6498
1485F498p458n956L850Q486J091p086o051L649Q755L12p252m785L390P768P26
1500E937p121m358L616O759O90o786l979L146O407R36o620l919L762N618K23n780
1516a469l422L632M639N1m196l663K753M363N21l510m199K274N534r5m411l522
1532d720K713N978j702m792j010L139L567j998l448N36J097J141J043j582k511
1547b549K03L202K980m493m221L482M898n66o031q54O024Q91m035q41J607J754
1563A451j282q22K017j376j845J777K357j072l511K3N137K0n021l39L311K612
1579C437l056l263K905L012k259k290J334K573j791k882L049K211k762k513K353
1594E8L406k584m196L042M130k738l765J632M118j777m371K110L716k001k937
$$ plain form
1485 6498 -960 -6916 -3066 5420 6511 -575 -6626 -2977 5778 6090 -1162 -5947 -2557 5211 5937
1500 5937 -1184 -5542 -1926 4833 5523 -1263 -5242 -2096 4311 5247 -1373 -5292 -1530 4088 4311 -1469
1516 -1469 -4891 -1259 3380 3431 -765 -4428 -1675 2688 3209 -301 -4500 -2226 3308 3213 -1198 -4720
1532 -4720 -2007 3971 2269 -2523 -3533 -394 3173 1175 -2273 -1737 -640 501 1544 -38 -2549
1547 -2549 -2346 856 3836 -657 -4878 -1396 3502 2936 -3095 -3949 2075 2966 -1069 -1910 -303 1451
1563 1451 169 -653 1364 -12 -1857 -80 2277 1205 -2306 -2283 2854 2874 -2147 -2486 825 3437
1579 3437 381 -2882 23 3035 776 -1514 -180 2393 602 -2280 769 2980 218 -2295 58
1594 58 3464 880 -3316 -274 3856 1118 -2647 -1015 3103 1326 -3045 -935 2781 780 -2157
1609b157J248L385j648l747K205L245j967k922J193L472j599l445J697L444j857
1624E47l095J064L500q53l975J069L341k11l481N1L425L36l762L31L503n41l471
1641b222J55M059j36m738P06M589k33n018JN661K88n878j77N540P28o110p47O271
1659B739J029o355j333O316J929o243k761O967K874p331k260O679K998o532l681
1674d965P042L808p232m062P215M616p223n634P616O243p478o503O247P538n652
1689A576p838N025P711n028p090L697Q172l478r133L397R511k988r832J252J0985
1704E939L61j2441j346J1958L174j1129m788J0617N178j0130m757R836M077r907
1718c358m037J0746M416j2549m496J3249N969j3706q051J3652R752j2235j0391
$$ plain form
1609 -2157 -909 2476 828 -2919 -714 2531 564 -2358 -1165 2307 708 -2737 -1040 2404 547
1624 547 -2548 -1484 2016 1163 -2812 -1743 1598 1387 -2094 -2043 1382 1718 -2044 -1713 1790 1249 -2222
1641 -2222 -2067 1992 1856 -2882 -2176 2413 2180 -2838 -2837 2824 3112 -2766 -2943 2597 3325 -2785 -3532 2739
1659 2739 3768 -2587 -3920 2396 4325 -1918 -4679 2288 5162 -2169 -4429 2250 5248 -1284 -4965
1674 -4965 2077 5885 -1347 -5409 1806 6422 -801 -6435 1181 7424 -54 -6557 -310 7228 1576
1689 1576 -6262 -1237 6474 1446 -5644 -1947 6225 2747 -6386 -2989 6522 3534 -6298 -5046 5939
1704 5939 6300 -6141 -7487 4471 7645 -3484 -8272 2345 7523 -2607 -7364 2472 6549 -3358
1718 -3358 -7395 3351 7767 -4782 -9278 3971 9940 -3766 -11817 1835 11587 -648 -11039
1731a1039R985R981o964r361N144Q062m785n832M487M706m522n403N558O350n371
1746I96p756M181R009q86j0902k241J1550M598r514p243P649Q132o453o822N718
1761A6M497n354l137O866L128j0694k890J3738L777j4598o778J4308R883j3174
1775d12j0588J0020R130n612p012K690M196k964M81M331m416n610M670P581k746
1790C739r814N59Q964K465n994m599J109N989K740m203n996N73P419K935o954
1805a068l859L061L722N92j558k599l216L096Q126j335j1933j386J2167N816j1096
$$ plain form
1731 -11039 -1054 8927 1963 -7398 -2254 5808 1023 -4809 -322 4384 -138 -5541 17 6367 996
1746 996 -6760 -2579 6430 5544 -5358 -7599 3951 8549 -965 -8208 -559 7573 1120 -5702 16
1761 16 4513 -841 -3978 2888 6016 -4678 -7568 6170 9947 -4651 -11429 2879 12762 -412
1775 -412 -11000 -980 8150 2538 -4474 -1784 2412 -552 -71 4260 -156 -5766 -1096 6485 3739
1790 3739 -6075 -5516 3448 5913 -81 -4680 -3571 2418 5158 955 -5041 -4468 2951 5886 -1068
1805 -1068 -4927 -1866 1856 2448 890 -1709 -4925 -1829 6297 4962 -6971 -8357 3810 9626 -1470
$$ [...]
8191a12
##END NTUPLES=NMR FID
##END=
