##TITLE=1H_Pr BrBnCl
 CDCl3, 8 sc, 
 4.06.2021
##JCAMPDX= 6.0         $$ Bruker NMR JCAMP-DX V2.0
##DATA TYPE= NMR FID
##DATA CLASS= NTUPLES
##ORIGIN= UXNMR, Bruker Analytische Messtechnik GmbH
##OWNER= root
$$ XWIN-NMR		Version 3.5
$$ Fri Jun  4 13:19:05 2021 Russian Standard Time (UT+4h)  she@DPX200
##.OBSERVE FREQUENCY= 200.131506
##.OBSERVE NUCLEUS= ^1H
##.DELAY= (6, 6)
##.ACQUISITION MODE= SIMULTANEOUS
##.ACQUISITION SCHEME= undefined
##.AVERAGES= 8
##.DIGITISER RES= 18
##SPECTROMETER/DATA SYSTEM= spect
##.PULSE SEQUENCE= zg30
##.SOLVENT NAME= CD3CN
##.SHIFT REFERENCE= (INTERNAL, CD3CN, 0, 15.7039)
##AUDIT TRAIL= $$ (NUMBER, WHEN, WHO, WHERE, WHAT)
$$ ##TITLE= Audit trail, XWIN-NMR		Version 3.5
$$ ##JCAMPDX= 5.01
$$ ##ORIGIN= Bruker BioSpin GmbH
$$ ##OWNER= she
$$ F:/spectra/data/she/nmr/H-F/1/audita.txt
$$ ##AUDIT TRAIL=  $$ (NUMBER, WHEN, WHO, WHERE, WHAT)
(   1,<2021-06-04 13:17:55.50 +0400>,<she>,<DPX200>,
      <created by zg, POWCHK disabled, PULCHK disabled
       configuration hash MD5:
       00 E9 B6 7A A2 85 ED C7 34 08 36 98 17 FE 4E 26
       data hash MD5: 16K
       3E 48 C3 2B A2 DA 0C 24 33 71 0B 07 42 0A BD 0B>)
$$ ##END=
$$ 
$$ hash MD5
$$ CD 39 22 E9 FE 1C 8A 58 D0 D7 B1 32 A5 5E 02 08
##$RELAX= 
##$RELAX= 
##$RELAX= 
##$RELAX= 
##$RELAX= 
##$RELAX= 
$$ Bruker specific parameters
$$ --------------------------
##$DU= <F:/spectra>
##$EXPNO= 1
##$NAME= <H-F>
##$PROCNO= 1
##$TYPE= <nmr>
##$USER= <she>
##$AMP= (0..31)
100 100 100 100 100 100 100 100 100 100 100 100 100 100 100 100 100 100 
100 100 100 100 100 100 100 100 100 100 100 100 100 100 
##$AQSEQ= 0
##$AQ_mod= 1
##$AUNM= <au_zg>
##$AUTOPOS= <>
##$BF1= 200.13
##$BF2= 200.13
##$BF3= 200.13
##$BF4= 200.13
##$BF5= 200.13
##$BF6= 200.13
##$BF7= 200.13
##$BF8= 200.13
##$BYTORDA= 1
##$CFDGTYP= 0
##$CFRGTYP= 5
##$CHEMSTR= <none>
##$CNST= (0..31)
1 1 145 1 1 1 1 1 1 1 1 1 1 1 1 1 1 1 1 1 1 1 1 1 1 1 1 1 1 1 1 1 
##$CPDPRG= <>
##$CPDPRG1= <>
##$CPDPRG2= <>
##$CPDPRG3= <>
##$CPDPRG4= <mlev>
##$CPDPRG5= <mlev>
##$CPDPRG6= <mlev>
##$CPDPRG7= <mlev>
##$CPDPRG8= <mlev>
##$CPDPRGB= <>
##$CPDPRGT= <>
##$D= (0..31)
0 1.2 0 0 0 0 0 0 0 0.06 0 0.03 0 0 0 0 0.0002 0 0 0 0 0 0 0 0 0 0 0 0 
0 0 0 
##$DATE= 1622798274
##$DBL= (0..7)
120 120 120 120 120 120 120 120 
##$DBP= (0..7)
150 150 150 150 150 150 150 150 
##$DBP07= 0
##$DBPNAM0= <>
##$DBPNAM1= <>
##$DBPNAM2= <>
##$DBPNAM3= <>
##$DBPNAM4= <>
##$DBPNAM5= <>
##$DBPNAM6= <>
##$DBPNAM7= <>
##$DBPOAL= (0..7)
0.5 0.5 0.5 0.5 0.5 0.5 0.5 0.5 
##$DBPOFFS= (0..7)
0 0 0 0 0 0 0 0 
##$DE= 6
##$DECBNUC= <off>
##$DECIM= 32
##$DECNUC= <off>
##$DECSTAT= 4
##$DIGMOD= 1
##$DIGTYP= 9
##$DL= (0..7)
0 120 120 120 120 120 120 120 
##$DP= (0..7)
150 150 150 150 150 150 150 150 
##$DP07= 0
##$DPNAME0= <>
##$DPNAME1= <>
##$DPNAME2= <>
##$DPNAME3= <>
##$DPNAME4= <>
##$DPNAME5= <>
##$DPNAME6= <>
##$DPNAME7= <>
##$DPOAL= (0..7)
0.5 0.5 0.5 0.5 0.5 0.5 0.5 0.5 
##$DPOFFS= (0..7)
0 0 0 0 0 0 0 0 
##$DQDMODE= 0
##$DR= 18
##$DS= 0
##$DSLIST= <SSSSSSSSSSSSSSS>
$$ [...]
##$SUBNAM2= <"">
##$SUBNAM3= <"">
##$SUBNAM4= <"">
##$SUBNAM5= <"">
##$SUBNAM6= <"">
##$SUBNAM7= <"">
##$SUBNAM8= <"">
##$SUBNAM9= <"">
##$SW= 20.0188882624521
##$SWIBOX= (0..15)
0 0 2 0 0 0 0 0 0 0 0 0 0 0 0 0 
##$SW_h= 4006.41025641026
##$TD= 16384
##$TD0= 1
##$TE= 0
##$TE2= 300
##$TE3= 300
##$TEG= 300
##$TL= (0..7)
0 120 120 120 120 120 120 120 
##$TP= (0..7)
150 150 150 150 150 150 150 150 
##$TP07= 0
##$TPNAME0= <>
##$TPNAME1= <>
##$TPNAME2= <>
##$TPNAME3= <>
##$TPNAME4= <>
##$TPNAME5= <>
##$TPNAME6= <>
##$TPNAME7= <>
##$TPOAL= (0..7)
0.5 0.5 0.5 0.5 0.5 0.5 0.5 0.5 
##$TPOFFS= (0..7)
0 0 0 0 0 0 0 0 
##$TUNHIN= 0
##$TUNHOUT= 0
##$TUNXOUT= 0
##$USERA1= <user>
##$USERA2= <user>
##$USERA3= <user>
##$USERA4= <user>
##$USERA5= <user>
##$V9= 5
##$VALIST= <valist>
##$VCLIST= <CCCCCCCCCCCCCCC>
##$VD= 0
##$VDLIST= <DDDDDDDDDDDDDDD>
##$VPLIST= <PPPPPPPPPPPPPPP>
##$VTLIST= <TTTTTTTTTTTTTTT>
##$WBST= 1024
##$WBSW= 4
##$XGAIN= (0..3)
0 0 0 0 
##$XL= 0
##$YL= 0
##$YMAX_a= 411408
##$YMIN_a= -408649
##$ZGOPTNS= <>
##$ZL1= 120
##$ZL2= 120
##$ZL3= 120
##$ZL4= 120
##$ABSF1= 10
##$ABSF2= 0
##$ABSG= 5
##$ABSL= 3
##$ALPHA= 0
##$AQORDER= 0
##$ASSFAC= 0
##$ASSFACI= 0
##$ASSFACX= 0
##$ASSWID= 0
##$AUNMP= <proc_1d>
##$AZFE= 0.1
##$AZFW= 0.1
##$BCFW= 1
##$BC_mod= 2
##$BYTORDP= 1
##$COROFFS= 0
##$CY= 11.3945322036743
##$DATMOD= 1
##$DC= 2
##$DFILT= <>
##$DTYPP= 0
##$F1P= 15.9154993809931
##$F2P= -4.1035820241983
##$FCOR= 0.5
##$FTSIZE= 0
##$FT_mod= 4
##$GAMMA= 1
##$GB= 0.15
##$INTBC= 1
##$INTSCL= 1
##$ISEN= 128
##$LB= 0.24
##$LEV0= 0
##$LPBIN= 0
##$MAXI= 10000
##$MC2= 0
##$MEAN= 0
##$ME_mod= 0
##$MI= 1.114404
##$NCOEF= 0
##$NC_proc= 0
##$NLEV= 6
##$NOISF1= 3.799351
##$NOISF2= 2.8
##$NSP= 1
##$NTH_PI= 0
##$NZP= 0
##$OFFSET= 15.70392
##$PC= 1
##$PHC0= -11119.9
##$PHC1= 11.00101
##$PH_mod= 1
##$PKNL= yes
##$PPARMOD= 0
##$PSCAL= 0
##$PSIGN= 0
##$REVERSE= no
##$SF= 200.130013532006
##$SI= 16384
##$SIGF1= 3
##$SIGF2= 2
##$SINO= 400
##$SIOLD= 16384
##$SREGLST= <1H.CDCl3>
##$SSB= 0
##$STSI= 0
##$STSR= 0
##$SW_p= 3612.71676300578
##$SYMM= 0
##$S_DEV= 0
##$TDeff= 0
##$TDoff= 0
##$TI= <>
##$TILT= no
##$TM1= 0
##$TM2= 0
##$TOPLEV= 0
##$USERP1= <user>
##$USERP2= <user>
##$USERP3= <user>
##$USERP4= <user>
##$USERP5= <user>
##$WDW= 1
##$XDIM= 8192
##$YMAX_p= 0
##$YMIN_p= 0
$$ End of Bruker specific parameters
$$ ---------------------------------
##NTUPLES= NMR FID
##VAR_NAME=  TIME,          FID/REAL,        FID/IMAG
##SYMBOL=    X,             R,               I
##VAR_TYPE=  INDEPENDENT,   DEPENDENT,       DEPENDENT
##VAR_FORM=  AFFN,          ASDF,            ASDF
##VAR_DIM=   8192,          8192,            8192
##UNITS=     SECONDS,       ARBITRARY UNITS, ARBITRARY UNITS
##FACTOR=    0.0002496,     1,               1
##FIRST=     0,             0,               0
##LAST=      2.0444736,     0,               0
##MIN=       0,             -408649,         0
##MAX=       2.0444736,     411408,          0
$$ Real data points
##PAGE= N=1
##DATA TABLE= (X++(R..R)), XYDATA
$$ [...]
2074E12j089KM88J128m17j395k64P77J193l47j120m82Q27J183k48j217n89R34
2092a24J027l01j117j84P34Q12o06r63j51J033P18o10p44l41R79O63l97j034J21
2111d85N50O49m37j238L74Q12J69o2p78m11J110L01j37q90j65P18P44n77q64j8
2131f35R26M37o10m83j94Q56M66j16j015j11J077J92p47n27Q0O89N05r08k99K33
2151a84N11J06o18L6J82n4K73j55l50k6M59Qj37k44J81N0J06K92n71J05k74M58
2173A54L72k23j021M48R79m08o11k61Q17O32n47q84j06P08O73n10j047L01R73
2192D39J88o98q10J027N87l87p18j12P87K24n03o34K91O86K54j022n57J280N6
2211C78j89j048R2J406p9j287M1P00O31k54j010L6R03N79o61j228P11Q86R9r58
$$ y = [512, -577, -575, -87, 1041, 624, -771, -1035, -258, 935, 588, -532, -1014, -187, 996, 748, -469, -1058, -124, 903, 602, -515, -699, 35, 847, 241, -722, -873, 160, 878, 268, -476, -817, 162, 825, 428, -606, -485, 65, 714, 277, -961, -587, 225, 394, 332, -446, -857, 253, 554, 417, -473, -638, 80, 824, 247, -617, -635, 291, 728, 118, -365, -559, 297, 763, 647, -368, -479, 598, 790, 43, -484, -404, 285, 790, -118, -417, -184, 327, 433, -185, -149, 33, -21, 252, 97, -253, -279, 180, 188, 51, -193, -12, 38, 144, 436, -135, -30, -304, 154, 526, 303, -718, -270, 709, 301, -310, -571, 246, 878, 331, -553, -659, 49, 722, 212, -835, -534, 439, 627, -71, -881, 146, 733, 346, -372, -484, 303, 527, 24, -610, -319, 367, 621, -401, -958, 322, 378, 189, -859, -767, 639, 560, -727, -686, 14, 645, 391, -619, -583, 320, 899, 238, -990, -279, 607, 706, -252]
2231b52n44J067P19q02q84PJ611L1j524n18J168O92m23p93m76J513L96j153n87
2250g52L18J417k78j422j15J159Q05j050j336J145J099k62j284n97J443J086j227
2267A49j311J59J876P37k013j598J769J509l81k380k8K135J236j722j939P41K575
2284A514m89k006l58J181J503l24k254m21K375P16j563j706J039K034j82k261
2300a202k26J636J389j422j661N69J914rj526q66J451J324q77j763J92K084O29
2317A636k015j071J294J834o00k792M64K418N82k075j445J312K287q26k229k02
2333a428J538J889j447j916K10K516N78k443j554J619K235q77k220m71K354J591
2349B174k470j554J058K145L70k516j111K185J580j033k563K03K846K51k175j045
$$ y = [-252, -796, 271, 990, 188, -696, -689, 922, 953, -571, -1089, 79, 771, 348, -445, -921, 592, 988, -165, -752, -434, 983, 705, -717, -832, 327, 1132, 82, -1254, -109, 990, 728, -556, -1153, 290, 1376, 149, -1162, -1003, 873, 1610, -403, -2001, -232, 1277, 896, -1484, -1512, 623, 1859, 137, -1802, -1061, 1514, 1025, -981, -1339, -158, 1345, 1021, -1233, -1654, 721, 1437, -126, -1832, -793, 1241, 1059, -1202, -1428, 208, 1597, 175, -1486, -917, 997, 988, -538, -1404, 47, 1371, 494, -1269, -1077, 1007, 1636, -379, -1450, -156, 1678, 1078, -1714, -1250, 1168, 1750, -325, -1770, -458, 1829, 1003, -1226, -1428, 110, 1999, 552, -1364, -1154, 1362, 1940, -503, -2057, -438, 1797, 920, -1300, -1771, 583, 2174, -296, -1850, -792, 1353, 1723, -793, -1904, 281, 1861, 828, -1735, -1532, 1314, 1565, -610, -1655]
2365a655R76K228n18k435O4J990R96j465k186J491K064l12k349j070K541J433
2381A793j660j884N51K182M58k080j157J793J380q13j827j13K108P94j722j288
2397a485Q47K032j69k400k0K067N66j299j749J359J585m49j630o99J508J508j053
2414E19k121O10J992J004k521j637K084K216q48k779k76L060P87k322j765J220
2430g77K562j95k212j068J445J858j48k761l41K053J746j572k637R96K483N4k209
2447g23n42J272J289j048j324R37K95J87k32n56oP18J16l46q26R12M66r95l08
2466g14J108R93j588j330J645J610j507j674K96K130M67j877q86N12J505P91j204
2483B77k363Q38K728N02k683j886K399K902j726k940J17K393J471j674j764M27
$$ y = [-1655, -679, 1549, 1031, -1404, -1340, 650, 1646, 181, -2005, -514, 1550, 1238, -1111, -2181, 360, 1793, 133, -1751, -1200, 982, 1440, -640, -1797, -4, 1376, 563, -1264, -1377, 731, 1525, -197, -1485, -638, 1394, 1225, -1175, -1195, 872, 1438, 139, -1610, -251, 1334, 885, -745, -1444, 64, 1572, 519, -1602, -992, 1000, 2004, -517, -2154, -70, 2146, 1298, -1481, -1757, 1303, 2090, -232, -1997, -777, 1785, 1590, -622, -1690, -245, 1613, 1465, -1296, -1637, 416, 2162, 590, -2047, -1051, 1432, 1486, -723, -1265, 7, 1296, 248, -1076, -139, 156, 343, 111, -445, -451, 267, 383, 37, -789, 123, 589, -406, -714, 394, 1387, -201, -1531, 114, 1724, 217, -1457, -1161, 969, 1436, -441, -1327, -815, 690, 1481, 277, -2086, -1248, 1480, 1982, -701, -2587, -188, 2714, 988, -1952, -1835, 558, 2029, 355, -1409, -982]
2499i82J592J242j552j659j06K200J465j942j893R11K043n7j771m47J140K51J11
2516E46j76p00p15Q76R00J82j929k76J864N12m28j444j77R80Q42R3j206q65N54
2535e67K287m38k425j020K325J869j391k545L14K001J515j539j687l30K166J052
2551A587q20k622K4K774J271k145k112Q15K833l24j506j256N78J850K15j084j351
2568a273q3J880J163j997j226J42K325R25k236j216R60J476L67j146j374K91J788
2585G66Q43j413k020Q26K045O27j747k019J626J915N8j320j768Q14K069L65j727
2602f0j557P47K131K71j836j500J254K141J27k303r44J001J834q1j441j099P12
2619f03J857N02k310j091R85K165n4k151j045J417J543Mj620j230R31K181j92
$$ y = [-982, 610, 1852, 300, -1359, -1465, 735, 2200, 258, -1635, -724, 1319, 1262, -509, -956, 184, 435, 546, 370, -330, -1045, -169, 731, 913, -1016, -1292, 572, 1084, 656, -788, -965, 15, 857, 950, -256, -1121, -567, 1720, 1282, -1143, -2163, 162, 2031, 640, -1905, -1591, 410, 1925, 386, -1301, -1631, 535, 1587, 767, -1855, -1831, 943, 2214, 69, -2043, -1228, 1605, 1281, -225, -1481, -903, 947, 1162, 78, -1273, -1356, 524, 1687, -310, -1536, -1394, 931, 1856, -380, -1596, -636, 840, 1207, 61, -1313, -1022, 766, 1609, 196, -1824, -998, 1047, 1674, -73, -2092, -466, 1449, 1507, 187, -1581, -767, 1302, 1667, -60, -1617, -870, 1261, 1532, -304, -1804, -550, 1591, 1718, -585, -1529, -528, 1306, 1225, -216, -1315, -603, 1254, 1756, -554, -1645, -660, 1505, 1451, -700, -1745, -328, 1215, 1219, -401, -1631, -700, 1481, 1289]
2636A289j992j187J319K135l85j989q37J255J948n96j856l09Q76J830o12j762
2652h73o10J102J790l51j967p92J804J362p12j898q5J288Q18Kj507r07J812J148
2670A424r52j131n63J192J362o75j316o04J393J203q30j495k35J298J340j078
2686C33j166N9J143P23o04j227K5R56P42o42j142Q3R57Q99p68j282Q6J447J56
2705G78o39p43J0R19M93j93j111j20Q07O18j24j604J54J028Q02q49r56J69M78
2724h3P92k18r58k12O15J104p11j269n6J420M88j080q96M39J143J61r31p76P34
2743b94O68M18j107p10P23J111Qj052p21Q22R98p59n52K83o8K29o4l5j51J9J4
2764b20O89o08o2L63k39O65l69j26r53M72M4Q39o01n28N3J687o60j46j277J476
$$ y = [1289, -703, -1890, -571, 1564, 1179, -810, -1647, -392, 1556, 960, -896, -1205, -329, 1501, 889, -873, -1483, -381, 1409, 1058, -909, -1701, 103, 1465, 753, -1145, -1230, 58, 876, 878, -629, -1536, 276, 1424, 472, -659, -1222, -30, 1332, 657, -659, -1263, 130, 1333, 503, -992, -1227, 71, 1411, 333, -833, -774, 369, 1092, 488, -739, -714, 242, 984, 342, -800, -717, 240, 1139, 371, -911, -825, 622, 778, 139, -604, -594, 325, 818, 625, -486, -606, 201, 819, 695, -909, -755, 273, 1075, 226, -730, -561, -83, 709, 491, -467, -679, -64, 1040, 329, -940, -996, 424, 912, -168, -1064, -625, 518, 679, -252, -1028, -294, 374, 792, -315, -1025, -302, 809, 817, -235, -956, -134, 864, 105, -447, -164, -232, -3, -67, -102, -253, -234, -220, 469, -139, -201, 162, -77, 588, 219, 93, -860, -388, -344, 495, -106, -634, -581, 1106, 446, 300, -977, 499]
2784D99M94j172L25n80R72j7J64j220L20N73O24j354m15M86J365n46j131k97J216
2803C06N94q03p52K76R19r0l38o14j29R92J61r40j12O96M08o02n56P43K39k99
2823I9p29N7P71J63o46l69N80P49k22p95k13Q90L61n34j042M03R61J14o36p74
2843h12Q55R07q04p68J37J015J48p86o57N53P09L1q91k58Q56O19p61q79K12J025
2863D51J34j057j74P95N29k24j193J63J014J05o88n51M84R68j29j377J47J008
2881D05K51n82p50J77J261K22j413l27Q05J060n06j269J63P45P26q55r64L77J323
2900H49n9j130m60J146N35q29p68M12P60J50j050j44N68P33q02K0m91N87J14l61
2920b20j101R31J656j537N27j128O73M64p02m40k2J510p69l24l38Q98O39j088
$$ y = [499, 993, -179, 146, -434, 538, 521, 685, -535, -215, 358, 982, -372, -787, -301, 1064, 518, -613, -910, 306, 900, 97, -655, -379, 540, 450, 112, -502, -631, 361, 522, -418, -530, 166, 574, -28, -584, 159, 398, 99, -630, -573, 198, 361, -285, -654, -74, 675, 453, -342, -555, 335, 696, 162, -880, -477, 484, 598, -38, -812, 43, 950, 146, -622, -485, 530, 678, -108, -765, -212, 497, 528, -363, -621, 235, 854, 93, -786, -574, 451, 585, -472, -646, 149, 678, 454, -739, -576, 438, 543, -145, -696, -212, 756, 627, -750, -603, 405, 656, 74, -676, -499, 762, 984, -429, -756, 49, 1109, 603, -666, -503, 242, 968, 113, -851, -474, 849, 790, -340, -800, 346, 881, 52, -716, -304, 456, 606, -444, -588, -20, 713, -89, -69, -560, 27, 141, -220, -1321, -390, 1266, -271, 256, -872, -199, 265, -437, -877, -899, 611, -158, -482, -820, 78, 717, -371]
2938c71O35k83M7M11n97p75K72J109k44m67o18J228j3k85p83K60J102J10q02m61
2958e25K80P20L15j092l53O81J047q64p86K46O86K12p16l14P09K76l49n30K03
2977a54J35L73k76l69M64K12o3n34j46O88L44q29l17K24Q32k96q00L94O30l5m09
2998F8p00N68N80k9p65l69M36P80j75r26R8M85O11l99r32M23O71P2q35j76N53
3019C9K75j92l11qL84L22n29l03K28P31k97n55l21N76L21k86j94J72J71pk58j35
3041a77J68K22K1k27l46M36Jj08k88J96M05o4m02O7J83L88o87j88N79j1J43k45
3063F6l30K55p2K24l43n9L56pj79R4k98M68J7m59R6K82K20k83l35L68K97k56k83
3086a61j55J92M08Kq08M61J13P7k7l95n2P03j24k92m32L34O11l60o8j38j27L48
$$ y = [-371, 264, -19, 28, 439, -158, -933, -661, 448, 204, -263, -881, 347, 334, 49, -734, -474, 628, 738, -64, -525, -245, 475, 790, -302, -655, 26, 1073, 209, -577, -331, 355, 567, -149, -463, 246, 522, 173, -357, -154, -19, 354, 78, -291, 173, 385, 322, -212, -358, 330, 674, -155, -472, -248, 584, 288, -512, -118, 512, 477, 68, -632, -64, 516, 487, -278, -647, -211, 569, 394, -532, -434, 51, 662, 263, -669, -246, 425, 497, -338, -514, 39, 314, 122, -189, -197, 187, 509, -20, -323, -95, 636, 339, -216, -537, 39, 360, 74, -120, 52, 223, 216, -42, -177, -9, 213, 234, 7, -339, 97, 98, -10, -298, -102, 303, 239, -163, -96, 87, 475, -212, -400, 179, 168, 311, 66, -264, -9, -81, 143, -200, -259, 97, 90, -89, 5, -293, 175, 192, -267, -171, 111, 331, 48, -287, 81, 378, 122, -161, -316, -124, 284, 286, -522, -61, 52, 129, 102, -293, -345, 358, 234, -58, -490, -156, 455, 95, 27, -111, -238, 110]
3108A10J18j62k58K0M80k01l88MM49J92l30p3J33j55K42P9j95j19m65N23K50q7
3130A67o72K25K45K86l83l87L21K77L1j24k92J20N42k14l09l43J17P27K14p06
3150a58l78J79Q06J3n52r9L05j32M79n75k15J79N82R6n88l54M30K64j4n22J61
3171i3o1L52R3m09l81N01L71L02p94k53J39N32k5l35j73k3N97k90k22k40K43O10
3193D41j81m52j18K54O44k87n89Q0O8N70l19k58l25N08L77j2l89n82L81N98j11
3214B98o33Q0R8P89l10o69j25P21K79o08j60K29k96Q57m20m84N3j8N43r7j85p40
3236g98P66M24k19k99m13O90N82o38m46J89L24Q8j38l86k57N48N06m09l60k76
3256e22P27L15j89l93k35M33L61l43l74m1K06O24k28p30J70L60M91j80p64m2N73
$$ y = [110, 228, 66, -192, -172, 308, 107, -281, -277, 172, 364, 34, -39, 94, -61, 181, 260, 65, -54, -519, 4, 254, 167, -505, -280, -35, 251, -132, -519, -198, 79, 110, -14, -306, -186, 356, 142, -167, -510, -393, 334, 548, -158, -536, -357, 449, 462, -90, -189, 116, -16, 463, -112, -327, -148, 434, 530, -58, -412, 18, 282, 268, -254, -93, -154, 198, 291, -118, -499, 2, 373, 675, -119, -372, -233, 299, 274, -61, -234, -257, 340, 50, -172, -412, -169, 441, 260, -192, -310, -56, 588, 301, -288, -208, -140, 430, 111, -147, -472, 36, 413, 401, 12, -570, -189, 409, 298, -335, -255, -157, 632, 322, -347, -472, 249, 528, -80, -240, -11, -307, 550, 130, -354, -301, -319, 224, 127, -58, -798, -32, 392, 173, -126, -539, 151, 733, 95, -351, -162, 162, 250, 112, -274, -531, 17, 523, 114, -246, -522, 205, 520, 331, -62, -297, 136, 497, 154, -220, -261, -55, 569, 341, -389, -219, 141, 632, 452, -312, -354, 219]
3277B19L20k76r70K87O51L27j22o75j04O85M11q38j57l21L47P32j027Q3L87m6
3297h7N98p16n62P06M98nj438K34R65N58m57k95m16L93j84K71p2p49N08j3j64
3318d27J153p04O65n75K57j03n93k26L64J055q43j60m06Q56K08l42n34k95P25
3337G5N39j045k6M79L74J79p73j25N7N18J98o21j88L35L80L6o85l84O59N46l8
3358D90r37L19K91p6j24p5J53p8oK05j28no9M9P1J6j85Q5j40K64r4M0m27J83M08
3383B30J87o19l13L16O61l90m14N7L44K69j94o03j98Q67K7j75p63J50J255n4j169
3404e29j01O18O65o95l75k4N80J25l60k11L37K9J51n21j99N77L01l14j91j35M13
3425A41j05l23P9L65J87m82l51K63M72k9m36p2K28N84n79k10N5O09r3n13j17K67
$$ y = [219, 539, 263, -707, -420, 231, 558, 436, -239, -343, 342, 753, -85, -242, -563, -216, 516, -511, -428, -41, -87, 511, -205, -767, -61, 437, 432, -1006, -772, 193, 751, 294, -1, -417, -24, -208, 63, -9, -758, -250, -263, -427, 726, 22, 687, 112, 369, 266, -327, -553, -189, 866, 23, -137, -543, 313, 521, 179, -355, -650, 75, 614, -431, -457, 22, 396, 575, -198, -323, -266, 252, 450, -171, -359, -24, 356, 392, -293, -677, -18, 528, 490, -447, -128, 163, 87, -37, -112, 41, -37, -43, 162, 34, 29, -40, 9, 80, 96, -89, -4, -144, 120, 26, 66, -361, -178, 230, 417, -202, -515, -199, 462, 72, -342, -285, 59, 328, 134, -469, -667, 200, 227, 52, -711, -561, 694, 640, -529, -630, -12, 653, -42, -417, -441, 139, 264, -96, -307, 30, 59, 210, -311, -510, 67, 368, 54, -137, -272, 141, 36, -287, -208, 157, 344, -138, -489, -226, 246, 217, -219, -291, -63, 521, -58, -268, -213, 396, 303, -210, -327, -60]
3447f0M33j7o25k96M57P27r10m7M18j139K337j395k91M01K45p2n58K59N09m4k37
3468I5n02M59pK08o67N8L77L88m17l29N1Q00j72n84j78M03N28l70p31l0J074Q
3490D62p15k44L44N30k7p11j54L93Q08m63r69L59N79L40m22p82K78P55l52l66
3510c57K0N54J20o87K09r2L92J84k62o23P26K79k40m01R0K97M0m40j50P55J3n38
3532a11j24NQ76m31l15P3Q8M38m12k80l43R08J68l07p87K11Q27J04q10j91N73
3553A60N81n48q00L52O14j83j97m67M17N42o3m69j51p7O84j78o21j82Q08J39l61
3574@n62O01M23n34j21J00K70k01N4R0j55l4O8K1k13K51K78k76m67M43J87j64
3596E9n64K02Q08j85n39n0O50j69rp77J82O12K26n38L0l05O01K26m06k07K45P89
$$ y = [-60, 373, 356, -269, -565, -108, 619, -291, -338, 80, -1059, 1278, -117, -408, -7, 238, 166, -392, -133, 376, 332, 95, -407, 52, 45, 253, -414, -356, 21, 409, -8, -337, -286, 514, 342, -242, -420, -17, 511, 141, -590, -620, 454, 462, -253, -497, -153, 377, 350, -361, -515, -122, 686, 223, -746, -387, 192, 532, 110, -672, -394, 361, 9, -357, -337, 217, 337, -350, -141, -233, 159, 343, 81, -542, 184, 463, 223, -178, -88, 209, 249, -191, -341, 414, 427, -111, -235, -230, 646, 215, -100, -27, 61, 499, 87, -193, -536, 372, 540, 233, -554, -343, 484, 588, -222, -413, 160, 741, 193, -607, -255, 359, 176, -21, -488, -71, 471, 408, -61, -212, -289, 395, 217, -404, -586, 222, 361, 0, -562, 39, 462, -72, -193, -93, 177, -24, 30, 120, -35, -69, -1, 20, -193, 58, 336, 60, -407, 36, 223, 59, -505, -303, 505, 320, -219, -269, 381, 212, 203, -574, -392, 220, 446, -92, -62, -367, 234, 460, 54, -153, 92, 881]
3618H81n49j070P72n8R2l51K23M62j40J13mn20l47Q71l97n4m40K00Q83n41j07
3639h1r37Q02O8J11p1q0L81K75l05o71L65q3LM4p4M34J01l74j58N08j68l62q4
3662c56J44M11k89j29J32K27n9k35r9K72m0K18k24j27J13J78O1l99J05J3J02j60
3684a41n7K01O3l32k08M46R6P5k31J89j48k24L82j47j44j64M33J29o23L16Q8p8
3706g9L75l87n3Q8K36K9l37%Q5O0K96k75l24L17k1J63N2k30J74j11o9J57j81r8
3730a33K02J90l41r2J57K55n0j29j02P3J67k6l61K09J53j19J29m37K1K50K71j78
3752A09L3m45O56l98K61m39R4O1p2K29k87K15j44L77l33p3M0K15N0k51q7j45L98
3775F4K95l96L5j91M96l37J53j51j20J14L00j23n79M51J93L2m03j57J60M13K2
$$ y = [881, 332, -738, 34, -24, 68, -283, -60, 402, 262, 375, 371, -149, -496, 375, -22, -76, -516, -316, 567, 26, -81, -1018, -216, -148, -37, -108, -188, 193, 468, 163, -508, -143, -226, -223, -179, -253, 181, 282, -92, -250, 258, 90, -272, -356, -212, 199, -90, -219, -87, 140, 81, -154, -253, 19, -21, 197, -27, -154, -41, 137, 198, -201, -96, -83, 19, -141, -198, 3, 66, -266, -474, -28, 68, 143, -88, 101, -47, -271, 111, -36, -180, -344, 89, 218, -405, -89, -1, -79, 296, -91, -144, -56, 180, 209, -128, -128, -43, 17, 313, 38, -286, 31, 10, 173, 225, -5, 169, 58, -11, 146, -35, -133, 69, 259, -82, -174, -17, 238, 188, 59, -43, 30, 197, 171, -190, 19, 172, 53, 182, -255, -234, 16, 287, 109, 142, -303, 353, -45, 216, -223, -129, -68, -140, 89, -198, 17, -127, 250, -83, -156, -116, 99, 149, -102, -189, -334, 64, 359, -37, -2, -193, 303, -34, 119, -32, -152, -38, 262, 139, -440, 11, 204, 236, -167, -324, -164, 249, 271]
3796B71l13k86J14J23N29o58K75p6O0mj78j0J6K29j50J22k09J09J35P7j29j73
3818a26j95L61N3j71m35N56K51L8k51n67L45K92J31j88m41N9O32L0l10l66j12
3839d14Q33K7n55M6k28N26l30Q0k9J85K32m04Nj26%J35L57n59j12J77L90k0m20
3862b04K2j7M26j50Ll56J89K2K37j75k65N3M92Nl40k04J20K16J85m09j08J46L81
3885B69n8k96k45k0L45N03q45O9L47K18q7l86j59L93J78q7k76L4R9J50p6k52j7
3908a99L33J61j30m61K39J85J54l82J23j75k5K19l0j22j00O1M16Q2m36j7K79N
3930A80O9j11l26K08j29L74l52j61Q9M45j18m38JO76k17p0l54N3J21K01k48j07
3952b14K64J9M45o19k84J34M03J10j36l35J53J1p1r5L98j77J09j15K95o7j99j09
$$ y = [271, -42, -328, -214, -91, 438, -220, 55, -21, 39, 35, -143, -153, -137, 92, -58, 64, -145, -36, 99, 176, 47, -126, -321, 40, 93, -78, -513, 43, 294, 332, 81, -486, -141, 151, 282, 94, -347, -288, 344, 374, 64, -302, -414, 419, 446, -109, -63, -291, 235, -95, -15, -44, 141, 373, -31, -26, -152, -152, -17, 340, -219, -331, -154, 236, 216, -204, -182, -199, 227, 77, 80, -276, -87, -65, 172, -3, -268, -215, 277, 282, -58, -262, -142, 74, 259, -150, -258, -112, 269, 211, -85, -330, -350, -5, 498, -347, -278, 69, 287, 200, -186, -345, 48, 226, 139, -137, -103, -4, 146, 70, -182, -199, 134, 295, 165, -296, -57, 128, 282, -100, 23, -152, -177, 42, 12, -110, -210, -149, 267, 349, -87, -104, 175, 180, 249, 138, -188, 20, -109, 265, -87, -248, -159, 286, 168, -270, -269, 407, 190, 120, -234, -181, -60, 141, -107, -214, 50, 69, 514, -105, -389, -255, 148, 258, 122, -213, -60, -49, -120, -215, 183, 6, 115, 0, 295, 228, 29, -80]
3974h0J56j2k1j74J13j0K08P6k14k43L37P7n0n64J5Q18l04j61k95K97J81J52m38
3997a36k29K09K61J20k06l81M47M15k07p18O0O31K32o53p1L01P8Rk10j35J39L38
4019B94l18k61J40L8M41l17l08L28J7n7j15j33M17l6m95L74J24J43m76J56o2J80
4041G4K3r8j22PL23k84k87j24O16L51o23k1J2M51j89j75j40K84L13k74n70L83
4063g0L42m9l10q7k6K72J97j87m60M62N1p2l73K37J47K32m00J26O0L16o05O5O
4086a26R7L71k25l05J90L18q8o79L67K7J73l1m27J33J21M44l51m67N41L92l33
4107A42r5j44J75J93k70k15L19o8L65l46k75L82lm3j27k13L91K2l22k4p7K32J6
4130A5o8k01L06M8n4n32P08j13q8N9j9K20k93pr7j09M37j27l86J45M17l6l23l78
$$ y = [-80, 76, 64, 43, -131, -18, -28, 180, 256, 42, -201, 136, 213, 163, -401, -386, 432, 128, -33, -328, -31, 150, 302, -136, -365, -156, 105, 225, 19, -362, 85, 500, 293, -425, -365, 266, 498, -155, -226, 75, 153, 162, -48, -183, -44, 294, -24, -285, -145, -107, 334, 17, -291, 37, 54, -3, -118, -251, 166, 130, -365, 9, 133, 276, -200, -44, -106, 74, 97, -1, -123, -116, 207, -77, -364, -488, 128, 479, -144, -165, -153, 298, 109, -66, -206, 78, 391, 117, -453, -70, 272, 223, -87, -174, -200, 72, 269, 82, -378, 84, 135, 63, -310, -73, 74, 306, -94, 32, 92, 408, -197, -132, -126, -29, 342, 117, -188, 2, 320, 232, -447, -80, -53, 120, 89, -338, -205, -84, 360, 9, -458, 83, 475, 142, 47, -97, 78, 271, 1, -214, 105, 37, 402, 56, -219, 163, 160, 117, -10, -223, 168, 190, -132, -156, -233, -1, 15, -53, -254, 52, 100, 46, -486, 222, 109, 21, 80, 61, 281, -12, -19, -116, -225, 212, 85, -301, -156, 261, 225, -98, -476]
4154d76L75K46p4j45J11k38L26Q9m48JJ2L86m4l17J33J20m0J18m61J14L27j2j29
4177b6k21J92J70j05n1k14L81o4j3o9J98k73q6K06q8m4o9L53p5N2K19l77m82P21
4201B35j71N7j11j48K51J0j77N8j0L07k50j40K13k51K71j59k82q3L19L76l06j17
4223a08k7L02j7p1j46O0rP1n2r0k21M07j67J09j82K59K8j61J37l19J02P4m2J52
4247H9o4n28L58K74J27n11l9K16J93rj76j05L32j4k93J27j63L5N23l35q6K4K91
4270B66o4m61J68L03lj61m5j4K42j60K0j40J07R7o2o9l06J72K82lm10nJ75Nk06
4295b72O7M0J07P3K11k88L2o4K9J46k61K02J69k98m4K45j55j68O7k8K47K49o29
4318c23O18O3m67k56L45L02l02L3l04N64l16r6k7M41m57k2M59m21K17j25l4J80
$$ y = [-476, -101, 145, 71, -74, 37, -201, 125, 214, -234, -233, -221, 165, 121, -196, -63, 57, 17, 135, -326, -212, 115, 103, -26, -247, -55, 115, 10, -41, -255, 126, 62, 49, -20, 178, -95, -181, 25, -63, -107, -176, 177, 102, 154, 373, -4, -486, 235, 64, 121, 10, -138, 113, 123, -54, 4, -6, 301, 51, -89, 124, -127, 144, -15, -297, -380, -61, 315, 9, -108, -135, 167, 150, 79, -67, -7, -16, 55, 3, -87, -308, 99, -68, 41, -141, 118, 146, -15, 122, -197, -95, -21, -63, 89, 25, -503, -145, 129, 256, -255, -294, -78, 115, 106, -70, -175, 157, 143, -150, -23, -186, -151, 372, 37, -49, -25, 266, 202, -259, -91, 212, 209, 48, 3, -11, 231, 71, 91, -49, 58, 155, 93, 24, -282, -110, 172, 169, -241, -246, -71, -66, -272, -205, -165, -58, 15, 226, -62, -30, -94, -65, 81, -180, 22, 191, -107, -151, 94, -61, -229, -162, -190, 57, 306, -323, 295, 358, -109, -365, -20, 282, -20, 13, -291, 273, -43, -139, -166, 275, -182, -204, 255, -166, 51, -74, -108, 72]
4340G2k33M45j70j24o9j30R4K14j13J48k92j28J58n3J69M0k10K94k09J8j9q0L4
4363a44K17j97j17K92K12l55K44l11M9J05J10p6q1K7m5j28K08j11J23j0q5K10
4385A37p9j33Q8O6j05j63J35P6N7p9n7j62M11RN1k73j38J57K44l19k18M04j6M4
4409A37j53m9J73R9j51k5j30J40J26l20J45J06q4K59j05l15K07J91k44K2L8j04
4431c7k5L51k82oO3R1o0J2j24J7M9J31j37k79K14K62%j90o3l42M49j13J93k84
4455a10m2P4L01j17k69N04j50k14J35l21J05K20L10j96L9k56j59J77K93j97k85
4476a58J41M3j10p5k51O99k45j89j35L18r3K94j82j73rJ28O5n8O1n9K27k82O8
4499B5o4J65o3L23n56K25j20M50m87L26l47K21m6j51K27l24K41J59k15k7L51m09
$$ y = [72, -161, 284, 114, -10, -79, -209, -115, 99, -14, 134, -158, -286, -128, -181, -12, 28, -182, 112, -97, -79, -98, -178, -144, 73, -124, -241, 51, 263, -92, 152, -159, -110, -5, 105, 29, -52, -25, -70, -198, 10, -101, 22, 12, -73, 137, 58, -75, 13, 79, -26, -189, -54, 22, 79, 0, -57, -219, 192, 201, 252, -21, -159, -2, 242, -77, -295, 109, 93, 137, -16, -65, 108, 207, 56, 31, -99, 41, 167, -153, -8, 98, 14, 273, 168, -147, 60, 251, 7, 29, 67, -37, -62, 289, 7, 1, 64, 155, 95, 107, -17, 0, 49, 180, 43, -236, -22, 240, 240, 50, -13, -355, 94, -19, 174, -110, -152, -78, 223, 106, -163, 341, 191, -23, 112, -209, -104, 116, 426, 230, 269, 13, -146, 31, 324, 127, -158, -17, 26, -84, -159, -410, 289, 44, -145, -280, 38, -55, 239, 57, -116, -125, 3, 68, 10, 71, 12, 239, -43, 25, -39, 126, 63, 386, -170, 55, -65, 385, -102, 224, -123, 98, 52, -99, 128, -196, 45, 204, -11, -38, 313, -96]
4521i6L45j08O9j95j60Q7Q3R3l13R4K56l94K19L6k40L98p7k51J06r8P0K62r7o0
4545B9j77L57l13n4L8K43J97k92j45O0J28k55L77j93j13J63Q7Ml66J57K14K5k53
4568h2P1J59l57J57Q8L2j80K99j06L60o01P4J49K6k79K75J61l89j31J85K74j26
4590E9r1M13l53r2l5M0r0M12l44m2K40l96j22N65l60j7P3J40K05l40J20q3K61
4613A63k20M0N4r6n3J75k57J57M36k89j88L3J06n6j14k9P6J08j0r6q9K89p0k07
4637a37J33P2r2r6J67j17R7l5K9n0L42m24J41j23J10OP3o6j64%J65l5j88K37O9
4662A14j18n0L08l55J09Q9K48k64J20m7P5m5j37RR7Jj68J42k2k7k13J41K94k39
4686F2L5j76n0N9l5J64k06L5J49Q1j72J05J0K69m10R2k11J92R2j03K63l7p0n7
$$ y = [-96, 249, 141, 210, 15, -145, -58, 25, 118, -195, -101, 155, -239, -20, 16, -224, 174, 97, -154, -48, -146, -76, 186, 89, 29, -148, 209, -104, -158, -120, 123, 320, 28, -117, -57, 71, -184, 193, 0, -113, 50, 137, 141, -225, -68, 146, 171, -82, -11, 148, -209, -52, 36, 68, -112, 187, 81, 441, -160, -86, 63, 89, -190, 85, 246, -143, -274, -89, 185, 59, -32, 381, 28, -64, -99, -59, -149, 263, -81, -123, 117, -279, -401, 164, -196, -213, -140, 0, 205, -135, -15, -98, 163, -57, -17, 37, -59, -112, 63, -194, -37, 399, 110, -78, -45, 61, 5, -109, -138, -62, 46, 36, -60, -149, 140, 70, -137, -4, 68, -24, -120, 47, -70, 27, -8, 21, -29, 313, -111, 30, -93, 17, 23, 96, 30, -134, -134, 31, -4, -192, 45, 114, -4, -54, 254, -101, 8, 97, 345, 81, 201, 154, 229, 184, 47, 56, 153, 154, -14, 128, 106, 79, -134, 7, 301, 62, 97, -79, -129, -70, -105, 59, -147, -112, 37, 118, -54, 51, 61, 330, -80, 12, -199, -7, 85, -18, 245, 208, 138, 81]
4710H1j41k23L22p0P7j87J70K51r6j14k6j33M23l43n5j0k42L78q8L6N5J40p2l05
4734a72k0r6M55m61K87M5l06M66m84J53O93o51lj87K38J75j98J18k48J20J51k89
4756b14K11O1r3R1J43l02J30J95j33j77K07j60L66n60j43K08L39J32m34j43J86
4777i0K09k4j60K14k10M14k97r8n4j02K87j78J04J67l26j0K84Jk90K98m0j02J1
4800HN0Q8k23Q7j2K13j79mR9j32o1j37n1K26l06J40J78j94M7J93j21j05Q5j23
4824b34K25k73K75M3m6J65k21J80k63K47M5j48j84K39r1q8J33l60N14M6j1Om69
4847b70L12K63k73J18r3N0k1K84m66qJ13k9n2j05M2L20j56r4P5R5Q7q2O7j32j23
4872g8J31%K05k54J85J23r2l64J07O4N2K38k36k27J14L1r0K12j34K76k73J82k70
$$ y = [81, -60, -283, 39, -31, 46, -141, 29, 280, 184, 70, 44, -89, 334, -9, -64, -74, -316, 62, -26, 10, 65, 205, 133, -172, -192, -288, 167, -294, -7, 38, -268, 198, -286, -133, 560, -91, -94, -281, -43, 132, -66, 52, -196, -76, 75, -214, -3, 58, -35, 56, 199, -103, 27, 222, 89, -88, 119, -41, 325, -235, -378, -170, 169, 301, -133, -276, -90, 119, 95, -65, 149, -61, 353, 56, -42, -96, -198, 89, -89, 15, 182, -144, -154, 130, 131, -159, 139, 99, -3, 8, 58, 146, -77, 10, -2, 211, 32, 28, 127, -5, -66, -203, -254, -28, -334, -194, -16, -210, -163, 30, -91, -196, -111, -234, -9, -282, -7, 36, -10, 155, -66, 114, -149, 98, 143, -5, -189, 50, -41, -129, 4, -356, 158, 204, 193, 199, -270, 42, 305, 32, 150, 57, 107, 86, 370, -96, -104, 9, -20, -72, -177, -135, 185, 29, -65, 10, 105, 192, 110, 177, 45, -78, 53, 53, 258, 4, 189, 312, 220, -144, -37, 27, 79, 317, 81, -146, -32, -1, -91, 121, -13, 263, -10, 172, -98]
4895i8J09Q4j22k7j42P2J56o2J05k58j78M20m3k8J99n21J76M12j76k61J36j0J63
4918A06j06j28J38M2Q9j99j72K57k20J25J96l95K56J10l2J37m83K4J38j71L88
4939A00Kj14J77J25l04M3r5K82j98k13K8K27k34K20l49K99rM5N8p2J3j48K40n3
4963G0J4p4J8m7m5q9p4K08l5k7p2l2N2L90j00l61L13l24N1K28k58K08K80m03K1
4988h8J00R2j35L78l00k02K76M4k76O3L2j39K23L2p1j29m5M23n03J76J5n1J24
5011C9j89M5J8K2R2R1n7j93K83l24K43k87J70J77q7p6J7o2K19j84Q0k42L6K47
5035G8P4k27J5N5l0m2J26p3K18j55N7k43J08K4J62P1k19J59k62K69j48j28P0J48
5059A07j74J08R2l22R1L79l80k9j40K20K8m4J94j68n6J95j94N9J75j86j01L73
$$ y = [-98, 11, 95, -27, -54, -196, -124, 32, -30, 75, -183, -361, 59, 16, -12, 187, -334, -158, 254, 78, -183, -47, -57, 106, 0, -128, 10, 52, 141, -58, -230, 27, -193, -68, 128, -267, -11, 99, 67, 204, -279, -255, -117, -288, 100, 102, -12, 165, 290, -14, 29, -66, 216, 18, -195, -167, 60, -174, 46, -303, -4, -13, 32, 90, 18, 31, -117, 123, 70, 84, 10, 28, -19, -64, -153, -227, -19, -54, -81, -153, -185, -133, 257, 157, -204, 109, -215, -164, 64, -194, 14, 294, -109, -88, 12, 104, -31, 347, 47, -155, 121, 165, -111, -48, -16, -155, 68, 100, 29, -100, -145, 278, -225, -49, -34, -85, 39, -150, -105, -87, -65, 27, 118, 61, -132, 151, -173, 70, -217, -47, 130, 43, -33, -16, -78, 141, -43, 37, -205, -169, 78, 152, -75, -60, -5, -35, -77, 49, -24, 194, 39, 96, -147, -39, -15, 147, 218, -1, 158, -104, 165, 17, -111, -41, 107, -67, 41, 133, -189, -98, 281, -99, -128, -268, -48, -20, -64, 130, -38, -94, 101, -93, -34, 141, -45, -146, 227]
5081B27k86J85k94q7N30l67J90J1j36M69k21k44O3J52q0j2l15J34J68k24R9PK09
5104A78r7l88K51m9J57Q8k59nJ35K3j26j04J55l09N69j60L3P7l82K02n1J2N0o1
5128f1L9j26J16L54l43m8L17k33J5j16O3Q1j13j18M02l13o1L45q2k99K22L05j41
5151B05l66Q5p2K92l04R9J24j80J12j52J91p8K87j36%k79j64M72P5l35J11J30
5173A17j44K8J33j78n5j01L12l32R6M7J48M9k44J11J0O8j74J40l4k09J35N3nM08
5197C79l10p7L4N4Q1j97J0J5M33m96olQ0J58j37n8K39j65k39J30p1P1K3J03k5
5222B6k75M05j39L8J19j73J15J18l07Q3J9n9K21j60P8k26J23K30j73J39k91K28
5244A39m3j86M5K90j60K74m27k1J0j5M1O4j9p9L27j19P6j98Q5j68K84N5l99K39
$$ y = [227, -59, 126, -168, -255, 275, -92, 98, 109, -27, 442, 221, -23, 40, 192, 112, 100, -215, -81, 87, -137, -38, -31, 178, 81, -307, -56, -105, 52, 140, -119, -124, 11, 34, -92, -196, -41, -350, 219, 59, 92, 169, -213, -11, -62, -50, 0, -61, -22, -148, -32, 322, -21, -69, 248, 15, 30, -86, -23, 58, -55, -173, 229, -84, -145, 200, 118, -181, 41, 346, 205, -161, -76, -148, 144, -160, -61, 63, -117, -5, -157, 34, -44, 243, 107, 107, -172, -336, 136, 211, -124, -13, 117, -27, 1, 134, -44, -99, -200, 112, -220, -124, -77, 71, 120, -124, -13, -3, 65, -109, 31, -3, -212, -77, -24, -29, 379, 69, -8, 26, 80, 161, -36, -26, -11, 422, -74, -80, -83, -3, 155, 18, -40, 199, 34, -205, -75, -146, -75, -52, 51, 26, -249, 156, 17, 55, 174, 1, 116, 234, -73, 10, 29, -30, 191, 31, 109, -117, 6, 236, 63, 202, -89, 139, 96, -90, -45, 245, 85, 359, -68, -89, -79, -94, -53, 11, -8, -87, 240, 121, 197, -1, 84, -84, 200, 255, -144, 95]
5268I5k90J36k09L11j06N2p4N7K1K34r5J50m31K37J70l40p6K3Q8J39j48N8m8q7
5292a33K61r7j64J21L0Jk8j93J87P3o9J36J07o5j2j62J36k17J68j63J3k8K50j89
5316c7N0k84J91K7j32j31K48J72o1j69L0R9Qk02J36Q2K1P7j28j17rK13j93K19
5340A10r9o6J01K26k18n0k3Qj54K80oJ84m72L11k18J27l3k09o7K08J40k0M1j6
5364H5j71M0Q6m9K4j63MJ1J50m5K22l75L60J7k55%rQ6l3J16M5r1Q9j26j54j12
5390b48J98k2J14J25k32J27j2k35R6K0R1J44l07L94m31K81k14o5R9J46L4j89K34
5413A48l16J71K65m13L8j40L25j27m6K3p0J97l6J34m37K74m3o1J73Qj81O0j23
5436a77K90M2l85r2M42K1k1p4l42p6O26k02j62K1j99K20j51J55p9J94J75m25J65
$$ y = [95, -195, -59, -268, 43, -63, -11, -85, -28, -7, 227, 132, 282, -149, 88, 258, -82, -158, -135, -47, 92, -56, 2, -46, -133, 128, 31, -133, -12, 18, 19, -9, -202, -15, 58, -11, 125, 232, 167, 155, -7, 129, -88, 80, -83, -70, -98, 152, -37, 13, -271, -80, -53, -185, -316, -68, 104, 43, -126, -96, 3, 11, -191, -55, 27, 48, 125, -3, -120, -129, 84, -109, 110, 11, -55, 46, 272, 54, 4, -19, -11, -165, 115, 109, 293, -179, 132, -86, 41, 8, -201, -268, -60, 80, 60, 101, 85, -86, -46, 40, -9, 15, -148, -144, -133, 17, -28, 194, -181, 179, 196, -59, -59, -68, 18, -15, 101, 146, 55, 144, 18, -136, -248, -50, -72, 42, 167, -65, 62, 50, -185, -89, -69, 22, 166, -141, 253, -178, 103, -111, -176, -77, 69, 103, -86, 148, -168, 3, 268, -145, -107, -247, 78, -49, -95, -72, -142, 55, 19, 153, -284, -10, -53, -114, 59, 67, -114, -54, -177, 113, 155, -230, -322, 120, 141, 120, 46, -296, -372, 254, 52, -110, -89, -288, -68, -219, -64, -143, 51, 226, -199, -34]
5459c4Jk7j47q1k7K43J02l13L44k16M2R2P3J6j05q1N3J13n9J04k33L71l88J07
5483e0m9nK37k14k6J63q2j03J31O3j34K72m4Ql20K07j70L13o8l52J10K74m6j84
5507f9J13j73K04oJ08j17k7j78P1J18J16m8k37j21M50m20L42k27J95mp8n1j36
5530a75L66j66k60K58j05J21j11O2j26J62p2K40l22J43m1j6K08m76N7K88j18r0
5552a73K81n4p4j9K60j5k12K27k75L6k44L04j6M1O1k74Q6Q6P3R5k51j31K23oj46
5577a17l9J27O6j5j42K55l79K11J8L5q5l4Q5J81O4k28k1l8L0jl6M9q8J84j92J28
5603A8K03j82k03qP5K90j60j23J26j96K11p2M92m10P9j43J99r6J96l14j74L57
5625A65L0k54P7j25K49l93K10m5j06K69q6J80l23K84P2j89j45M8N0k1K50m42K19
$$ y = [-34, -33, -60, -207, -288, -315, -72, 30, -283, 61, -155, -113, -21, 52, 68, -37, -118, -65, 48, -11, 93, -140, 231, -157, -50, -99, -104, 133, -81, -107, 56, -26, -129, 2, 65, -69, 203, 159, 167, -153, 54, -116, 197, 129, -223, -113, 161, 115, -69, 44, -129, 75, 69, 177, 60, 33, -145, -74, 44, 160, 112, -125, -246, 204, -216, 126, -101, 94, 90, 12, -39, -175, 191, 25, -235, 23, -82, 39, -72, -10, -136, 26, -46, 194, -128, 15, -26, -42, 166, -310, -253, 35, -83, -173, 108, 54, -20, -39, 221, 206, -6, 221, -54, -18, -262, 42, 26, 67, 128, -146, -60, 26, 99, 194, -57, -188, 35, 29, -117, -156, -29, 37, 22, -120, 135, -244, -33, -15, 20, -65, -99, -14, 167, 231, 3, -18, -56, -26, -27, -63, -14, -102, 82, -110, 18, 221, 39, -164, -172, -97, 193, 33, -90, 36, -160, 51, -21, 471, 61, 140, -3, 196, 100, 296, -18, -192, 165, 195, -59, 18, -107, 142, -251, -41, -86, -192, 77, -9, 171, -152, 132, 204, 15, -130, -82, -32, -53, 197, -245, -26]
5648b6K34k10p1j26M04j45Kl28O9k4L11k07O5j14J73N5j46J39K7l16K51j21K29
5671A25k92lJ72K05k25LK7r2M1K43k37O1j58J39mm2j55J40J68l27oO0Q3L48l96
5696a22J45N7K14k82K35j86j07o3N2J79l23M20q2p5mk6K9J50k00j12o0K12K37
5719B88l20l7Q5M9M4k72J36J47J34k63j10k8K41j20Q6k05J38j83K04k53K21Q8
5741G0l68K49O0J20l93J46j24Q8R5K41k68L6k49L48j05j26L0J31MQ9j17j13j98
5764c54J69N7P2J11L4q3k55R6J32Rl7j03k2K77mk41j8K57j36K98n02R8L42o6j20
5789A1j88OP3J25pln4K75m73J60k3n7J39J00J92j19k49J56l91L92j27j50R0K33
5813A11p6k27J56p2K22K22k99j11j66P1K59q6o6j83M84r7j99j58P5M69j42l81
$$ y = [-26, 208, -2, -73, -199, 205, 60, 62, -266, -197, -221, 90, -117, -52, -166, 7, 62, -84, 55, 82, -234, 17, -104, 125, -167, -170, 2, 207, -18, -15, 12, -80, -39, 204, -33, 28, -130, 9, 5, -37, -192, -52, 116, -211, -217, -157, -74, 274, -122, 23, 80, 294, 12, 247, 61, -46, -109, -57, 122, -201, 219, 137, 62, 58, 32, 61, 211, 11, -101, -161, 51, 288, -32, -69, 16, 65, 109, -163, -27, 120, 254, -9, -119, -147, 94, -26, 60, -145, -7, -190, 14, -239, -18, 70, -298, -49, 11, 131, -262, -116, -240, -152, -57, 184, -84, -48, -297, 51, -54, -180, -150, -19, -15, 74, -43, -156, -354, -185, -128, -56, 55, 89, 6, -249, -153, -21, -12, -49, -152, -174, 103, 99, -142, -160, 97, -39, 259, -243, -145, 197, 131, 11, -177, -171, -98, 27, 20, 17, -37, 238, -235, -75, -98, -155, -16, 84, 276, 157, -92, 64, -327, 65, -62, -212, -122, 111, 35, -192, -36, -108, 114, 336, 37, -74, -240, -169, 90, 4, -62, -245, 239, 142, -57, -215, -140, 329, 187, -194]
5835a94K20J25J4m11K89m16L67Q7j06l4J42J41l27J14l39L53k3K60q8k4m25L55
5857H0R4j58r9J50j78O8K66k62m9p7K81m3J95m25m6J68K38k9l43J54p8J45r2l0
5881g0J37j68J10L1K4J97J64l41o6k22L65k46J84R0mj22j65J87j38J43J12r9J06
5904B09J3m01J27K31k91K6N0M6Q3k86K58P1J0j56K28k08J6j58K64N3k37J58r4
5927A2J05j68K47m60K1J66J99m9P1j74J72lm68J31L43q8r4k7j11R5L4J01k16O4
5951i7J49N5j0k46k9J44PM9j35m0K97o4j57J26j71K73j04l0k3L7Q6j2M9k89J11
5976b4J35J64r0P3k65j70M25k26m5k66J88L33p3p0O2k96K65n1R7j26k64K87k18
5999a55O0J42j31M0J75l13J72j6J13l2j97J39j18pK73k08k48N20k40o6J25k25
$$ y = [-194, 26, 151, 165, -246, 43, -373, -6, 81, -25, -59, 83, 224, -103, 11, -328, 25, 2, 262, 174, 150, -275, 80, 174, 16, -83, 67, -111, -43, 223, -39, -88, -165, 116, 73, 268, -157, -203, -35, 203, 174, -169, -15, -93, 52, -40, -70, 67, -101, 9, 40, 64, 261, 425, 84, 18, -204, 161, -85, 99, 189, 185, 63, -102, 85, -53, 90, 202, 103, 209, 222, -179, -52, 179, -112, -86, -36, 10, 93, -193, 65, 136, 146, -10, 218, 10, 26, -132, 132, 185, -52, 106, 12, 117, -51, 196, -264, -243, -77, 122, 73, 144, -30, 142, 139, -329, -198, 145, 57, -37, -64, -175, -80, -46, 55, -161, -97, 52, 107, 97, -149, -178, -34, -27, 22, -113, -153, 144, 80, -77, 49, -122, 151, 47, 17, -6, 31, 117, 105, 154, -135, -24, 111, 275, 185, 258, -7, -177, 248, 22, -23, -289, -101, 232, 159, 89, 151, -145, 120, 69, 166, 40, -224, 63, -155, -95, 47, -84, -44, 131, -182, -10, -26, 87, 55, -142, -3, -121, -128, 145, -63, -311, 209, -31, -97, 28, -197]
6021a97M22j63o1J82l55L1J92L1J39k86M8J15J49k97j18K01M4k31K79l88o7K78
6043e2R5K04j89j44K79j22j95J4l41N70j10L5O1J71l33K61q6k27K44j98K21j42
6065A6r1K78op0j15j25K80L89m93j25M13n46L01M6J38m50J72K46k75on5J66rk06
6089a27J4J09J5j6N6j31J78o1j46k23M16j17J31Q9j7k64R9j93L46J70l21M2j79
6112a30j45L81l28qK79m6k9j46J38R2LK8k46l7K80l03K75l18M0J09K03j66J91
6135A17k79L48k65K81k04r3L4J65Nj84J5n9L62O1k20j15J33q0N0k20O2O2J68l7
6159A07p5L4MR4j90j23j58M62l0r7Q4m32K92K14p5L2k69K43L6k18j34J24O6Qm5
6184d6p2L00j20J99l71J68j3N1m9%J26j46Pk46J38l1J41j30M42k43l97K16L52
$$ y = [-197, 225, 62, 1, 183, -172, -141, 51, 82, 221, -65, -17, 98, 247, -50, -168, 33, 77, -154, 125, -263, -330, -52, 43, 247, 58, -86, 193, 71, -124, -110, -451, 119, 9, 44, 105, 276, -57, 204, 118, -109, 135, -63, 158, 16, -75, 203, 197, 127, 12, -113, 167, 556, 63, -62, 351, -195, 106, 152, 290, -160, 12, 258, -17, -23, -78, 88, 79, -127, -113, -4, 11, -5, 51, -80, 98, 37, -109, -332, 84, -33, 98, 187, 170, -94, 5, -188, 158, 328, 7, 49, -130, -275, 106, -222, -230, 49, 3, -26, -172, -34, 58, 61, 89, -157, -194, 86, -217, 58, -260, -220, -111, 92, -74, 117, -162, 186, -79, 202, -2, -95, -61, 104, 109, -75, -60, -119, 243, 304, 84, -31, 102, 22, 72, -148, -86, -24, 144, 107, 32, 66, 70, 164, -26, -149, -307, 155, 125, 28, 112, -320, -28, 186, 111, 143, -126, 117, 153, -65, -199, -75, -9, -1, -46, -118, 182, 62, 261, -110, 58, 45, 96, 47, 47, 173, 27, 34, -212, -74, -105, 36, -94, 348, 105, -292, -76, 276]
6207B76l99Pp2K49k55QM6l6J23L08j97J24j42O9J16q0r5o1m2J26Nk14j23J7K17
6232b5k62J13j1J83L8J48l84J94N0J51j64M0k21J02J86q3k3Nk66K73L07m53K10
6255A08j03l8R8k90K50K0J40o7m1j04M00k17k04R3l7%J07L4k56J73P6l3R0j50
6279D9j18J18N0k11M3N4j40M1n5K9J13J56j17m4m0qQ2K48Nm56ML91J41l38j83
6304a86m9M20j80p3k2K72m5k31l3J76M5J70k06q3kj01J42M2j6k52K89J15k87J85
6328I0j61n7J22R1J09m92J95%Nq7O9K39R3k59J16r5p6J2J66m7p8j07L81Q3l83
6353g1O1r7K08J3k66J82J12J93j76q3k02K26o9M8j13j75K21k3k1K9O1p4M44l00
6377A28l17J16Jk5K83k36L16m39O5J86j14J79M4m09K79n42L66L45j3r9j42L5q9
$$ y = [276, -123, -116, -188, 61, -194, -186, -140, -176, -53, 255, 58, 182, 40, 109, 225, 145, 50, -11, -53, 73, 78, -136, -259, -242, -25, -287, -174, -185, -2, 36, 184, -200, -6, 44, 195, 31, 71, -150, -48, 138, 55, 32, 37, -229, 44, 351, -102, 108, 5, -33, 65, -225, 25, 45, 185, 118, 77, -27, 373, 156, -48, 45, 8, 8, 115, 149, -107, 66, 142, 109, 199, 49, -69, 49, 99, -112, -69, -15, -155, -114, -169, -140, -27, 129, 12, -32, -72, -80, 2, 250, 255, -201, -197, 194, 335, -3, -186, -235, 185, 5, -68, -90, 182, 137, -94, -127, 49, 94, 264, 58, -25, -27, -128, 14, 56, 40, -212, 77, 192, -95, 90, -71, -128, -6, 85, 194, -298, -103, -103, -98, -185, -116, 123, 216, -43, 73, -22, -98, -86, 80, 33, -45, -152, 229, 312, -71, -10, -107, 101, 114, -152, 30, 142, 335, 159, 76, -126, 100, 31, 79, -34, -209, 12, -11, -32, -3, 58, -16, 428, 128, -189, -73, -72, -97, 186, -50, 266, -173, -108, 78, -36, 143, 187, -222, 57, -485, -119, 226, 213, 114, -28, 7, -82]
6400h2Q7K95j85k43J61j49O9o5N5J03m7J03o7k08J73O3j13K79Oj55J58Qm06J58
6424bJ04L15m45L6j49n2J28J77n5jJ96r7P9m76J7L03j9k03j20Q7K19N4l82J91
6448i5M9J34j88P4J19L1k91K27k0O7j1j79K84l03j65N37l94j0J23J33j54q8J58
6471C8J71m3J22n53K90J66k55J22l1R5p9k32K21j38O4J10j68j34L92J96k68j72
6493h6j38M28r0q9m3K53l72L71k11J04L4k13K73k27j52J95j8J82j64n5Q9M3Rj7
6517A06K4l46J24L28k9k56O1m2M17m73M5J88j27o5J96M6m65K87K70m4k78J20P5
6540A62k6k37j16J49P3k7J4L60l59m11L77m3o3J5l6N8J26j34L6M9j1j54O7K56
6564A25J21j61j77K9j60K78m7k16P9R3L81j75j96J53k16J54n5O7j56J27Rj6l4
$$ y = [-82, 5, 300, 115, -128, 33, -116, -47, -112, -57, 46, -1, 102, 35, -173, 0, 63, -50, 229, 235, 80, 238, 246, -160, -2, 102, 417, -28, 8, -141, -193, -65, 112, 57, 56, 252, 155, 234, -242, -225, 78, 59, -144, -264, -177, 42, 96, -286, -95, -46, 88, -100, -26, 93, 124, -167, 60, 40, 107, 96, -83, 201, -102, -267, 270, -124, -134, -11, 122, -32, -120, 38, 209, 166, 288, -265, 25, 191, -64, 58, 27, 122, 43, -189, 32, -106, -42, 68, -100, -234, 158, 354, 86, -86, -224, 204, 114, 25, -18, 235, -137, 234, 23, 127, 161, -52, 221, -6, -158, 37, 19, 201, 37, -18, 71, 114, 123, 106, 130, -216, -92, 236, 207, -49, 12, -30, 387, -86, -41, 147, 20, -45, 151, 197, -268, 19, 289, 245, -33, 87, 162, 136, -101, -217, -68, 5, -22, -8, 352, -7, -418, -41, -84, -147, -132, -168, -110, 16, -118, -82, -33, -44, -198, -131, 125, 246, 85, -92, -63, -223, 55, 8, -208, -129, -36, 345, 170, -26, 127, -89, 65, 10, 77, -79, 48, 57, 41, 7]
6587GK51l39K93l34J39j34K61j5j01Q6Kp1k3K19m19J60K6J21M1j98J18k40P3J0
6611f7Q4k93L5J97L67m33Q9o0R0L59m27J73k01J9J12p2m5J87N4l4k9L7k79K76
6635A39k14J23j14J56k46K31j54L8J77J87m58K06j93J98J20k09R7l28L35k74K71
6656H8o1rj83K41O0k80M0O2j95L39j16j15K15j21K6P6m7p8K87k10j67J49J7l4
6680a6R1l9m1P2j48J51j05J12j92K90j51j99P4kmJ59k39J97N6j53K31J3j40K16
6704B33m75n3K99p6j26J41j69K13p4j64L06R8q1j30n8K36p2j18O0k35M68k87N2
6727a2J38k75L09l08K67k50K86j8O2j41j32o3L78l58J08n7K1J32J60l60J72o1
6749bJ40m7j43kJ23k54J60L7J89l20K86n2k33P7P5K26j12j29j17l3r0J34n0M7
$$ y = [7, 258, -81, 212, -122, 17, -117, 144, 129, 28, 114, 116, 45, 22, 241, -178, -18, 8, 129, 170, -28, 90, -150, -77, -67, 17, -276, -241, -44, 323, -110, -21, -81, 9, 368, -59, 114, -87, -68, 44, -28, -73, 114, 168, 134, 105, 142, -137, 139, -75, 48, -66, 90, -156, 75, -79, -41, 136, 323, -135, 71, -122, 76, 196, -13, 84, -244, 91, -183, 88, 27, 18, -165, 76, 136, -144, -104, -42, -237, 102, -14, -129, 86, -35, -9, 67, 20, -58, 229, 19, -148, 1, 18, -16, 75, 36, -5, 67, -81, 70, -35, 77, -115, 175, 24, -175, -101, -103, -107, 52, -187, 10, 66, -87, 144, 157, 17, 233, -242, -295, 4, -72, -198, -57, -226, -13, -87, -251, 55, 153, 72, -58, -116, 120, 48, -70, -10, -245, 223, -64, -12, 126, -149, 160, -148, 119, -131, 155, 137, 199, 58, -74, -137, 241, -117, -9, -66, -45, 87, 247, -113, 59, -2, 138, 91, -52, -54, 69, -185, -25, 12, 201, -119, 167, 115, -118, -41, 34, 260, 148, 19, -98, -131, -221, -87, -137, -90]
6773i0L06k48M0j74P6J90n9O3l61l0O6L59Ok86K14J81j0J9m09J31l0M8p5K11k48
6798a10L49l19LJ54k38L47j09k19M34l12J73j81O4j52L9o8J38M8J7k26K38j86
6820a16P5k3nJ96j82l9p1L34j17J2j74K0K77j70J6K9O2k58J30K42Pm33q4L17p2
6845b7j2J37o9J98Q8l66k00Q1J65j76K4J7J28l8J63l69J84K09o5J52r4j72j37
6868a79L3J27j55K43pJ07j21Ol46J60R8j07J9M9j88N2K67k24OK1J16J81j85J09
6892H2k6m7K6q2K39k14N0P6k17J93j39K76k54L0o0n9J70p7l7P5j5m8j24LJ35J56
6918A12j51j64J17N3J49j2p6k4k8J25k46J52n3O2pk34R5O3n1K3J34q9r5J41J07
6943A03j85p3o3M5J03l1J40k32J45r6J6J7J72o3kn3n1J31r0L20k13j14J8K01k9
$$ y = [-90, 216, -32, 8, -166, -90, 100, 41, 104, -257, -287, -221, 138, 144, -142, 72, 253, 243, 262, -147, -16, -46, 2, -73, 138, -110, 239, -80, -77, 77, -161, 186, 77, -142, 292, -20, 153, -28, 36, -116, -77, -145, -7, 41, 58, -168, 70, -116, -41, -64, -69, 127, -55, -94, -165, 169, 52, 64, -110, -90, 187, 17, 33, 62, 124, -134, -4, 238, 245, -188, -272, 45, -27, -39, 98, 29, 227, 315, -51, -251, -170, -5, -181, -157, -140, -12, -50, 113, -256, -72, 137, 72, 224, 130, -42, -179, -146, -19, -174, 69, 62, 169, 48, 54, -292, -132, -34, -141, -122, -73, -261, -209, 58, -166, -160, -139, -23, 158, -27, 82, 56, 9, 35, -47, 192, -22, 28, 104, -113, 80, -59, 217, -37, -7, -67, -126, 44, -33, -70, 5, -10, -58, -182, -179, -44, 112, -39, -203, -86, -33, 116, 104, 28, 4, -24, 101, -145, 7, -46, 16, 9, -225, -130, -67, -118, -95, 39, -50, -145, -4, 103, -82, -155, -218, -173, -70, -101, 39, -193, -48, -144, -128, -111, 61, -2, -4, -57, -108, 23, -67, 253, 40, -74, -56, 145, 116]
6968A16l4j44j24K73J95k93j56L60j33n0l89K82J29J13j30j09O5K18m37K45P0
6989F7k9j44L81k72n6k7P6L6J71j66P6m19M26l2j99p0K91j90k26L71k33M1Q0J58
7013A11j53o8J06ko3J29n2p1M0J62l51J4J84K46m53K41L4j44Q7M43n16n8J71l9
7037bK14p8j95M00m31j8p0L87k68j75L44l06J31J29Q0k42K41k75k9O0J22%m1j78
7061b00M13k51J31j27J54K1j67Q4J05r1p2J11L1j64L1O5J14o8m07K01q9R0Kk07
7085b90M69n07L90q9q7J64K51l09m2K36j41p7J11k73K72k4j07n2m7J30q7j39K80
7108C2MJ42j94L08l81N0K0J45j96J57k5k98J39J73J7j01Op9J04j74J69l43K53
7131g2J98l2p1o9oj29J3K64k51QL31l67m7L49kjJ31j53l39K53M5j14l1l07L03
$$ y = [116, 82, -62, -186, 87, 282, -11, -167, 193, 60, 10, -379, -97, 32, 145, 15, -94, -29, 189, -248, -3, 67, 38, -106, 275, 3, -53, -80, -4, 32, 203, 37, 113, -306, 120, 88, -111, -181, 110, -80, -306, 65, -168, -127, -47, 111, -42, -110, -4, -6, -69, 60, 8, -63, -23, 139, -212, -198, -14, 232, -221, 20, 54, -90, -3, 440, -76, -134, 37, -2, 212, 134, -61, 339, -92, -110, -180, 207, -61, -236, 108, -198, -67, 62, 142, -100, 141, -134, -163, -103, 19, 19, -22, -200, 213, -38, 93, -34, 120, 141, -26, 58, 163, 72, 0, 111, 142, -22, 9, 74, 188, 120, -287, -86, -175, -85, -83, -290, 179, -328, 62, -27, -114, 50, 301, -8, -50, 186, 45, -32, 79, -194, 78, 54, -53, -105, -152, -22, -109, -248, 32, 36, 178, -16, 292, -89, -39, -19, 126, -70, 87, 62, -236, -97, 76, 93, -8, -2, -81, 23, -151, 18, -325, -72, 126, 94, 23, -46, -52, -181, -168, 96, -155, -147, 184, -183, -230, 119, 117, 116, 247, 94, -245, 8, 53, -61, -92, -399, -96]
7156i6J54J58k26m7J6K64k01k25L33J75k87J4n8j44J97n3J12j6J1j17K26j43l4
7179A3k80K68j59j82J94j4L5n2K53j94J08M2l3J42J0l11J68m1k26L84K0j33J58
7202A70N2k16J62j72q3j4J09j77Q2J18L0J51l12LQo4K25j77K45j37J79k35R6R6
7226A39r5k47r3L50j00J86j75J6J20J49j89J16r3j41K18k6n37M42o4J45P1l53
7248a61K30l02K56M2l6J8m11L69K7J19j53j19J32R5R0m97L30Q0qk2l9l9q9K04
7272A16n5M5k06L7K01l6k94LL43l19J08j6PJ27J0j85m6K38k91J30j30L12j55K9
7296b7L6j77N4K46l9o3M0k4O7k88L20ql34J34n7kK34k63K05J50l14J97j41J55
7320A01j8j15K12j91k29L85m7j78K24k5R7j70P5q6j29k8Q3P6m6J11R0k18n8J51
$$ y = [-96, 58, 216, -10, -57, -41, 223, 22, -203, 130, 305, 18, 32, -26, -170, 27, -26, 86, 70, 81, -36, 190, 47, 13, -267, 1, -158, -340, -146, -160, -125, -177, 76, -118, -10, 32, -1, 141, 151, -160, 8, -33, -259, 125, 145, 12, 170, 222, 6, 168, -4, -87, -101, 8, -169, -87, 31, 61, 212, -100, -97, -89, -153, 72, -105, 140, 3, 182, -53, 43, 139, 44, -203, -296, 54, -46, 140, -35, -19, 101, 250, 61, 177, 84, -57, 161, 135, -402, 40, -24, 121, 192, -161, 69, -233, 23, 65, 29, 47, -364, 5, 32, 151, -2, -121, 11, 106, 196, -301, 29, 109, 101, 79, 40, 1, -88, 116, 61, 106, -100, -63, 138, 102, -192, -189, 154, -165, -57, -73, -66, 61, 71, -114, -160, 78, -213, -83, -213, 99, -56, -27, 9, -168, -114, 132, 93, 30, 70, 46, 113, -175, 145, 137, -197, -63, -120, -122, 112, -151, 54, 204, -110, 87, -54, 101, 83, -32, 180, -11, -240, 145, 98, -80, 144, 119, 216, 46, 121, 35, -94, -122, -39, 37, -9, 102, 192, -26, -84, 67]
7344F7J7k29n5P6J30j61K65m3j25M6M8j03o0P0r0J7P2k5J58k17J42J87l87J15
7368h5l6K18l98L60k31l1K21P5J00n84M86J60k65K7J25q1P1k58K34k19K09j31
7390c3l0J56k4j78K19J50l21k9j66L26m3j45J99J33l00k8J22j10K00j59NO9N1
7413F4J20k3l90K51k51K91j66K0M17j88K04k36o1r6k3J48J4k3O5j51j3K43l05
7436h9j04L17j20p7J09j64L8J28k37K25j24k3JK16m5N9o5r9J8m9K67m87L70NK8
7461I8l9j58J56o5j27J65l7J82q6o2j18j32R9J58P2o7k35K99m0M0j18N7P5m6j9
7486E2J72j76j04J60j99R0r9Q2j26J12j27J69o4J95j94K14n6j90J27O1k7q1J22
7509A13j57j20q0K23J05k38j23K01K08J49j54j22J65J0l58L69m61K33m1J41q6
$$ y = [67, 84, -145, -200, -124, 6, -155, 110, 67, -58, -12, 36, -67, -127, -57, -147, -130, -58, -83, 75, -142, 0, 187, -200, -85, -121, 97, -301, 59, -172, -203, 18, 93, 193, -391, 95, 255, -10, 17, 142, 61, 132, -126, 108, -111, 98, -33, -63, 93, 69, -109, 110, 260, -61, -90, -256, 70, 27, -118, 81, 214, -86, -114, 8, -102, 98, -61, -56, 13, 64, 184, 161, -229, 22, -229, 62, -104, -84, 333, 145, 349, 113, 52, -44, -67, 81, 95, 72, 137, -14, -27, 216, -89, -193, 124, 4, -73, 36, -128, -90, 38, -199, 26, -98, -121, -120, 96, 51, 110, 45, -54, -36, -85, 182, -305, 65, 70, 98, 59, -99, 57, -8, -135, 30, -7, 175, 89, 27, -91, -223, -124, 34, 106, 39, -196, 103, 63, 103, -15, 42, 117, 71, 52, 224, 48, -56, 104, -95, -5, -104, -22, -148, -36, -163, 6, -58, 137, -57, 157, 101, -89, 38, 99, 72, -9, 113, -44, -164, -244, -21, 84, -154, -277, -76, 132, 281, 127, 5, 170, 180, -178, 191, -270, -37, -78, 63, -23]
7530b3P7p4R3r1L01k9j19l9k91K23N4k70J57j43J81J45m38M10n3M9q6l4k91K82
7554iJ63k62R0p2R8K47k67J09P4M5k39k27K87k23L58p6M9k91O1J29r2M8j9j09
7578a28J19K62p9j51J06k34J32K6J70m12J98K09k41J80j86J38n0r9O2O5J37j98
7600B6J40R9k32R6l18J53j10J79M7R9k17j34J95Qj12q3o7Q0M02n3k13o3K09j97
7624f6o7J4J54o0J52j30k9o6j03J81J54j08k19M02j82k46L32j71o3K1J78k00M0
7647h2P9J66j87n6K10J46l7l25J25q8K27j72J9j28J48K30m15K18j28J93R8k83
7669d2k05K69KJ95j63J8J20j08P8j34j69K6K88j24j61J65j42J08J0J12k89KJ19
7692b5j77Q1J22Q9J24j99j19l6%J57k00L70j93j74O5O3M5q1J48j60J33j38l1P0
$$ y = [-23, 54, -20, 73, -18, 283, 254, 135, 96, -195, 28, 82, -188, -31, -174, 7, 152, -286, 124, 71, 120, 34, 0, -291, -9, 154, -108, -18, -90, 8, 255, -12, 97, 171, 216, -23, -250, 37, -186, 172, 96, 145, -146, -85, 44, -48, 0, -19, -128, -9, 253, 174, 23, 129, -105, 27, 53, 223, -189, 9, 218, -23, 157, -29, 109, 59, -40, 22, 87, 224, 26, 166, 265, 33, 129, -189, -36, -146, 33, 80, 179, -38, -172, 23, 31, -81, -164, -231, -151, 251, 198, -15, -78, 131, -66, -133, -119, 35, -25, 127, -3, -32, -98, -201, -20, 134, 26, -193, 209, 27, -219, 113, -58, -121, -100, 78, -122, -82, -3, 163, -24, -80, 130, 276, 239, -86, 39, -49, 178, 6, 25, -103, 45, 275, -140, 78, -50, 143, 241, -42, -247, 22, 24, 219, 56, 74, 194, 86, 164, 30, -139, -113, 175, 51, -110, 55, -87, 21, 31, 143, -146, -144, -25, -202, -121, 1, 90, 214, 15, -104, -140, -140, 17, -183, 187, -6, -180, -115, -52, -7, -88, 60, -100, 33, -105, -136, -66]
7716f6L30l58J56j10J90l91K54k8N7j38r0M21ml0k47J34Jq6l0r1J57P2r6J17k5
7741I9J6l28M90l05L5Q2k3k33K35R7j68j19L54o02N71j28j19O4J2L8r7r8O5K14
7765A52k13M2L12k98K24J84j64k65m2j52L03KK23o17J66J80Q0k4k74K79n6M03
7787D45l06k44J40j60o0J92Q4m08J46R5N19k43k82L32j14j50K97m53K87n6M9j45
7809c5J28M8j56N0j24R9R0K4r0j00J55k4p0j44P3J61j05M0J54q9K6m24K56r4K82
7834A31K5l89J06p8J54J4M0L6J20p5k2j64j9j39J02J54L0M4j62j39K3M86k14m
7858F0m7k4J02J34n6j53J41r3o0k38K44JR3K4j29q7J91j60J00j62J29p2n0N6J82
7883A26L1k06J84j44k3k8j32J34k21L74l14L00J03k37J20J69j01n07L67j29L86
$$ y = [-66, 264, -94, 62, -48, 142, -249, 5, -23, 34, -104, -194, 227, 223, 193, -54, 80, 81, -5, -35, -126, 31, 103, 7, 124, 99, 115, -213, 277, -28, 7, 89, 66, -167, 68, 165, -3, -122, 232, -370, 201, 73, -46, 18, 30, 68, -29, -127, -62, 152, -61, -19, 293, -5, 219, 403, 239, -26, -68, -220, 83, 85, 308, -309, -143, 37, 117, 93, -181, 98, 42, 445, 139, -105, 35, -125, -185, 7, 91, -317, -171, -76, 443, 200, -82, 250, 136, -14, 283, -170, 117, 61, 110, -35, 93, 141, -15, 35, -89, 10, 100, 124, 34, -66, 89, 65, -5, -149, -76, 85, -20, 20, 174, 85, 111, -313, -57, -151, 131, 156, -233, -127, -205, -51, -37, 3, 39, 159, 84, 62, -102, -121, -260, -158, -4, 26, 70, -92, -231, -208, 278, 64, 60, 13, -11, 91, 225, 169, 16, 157, 64, 4, -234, 10, 11, 104, 128, -1, -88, 103, -57, 43, -119, 10, -62, -112, -56, 126, 157, -49, 135, -9, -32, -60, -192, -58, -279, 95, -219, 81, 184, -53, 67, 236, 135, -372, -5, -134, 252]
7904B52n57K52M3K43k36j12J50m3K21L1j55j75K19K7k03J31j01O6n9N7k64J24
7926h9K67o3r7N6j45L8J02q2N6p0J58l37K75j35J68r2K3k5J61k47J01k30J62P6
7950C1n9J75J48l68r2K34k70L44n5l69J68K60jl7k33PL63J54m65K82l66L55k88
7973h2N3K27j91q0K73j19j74QP2K13P1j47m8J08j89Q8l43K36q1K90k76L3j04L85
7997B23k58k7P4L9k8j59J28j79K59lj33ok9r0K11J25k87J74j15m5M3L7o2J19K2
8022C3K8k42J37K36k65J75l50J60O8O9p0j38L0P5n3RN6jP8j46J44Q5j20J51j67
8047a8J53n3J40p5l2m2Q3J46k25n9O7J0k37J73j71MM6R0n2k6K75%j89J88j33k01
8073a38K65j49n0L82n30K24j34J70K10j25O3m08L86m0k27L67o2j15j48J69j38
$$ y = [252, -305, -53, -10, 233, -3, -115, 35, -8, 213, 244, 89, -86, 133, 160, -43, 88, -13, 53, -6, 51, -213, -89, 178, 115, 18, 74, -71, -33, 69, -13, 43, -27, 131, -206, 69, -66, 102, 10, 33, 8, 169, -78, 23, -207, -45, 31, -28, 147, 295, -73, -165, 69, -201, 143, 88, -281, -113, 147, 146, 109, -124, -117, 246, 400, -65, 217, -149, 206, -82, -29, 198, 7, -73, 200, 81, -93, -85, -13, 200, 271, 124, 76, 184, -5, 83, -260, -24, -105, 185, -91, -58, -162, 223, -35, -62, 12, 51, 23, -136, -8, -187, 72, 69, -64, -70, -99, -189, 22, 147, -140, 34, -81, -126, -83, -46, -108, 11, 33, 61, -181, -44, 192, -73, 102, -248, -88, -20, 49, -21, -159, -129, -54, -107, -98, -42, -43, 35, -111, 33, 118, -2, 149, -18, 135, 82, 222, 147, 115, 73, 156, 302, 77, 18, 85, 95, -142, 31, -140, -136, -90, 0, -52, -78, 197, 197, 8, 196, 63, -138, 127, -22, -72, 310, -220, 4, -130, 40, 250, 125, 188, -220, 166, 126, -101, 266, 204, 89, -59, 110, -28]
8094b8k95K47K36j45j31J02k02K2K15p8m9J18l5O9j14P4J97J9k02l02M53k63m7
8117a39Rl5J83K3j84r1K46J87J3k84J39n8k9q3Lm1PJ37L2j04K4PQ6R4j9j05j02
8144h4k1J77l8j49n4j20J26K00mJ88j24j47K35k52J2J16pj03M05k18k77J24j46
8167a61J98k03L82j22k08J40j22l1K42k6k3q2k3J95O0k04jml6j52q5M4N0L04
$$ y = [-28, -323, -76, 160, 15, -116, -14, -216, -194, 21, -57, -106, 12, -23, 46, -68, 6, 203, 222, 20, -282, 171, -92, -139, -130, -165, 18, 41, -143, -234, 12, 199, 212, -72, 67, 9, -20, -103, -100, -141, -134, 3, 35, -69, -45, -38, 48, 142, 123, 18, -84, -105, 72, 34, -115, -169, -289, -163, 37, 33, 221, 97, -50, 185, -67, -55, 61, 54, -49, 356, 138, -139, -15, -161, 37, -166, 216, 94, -114, 26, -96, -127, 115, 89, 66, -16, -39, 156, 216, 12, 11, 7, -29, -181, -266, -222, -172, 132]
8191A32
$$ Imaginary data points
##PAGE= N=2
##DATA TABLE= (X++(I..I)), XYDATA
0@%%%%%%%%%%oJ4j6J6j6K4l2M0m8N6p2Q8j02J18j37J62j89K17k54K92l33L81m35
33b32M94n57O28p08P94q87R92j108J232j369J518j680J858k050K263k495K749
50A442l032L338l674M052m476M948n480O090o790P605q575R745j1187J3024j5451
65h421J8828k3884L2368n0100J52951k94667k35724N14559K23735k94665k89576
76b54596J67322J86813O753n7477r1244j20837J31395K37879p2564l48120K338
87b12338L80717O6758l52702r0498K66987R6618k00486n1161J51383k3589j29013
98i7324R4892J17153j17626j30711J14060J34167r6535r6529P4328J4108n3032
109d3049P5236P0675j54098j39024K13580K29434k30831k99258J81537L38242
$$ y = [0, 0, 0, 0, 0, 0, 0, 0, 0, 0, 0, -6, 8, -8, 8, -8, 16, -16, 24, -24, 32, -40, 48, -54, 64, -73, 89, -100, 117, -137, 155, -178, 203, -232, 262, -295, 333, -375, 419, -468, 524, -584, 648, -721, 797, -883, 975, -1075, 1188, -1307, 1442, -1590, 1748, -1926, 2126, -2350, 2598, -2882, 3208, -3582, 4023, -4552, 5193, -5994, 7030, -8421, 10407, -13477, 18891, -31209, 121742, -172925, -408649, 105910, 329645, 34980, -254596, -87274, 99539, 106292, 48815, -42429, -163266, -31871, 206008, 133444, -214676, -212338, 168379, 235137, -117565, -208063, 58924, 155542, -44944, -96105, 55278, 31689, -97324, -2432, 114721, -2905, -133616, -19556, 114611, 18076, -78453, -4125, 9983, -43049, 32187, 102862, -51236, -190260, 23320, 252754, 21923, -277335, -95798, 242444]
119B42444q2627l33593j4535K65063P9970j31126j06244k0664Q1113J42813R421
130A32035k19753j34747K46951K43026k10647l03661J21747L17916k3203k82300
140a12636m1554J93874O6841p9637o0111j2127J6853O4606N4537q9037j17012
151a15403Q9676J42248o5441j38158L3958J21445k7733r3726M9562N8887p6249
162b0934m2056R3576N5207j05021p9499J00920Q7155o7016p7209J1972N1966L0344
174C9405l079m4460p0708L5859J38243o068j71341n0680J67998J15340j39616
185A0893j53509Q5372J49948j1934j17760n0135O4874P4451O476o4442p8555L5934
197d8387J22057P086j26285n9646J07926R8832p8392j03382L7869Q3447K153n6030
$$ y = [242444, 159817, -173776, -188311, 76752, 156722, 25596, -80648, -101312, -20199, 122614, 132035, -87718, -222465, 24486, 267512, 56865, -246796, -125049, 192867, 169664, -112636, -154190, 39684, 106525, 26888, -33223, -45350, -28497, 36109, 90646, 1609, -115403, -25727, 116521, 51080, -87078, -53120, 68325, 40592, -53134, -3572, 55315, -20934, -62990, 30586, 85793, -19228, -98727, 2193, 89348, 22332, -54877, -42905, 9061, 39405, 36326, -8134, -78842, -42983, 95260, 89192, -82149, -132829, 35169, 150509, 10893, -142616, -57244, 92704, 80770, -36990, -87125, -22251, 52200, 58676, -5766, -84321, -48387, 73670, 80756, -45529, -105175, 2751, 101583, 23191, -80191, -42322, 41125, 43278, -12752]
209a2752j9627K6488J1341P218L870k8738j3846K7181K4034j3544l0674P888K1992
222A0831r071J68J2119j5646k0910J4527M2176o257o0146m122N8594K2735m0669
235D329m3675J9527M8965L811l2103l1655P012N0155J6721m5173m2668K3258O5649
248D4153j273o9631j9717N1966M0226k7164n2298O700M2722J2178k0667k9627
260b2432J662L2368J0994j7981k5386J695L3266N925k5169j2773R980J9045j978
273I216j6586l75M151L868N141n952m486r54J776J0217k500r727m09K059Q561
288D000K439j1334l692L548R863M892j5265p222J0887J0294o01j5060n420J5298
302B627O830n966r987l479J3787N778q498o445j123J0368N744j0235m764K802
$$ y = [-12752, -32379, -5891, 5450, 12668, 16538, -12200, -26046, 1135, 25169, 11625, -19049, -11161, 10831, 1760, 1928, 14047, -1599, -22509, -7982, 34194, 27937, -32209, -36331, 22263, 44998, 4329, -39346, -19819, 29146, 32957, 854, -30801, -23789, 26366, 43087, -2086, -44754, -21496, 44153, 42880, -26751, -46468, 5498, 45724, 18560, -33738, -27038, 15684, 27862, 7195, -22432, -20770, 11598, 22592, 4611, -20775, -19080, 14186, 20111, -5058, -17831, -7851, 11194, 9216, -7370, -7745, -3594, 274, 5415, -537, -5023, -5977, -4201, 6016, 3516, -6211, -6620, -4561, 4000, 6439, -4895, -8587, -5039, 4824, 9716, -5549, -12771, -1884, 8410, 7809, -7251, -12671, 2627, 9457, 3491, -6496, -9975, 3812, 9590, 1092, -5353, -6476, 3892, 9636, -599, -5363, -2561]
316b561O127M703r210l575N168K301K646n346m070N869Q75qo61m776L562K213
332C257j710P10l350P05L699k243N60j559j678M758j925j230Q03k216L252k30
348A603l075K155j249R04J056l925K656N40j789J578k190O86K537l606P42M13
364i64o53K940l202m50K671j592J223j200j703L525j277p63Q17j977K238N21k193
381b039J791j309oK525k131R13j86k017L490n59j378N66j776L402Q27l822N14
398a195R49K115J251n612Q50L645n3J90m326M63N202j082k335j602N90N688k241
415B497m550J325J672L481k655n575L909L780q20l178m066N757M598n528m112
430c465J170N971K394q348k804O102L767j269p909o31Q582J839n873m939J812
$$ y = [-2561, 3566, 8269, -941, -4516, 652, 2953, 5599, 253, -3817, 2052, 2927, 2919, 2258, -2518, 1044, 3257, 1547, 2257, -1093, -388, 3311, 1068, 1628, 69, -1609, 3149, 1224, -6, 797, -1419, 1833, 1603, -1472, 683, -566, 338, 1394, -2531, 125, 665, -1124, 454, -1736, -1050, 1487, -2119, -1377, -964, -1617, 1323, -1879, -2329, 342, -1250, -27, -1227, -2930, 595, -682, -1445, -628, -2605, -367, 154, -2039, -248, -1557, -1563, 962, -1169, -256, -442, -2459, 1031, 472, -906, -340, -2116, 1286, 2113, -1709, -1195, -246, 1869, 3120, -2492, -1642, 2003, 1950, 2140, -2186, -1723, 3479, 2397, 62, -1540, -950, 4738, 2497, -2053, -728, 944, 4425, 1770, -3805, 104, 3884, 3064, -114, -4180, 1577, 6175, 647, -3465, -2295, 3676, 6070, -2278, -5082, 1020, 4787, 3518, -4391, -5022, 3560, 5399, -474, -5413, -3601]
445c601Q939p88q344j441M705N723l165p943K290O145P03l931n469M667O121l560
461A051m689r76N436M958p843n283O375O445k240j0363J57J3081R63j1599n070
476i597Q692J1294p020j3588L129J1739M934q898j2599N775J4612K261j3371j2829
490a5466J1747K0038o805k0979l669K0449J3441j7014j7698Q697J7714K805j5921
503b661j0772J0241J3899J06j4539j0385J3745J5570q688j7403J143J8604L868
516A2728j7606n357J3395N319q516o799P771N909p412l060M215J867J39k895l952
531d254K423O673L571j2422j0845J6826J7171j5195k4377P615L2165m3l3450q810
545b2952K6300J8246j5049k2723J750J9113J1456q008k3695n956K8627J9608k3339
$$ y = [-3601, 5338, 4550, -3794, -5235, -530, 5193, 2028, -5915, -3625, 2520, 3223, -708, -6177, -1510, 4611, 1051, -3638, -4614, 822, 5780, -2063, -7346, -971, 5474, 3234, -7129, -6972, 6109, 7072, -4527, -9597, -905, 10389, 3369, -10219, -7090, 4649, 9583, 685, -11914, -6139, 8473, 10734, -2637, -15466, -3719, 16319, 9514, -11465, -15134, 5315, 18756, 1742, -15956, -7259, 10455, 13260, -2661, -13433, -3192, 10707, 10813, -3726, -14111, -366, 15204, 6516, -10887, -9744, 8860, 12728, -4878, -10235, 3160, 8479, -37, -6836, 935, 6844, -568, -3628, 587, 2454, 2593, -302, -4254, -1831, 4842, 8413, -4009, -14854, 1972, 19143, 3948, -20429, -12814, 19351, 19308, -14142, -22952, 3348, 21594, 6545, -16178, -14428, 4685, 16141, 8133, -15562, -21518, 7109, 26717, 3378]
558C378l3087J3466M1062k017l9749r544L0805J9235j9505k1427Q114J5116L388
571I235m832j1867m361J3560J2417j0004j9422O074K3605n407k0782L666J8637
584A0519l586j9564P333K0515j0412k0491Q883K0853l205k0517j713J4562N317
597H494l670n024j0711J791K0782J0765k9435k5559L2392L8245k4900m7360R841
610b4349N0164N366m3472j7480K8871K1956p359j9451j2479R544K4552P934l0229
623f432k6133K8246L8854j9115m4203N982M2681M415l4769q111K1336O607q225
636A133k011N75o212J848J5735l466k0459L934J9142l227j6683N340J5806j2876
650a421j5686K1635J7576k6583k3719K6411L2072k2473l6081J3519L3112j200
$$ y = [3378, -29709, -16243, 24819, 22802, -16947, -26491, 4314, 23549, 4044, -17383, -9269, 5847, 9235, 4403, -7464, -11825, 1735, 14152, 4148, -15274, -9200, 14405, 8998, -11784, -8118, 10519, 6933, -12631, -5298, 15217, 4805, -15686, -6803, 14050, 10845, -9672, -11385, 3177, 8494, 4824, -200, -10911, -9120, 11662, 22427, -7008, -32567, -175, 38070, 13170, -34190, -24349, 25815, 31181, -12291, -29771, -900, 21056, 13697, -5754, -18233, -8689, 15863, 23797, -6432, -32565, -4319, 34535, 15420, -28783, -22801, 19880, 24295, -10474, -18585, 2751, 9358, 1133, -878, -303, -6515, -4667, 11068, 7602, -12857, -8923, 10219, 6992, -9691, -4351, 11455, -1421, -17107, 4528, 22104, -4479, -28198, -1787, 30285, 7812, -28269, -14750, 18362, 17162]
662A7162k2886r424Q227J2289R841o147k8912m902M0163K0590m0873l7167L2933
675i106M8981k0064m9766M476M0008J0038k4253j6410N919J2243J3013j774k5957
688a2652j1079K9700K3641k5374l3249J8075L5601j1029k9381N130K0098l363
700F118j1817P389N869j4602k158J9276K173j9158n409J6398O236j1197j860M388
714A646p157J122J7424q13k7214o407L4649J5446l5155k4008K7373K9687j4287
727A2306l0203J593K1001Q874n137j4696j2322J3051K6167k797l5206j1631L7660
740H660K3240l1007k9602J7486L1149n212k4737l494J2216P352J997o288j2330
753a0570N9J7014R109j8184j5003J4768J6304q911j2872L559Q164l170k024P390
$$ y = [17162, -5724, -15148, -6921, 5368, 15209, 9062, -19850, -24752, 15411, 36001, -4872, -42039, -9106, 39875, 19811, -29955, -25479, 14529, 24567, 314, -16096, -10177, 2066, 15079, 13305, -12652, -23731, 5969, 29610, 4236, -29013, -10938, 24663, 13634, -15747, -10617, 9481, 6118, -5699, 1690, 7559, -7043, -9201, 10075, 12248, -6910, -12319, 4079, 10315, -882, -2742, 1646, -5511, -4389, 13035, 12222, -14992, -21399, 13250, 28696, -6459, -30467, -3094, 26593, 12306, -17897, -16304, 4697, 13571, 8434, -6262, -18584, -5533, 20634, 17837, -17369, -29000, 8660, 31900, 893, -28709, -11223, 19926, 14714, -10023, -13517, -1301, 6051, 8048, 1760, -10570, -10511, 6503, 15612, -2572, -17575, -2807, 13497, 4586, -8286, -4727, 3437, 267, -1757, 5633]
767E633l871j1571M948J5511j025j8301l457J6446O721r343p766K16N903O762
781F806J217j0185j1811J0335K0692o145k4678k703K4162J2327j9684j7133J0327
794f473J7137J241j3050r730N066J2281N893j0561j5550N911J9172J447j7511
807d727r269J2867J3289o981j1373n95O785N663j639n149m763J916Q983K274r480
822b199n364N847P014j039p222j532L155K827K541k671n973o10O628N946n850
837A498r892L242J0291J780q224o624M620Q100L85o045o053K628R394J532q382
852a750o273M583J0310p66r891l223O302P033k087p986j536N080M982q12p012
867c046k090N047M738j119o147j994N459L505j643m746j791M521L284j913l416
$$ y = [5633, 1762, -9809, -4861, 10650, 9625, -8676, -12133, 4313, 11034, 1691, -6075, -5859, 44, 6806, 8023, -2162, -13973, -3638, 17054, 10909, -13769, -16472, 7690, 20017, 333, -16800, -6473, 10664, 11905, -1145, -10875, -5809, 6472, 12365, 1804, -13746, -7835, 11337, 12784, -4727, -13996, -1129, 12160, 5179, -6194, -6789, -4, 5659, 4020, -1129, -5892, -3976, 5007, 7281, -2199, -7563, -1716, 5298, 4259, -2963, -4495, -1340, 1487, 4028, 1357, -4616, -5226, 1402, 7348, 1498, -8394, -5152, 5139, 6919, -1305, -7929, -3309, 4791, 5176, -869, -6922, -4294, 5100, 6632, -1750, -8023, -3440, 6870, 6104, -3787, -7010, -708, 6325, 4238, -3748, -5284, -204, 4778, 3966, -3046, -5136, -89, 4649, 3530, -2617, -4611, 848, 4353, 2710, -2036, -3827, 694, 3978, 2065, -1351]
882a351j912L222M025j551l989j703K939M314j561m225j014K627L772j462m169
897b038m40K736L027r60m486n71K832K631j254l710k08L053J652r82l370k68L221
914H65J201j470k015p75K529J569j411j734p58K152J669j562j617o8J222J880
930A677j511j723K34J308J404r20k036M56J109R55m10k025O09J339O1k04j449
947a126L01J744j82m86r67MJ433j42o39k5n03J261k18n60j51J5K01O83l34m41
967a32R3k9J129n43j087N71j1R81o02j183N57O02N07n10r69N69Q81m09n13o49
987g47R19J133j222p63K05Q98M30j156n82J036L18L03j300n20J586N81j626m09
1005i16K7J891k00j990j63J457J071p85k372R79K018j45j449j363J551K073j371
$$ y = [-1351, -3263, -41, 3984, 2433, -1556, -3259, -320, 3994, 2433, -1792, -2806, -179, 3593, 2131, -2038, -2478, 258, 3285, 2325, -2161, -2732, 100, 2731, 1477, -2233, -2441, 612, 2264, 1282, -2088, -2356, 865, 2066, 596, -1419, -2194, 335, 1904, 493, -1241, -1999, 153, 1822, 260, -1357, -1425, -203, 1677, 166, -1557, -1323, -15, 1389, 469, -1567, -1111, -2, 953, 543, -1482, -873, 466, 527, 323, -1126, -825, 919, 737, 251, -716, -712, 721, 579, -60, -85, -588, 673, 455, -105, -256, -241, -40, 643, 309, -132, -39, -68, 1061, 518, -569, 2, -9, 972, 370, -813, -256, 346, 853, 343, -626, -57, 824, 415, -98, -747, 172, 1305, 83, -680, -475, 423, 853, -303, -885, 151, 469, 772, -528, -1048, 538, 1119, -507, -916, -889, 1002, 802, -1188, -1351, 106, 1177, 392, -1980, -1001, 1017, 872, -577, -1940, -389, 1684, 313]
1022C13j626J56J624P42j678j531J896Q90J9j617r74K420Q97j242j413K24K001
1039A101K92k157p51J635J847j158k704O46K614M61k356j589J653K695j282k508
1055a561Q1K625J082k290j947J805K117m61k398j132K677J750j806k417M46K974
1071A545P56l015j483K233K429j315l383L84L695L38k648k076J964L221j139l273
1087a767k97K665K227k289l410J211L562O15l611k382L519L118k200l637L21L912
1103A557J282l155k687K157K672J8k885j695K973K007j306l103j34M046Q33l479
1119h99j776K194K945j413l410J059K748J01k308q25J745J449j140j508K1J200
1135A83J573j410k093Q77K912K54l937j407L949K811l310l851K320M470j207m296
$$ y = [313, -1313, -1157, 467, 1209, -469, -2000, -104, 786, 805, -812, -1786, 634, 1531, 289, -1124, -900, 1101, 1393, -764, -1515, 120, 1967, 809, -1895, -1249, 1365, 1826, -530, -2119, -466, 2229, 947, -1561, -1480, 1145, 2227, -63, -2010, -205, 1912, 1451, -947, -2079, 598, 2348, 542, -1875, -1429, 1545, 2301, -714, -2197, 36, 2465, 1150, -2233, -1849, 1846, 2184, -464, -2540, -576, 2645, 1506, -1767, -2064, 601, 2828, 539, -2871, -1660, 1902, 2517, -1094, -3476, 43, 3161, 961, -2676, -2355, 1557, 2839, -316, -3003, -846, 1826, 1844, -1041, -2736, 237, 2244, 938, -2165, -2299, 1747, 2580, -899, -2675, -481, 2464, 1051, -2359, -1300, 1448, 1549, -759, -1584, 161, 1610, 470, -1038, -1017, 183, 1756, 346, -1747, -870, 2042, 2296, -1641, -3048, 901, 3712, 402, -3449, -1129, 3341, 2134, -2162]
1151b162m69L166K023j419l280J42K841K180k054l986P98M620J079m758k654L785
1167a48M007k736l732J052K968N68k121j414P19J352P84p09k372O06K462M56k515
1184g73j290L090J138k921j321K644J408k359j784K244J807j832j625J063J434
1199I23j95j167m39J60J182J044j330k470J308L443l68m099j043M430J670l403
1215c54k325J605L167n12k799l15J151J569K58j693j982J375K834k70l438n56
1231b285L296J386k689j709J728K013j323j138N54M58k54k9M34n11m27L91R41
1248H36j187j53J197p1j057k72J663l28j726L22J799n1j808k14J469J066j529
1265d4j061O91Q87K15o16l30o31J006R05k58k157K84K116P37k237r76J773R38
$$ y = [-2162, -2631, 535, 2558, 1139, -2141, -1999, 842, 3022, 968, -3018, -2220, 2400, 3479, -1279, -3933, -148, 3859, 1123, -2609, -1557, 1411, 1979, -142, -1556, -837, 515, 1299, 590, -1782, -1176, 1286, 1742, -773, -2063, 1027, 2165, -756, -2077, 567, 1975, -384, -2168, 76, 1883, 51, -1574, -511, 923, 728, -439, -878, -718, 464, 1508, 178, -2292, -984, 2459, 2091, -2008, -3051, 1379, 3049, -354, -2679, -1074, 2093, 1581, -1218, -1533, -382, 1187, 1445, -248, -2230, -855, 1979, 1709, -1729, -2285, 1011, 2397, -292, -2001, -273, 1740, 417, -721, -167, 291, 37, 8, 442, -69, -496, -105, 836, -351, -504, 693, 622, -435, -707, 956, 628, -1098, -776, 1023, 972, -836, -1050, 419, 1485, -44, -1105, -414, 473, 688, 72, -258, -889, 117, 1022, 764, -1393, -1109, 1007, 1744, -493, -1469, 304, 1242]
1283A242p98j260L15Q06j4qm98j53j88J304J93j491l16J280M09q71q58Q95P0j09
1303e0j76L39L4j60O7L39k81m04r4N77J46l73q1q9L55j86K02j59m03j3J078Q7
1325G55j168k56R16M87q06n57j26Q37L16l68o95J63M69M83J9p89l54Q64M09j28
1345D71j086kJ082J54n74n20K77K45K30q1l21j63L18L39M4p14L8L31L47l81j84
1366a50J77K37j96j68L17n42J51M95K20n76n16N58L42j45o40K44J77K10K07l51
1386E1o26J78Q17N4m48r42Q11P95j55q09m76N75P45l12m69k71K79P80k49n67m45
1407f84L38J004q1q81k02M80P72p69k99mM09M26k07o51j80L63L76K66n34m33N50
1428E9O58m06m43n02P51O0P5k88n19L68N95J04o89n02M90Q49l32n57m55O50O73
$$ y = [1242, 444, -816, -501, 305, 291, 283, -215, -368, -556, 748, 941, -550, -866, 414, 823, -48, -906, -11, 59, -50, -226, 113, 147, -13, 54, 393, 112, -292, -386, 191, 337, -36, -117, -206, 149, -37, 165, 6, -397, -410, 668, 755, -413, -669, 247, 734, -72, -629, -755, 82, 398, 30, -665, -502, -33, 450, 469, -320, -674, 190, 599, 471, -615, -617, 465, 619, 45, -475, -198, 47, 277, 196, -125, -288, 30, 369, 413, -301, -263, 68, 415, 34, -150, 27, 264, 68, -100, 217, -325, -174, 321, 541, -35, -551, 7, 349, 204, -436, -192, -15, 195, 402, 51, -575, -397, 420, 474, 26, -916, -105, 690, 535, -274, -750, -175, 570, 258, -211, -482, -203, 577, 328, -239, -684, -346, 658, 577, -304, -506, -26, 746, -23, -322, -326, 83, 509, 302, -349, -529, -166, 210, 476, -58, -491, 59, 717, 311, -132, -634, 117, 177, 252, -36, -555, -187, 408, 512, -177, -679, -189, 660, 328, -229, -684, -34, 639]
1449F39q8q30l58M40N39m9n82k04K97P44o1q08k14N47N68q4p16l24N40L82r6m82
1471b00j93M02N79k72m22j09K87L57k43k82k11M73K77l03k59l13M45O31j08q14
1491b78j62N08N07k38q10q2M90K09N0m96J6K06P47p99j43m0K91P51o29n11J45
1512b68L90N2j73k51q9L59K18k52k29k40N32L09k05n80R6J43M93m92Ro5J77L33
1534B67k89k65k1M90m6N1m08j97L68N16l90l33K38J04K45k13m30K33R7K02P7k03
1556I3kj41K89k10q8L60l19J4J90k39l19L90L8M89p05k50L41M49k01m09K52n5
1578c3J20Pp6l23M05N07n55k73Q0M40K00p20j4o0P50p0n75k90N56K09k84r5N7
1601c7M4K16m24o6J30Q20n47l43k5L33L64n10m93M81L40l9m02j10N14K40m73n31
$$ y = [639, 551, -279, -637, -197, 342, 293, -289, -493, -196, 548, 487, -321, -535, 12, 580, 496, -220, -544, -4, 378, 282, -200, -393, 9, 588, 316, -106, -215, 72, 429, 186, -96, -307, 166, 443, 140, -119, -432, 13, 644, 536, -278, -440, 68, 575, 337, -473, -555, -65, 144, 194, -302, -286, -80, 667, -132, -275, -315, -24, 727, 98, -413, -268, 122, 174, 1, -250, -339, 20, 238, -14, -243, -483, 49, 358, 153, -427, -331, -188, 305, -187, -178, -243, -66, 267, -22, -287, -308, 182, 136, 187, -221, -418, -50, 466, 76, -257, -19, 85, 330, 117, -313, -80, 17, 219, 296, 93, 91, -50, 239, 29, -59, 301, -18, -4, 186, -53, -372, 18, 56, 545, -160, -410, -69, 380, 179, -230, 22, -33, 87, 94, 18, -305, 100, 607, 52, -221, -141, 299, 499, -221, -235, -295, 455, 385, -190, -480, 76, 285, 1, -94, -37, 7, 223, -201, -267, -137, 683, 136, -207, -232, 101, 465, -45, -538, -57, 283, 244, -158, -268, 246, 486, 13, -518]
1623e18K01O08L9p42j07M81O65m67p42K17Q03K66q19m66M43O69l15n04j24O03
1643A91M00k99r48L71Q99l19n53k00M96Q09n11j083L65J065J79r34o95J009P27
1662I69l57j170j81J481J95r85p74O98J021j61j411r1Q54R43q06j306J93J608
1680G20J86j268n62M32J542l81j439k24J107J131j056j412J039J032n8j310p09
1697a230J162J108j031j157L15J668K31j942k80J068J182n41j484oJ565N08j306
1714a70r56P43J395n1j614q52J460J357o47j924L78J811j30j301r12J179J548
1731A314p73j720K58J556O28j664o33P85J284L2k037l76J873P74j336j325N86
1748g74K318k22k058m26J551J163q41j993K77J824O81j400j869J312J999k80k158
$$ y = [-518, -317, 291, 330, -412, -519, -38, 627, 160, -582, -365, 438, 704, -115, -581, -138, 531, 216, -288, -412, 191, 591, 292, -656, -285, 614, 295, -258, -458, 38, 847, 336, -747, -382, 683, 862, -72, -767, 242, 969, 612, -558, -739, 742, 937, -48, -822, -124, 897, 736, -675, -766, 88, 1031, 225, -1081, -888, 720, 906, -362, -924, -492, 1050, 669, -770, -994, 113, 1244, 188, -1224, -185, 847, 789, -521, -1230, -68, 1040, 9, -1148, -833, 835, 1066, -876, -1156, -88, 1094, 553, -931, -937, 628, 1136, -170, -1126, -383, 1012, 961, -653, -1505, -45, 1312, 665, -1259, -881, 930, 800, -501, -1413, -234, 1314, 541, -1179, -921, 635, 1263, -401, -1034, -249, 1035, 1067, -970, -1346, 527, 1301, -35, -1360, -774, 1544, 1322, -736, -1162, 389, 1552, 711, -1282, -1005, 819, 1500, 100, -1769, -457, 1542, 1262, -896]
1765h96j053J900K479j811k690O26K792M54k541j419K178J679j145j787M7J660
1781D73N16p49j105L3J589M11j271j188R72J335o46j775M70K078k25j895L1J408
1799D62L73j226q54J252R00n02r17l10P89R40m47j589n15K524J382k441k254J659
1817g74K972o10l494J6K640J447k006j988Q61J749Q65j376j872K03K393J246k604
1834c32k181J998K873q19l397K13K771O49k001r43J074O28l70J38k82n00M38O73
1852F30k67j014K63J076o25n75P93N39j170j026J493J742k080j877J591K284o62
1869A115k437j91J919R30p47j601m19J032K021m05k785j035L558K131l221k886
1885c021K019K965j32l176o91K068J267l01j742q97Q94K001L45k445j471K237
$$ y = [-896, -1949, -49, 2430, 619, -2071, -1445, 1347, 1801, -740, -2159, 19, 1698, 553, -1234, -1187, 473, 989, 240, -865, -832, 757, 1168, -103, -1291, -319, 1016, 370, -1405, -935, 1143, 918, -977, -946, 462, 835, -391, -1245, 7, 907, 405, -512, -822, -33, 907, 460, -1129, -1644, 880, 2262, -179, -2433, -774, 2198, 1588, -1906, -1890, 750, 2197, 191, -1797, -936, 813, 1678, 302, -1570, -1367, 1026, 2272, -332, -2513, -515, 2358, 1539, -1858, -1645, 1126, 1775, -226, -1169, -95, 533, 163, 301, 19, -481, -43, 630, 363, -651, -388, 688, 63, -512, 281, 820, -350, -1376, 117, 1859, -221, -2098, -507, 1777, 1115, -1322, -1513, 406, 1336, 589, -1012, -1431, -399, 1622, 1217, -1568, -2603, 955, 3086, -135, -3021, -1002, 1963, 1831, -1345, -2036, 32, 1299, 998, -744, -1641, -747, 1254, 1599, -846, -2317, -80]
1901h0K177j515k388P11K215Oj575o3O60n70K67P02j51j254J44J664J61j445q74
1920a208J003Q78j40m34n87l98N28J834q89k174J1K929J082k397k515K058K211
1937A792m26k161p86J189J405M22j402j559N92K935J07k954j441K098K310j210
1953I11k277k21K157J007j060j481P4R44Q04M03k177o53J681J678j125j764r9
1970a198J531L96l14p08n89P04P96J61p32j384P01J797l22j349j248J560J273
1987A075k24j624o05J146J410j81j431r90J069J798j06k168r43J763J427m54k114
2004a152j84J166J361m84j620n60J666J060l74j674m61J398J432j057j339j01
2020i23J294R14o43j503j26J171J093n71j469l07J223J018n64j367j61J087J023
$$ y = [-80, 2097, 582, -1806, -1095, 1120, 1126, -449, -512, 148, -422, -155, 547, 396, -858, -714, 950, 1111, -334, -1208, -205, 673, 533, 99, -488, -886, -358, 1476, 587, -1587, -1576, 1353, 2435, 38, -2477, -419, 1792, 1366, -795, -1581, -392, 1013, 1435, 33, -1526, -934, 2001, 2108, -846, -2287, -189, 2121, 911, -1366, -1587, 570, 1577, 517, -964, -890, 54, 858, 1261, -916, -1569, 112, 1790, 665, -1099, -1198, 333, 729, 415, -293, -882, -178, 618, 779, 47, -1337, -636, 1161, 839, -510, -1758, -198, 1075, 851, -773, -1378, -232, 1178, 997, -434, -1424, -355, 1443, 1337, -831, -1774, -11, 1416, 962, -1152, -1336, -170, 1191, 707, -913, -1473, 193, 1253, 879, -795, -1256, 142, 1574, 517, -822, -923, 371, 1285, 642, -861, -987, 184, 1277, 706, -763, -1070, 153, 1171, 607, -760, -921, 166, 1189]
2037A189m78j553l86J886L60o15j094m75J567P04l27j554m04J548J053j121j141
2054h41k38J300R82r05j036k52J157J029j071r29L03N45J190p66j500L40Q22R13
2072A043p40j229J50P48R16m49j369q2J628L14o14j498K53J325N30q48p54l76
2090a052J509L15p85q94J04J174N39q38q91j48R32J120j013q77L26Q13M48o02
2108A80j155L34Q96N42o04r08K24J143k7l02p52J0P95L63m45p34k31J211L16p84
2128G2o12o7J262L37j115o67N06Q44K77q05p50N54Q50J58q44q67Q60O09r5q31
2148c24j6M93P3j30k69l23M77L18k40k53o8J54O2J41n1J50l87J60L10%l00l97
2170d20K20N94J40n71o69P67O49o05o82L14L57O73p00o14J56M18P57p31r40L21
$$ y = [1189, 711, -842, -1228, 658, 1018, 403, -691, -1166, 401, 1105, 778, -776, -1180, 368, 1421, 300, -841, -1079, 221, 1203, 298, -738, -990, 167, 1196, 125, -804, -501, 44, 1234, 468, -1032, -692, 130, 1043, 303, -926, -776, -28, 888, 439, -930, -1012, 616, 930, 316, -1182, -929, 396, 926, 78, -676, -1052, 457, 772, -13, -907, -803, 371, 910, 72, -819, -967, -35, 1085, 72, -805, -479, 334, 782, 180, -975, -641, 255, 797, 193, -715, -491, 652, 625, 323, -429, -419, 376, 739, 294, -440, -671, 540, 856, 72, -540, -607, 655, 992, -123, -790, -284, 560, 837, 32, -718, -164, 686, 844, 0, -867, -7, 602, 507, -324, -340, 153, 226, 96, -173, -496, -19, 299, 59, -194, -262, -108, -46, 95, 44, 194, -193, -33, 277, 277, -23, -420, -200, 394, 534, -37, -706, 61, 710, 105, -577, -263, 94, 767, 67, -547, -391, 27, 784, 53, -887, -566]
2190e66J343k36j003l16Q00R91p51p72q6R16N78j143l02M22Q59l55o76o08J366
2209D61J91m31j039M55J074j68j015l21R14J022r03r27M85Q07J09j042k46N42
2227c2J154p15p84n51J304Q50j191j000N28J370J27j570n18J367O02n05j247L9
2245g72J311N89j193o57M81J208m53j374j10J317M72j138r50J092J270o89j233
2262h29q1J227R91j329j292P01J558Q1k036q44J614J639q46k095O1K564O84k133
2280c65j278J410J702l79k223n58K047R57r67j827N45J843N62j612j588J283K069
2297A621m72k512J77K143O74j553j594J063K092r62j420l48J392J189j294j335
2313a139L89J922L10k190q48K044J296j307k123O51K187J69j988q04J507J711
$$ y = [-566, 777, 541, -462, -778, 22, 1013, 262, -510, -596, 320, 898, -245, -547, -125, 734, 379, -297, -905, 461, 652, 221, -818, -363, 711, 543, -472, -793, 121, 1143, 240, -687, -202, 605, 714, -328, -574, -32, 1122, 407, -377, -928, 376, 1226, 35, -965, -437, 933, 1060, -510, -1028, 339, 941, 436, -811, -772, 539, 1128, -65, -722, -241, 967, 514, -860, -970, 347, 819, -319, -1269, -177, 1093, 404, -829, -910, 317, 1308, -21, -1313, -612, 946, 1027, -1009, -1853, -239, 1400, 554, -1541, -1480, 1084, 1768, -365, -1643, -233, 1469, 1090, -1133, -1691, 356, 1313, 346, -1481, -936, 907, 1469, -143, -1731, -448, 1621, 1149, -1363, -1186, 957, 1631, 78, -1516, -453, 1639, 677, -743, -1091, 301, 1490, 196, -1139, -750, 1172, 1482, -708, -1556, 488, 1784, 477, -1646, -995, 1192, 1361, -627, -1431, 76, 1787]
2329A787j011k089J17J834R64j605j975Q98K590rk522j063K350K006j742k300
2345a770M69K388J037k559j732J724K032k40k458q51K588J160j642j963O33K815
2361A631j65k398q70J742J876j082k473O56K046N26j544j765J533K266q66k483
2377a370l79K365J386j937j791J170J891J7k215p90K006J178q63j917m7K278M78
2394A460j770j151J293K078q87k490K51K310J94j359j499J429J790j159j259j02
2410h71J474J022j739j331Q36K230K68k491j299K333J666j595k448K96L176M55
2426A982k728j160J617K145o33k523l22J920J620j063k361k31K411J379j760k388
2442b095R78K656k83k540l37J863J022j353q49O67N20K94l90r66K91Q18j05k44
$$ y = [1787, 776, -1313, -1196, 638, 1602, -3, -1978, -1080, 1510, 1501, -1021, -2084, 266, 2272, 530, -1770, -1301, 1087, 2124, -435, -2167, -443, 1589, 1349, -1109, -1960, 628, 1788, 146, -1817, -1184, 1631, 1466, -932, -1802, -60, 1816, 734, -1739, -1083, 963, 1489, -55, -1820, -287, 1979, 1113, -1370, -1749, 616, 2002, 65, -1726, -556, 1335, 1352, -863, -1653, 353, 1531, 668, -1249, -1296, 982, 1460, -310, -1461, -168, 1910, 1023, -1467, -1216, 1094, 1288, -71, -1570, -141, 1649, 490, -769, -871, 603, 1625, -114, -1445, -609, 1621, 1889, -602, -1901, 432, 2098, 503, -1945, -1649, 1527, 1982, -746, -1906, -289, 1856, 1223, -1300, -1622, 298, 1918, 855, -1506, -1737, 674, 2053, 293, -2095, -1117, 1539, 1256, -1284, -1621, 242, 1264, -89, -938, -271, 249, 543, 153, -813, -522, 296, 191, -53]
2460e3m58M68O35r30m57J212M91j129q78J004J888j710j656Q93J842J80j856r25
2478a439J156J317J81j207j968J496K127J45k889j315K944K323k276k820O25L133
2494A533O77k590j395J134J757L25j606j017J35J860P70j353k150J362K179n34
2510A087j522n65J304P65j067Rn82l18J084P44n48j332l25J944N92j256q16k09
2528a011J249Q18m50j303o38J042J877p84k300j92K347J936k491k178J043K263
2544A228N37j733j807R54J812R09j715k314Q13K732P26k376j990J462K654n78
2560A314k221q45J369J717K4j691j026M57K012M66j830j334R90K211k9k089j201
2577a706J805J219j76j579r33R19J546L66j627j472J123K069M4k406p26J363J958
$$ y = [-53, -511, -43, 592, -338, -795, 417, 908, -221, -1099, -95, 1793, 83, -1573, -680, 1162, 1342, -514, -1439, -283, 1034, 1215, 8, -1960, -464, 1663, 1808, -1081, -2396, 548, 2871, 595, -2225, -1600, 1533, 2210, -380, -1775, -641, 1116, 1441, -165, -1182, -1047, 813, 1583, 230, -1920, -558, 1621, 1087, -435, -1000, 304, 1069, 2, 11, -571, -889, 195, 939, 391, -941, -1266, 678, 1270, 14, -802, -1011, 238, 1056, 606, -697, -1335, -293, 1584, 800, -1500, -1692, 655, 2591, 100, -2078, -1035, 1228, 1765, 32, -1775, -821, 991, 1900, 185, -2129, -1316, 1416, 2142, -234, -2224, -762, 1892, 1314, -907, -1752, -383, 1334, 1358, -333, -1359, -902, 1110, 1576, -254, -1588, -598, 1613, 1584, -505, -1706, 99, 1318, 1142, -437, -1370, -451, 1095, 1461, -166, -1638, -515, 1554, 1598, -808, -1534, -171, 1787]
2594A787n37j972n95J051J724l60j496j481J390K347m20k319j032J480K006l12
2610A261k467m02J803R78j80j866p18J399J748p90j620r34J707J559l44k149n57
2627a572J604J479p49j847n35J585J507p47j429q03J469J693j044j906j12J564
2643A57J423q03k017RJ500J263p68k116l9J829R98p01k005R0J556R91r68j414
2661a015m31J763R15r16j206l18J555J101j074j142k49J492R59j018j448L86J125
2678D79J207j179j631K97J347R07j104j509M04J548M19p14j470K24J050M86n14
2695B47j194p1J553O11j248p99K41J604j33j143o03K15J312j14n01o77j94J080
2713A86J074j242q24N0J260L38r69q25K06J254K36n05j070q9J169P70r23j530
$$ y = [1787, 1250, -722, -1317, -266, 1458, 1098, -398, -1879, -489, 1858, 1438, -881, -1913, -433, 1573, 1261, -1206, -1608, 195, 1173, 993, -873, -1591, -192, 1556, 766, -854, -1788, -81, 1478, 1134, -1015, -1572, 32, 1511, 762, -1085, -1620, -35, 1472, 725, -704, -1507, -38, 1655, 611, -1295, -1407, 157, 1580, 777, -1240, -1231, 269, 1532, 764, -1352, -1391, 438, 1436, 735, -1270, -1180, 376, 1367, 399, -1015, -1446, 317, 1232, 316, -890, -1208, 347, 1448, 374, -768, -1017, 475, 1434, 416, -1032, -646, 479, 1686, 507, -1124, -827, 520, 1427, 323, -1186, -782, 766, 1185, 471, -999, -775, 275, 761, 247, -947, -1018, 535, 1146, -102, -901, -660, 944, 811, -332, -935, -720, 592, 478, -23, -700, -894, 186, 1260, 18, -806, -756, 504, 842, -127, -952, -746, 508, 744, 239, -831, -920, 249, 1019, 96, -1434]
2731a434M56J896J9j271o93P68J295n09p44p19O39P30J63j126l94R04R46l29j460
2750h63J48J030M63q62m79N0P72r1k40j43K30m17N30L66l01p04P89j20k24N56
2770D90k99n71O24k32N1P7n36K28J575p28j165l0J612o70q7j320M40J292m8p24
2790b1r08L71J018K43j144k77N87J150o90j069k42J518M39j246o37O19P67lq63
2809c88l22O42N28l51m94n9Q54n4n61n90J030M76o57q38L35P05L7m70l63M33O51
2830E44l04q41j47J008K42n78r00M84J213j43r55l74R20O31l40j222K39J054j10
2849D21o29m36L85R36k72r18O0Q74K12m25p81N99M91p9o93l37P12K97m74m46K0
2870d83R21K70r54k47L62P12j40j104mJ077L01o50q59N36R82k66q63NN43Q11n86
$$ y = [-1434, -978, 918, 937, -334, -1027, -259, 1036, 527, -217, -936, -297, 433, 596, -530, -924, -20, 926, 597, -863, -715, 315, 778, -84, -563, -513, 259, 168, -72, -215, 15, -402, 128, 494, 193, -511, 278, 158, -66, 490, 191, -380, 244, 12, 63, 140, -396, -168, 1407, 679, -486, -516, 1096, 426, 339, -981, -541, 751, 703, -21, -929, -558, 460, 703, -441, -718, -131, 1019, 329, -740, -982, 536, 975, -271, -908, -289, 478, 475, -388, -710, -68, 460, 109, -385, -444, 410, 356, -205, -795, 235, 711, 54, -784, -449, 256, 293, -177, -540, -107, 544, 240, -601, -748, 260, 502, -76, -976, -492, 721, 578, -377, -751, 169, 800, 460, -762, -523, 531, 421, -208, -644, -259, 677, 405, -513, -453, 421, 633, 208, -573, 26, 517, 438, -255, -592, 120, 417, -57, -503, -483, 438, 708, -246, -493, -131, 581, 441, -663, -667, 410, 711, 61, -798, -262, 720, 454, -409, -404, 139, 950, 364]
2891C64r11o7O54N43o39p50M72J128r4j100o77J196Q93j092o85M93P70Qj023r4
2911f11O53N46n08n49k76P80M71m02j163J79K478p33r61J80M73N55o11j344Q94
2930E1P03l74q83o3J276o97k72m85M22L88J268j800o29P28J301m64j423K25R75
2949B47O68j056o88Q31O76J28j257j37N05Q07p6j146J00M70P30n74q28K13J064
2968F77m03p51R3N69M45q84j10J58M20Rk22m59O24nJ96o84o4P33L81o85m30O45
2990B53J46k58o64R7Q71j07l14o52L99Q74l22m99j91K51M22jr36J08N03M73k99
3011A54q25M95Q04l41q71k0P44N46m28p53j4N83K83o13k53M59M36j55l74l48O39
3032A48J24l99m10O00K28K8m82J31R6L29k10l06J9L77r2q2n41L29O56l20m80j2
$$ y = [364, -547, -614, 40, 583, -56, -806, -334, 794, 700, -400, -1077, 119, 1012, -80, -765, -272, 498, 506, -517, -611, 42, 588, 80, -469, -745, 35, 506, 104, -1059, -880, 1598, 865, -96, 84, 557, 1112, 501, -843, 51, 754, 380, -503, -566, 710, 13, -259, -744, -322, 66, 1334, -466, -1095, -367, 934, 470, -953, -728, 247, 915, -141, -829, 2, 678, 806, -451, -588, -83, 724, 648, -498, -398, 72, 802, 228, -600, -387, 677, 274, -477, -384, 185, 630, -254, -364, -206, 214, 223, 1, -458, 166, 161, 357, -327, -391, 342, 723, 38, -392, 253, 399, 141, -523, -426, 445, 338, 24, -628, -229, 645, 323, -176, -367, -116, 306, 305, -631, -523, -20, 453, 154, -671, -176, 628, 287, -584, -604, 140, 686, 258, -495, -509, 74, 357, -256, -509, -50, 386, 231, -143, -491, 148, 272, -127, -537, 63, 291, 319, -163, -32, 64, 393, 183, -123, -104, 273, 181, 99, -442, -113, 543, 223, -257, -269]
3054b69M43J87k72k28K44N8j70r5j49K33q6J43j38N2L29j47j69o2K98J67k32q45
3076g08L09P99l57l55R5L55m1j41j41L0L07J4j71m02P2M25K25l01k54K78J02J41
3098B81o13k10M18K81l09P7p4K10J80j44m01O0J53M48k29n18J05K88l4l0M4j07
3120a24K02q7K81l72R8p5lL82M3n66K51J28L08n36l30M40l2L83m81q3J03J54L04
3143C88l70k68K47L03j87m73l4N25M98l78n72p9L62M02J24m77m97P23l2j00j41
3164c6k56M76K88r0o63r2K88K23J78k97m69M94N13l66m83j40M45N58l40k78k87
3185c34O4N94l28l29j17J27O43k76m41j07O21L02k18q33L56L46J94k46n10J79
3205c13N79L79o21l77k45N66N31m63k64K5L30J25l45r5q7M12N49p50k92k0L69
$$ y = [-269, 174, 361, 89, -139, 105, 163, -7, -102, -251, -18, -104, 39, -99, -47, 282, 135, -34, -96, 202, 369, 137, -708, -399, 400, 43, -312, -217, 138, 97, -44, -185, -155, 152, 166, -5, -407, -335, 90, 315, 14, -240, 38, 140, 281, -332, -542, -124, 157, -152, -75, -149, 61, 241, 97, -304, -244, -91, 357, 128, -390, -285, 3, -31, -61, -17, -124, 78, -9, 272, -100, -2, -77, -80, 302, 345, -221, 30, 158, 466, -70, -400, 40, 8, 391, -90, -173, -70, 84, 388, 18, -250, -3, 300, 113, -360, -394, 131, 629, 251, -321, -400, -38, 364, 488, 11, -486, 237, 205, 105, -36, -292, 184, 472, 382, -281, -373, -85, 138, 316, 19, -450, 44, 557, 191, -292, -432, 13, 571, 231, -47, -334, -270, 324, -4, -333, -450, -323, 320, 44, -397, -504, 117, 419, 201, -632, -276, 70, 264, 18, -492, -313, 266, 645, 24, -353, -598, -32, 499, 36, -228, -203, 127, 252, -93, -188, -275, 137, 686, -64, -356, -376, -7]
3226gM60o3p97OP47R2M0j059K94N74J63n31k18J55M25N0l51k52p7N70J53k11l16
3249a53k00L83L63m22l60J65L93M30l90p20K21N35M19l28p44KM34M24j62o69j30
3270e09O91K04l96m01J94O46j50j43o00Q2P95O3k41o19K77M24L54p69j82l2R76
3291F64n29n81K1N47M53l66p8l85K36k21P85p49p6N50k57N38p02k47L58L12O61
3312I34j633N92j68L44R73j185N67j107J095J66j295N53N60j05l80k70J53k81
3330d87N31N06o63j24k7P05M60j369j61N58O82l79k19m73M67N75k90n09k8J84
3350f1N18q4p19K9M80L46l67m61K35Q8L05l34l2r6J2J05M28n71J4J31K1O1k52
3373b04L52k89j14K85k0j55l05J85M80n8m29l72P84K24l18n73L46N14q6j63n99
$$ y = [-7, 453, 390, -407, -401, 346, 438, 478, -581, -287, 287, 450, -81, -299, -144, 281, 331, -20, -272, -349, 221, 374, 163, -153, -353, 30, 393, -29, -389, -224, 169, 599, 209, -511, -290, 245, 664, 336, -408, -406, 28, 452, 290, -379, -509, 182, 386, -10, -411, -217, 429, 279, 136, -464, -382, 413, 476, 235, -384, -107, 317, 671, -98, -280, -312, 664, 135, -446, -425, 122, 575, 209, 131, -254, -18, -239, 546, -203, -279, 271, 14, 552, -150, -397, -39, 273, 934, -699, -107, -275, 69, 1042, -143, 424, -683, 412, 578, -717, -164, 396, 291, -89, -359, -206, -487, 44, 550, -113, -237, -264, 441, 901, -468, -629, -71, 611, 232, 13, -460, 7, 582, 292, -217, -245, -61, 457, 373, -346, -317, 163, 509, 142, -319, -84, 4, 309, -25, -57, -153, -141, -36, 392, -179, -165, -34, -13, 48, -204, 148, -141, -255, 30, 10, -145, -450, -265, 215, 157, -272, -644, 140, 364, 46, -527, -181, 333, 247, 84, -515]
3394e15K95N17K63o50m56J77R52k51p91k70P39Q55p93n66K69O48r8k98k68L27
3414H6J76j8o13Q6K49M66j78l45r4L55J05m79j33O79j12m23j23M97J78n0m81l7
3436b09J77L47k65j45j26O19K06q27k20N37M93l99n61L0M99M23r65K19j87Q76
3456E22Q28j409n9M57N48o71n05K30n6J15J62m88K13L34L0p03L54K82l4k21m35
3477e06L73M00j82j49k96M85M46p62k64L89M32J20r46j89Q76K55l39n60j5N51
3497A19M68n38m81J90O62P8p53k01N75L60m43l57k24Q48J35p02j8R6P67m31j35
3518A5k72K11J63j37k12Q2O05l38k35nM33J51o88k82O01J97k2o69K78K49K14l66
3540b7m60J34O60L04r17k86L74O15j28q48k6P44M16o08q51N39N11J24l62n30N83
$$ y = [-515, -220, 297, 560, -90, -546, -369, 583, 332, -459, -729, 10, 865, 72, -494, -225, 423, 325, 27, -241, 86, 262, 244, -369, -283, -34, 432, 254, -91, -185, 170, 275, -204, -337, 342, 230, -193, -316, 181, 359, 309, -172, -209, -32, 315, 50, -95, -221, 398, 604, -223, -443, 94, 587, 188, -373, -343, 156, 579, -386, -167, -354, 522, 1350, -59, -118, 339, 887, 216, -289, -59, -115, 0, 162, -326, -113, 221, 251, -452, -98, 184, 150, -71, -506, -133, 267, 85, -64, -360, 125, 571, -191, -455, -66, 366, 486, -460, -649, 227, 482, 143, -417, -432, 119, 587, 49, -432, -242, 420, 498, -255, -456, 119, 479, 36, -321, -545, 303, 438, -264, -282, -186, 581, 150, 15, -257, -46, 117, -20, -232, -150, 455, 117, -118, -123, 310, 461, -227, -509, 92, 289, 267, -402, -124, 125, 339, -27, -487, -353, 307, 611, -306, -592, -218, 397, 269, -579, -605, 139, 555, -53, -904, -365, 146, 270, -92, -622, -39]
3561c9N64k24m91k39K63N26j09p81J98P89N3q04k21P34j23j35j30J38Q7M0j36
3582d0P4j17L8r1M8j21KM23j31k09K34P0j60l96L78M16p9m44k04J55K87lm35P8
3606b27J32P1J29m26l1M16N34n51m79M40K82j71K24n99Q21Q2n63p3o3J38K87p23
3628c50K1N17J3K98o06j79N54L5L52p06k07l8M61J30M79n89J26m34n42M30K29
3649fk5k81M07k15m5K08J29k13J56pk13j4M6L45k10k57L67J4j59p1N4J21J3j97
3673e3p7P9L63l69O4L3k11L34j03k74j53L79J11j88k05L01oj93M02m40J35O7j3
3696a7R6j07k67N62l11r8J42r5L62k10l50N06m7J09j36j19K00k64J14K94k05k96
3718a37P1K93k82J36Q0k56N2Q8j17j4k30L40K21j51k82L07J61k40j39k07M41p8
$$ y = [-39, 525, 301, -190, -429, -166, 360, 251, -530, -332, 457, 510, -294, -515, 219, 96, -39, -169, -31, 56, 96, -40, 34, -83, -45, -136, -88, -209, -207, 216, 85, -124, 110, 180, 20, -376, 2, 418, 339, -105, -309, -154, 133, 130, -305, -227, -95, -24, 105, -321, -352, 64, 598, 47, -432, 8, 290, 119, 343, -256, 565, 647, 84, 11, -52, 86, 373, -350, -329, 188, 201, 499, -107, -286, 268, 303, 655, -51, -258, -296, 165, 295, 774, 185, 311, -123, -665, -235, -6, -31, -312, 95, -120, -165, 43, 172, -41, 115, 108, -105, -119, -73, 272, 62, -195, 172, 186, 27, -44, 10, 131, 144, -53, -130, -51, 312, -57, 7, 40, -171, 163, 60, -214, -367, 12, 123, -65, -270, 31, 25, -168, 234, -206, -71, -4, -17, 79, -28, -295, 267, -44, -142, 0, -95, 267, 57, -293, 213, 166, 275, 139, 20, 220, -44, 70, 364, 159, -137, -66, 227, -55, 81, 161, -95, -43, 45, -72, -86, -316, 24, 245, 94, -188, 119, 280, 40, -99, -306, 135, 57]
3740E7j92kN4l5J46o1J39k72J27M75j57j16l56K81J13j46j90K05p5K74q0k9l88
3763b28J84L10k21j40j24J21K60j14k46M2L00N8k17j28j94L03K52j91l23M2K42
3784a2K85l15k92p1O34k3k66k64L79J62j7l79j1J75K65k7m06j33M97j83L72l26
3806D4l72K72L80J47o17j57L03L13p3l12j0K28m8k8j62j84M39J9j12k1l43R1L49
3829A46m9j98j88L98K98k63k90M2%M79j93l96j42j7O23j37p3m22L61J88j54k73
3851b60K74j01L66M0o49j49K65M61q5j64l74L64L31k65j99J60K8Q3L8k99j93M2
3873b86N48J94o72j35N87K16k36k25p2R5K82k54j26r9K21K12J96q30j9L29N19
3894D45n21m6l8N80k71m56L55j26O2R4N2m61K09K9L49k75j23l7N21l34j21l1L10
$$ y = [57, -135, -137, -83, -118, 28, -33, 106, -166, -39, 436, 279, 163, -193, 88, 201, 55, -135, 70, -5, 269, 189, 160, -228, -44, 266, 45, -95, -219, -98, 162, 48, -198, -156, 144, 202, -15, -143, -337, -34, 218, 27, -296, -254, -12, 273, -42, -334, -405, 229, 206, -60, -324, 55, 217, 200, -179, -190, -15, 250, 223, -183, -316, 181, -2, 370, 44, -328, -56, 324, 471, -146, -303, 0, 313, 240, -72, -82, 146, 98, 70, -92, -276, 163, 182, 70, 49, -294, -203, 146, 97, -101, -289, 109, 407, 144, -146, -104, -104, 375, 182, -214, -356, -373, 250, 113, 40, -382, -21, 167, 13, -260, 14, -87, 279, 319, -330, -479, -214, 247, 162, -2, -376, -12, 319, 54, -145, 15, 43, 126, 164, -135, -328, -286, 262, 456, -216, -351, 236, 452, 216, -9, -81, 14, 296, 42, -84, -183, 38, 250, 446, -384, -403, -74, 445, -76, -122, -160, 420, 149, -307, 48, -78, -16, 78, 130, -331, -122, -93, 256, -19, -142, -179, 342, 8, -113, -144, 166]
3917A66j65J29jJ13n23kM55j91n3l49L87J62M3l16j64J60M22Ol74j19J47M01K5
3940C59q43J38M15M29o35m06L27N3M25l13J4m8lK56m1m31LM17J57n39p5J67M93
3963C19j78l99J75N3K33j88M6j04J3J19o3J76j17k6j08j1m3Q3j09K5J07o2L45
3986B86n89J68J49K83n44k8M17J45j41k35N6J32K07j62l01r3K56M04m56j89J97
4007c8K36K56o80k08N22O7J3j88q4LJ68l1j58j41K98M4J97m71k1O08k78j63l00
4030c49M01K33n05J95K21j39n9l34K55L34k62j22J81j82M20r1l49r7K65J16O3
4051A95o51M85M83k21m33o9J47L54q5n22k7K44M37m82k51L19J26J67l42j9J93
4072D8K10k8k67k9K97k6j09k47J66kJ00k41j57N89k30k2k31P3M74k52n36K62L42
$$ y = [166, 1, 130, 129, 242, -281, -283, 172, -19, -72, -421, -34, 128, 171, -145, -309, -149, 273, 279, -95, -214, -67, 334, 359, -484, -346, 69, 498, -137, -543, -216, -163, 262, -51, -37, -85, -88, 168, 127, -304, -301, 116, 273, -266, -341, -174, 319, 141, -258, -83, -30, 203, 15, 61, -43, -30, 89, 26, 202, 85, 59, -49, -60, -103, -20, -129, -104, 3, -59, 286, -303, -135, 14, 297, -247, -275, 142, 287, 146, -89, -33, 99, 306, 144, -157, -250, 6, 410, -46, -235, -38, 198, 454, -226, -434, 88, 155, 168, -20, -104, -101, 67, 36, -122, -263, 35, 79, 276, -195, -216, 392, 114, -49, -349, 52, 285, -220, -25, 196, 57, -2, -336, -81, 253, -9, -131, 50, -132, 288, 197, -152, -249, 16, 132, 195, -456, 29, 512, 291, -142, -211, -64, 290, 205, -317, -344, -100, 337, -145, -396, -77, 49, 216, -126, -145, 48, 258, 230, -37, -66, 231, 205, 96, -151, 15, 13, 113, -128, -285, 304, 74, 52, -179, -106, 368, 116, -420, -158, 184]
4095A84J81m36j80J80O42m22j97l85M36M35k93k92J48J57K95l42l17Q1M03k5m96
4116b43n4K17L79k78k39J56J48J11m69J10J42J27J06p35J35M42k5Q1l85L20M6
4137I2l6k37L44l1J02k63j90M41o1K7o55j6O93k35j6m79L81L03K6n32K85J21K4
4160H8N1l47J07P2K63k0l17q2M70K22o95j17J87N91n16k16J31K66J73k34j66p1
4182a60J76R2Q6k68o3J16JK13k31R3J4k44j00K01K43K6j89j77K23k49q3L01K41
4205B62j40k08J74K0P6n2j27k21L97N3p3k24k02M83J07n85K26m3K50l7m2k27k08
4228c41K38M98l81k36R1l7L75j56j88L12J41l01j35Q6m6K92k52j10R7K5o1J35
4250D6R9l78L64K44k85J93k29j16q3J95j87K74m3k43J64J48m8l01N05l31k46O4
$$ y = [184, 365, -71, -251, -71, 571, 149, -48, -433, 3, 438, 145, -147, 1, 158, 453, 111, -206, -125, 278, 253, -243, -297, -80, 299, 21, -218, -62, 86, 197, -272, -162, -20, 107, 213, -522, -387, 55, 30, 111, -274, 46, 92, 56, -181, 163, 132, 234, -29, -219, 222, 161, 188, -467, -483, 210, -25, -41, -520, -139, 164, 190, -342, -57, 64, 88, 139, -208, -101, -29, 234, 214, -103, -185, 285, 507, -188, -305, -118, 473, -43, -259, -128, 138, 311, 77, -89, -160, 16, 108, 194, -74, -137, -21, -20, 193, -38, 55, 69, -175, -275, -74, 169, 195, 6, -171, 52, -197, -280, 21, 262, 122, -86, 88, 108, 184, 132, 5, -216, 181, 234, 161, -63, -265, 218, 325, -260, -34, -77, 173, 136, 94, -133, -341, -103, 395, 14, -222, -131, -168, 207, 51, -137, 175, 316, 15, -120, -34, -80, 212, -40, -150, -53, -28, -89, 46, 145, -233, 131, 375, 90, 283, 54, -62, -145, 50, -137, 137, 94, -149, 15, 163, 115, -186, 319, -12, -258, -194]
4272a94K84P0j84R6k99J74M1R1J63m78L89j18L22l53m38N00n2l8j47J73L8J27
4294A67k33J04m0j85K75j08k89KK55K86j94j5p8Q1j33J82o2J74j56l1l1j20J90
4317D1k8J82%j00j01L08k14l22K85j08J6J49K3p6l80N67j01j91k46N74Oj92k25
4340a33N7J37R5k40j6Q0Q8j62J46l18r8l3L75j2j02J23q6K29j39J28k20J45J46
4363A90L1k23J33M3j74J34j95J55j92j5p0J04J91mr2j78R5j4K95J12n99K23r3
4386a43K60k92r7L27j7j2qm5j33K31O1q7k09LK39K50j75k98L4K54n4j10j6k37
4410b74L09N1j24j0k36O9L30N7j55L22l96m1Ll4M0K16N1l66l9J72K28M9k89m6
4434a13k1K16j15M1P3j72J20j0J24l46J35L66l46p8l9K93n3o3j35rL91k56J12
$$ y = [-194, 90, 160, -24, 72, -227, -53, -12, 79, 242, -236, 153, 35, 357, 4, -434, 66, 14, -24, -171, 2, 40, 167, -66, 38, -2, -187, 88, -20, -309, -307, -52, 234, 40, 25, -53, 28, -105, 77, 15, 189, 33, 2, -29, -149, 41, 13, 195, 195, 95, -6, 302, 88, -234, 51, -57, -41, 108, 131, 55, -325, 242, 141, -50, -296, 278, 284, 92, -133, -76, 61, 156, -84, -100, -20, 68, -94, 52, -266, -364, -397, -22, -34, -136, -13, -99, 130, -9, 119, -101, 44, 190, 221, -2, 131, 174, 0, 134, -61, 94, -98, -113, -183, -79, 112, 108, 16, -162, -67, -81, 214, 326, -273, -50, -143, 117, -175, -272, 55, 38, 26, 18, -27, -160, 71, 132, 45, -164, -161, 78, 328, 153, -145, -111, 143, 89, -21, -37, -274, 35, 86, -38, -48, -284, -215, 115, 172, 17, 339, -57, -98, -95, -129, -89, 127, 178, -188, -227, -55, 173, 222, -67, -113, -134, 82, -33, 8, 81, -91, 29, 19, 143, -203, -68, 298, -48, -126, -165, 128, 75, 12, -123, -132, 259, 3, 115]
4457A15j10K17l99K84L25n28K21j16L07l32p5J0Q2K26l58J84k54J3O24k96j15
4478B5Rk39N32k92k98K28J19j94J95j50m5l8P7j8o7o6K3M35l9k54j40L48l7k37
4502a23J84J39mj46p4J5O2K5k40P5Q3p2L10k27j62J50N1J72l10P1Pn6J44j27K14
4527A61k36m8J74K63l90j70n4L30M6M2j77q7O6JM44l58j4lj35K49n7r0J82k26
4551h7N3j2o4k6J62P3j19j03j56M56o2m34P5O15k36o9j94J41J2%j04lM7j22K28
4576G1k08M17o30K81J80j44L93m64Q9k4k7m8J6k6O9k2q1K9%K53Mm02L57J47J7
4601B47m12O2p2L73m57L18pj13Q6R1j84k62k3L04N6R8j21J68k25J88j25J09k00
4624a01m0J91k81J86j33K46J63j12J30k27l8R9o1p5N1j90K00K2j21j6J49r2N7
$$ y = [115, 5, 222, -177, 107, 432, -96, 125, 9, 316, -16, -91, -81, 1, 227, -131, 53, -201, -188, 436, 140, 25, 34, -205, 327, 35, -263, -35, 84, -110, 85, -65, -110, -148, -71, -89, -156, -222, -199, 236, 197, -57, -197, 151, 114, -123, 61, 200, 196, 50, -24, -9, 53, 78, -162, -87, -4, -76, 234, 7, -155, -5, 46, 218, -92, -21, -14, -70, 74, -53, 161, -75, -123, 51, 314, -76, -246, -300, 30, 76, 118, -59, -146, -80, -79, 365, 7, -7, -10, -145, 104, 47, -43, 139, -87, -34, -46, -110, -136, 26, 99, -20, -123, -279, 177, 115, -319, -244, 371, 135, 66, -128, 13, 25, 25, -79, -82, -35, -157, 71, -137, 280, -350, -69, 111, -33, 360, -104, -15, -39, -66, -114, -98, -124, -55, -77, -158, -129, -129, 124, 128, -274, 83, 230, 247, -165, -103, -175, 198, -259, 59, 52, -61, 25, 116, -68, -330, -353, -49, 7, 105, -16, 152, -73, 115, -10, 99, -101, -141, 50, -231, -45, -178, 68, 231, 119, 249, 22, -16, 83, 22, -53, -2, -192, 8, 30, -91, -107, 42, -50, 7]
4647GJ21p7J19j68J38l5kN0l55J27j85L69k60K14LK3M7r8J66l89K03K5j28K20
4671A35N9j34j5o5j3LO9l65R8J90J90j07k61J96j88K31l17L62l5R3k21mn4K43
4695I0n7%J2k16K87K8m97M79k26O4l0R0L77j69l92J9P9J56m2l27K26K81j66K7
4719I3q3J29k25l44K88L13k2k66j47K87j7j26J80j26J56J32j98j29K14k79Q5j28
4741b13QK60K32k4m6q9k82M0J56m2J41p7N3m41K67L03k08j17l3m5L93k40K3K3
4765D2k98L62j12K71j01Kk65L14r4r7r1K00j17j97r4K14J31K45k08l50K84k04
4787a63J1N4K15l93J54k31K81j73L54o4J09m5J00k76R8O3Kr4j37L6O6j91K38j32
4811a18J91J36l01O7l5j59N78j67l92K07J58o1j39q7k11J06N70o32M36K2n6k19
$$ y = [7, 128, 51, 170, 2, 140, 105, 103, 153, -202, -75, -260, 109, -151, 63, 66, 89, 136, 38, 204, -185, 18, 43, -85, 135, 194, 60, 45, -20, -33, -30, 39, -326, -228, -38, 152, 45, -216, -20, -208, 23, -294, 68, 33, 126, -95, -99, -153, 90, 33, 33, 45, -171, 116, 144, -353, 126, -100, -36, -66, 24, 401, 232, -160, -141, -62, 94, 52, -275, -49, 232, 66, 93, 10, 139, -86, -430, -142, 171, 149, -117, -264, 23, 6, -120, 60, -66, 90, 222, 24, -105, 109, -170, -85, -213, -205, 55, 287, 263, 217, 128, -154, -114, 42, 0, 141, 64, 117, -324, -57, 246, 38, -79, -112, -157, 236, -4, 19, 42, -256, 106, -6, 265, 164, 166, -99, 215, 121, 24, -67, 133, 16, -181, -275, -61, 70, 315, 107, -243, 41, -163, -152, -98, 117, -276, -122, -353, -72, -245, 109, 45, 154, 109, 209, -67, 31, 94, 96, 2, -135, -99, -33, -224, 14, -118, 73, 209, -92, -25, -60, -219, 359, 192, -200, 7, 165, 104, -35, -122, -333, -227, 343, -289, 147, 169, 113, -106]
4833a06l5N2Kj42K73j50R2J15j22J55j57J53l28L15j23l6lQ5J3j92K71j68O2K45
4857B71j36j58q2M10L0m48M0J6j25J53p0J02j55Q5L95j32l97J44O3n6m3r6J5J30
4881d4L15p0j54j72j70K38J74n1k61Q4J36K6N6k08ROjn5O4K63k2j32Pm8j40J18
4907c2L0r6k1j8L69j70m9q6J18K02k54j02j44O7N63m74J57K9j71J38j67J85j57
4930h3L72m12M8k3J03%L83l04k1j29q4K41o0N1n1j15l5J85k04K42%J4k37L7R6
4955A4mL1j30n1K28J18q6j79K42l90L69l50M1N3O3J47j32k08j31P3J80R3L5p5
4979d9mJ05k7n2J99J53l58m4J13p2M7k05L13j14o7M8M8k06j40L83o1jL31l07j01
5004f8J84j86k2J01J09j46j61l2J81k3K29l30Qo5K06L1J72k78n4J18J09p2k9o2
$$ y = [-106, -141, -89, -87, -229, 44, -106, -14, 101, -21, 134, -23, 130, -198, 117, -6, -42, -45, 40, 53, -139, 132, -36, 26, 271, 135, -23, -105, 305, 335, -113, -73, -57, -182, -29, -99, 3, -152, -67, 328, 196, -201, -57, 6, -50, -93, -189, -174, -44, 271, 201, 47, -125, -295, -57, 117, 66, -195, -111, 25, 51, 107, -101, -92, -86, -87, -142, -78, 185, 163, 31, 38, -10, -150, -32, -2, -98, -119, -137, 232, 62, 13, -73, 45, 247, -7, -109, -253, -186, 377, -97, 60, 89, -82, 56, -111, 74, -83, 289, -123, -75, -98, 5, 5, 388, 84, 63, -66, -150, 91, 31, 82, 31, -84, -119, 66, -138, 104, 104, 118, -119, -82, 14, 10, 41, -89, -140, 88, 206, 120, -59, 183, -207, 162, -188, -147, -94, -31, 116, -16, -224, -355, -282, -102, -9, 26, -49, -53, 52, 25, -27, 172, 325, -33, -77, 36, -36, 11, -194, 119, 5, -62, -14, 34, -172, -312, 71, 10, 9, 340, 33, -68, 116, -70, -92, 9, 118, -28, -189, -221, -40, -63, 166, -164, -156, -221, -15, 16, 188, -90, -144, -26, 83, 11, -18, -80]
5028h0r1L58l19L8o3L0K60n40M50p1M2L33n75R0K77r8K8j74J21j78J7J74J09j14
5052B4j50M03j89j51n7L28k20K36l01p4O9j02K11m75N15p5J21m7K8k59J32q5l
5075a21J69j01K10k85J93L37l76j50L46k11k5k10L72l47O1J10k4L35l39j7RQ8
5097B4o4K47m35p4K34N2K37m1l53K61N9k03K81l82M2O5q0l2J52K08j04r4p4j34
5121b08qM55J7k85N6OM3Q5m19J97K6N0N1Q7j14J58j37K13l18K10k41k41K48K83
5145B14k27K4j03O4m6k01l2J54J74o6q3J20K93k94j53L2O7j9K68l59K52k55L34
5168A58J05k39j09K3J88K15m94J95r3L8k12L08l32k2K92j02L7L26m37R5K97l51
5190a14n9J99n6J86J50j62r1n8Q7k32K55l28n7M98j56l7m6j09L49j97j91K84j64
$$ y = [-80, -171, 187, -132, -94, -157, -127, 133, -407, 43, -28, 14, 347, -228, -138, 139, 41, 69, -105, 16, -162, -145, 29, 138, 24, -126, 277, 88, -63, -120, 208, -12, 224, -77, -151, -82, -184, 27, -448, 67, -8, 113, 66, 94, -165, -33, -118, -121, 48, -53, 157, -128, 65, 402, 26, -124, 222, 11, -14, -224, 148, -199, -138, -28, -52, 283, -56, -73, -64, 24, -40, 207, -228, -302, -68, -16, 221, 180, -173, 88, 147, -56, 225, -157, -115, -50, -130, -162, -10, 198, 94, 0, -74, -208, -216, 239, 256, -29, 27, 33, 76, 161, -258, -61, -35, 15, 66, 153, 39, 197, 60, 273, -45, 165, -76, -317, -69, 214, -13, 11, -92, -28, -74, -275, -307, -153, 21, -45, -128, -8, 285, -9, -162, -130, -63, -82, 186, -173, 79, -176, 158, 263, 24, -85, -62, 126, 341, -153, 42, -51, -13, -225, 83, -249, -271, 21, -81, -44, 282, -155, -60, 237, -114, -173, 26, -30, 156, 306, 144, 53, -5, 82, -150, 105, -223, -280, 218, 62, 25, -21, -130, 219, 22, -169, 115, -49]
5213d9k6J49L3k0p2J04k27J46J31l8k46j6K27n9J86k15j23j19K39l37K87j21J77
5236A1n1J53j54q0J76j82J29m7j51P3j76K14J84q9J61j33k19R5O1R7K9J03j97
5259GM2m8j26K88j24j11j49o4M43k2k2j63l31N20m6o6l7%j3l7J79k61J0K32J01
5284B02l51J30K05q0k07J6m0J31k1K2k60K08J23l76L70k25P1J59o8p1q6m7J71
5307b4n6q7k19K82k7r1K80k2mP0j01k03J20K02j33%K16j12k04M15l75j2K11k49
5331a23J17l0J17n8j91J45k8J98r0m1M0m93N27j31p2J24j76o9L01J30m10K82L8
5354A07j44O2L5j6j21K73k75J86j44K07o2k51K23J71j2j78k57M86l24j02L89k01
5376E2k31Pj17M36l30K14l1J15Rj62q5l3l6P5J15K12m9k8k24L4o7P6J0KP1N7K8
$$ y = [-49, -75, 74, 107, 87, 15, 119, -108, 38, 169, 131, -115, -131, 96, 37, 223, 8, -115, -234, 5, -332, -45, -166, 11, -40, 113, -41, -121, 55, -127, 2, -45, -196, -123, -299, -85, 99, 10, 171, 38, -181, -86, -25, 72, 101, 204, 7, 49, 1, -125, 163, 39, -72, -221, -285, 158, 136, 114, -49, -380, 140, 94, 28, -9, -9, -22, -59, 120, -141, -131, 101, 202, -149, -19, 186, 106, -101, -85, -125, 6, -15, 7, -253, -45, 78, -298, 72, -153, -82, 77, 9, -62, -148, -195, -24, -80, -167, -386, -104, -131, -222, 58, 36, 32, 102, 1, -202, -82, 120, -13, -13, 203, 91, -113, 302, -73, -85, 126, -123, -6, -36, 81, 23, -168, -23, -51, 147, 57, 16, 56, -437, 90, -41, -113, 11, -165, -234, 67, 197, -213, 69, 107, -37, 25, 60, 44, -77, 196, -79, 107, -37, 170, 108, -143, 80, 251, 239, 61, -196, 290, -34, -136, 253, 52, -179, -172, -289, 147, -183, 31, 0, 115, 124, -38, -123, -156, -192, -117, -2, 210, 161, 133, -91, -57, -124, -48, -38, -36, 35, 92, 120]
5403A20M8ok49o3n5K2K41N0j13K14l30J44K12j6j04K7j29P4jq7j00j20Q9L9K38
5428A45N3l5k30Q7O2k28j79L41M8n4L5J32j92P6j02n8Q8O8M6j35k7K76j56r8J10
$$ y = [120, 168, 162, -87, -150, -205, -183, 58, 108, -5, 209, -121, 23, 235, 219, 115, 142, 13, 87, 86, -1, -101, -221, -132, -93, 145, 198, 163, -67, 20, 82, -146, -325, 16, 64, 10, 45, 177, -15, 61, -41, -99, -11, 57, 103, -32, -59, 217, 61, -37, 73]
$$ [...]
8191i1
##END NTUPLES=NMR FID
##END=
