##TITLE=1H_Pr BrAcCl
 CDCl3,8 sc, 
 4.03.2021
##JCAMPDX= 6.0         $$ Bruker NMR JCAMP-DX V2.0
##DATA TYPE= NMR FID
##DATA CLASS= NTUPLES
##ORIGIN= UXNMR, Bruker Analytische Messtechnik GmbH
##OWNER= root
$$ XWIN-NMR		Version 3.5
$$ Thu Mar  4 13:12:06 2021 Russian Standard Time (UT+4h)  she@DPX200
##.OBSERVE FREQUENCY= 200.1315066352
##.OBSERVE NUCLEUS= ^1H
##.DELAY= (6, 6)
##.ACQUISITION MODE= SIMULTANEOUS
##.ACQUISITION SCHEME= undefined
##.AVERAGES= 8
##.DIGITISER RES= 18
##SPECTROMETER/DATA SYSTEM= spect
##.PULSE SEQUENCE= zg30
##.SOLVENT NAME= CD3CN
##.SHIFT REFERENCE= (INTERNAL, CD3CN, 0, 15.7039)
##AUDIT TRAIL= $$ (NUMBER, WHEN, WHO, WHERE, WHAT)
$$ ##TITLE= Audit trail, XWIN-NMR		Version 3.5
$$ ##JCAMPDX= 5.01
$$ ##ORIGIN= Bruker BioSpin GmbH
$$ ##OWNER= she
$$ F:/spectra/data/she/nmr/H-F/1/audita.txt
$$ ##AUDIT TRAIL=  $$ (NUMBER, WHEN, WHO, WHERE, WHAT)
(   1,<2021-03-04 13:10:45.03 +0400>,<she>,<DPX200>,
      <created by zg, POWCHK disabled, PULCHK disabled
       configuration hash MD5:
       00 E9 B6 7A A2 85 ED C7 34 08 36 98 17 FE 4E 26
       data hash MD5: 16K
       27 C5 3B BD 44 9E 3B F9 B4 4D 20 EA B7 F7 5F 86>)
$$ ##END=
$$ 
$$ hash MD5
$$ 92 83 3C 08 4E 2C F6 99 B3 93 74 F4 53 4E D4 29
##$RELAX= 
##$RELAX= 
##$RELAX= 
##$RELAX= 
##$RELAX= 
##$RELAX= 
$$ Bruker specific parameters
$$ --------------------------
##$DU= <F:/spectra>
##$EXPNO= 1
##$NAME= <H-F>
##$PROCNO= 1
##$TYPE= <nmr>
##$USER= <she>
##$AMP= (0..31)
100 100 100 100 100 100 100 100 100 100 100 100 100 100 100 100 100 100 
100 100 100 100 100 100 100 100 100 100 100 100 100 100 
##$AQSEQ= 0
##$AQ_mod= 1
##$AUNM= <au_zg>
##$AUTOPOS= <>
##$BF1= 200.13
##$BF2= 200.13
##$BF3= 200.13
##$BF4= 200.13
##$BF5= 200.13
##$BF6= 200.13
##$BF7= 200.13
##$BF8= 200.13
##$BYTORDA= 1
##$CFDGTYP= 0
##$CFRGTYP= 5
##$CHEMSTR= <none>
##$CNST= (0..31)
1 1 145 1 1 1 1 1 1 1 1 1 1 1 1 1 1 1 1 1 1 1 1 1 1 1 1 1 1 1 1 1 
##$CPDPRG= <>
##$CPDPRG1= <>
##$CPDPRG2= <>
##$CPDPRG3= <>
##$CPDPRG4= <mlev>
##$CPDPRG5= <mlev>
##$CPDPRG6= <mlev>
##$CPDPRG7= <mlev>
##$CPDPRG8= <mlev>
##$CPDPRGB= <>
##$CPDPRGT= <>
##$D= (0..31)
0 1.2 0 0 0 0 0 0 0 0.06 0 0.03 0 0 0 0 0.0002 0 0 0 0 0 0 0 0 0 0 0 0 
0 0 0 
##$DATE= 1614849044
##$DBL= (0..7)
120 120 120 120 120 120 120 120 
##$DBP= (0..7)
150 150 150 150 150 150 150 150 
##$DBP07= 0
##$DBPNAM0= <>
##$DBPNAM1= <>
##$DBPNAM2= <>
##$DBPNAM3= <>
##$DBPNAM4= <>
##$DBPNAM5= <>
##$DBPNAM6= <>
##$DBPNAM7= <>
##$DBPOAL= (0..7)
0.5 0.5 0.5 0.5 0.5 0.5 0.5 0.5 
##$DBPOFFS= (0..7)
0 0 0 0 0 0 0 0 
##$DE= 6
##$DECBNUC= <off>
##$DECIM= 32
##$DECNUC= <off>
##$DECSTAT= 4
##$DIGMOD= 1
##$DIGTYP= 9
##$DL= (0..7)
0 120 120 120 120 120 120 120 
##$DP= (0..7)
150 150 150 150 150 150 150 150 
##$DP07= 0
##$DPNAME0= <>
##$DPNAME1= <>
##$DPNAME2= <>
##$DPNAME3= <>
##$DPNAME4= <>
##$DPNAME5= <>
##$DPNAME6= <>
##$DPNAME7= <>
##$DPOAL= (0..7)
0.5 0.5 0.5 0.5 0.5 0.5 0.5 0.5 
##$DPOFFS= (0..7)
0 0 0 0 0 0 0 0 
##$DQDMODE= 0
##$DR= 18
##$DS= 0
##$DSLIST= <SSSSSSSSSSSSSSS>
$$ [...]
##$SUBNAM2= <"">
##$SUBNAM3= <"">
##$SUBNAM4= <"">
##$SUBNAM5= <"">
##$SUBNAM6= <"">
##$SUBNAM7= <"">
##$SUBNAM8= <"">
##$SUBNAM9= <"">
##$SW= 16.9725356469052
##$SWIBOX= (0..15)
0 0 2 0 0 0 0 0 0 0 0 0 0 0 0 0 
##$SW_h= 3396.73913043478
##$TD= 16384
##$TD0= 1
##$TE= 0
##$TE2= 300
##$TE3= 300
##$TEG= 300
##$TL= (0..7)
0 120 120 120 120 120 120 120 
##$TP= (0..7)
150 150 150 150 150 150 150 150 
##$TP07= 0
##$TPNAME0= <>
##$TPNAME1= <>
##$TPNAME2= <>
##$TPNAME3= <>
##$TPNAME4= <>
##$TPNAME5= <>
##$TPNAME6= <>
##$TPNAME7= <>
##$TPOAL= (0..7)
0.5 0.5 0.5 0.5 0.5 0.5 0.5 0.5 
##$TPOFFS= (0..7)
0 0 0 0 0 0 0 0 
##$TUNHIN= 0
##$TUNHOUT= 0
##$TUNXOUT= 0
##$USERA1= <user>
##$USERA2= <user>
##$USERA3= <user>
##$USERA4= <user>
##$USERA5= <user>
##$V9= 5
##$VALIST= <valist>
##$VCLIST= <CCCCCCCCCCCCCCC>
##$VD= 0
##$VDLIST= <DDDDDDDDDDDDDDD>
##$VPLIST= <PPPPPPPPPPPPPPP>
##$VTLIST= <TTTTTTTTTTTTTTT>
##$WBST= 1024
##$WBSW= 4
##$XGAIN= (0..3)
0 0 0 0 
##$XL= 0
##$YL= 0
##$YMAX_a= 177747
##$YMIN_a= -174020
##$ZGOPTNS= <>
##$ZL1= 120
##$ZL2= 120
##$ZL3= 120
##$ZL4= 120
##$ABSF1= 10
##$ABSF2= 0
##$ABSG= 5
##$ABSL= 3
##$ALPHA= 0
##$AQORDER= 0
##$ASSFAC= 0
##$ASSFACI= 0
##$ASSFACX= 0
##$ASSWID= 0
##$AUNMP= <proc_1d>
##$AZFE= 0.1
##$AZFW= 0.1
##$BCFW= 1
##$BC_mod= 2
##$BYTORDP= 1
##$COROFFS= 0
##$CY= 11.3945322036743
##$DATMOD= 1
##$DC= 2
##$DFILT= <>
##$DTYPP= 0
##$F1P= 15.9154993809931
##$F2P= -4.1035820241983
##$FCOR= 0.5
##$FTSIZE= 0
##$FT_mod= 4
##$GAMMA= 1
##$GB= 0.15
##$INTBC= 1
##$INTSCL= 1
##$ISEN= 128
##$LB= 0.24
##$LEV0= 0
##$LPBIN= 0
##$MAXI= 10000
##$MC2= 0
##$MEAN= 0
##$ME_mod= 0
##$MI= 1.114404
##$NCOEF= 0
##$NC_proc= 0
##$NLEV= 6
##$NOISF1= 3.799351
##$NOISF2= 2.8
##$NSP= 1
##$NTH_PI= 0
##$NZP= 0
##$OFFSET= 15.70392
##$PC= 1
##$PHC0= -11122.71
##$PHC1= 14.20094
##$PH_mod= 1
##$PKNL= yes
##$PPARMOD= 0
##$PSCAL= 0
##$PSIGN= 0
##$REVERSE= no
##$SF= 200.130013532006
##$SI= 16384
##$SIGF1= 3
##$SIGF2= 2
##$SINO= 400
##$SIOLD= 16384
##$SREGLST= <1H.CDCl3>
##$SSB= 0
##$STSI= 0
##$STSR= 0
##$SW_p= 3612.71676300578
##$SYMM= 0
##$S_DEV= 0
##$TDeff= 0
##$TDoff= 0
##$TI= <>
##$TILT= no
##$TM1= 0
##$TM2= 0
##$TOPLEV= 0
##$USERP1= <user>
##$USERP2= <user>
##$USERP3= <user>
##$USERP4= <user>
##$USERP5= <user>
##$WDW= 1
##$XDIM= 8192
##$YMAX_p= 0
##$YMIN_p= 0
$$ End of Bruker specific parameters
$$ ---------------------------------
##NTUPLES= NMR FID
##VAR_NAME=  TIME,          FID/REAL,        FID/IMAG
##SYMBOL=    X,             R,               I
##VAR_TYPE=  INDEPENDENT,   DEPENDENT,       DEPENDENT
##VAR_FORM=  AFFN,          ASDF,            ASDF
##VAR_DIM=   8192,          8192,            8192
##UNITS=     SECONDS,       ARBITRARY UNITS, ARBITRARY UNITS
##FACTOR=    0.0002944,     1,               1
##FIRST=     0,             0,               0
##LAST=      2.4114304,     0,               0
##MIN=       0,             -174020,         0
##MAX=       2.4114304,     177747,          0
$$ Real data points
##PAGE= N=1
##DATA TABLE= (X++(R..R)), XYDATA
0@%%%%%%%%%%%%%%%Qj6J6j6J6k4L2l2M0m8N6o5P3q7R9j10J25j46J67j85K09k34
37a22K59k91L26l65M06m48M97n52O11o75P43q17R00r92J093j205J329j468J624
56H53j801K007k245K523k858L266l780M449n360O677q757J2561k1758Q5980J05990
71A77747j60958j51665j733J70739J24375n4032j82857p9934J08865J72755K2106
82A45408j45093j40213L0057J61055J03222q0509j65014n2965J23803J44756k824
93A21683j46206j12544N0211J55580P2459r8354j48032k0164J29468J20709k9734
104I5076j44179q5707P5190J45015L9201j14661j24961J1376J33280R3252n7181
115F5701j37581n3099R6345J26665N202j21560r9029L9954J29856O4645p9211
$$ y = [0, 0, 0, 0, 0, 0, 0, 0, 0, 0, 0, 0, 0, 0, 0, 0, 8, -8, 8, -8, 8, -16, 16, -16, 24, -24, 32, -33, 40, -47, 52, -58, 67, -79, 88, -97, 112, -122, 137, -154, 172, -193, 213, -235, 262, -290, 321, -354, 389, -428, 472, -520, 573, -632, 697, -771, 853, -948, 1059, -1186, 1337, -1521, 1745, -2035, 2414, -2946, 3731, -5026, 7535, -14223, 71757, 177747, 16789, -134876, -136609, 34130, 158505, 104473, -78384, -158318, -49453, 123302, 145408, 315, -139898, -109841, 51214, 154436, 73927, -91087, -144052, -20249, 124507, 121683, -24523, -137067, -86856, 68724, 141183, 42829, -105203, -125367, 4101, 124810, 95076, -49103, -134810, -59620, 85395, 124596, 9935, -115026, -103650, 29630, 122882, 65701, -71880, -124979, -28634, 98031, 103233, -18327, -117356, -77402, 52454, 117099, 37888]
126C7888j25557k1519J09616J05902k3300j23798p5266O4009J25757L7518r7437
137A3813j13294O401J19842Q7857m9119j26134n3045Q5191J21155J2116j13292
148h509j00750L2389J25709P0188p1000j25977l1072J02331J11741j1690j21075
159b7715q5577N2038J25941N0913q6024j18782j0593J09445R8871l0712j21247
170d3442o8881O6566J20105L1909r5194j07369Q043J12225Q2801m6344j17943
181e7524n0345P7678J11598J2331j00871r3562K6057J12285O5411o0548j12143
192f9633l0160Q6941R9921p479j03389p6534M2758J08847M5645p2084j02031r447
204h6645R2637Q3887k6096j02176n6196N7412J01035K2898q0518q7518J1945R5240
$$ y = [37888, -87669, -109188, 428, 106330, 83030, -40768, -116034, -52025, 73732, 111250, 13813, -99481, -93080, 26762, 114619, 65500, -60634, -113679, -28488, 92667, 104783, -8509, -109259, -76870, 48839, 119027, 48027, -77950, -109022, -6691, 105050, 93360, -27715, -113292, -61254, 64687, 115600, 29576, -89206, -99799, 9646, 108517, 77805, -43442, -112323, -45757, 74348, 106257, 11063, -96306, -88263, 23962, 106763, 60419, -57524, -107869, -30191, 81407, 93738, -7133, -100695, -74638, 37647, 103058, 42510, -69633, -99793, -12852, 87069, 79590, -23799, -100333, -57575, 51272, 96917, 24833, -77198, -86645, 5992, 89879, 63783, -38393, -94589, -37177, 63858, 86756, 6238, -81280, -69335, 25905]
216B5905O4390m4347r7923l3523P0410Q9935J59q8157p0846L2667R6022M3554
228H8246o0595r2723j1954Q2262P8294k1061r4163n5100N1115R6068K4797p5938
240I248q6343P668R2024O6116l9525r8691l8276O6567R2978O469q6876p7181K5427
253f0395R7420N1796n4905r6952k1764P7826Q5027r711r3112o4596M0352R7512
265D8498L7233o6286r1292o763Q5197P5830k4148r5284n1888N1981R5815K3787
277H2680p5868q4657P404R0663O5407l6981r6016l8569O3340Q9934R319q2333
289e677p3901K1408R1620N0855m9113q9776k2515P0508P8229o536q3112n8458
301g6468L4305Q5788L3809n7527p8781o228P3645O3523k1323q0946m2320M6304
$$ y = [25905, 90295, 45948, -51975, -85498, -15088, 74847, 75006, -13151, -83997, -51330, 44692, 88246, 27651, -65072, -77026, 5236, 83530, 62469, -31694, -86794, -35679, 60389, 85186, 9248, -77095, -69427, 22597, 88713, 49188, -49503, -87779, -21212, 71766, 78235, -8641, -85822, -60395, 37025, 88821, 33916, -63036, -84800, -6974, 78053, 68342, -24770, -89366, -49014, 48498, 85731, 19445, -71847, -78610, 6587, 82417, 58269, -37015, -88903, -36922, 58893, 82680, 6812, -77845, -70441, 20222, 85629, 48648, -47368, -85937, -22597, 67337, 76656, -5677, -79578, -58170, 33450, 84305, 35192, -54584, -77099, -6591, 71638, 65102, -18010, -76468, -42163, 43625, 77434, 19907, -58874, -65102, 8543, 72066, 50743, -30203, -72523, -26219]
313b6219P8550J6897o6376o7511J0508P6937M9403l7174p8692k5754N8579P1110
325F0258j465p2956n5938K8233P8350L3261n1950p3999p345O8857O0483j9549
337D6240p6772m1056M3589P5525J7224o2511o6129Q907P3905M9480l3741p6765
349d2104k7912N5414P1372L020p0336n8481K3134P7762L9465m6451p6602j5254
361f6973O5401O7483j0765p6934n0899L6671Q0133K8322n7627p4203k663P2551
373A0497O1066k3613p9192m0655M6633P7450J6729o3992o8132R123P4112N1330
385G1356l3273p6469k9623N2694P1528M960o6778n8734J9362P3133L9711m1593
397B6274p1674j7168N7887O3056p400o8437m7321L0450P0185K6741m9468o5448
$$ y = [-26219, 52331, 69228, 2852, -64659, -54151, 22786, 72189, 35015, -43677, -69431, -10852, 60258, 58793, -14163, -70101, -41868, 36482, 69743, 17793, -56206, -63551, 5306, 65789, 46240, -30532, -71588, -27999, 47526, 64750, 2239, -63890, -54983, 18922, 68402, 34661, -42104, -70016, -14602, 56770, 59790, -10546, -69027, -45893, 31869, 71334, 24883, -51719, -66973, -1572, 65911, 55146, -21788, -72687, -36016, 44117, 72439, 14812, -59391, -62054, 10497, 71563, 47950, -31242, -71897, -25264, 52186, 68915, 4923, -63209, -54086, 20026, 71356, 38083, -38386, -68009, -15315, 56213, 61173, -5605, -64339, -44977, 28156, 67867, 26274, -45400, -62568, -4681, 58375, 50975, -17462, -64783, -34333, 35852, 62593, 13125, -52323]
409e2323k960O2196N2583k0366o7977l4455M0947O5704J1869n5224n6513J1078
421d5441O3872M0594l1984o4903k0058M8363N9087k085n9235m5741K3532O3621
433B9622K7521m1559o0464n992N4983N0642j5584o2462l4114L5537O2670J4101
445E4901n0873n5638P631O1333M1895k8146o4790k3267M6469O0661J860n9474
457g438m9705J9888O5671L2944l9142o5422j2070N4300N6587r327o4059m2142
469e9915K9658O6622K2856m6975o1681j715N9001M9513j8850o5266l3008L7598
481b2162O3480J3095n2491n5415Q058O1386M0785k7092o3788k3340M4437N8754
493D5707K813n6259m7797J7245O2170L1671l5136o0517j3012N0119N2291p512
$$ y = [-52323, -55283, 6913, 59496, 39130, -28847, -63302, -22355, 43349, 55218, -6, -56519, -45441, 18431, 59025, 27041, -37862, -57920, -9557, 49530, 47445, -11790, -57531, -33999, 29622, 57143, 15584, -44880, -50872, 4111, 54753, 39169, -23293, -57407, -21870, 40800, 54901, 4028, -51610, -43979, 17354, 59249, 31103, -33687, -56954, -10485, 50176, 52036, -7438, -57143, -37255, 28416, 61360, 22218, -43204, -55274, -974, 55613, 46286, -17773, -59915, -30257, 36365, 59221, 12246, -49435, -51150, 7851, 57364, 38514, -26752, -59760, -22162, 41318, 54413, 1922, -53493, -45435, 15951, 56736, 29644, -34144, -57484, -13047, 45707, 48520, -7739, -55536, -38291, 23879, 55550, 20414, -40103, -53115, -2996, 49295, 41783]
505D1783n8382l8263K6650O0071K0723m2300n4248j292N3457M2158j7616n7167
517b4426k6520L4957N4081Q693m6986m5466J0546N3924L1646k7871n4023j4711
529d6156M1923M8067l280n1625l6789K1981N4128K1391l8061n0859l424M9513
541F809M1526j5677n5089k7778L3254N4277R946m7212m6877R003N4690L4206k7474
554B3604n6091j7700M1827N1302p88n2172m0855J9127N6025K6308l5343n4354
566c9110q904M8058M6592r732n5033l4412K7313N6528J8496m2215n1700l40N2299
579G840M2418j8418n6775k7697L5297N5184J0235m7801m7746Q704N5014L5404
591E1659k6140n5813j9210M0406N1152J362m9892m0938J6977N3178K6697l1664
$$ y = [41783, -16599, -54862, -28212, 31859, 52582, 10282, -43966, -45258, 8199, 50357, 32741, -24426, -50946, -15989, 38092, 46785, -201, -45667, -35121, 18803, 50449, 22578, -31445, -46156, -4233, 43834, 40554, -11071, -47860, -25879, 28249, 49640, 11579, -39280, -42704, 6809, 48335, 32658, -22431, -50209, -16955, 37322, 47268, 56, -46821, -37818, 16872, 51078, 23604, -32487, -50187, -8360, 42942, 42154, -10018, -50873, -31746, 24279, 50587, 15244, -39110, -48014, 44, 46636, 36904, -18129, -52541, -25228, 31300, 49796, 7581, -44119, -44459, 7840, 50258, 31840, -24935, -52632, -17335, 37849, 48084, 283, -47463, -38759, 16255, 51659, 25519, -30294, -49504, -9098, 42054, 43416, -6476, -47414, -30437, 22741, 49438, 17774]
603A7774n1445j0141M3297M4194p508m8963l2819K3193N0523J7210l6124m6307
615c7116n17M4918L6597j5967m8770k3353L0457M7060O827m1371l9699R947M6856
628A5869K7454k5068m7479j2709L7584M1966m418m4683l1910K0021M6946J7484
640D1057l2553m3662j877M1559L5643j4117m5880k3227K7518M5465Q708l8696
652f2l9535P715M5610K8444k2241m7114j4936L5249M3543p15m3904l4707J6546
665b6107M8370K2071l0775m6932o381M1263M0854r672m7812k9256K4460M9534
677B9617J4694l6878m5126J028M5575L5635j6461m9275k2742K9830M7787P717
689D1401m0604m1228P996M7002K9422k2494m7953j5544L4706M3561k7m2923l4718
$$ y = [17774, -33671, -43812, -515, 43679, 36171, -12792, -45611, -22418, 28105, 45315, 9191, -37116, -37633, 7285, 43882, 27915, -20855, -44208, -13751, 33309, 40136, -1235, -40934, -30987, 15869, 43323, 18255, -29224, -41933, -4349, 37617, 33199, -11484, -43394, -23373, 23573, 41057, 8504, -35158, -37035, 4524, 40167, 26050, -19830, -43057, -15539, 29926, 38634, -62, -39597, -31882, 13728, 42172, 19931, -27183, -42119, -6870, 36673, 35958, -7946, -42653, -26107, 22263, 44334, 13559, -33373, -39754, 1509, 42363, 32691, -15121, -44377, -19917, 29617, 44311, 7433, -37693, -36665, 8910, 44545, 28084, -21191, -43933, -14103, 33684, 41401, 797, -40431, -32435, 14567, 43989, 21495, -26458, -42002, -7296, 36265, 36238, -6685, -41403]
702d1403J4743M6624K1856k7913m5224p599L8561L7952p497m4303k7164K1405
714a9962M4909J3474l2921m0401R86M0902L1123j5251m3673j8827K8136M1143
726B9638M613l6907l4051R663M1937K2883k2689m1523r301L3192L6002m391l9450
739a0384k6662J7850M1613J4371k9400l7781q59L7742L0017j2812m0948j9556
751c6809K5395M0119O322l5157l4249P525M1013K4761k0817m2489j2567L2741
763d212L8355j622m0439l0312J5445M3410J9031k8342m1317n469L7339L4829q502
776B8194m2729k5114K1898M2427J2956l2422l8493M21L9406L0753j4266m2336
788a9305k0036K6534M0826O839l5743l4934O947M0644K5868j9986m1255j3829
$$ y = [-41403, -26660, 19964, 41820, 13907, -31317, -38916, -355, 37597, 30100, -14203, -41367, -19962, 24947, 38421, 5500, -34901, -33915, 6987, 38110, 22859, -20814, -39641, -11505, 29638, 34251, -2656, -36707, -27044, 14893, 37776, 15087, -26436, -35737, -2545, 33457, 29066, -10384, -37046, -19196, 22417, 36788, 7388, -30393, -31252, 6490, 36507, 23695, -17253, -36809, -11414, 28705, 35027, -130, -34379, -26854, 14159, 38920, 18103, -24386, -36953, -4212, 34143, 32521, -7918, -38230, -22785, 20625, 39656, 11314, -30003, -35472, 1867, 36696, 28194, -14535, -39649, -17751, 24676, 37632, 5210, -33283, -32862, 6544, 37297, 23031, -19305, -39341, -12807, 28019, 34858, -885, -35819, -28872, 11772, 37640, 17654, -23601, -37430]
800c7430L0599L7956m7l7620l0369J3935M0476J9321k5196l8783o322L3864L2519
813C2903o769l7883k3495J9551L7777J1830k8622l3910J334L4028K6559j3438
825A9865l5714j6409K3755L4133L823l0899k8488Q385L4815J9779j9780l4726
837b1461q524K8550L0863m443l3768k2880J6050L5324J1865k5906l2883O8L3044
850E899K5888j2656l5754j6421K3426L4845L975l1019k9698Q049L5647K0430j9118
863A3493l6043r817K8455L2347k338l4136k5575J4240L6608J5805k4509l5386
875b6856l827L2441K9940q476l6831k1036J9975L7519R888k9464l3745K894L5674
888H096K5988j4804l7518j5889K5030L6153L890l2683l0005Q428L6449K1207j9027
$$ y = [-37430, -6831, 31125, 31078, -6542, -36911, -22976, 17500, 36821, 11625, -27158, -33480, 384, 32903, 26134, -11749, -35244, -15693, 22084, 33914, 5292, -28618, -27284, 6744, 33303, 19865, -15849, -32258, -8503, 25630, 29453, -1446, -29934, -21549, 13266, 33045, 13265, -21461, -29985, -1435, 29428, 24985, -8783, -31663, -15613, 19711, 31576, 5670, -27213, -27145, 5899, 31787, 19131, -16623, -33044, -9618, 25227, 29202, -1817, -31515, -23466, 12181, 32611, 13493, -22550, -32367, -3912, 28435, 26097, -8039, -33614, -19374, 17234, 33039, 8530, -26856, -30683, 1758, 31698, 23222, -13609, -34645, -14670, 22849, 32737, 3273, -30472, -27578, 8096, 34084, 19280, -18238, -34127, -9097, 27056, 30946, -1737, -31742, -23314, 13135, 34342, 15315]
901A5315l6941r684K7726L2518j621l3310k5474J2780L5675J5418k2376l4114
913b4088m087K9760K8211p010l3610j9799J7113L3650R238k5782k9899J850L1267
926F814K2503j2799l2969j3142K1926L1273J759k8491k5296Q778L1845J6300j8109
939A0392l1543o334K6220K7059m845l0414j9757J4736L1631R986k3268k8391M74
952b4054K8995K2445j0603l1503j4000K0429K9907L866k7065k5241O809L1108
964A1093J7730j6905l1238q123K5066K8120k106l0396k1956J2801L2629J3098
976B9813k2181l0710k929K9169K5778q280l2357j7852J7937L2681P895k5905k9077
989b6018K658L1038K2173j2912l2894j3106K1614L0421L218k8079k5806P157L1783
$$ y = [15315, -21626, -31310, -3584, 28934, 27313, -5997, -31471, -18691, 16984, 32402, 10026, -24088, -28175, 1585, 29796, 22786, -10824, -30623, -13510, 20140, 29378, 3596, -26303, -24453, 6814, 29317, 16518, -16451, -29593, -7667, 23606, 25365, -3126, -28422, -19644, 12201, 28501, 10392, -21151, -27485, -1265, 25794, 20949, -9465, -29222, -14486, 17145, 27131, 3863, -24528, -24054, 4941, 27386, 16783, -14720, -28720, -8291, 21616, 25482, -1583, -26824, -20015, 11093, 28823, 11918, -19320, -27443, -2377, 25743, 23637, -6759, -28715, -15914, 16715, 29813, 7632, -23078, -26007, 3162, 28940, 20660, -11697, -29549, -11612, 21069, 28964, 3059, -26018, -23360, 7678, 29851, 16939, -15955, -29061, -7447, 22974, 26192, -1887, -27693, -20536, 11247]
1002A1247J7371j6465l1110q438K4042K7828j929k9105k1500J1830L0471J3118
1014B7360k0619k8438l446K6528K3880p116k9135j6876J6608K9021P274k3781
1026A260k5370K955K7866J9233j2737k8534j0254K0425K5985J017k5275k1117
1038b4546Q931K7430J3535j7090k6573m159K3349K2539n371k6179j6239J3951
1050a0422K6894P497k1243k4259J983K5866J9213j1413k7459j1344J9483K6295
1062B1091J529k5176k1880Q035K7960J4931j7002k7885n908K3649K4693m154k7644
1075g761j8632J2931K9042J0545k1181k6911r88K5950K2417q499k8583j5265J6408
1088a0527K8551O424k3114k5631L296K7691J9320j2168k8936j1559K0243K7134
$$ y = [11247, 28618, 12153, -18957, -27395, -3353, 24475, 22546, -6559, -28059, -16229, 14242, 27360, 6741, -21697, -25143, 1385, 25265, 18149, -10986, -27862, -11254, 17767, 25041, 1260, -24110, -21155, 6711, 25944, 13207, -15327, -25581, -5156, 20829, 21846, -3429, -24546, -15615, 11815, 25350, 8260, -18313, -22472, 877, 23416, 18045, -8134, -24373, -10422, 16472, 23969, 2726, -21533, -19550, 6316, 25529, 14116, -13343, -24687, -5204, 21091, 22620, -2556, -24436, -16401, 11559, 26490, 9488, -18397, -24305, -656, 24037, 19883, -7761, -26393, -13462, 15580, 26125, 4944, -21967, -22955, 2995, 25412, 16913, -11670, -26935, -10527, 18024, 24448, 1334, -24297, -21001, 6690, 26010, 13842, -15094, -26653, -6410, 20724]
1100B0724J739k5224k2680P619K8351J5506j6069k8160o218K2392K4861k871k6622
1113f652j8578J1875K7542J0352j8279k5744j597K3471K0999p053k6038j3908
1125b3610J4710K5578N743k0605k1902K788K3961J6478j1180k4778q960J7561
1137d216K3177K46k2540j8065P951K4491J0982j5198k3679k773K0939J9455n837
1150A4933k3703j3418J3288K3967N387j9478k0803K710K3236J5644j0653k4774
1162a3664q204J7120K2624O67k2151j8188P274K4942J1604j4936k4255l934K0654
1175d47K0983l850k4508j5401J2166K5318P804j8380k3242J7K3429J8677q287
1188A4279k5894j1534J5896K4907L927k2001k0971M281K5380J5562j2738k5535
$$ y = [20724, 22463, -2761, -25441, -17822, 10529, 26035, 9966, -18194, -24412, -2020, 22841, 19970, -6652, -25230, -13355, 14187, 24539, 6260, -19484, -21081, 2390, 23389, 16336, -9702, -23610, -8900, 16678, 22421, 1816, -20086, -17298, 6663, 23141, 11961, -12817, -21777, -4216, 18961, 19207, -3333, -21398, -13447, 11044, 22026, 6828, -16851, -19624, 1315, 20770, 14933, -8770, -22188, -8900, 15067, 20454, 976, -19827, -17117, 6119, 21763, 11110, -13664, -21868, -4748, 17876, 18543, -3608, -21796, -14522, 10420, 22024, 7088, -17167, -21101, -447, 20536, 16686, -7822, -23223, -11057, 14261, 22065, 3685, -19557, -19540, 3889, 22566, 14279, -11615, -23149, -7253, 17654, 21581, -420, -21391, -17110, 8270, 23832, 11094, -14441]
1200a4441q015J9279K3354m67k3300j8230P769K5352J2090j5452k4209m130K0595
1213A95K0453l675k3808j5060J1387K3913Q325j7967k1776j28K1643J7103p835
1226A2770k2996j0645J4307K1897L124j9199j8379M036K2075J3170j1575k2083
1238a3498o249J7449J9523j647k0709j5109R248K1673Q544j5255k0313j224J9745
1251B178J6484o247k1459j0739J2836K0991L850j7923j7689K950K1043J3207j0259
1264I223k1407o902J6241J9645j28k0203j5349P366K1681J0263j4365k1120k955
1277a8010J9238J8071m818k1759j2962J1696K2502O184j7640k0155J256K1360
1289D963J6003q919k2838r639J4901K1459L040j9751j8542M929K1810J3171j1750
$$ y = [-14441, -22456, -3177, 20177, 19710, -3590, -21820, -14051, 11301, 23391, 7939, -16270, -20400, 195, 20648, 16973, -6835, -21895, -10508, 13405, 21730, 3763, -18013, -18141, 3502, 20605, 12770, -10226, -20871, -6564, 15333, 18457, -742, -19121, -15085, 6990, 20160, 8585, -13498, -19747, -2298, 17225, 15578, -5131, -20240, -10992, 10681, 19225, 3970, -16343, -17567, 2178, 18662, 12415, -9044, -19783, -6947, 14044, 17894, -29, -17718, -14768, 6275, 19482, 9223, -12184, -19086, -2845, 16800, 16672, -3531, -18880, -11514, 10167, 20430, 6065, -15055, -18010, 1228, 19299, 14481, -7278, -20240, -8544, 13958, 20142, 2502, -17653, -16397, 4963, 20966, 12047, -10791, -20430, -5529, 15930, 18970, -781, -19323, -14394, 7416, 20587, 8837]
1302H837k2092o333J6628K0226q63k0228j5850P737K1599R827j3737k1043k891
1315a8183J8314J7660m267k0911j2388J0760K1507N716j6398j8801J580J9432
1327D021J4340p861k0811q144J3591J9206J420j7529j5497N260J9378J0388j1262
1340F500j8724l804J5344J6346k393j8158j1903Q396J9050O111j3416j7596L3
1353a4214J7367J3820o693j8751q006J1915J8347J455j6162j4892M422J8563J0349
1366A7520j0663j8990l880J5242J6665k519j8888j1924Q792J9314O753j4306j8116
1379a5000j53J7509J4780o038j9637r487J1547J9342L674j6453j6597K721J8911
1392E119J2700q981j9859o954J4136J8262R54j7988j5211O061J9878R910j1750
$$ y = [8837, -13255, -19588, -2960, 17266, 16403, -3825, -19675, -11938, 9661, 19488, 5751, -15292, -18183, 131, 17791, 13524, -7387, -19775, -9015, 12492, 18208, 1810, -16991, -15411, 4021, 18361, 10500, -10311, -18455, -4864, 14342, 15762, -1767, -17264, -12004, 7374, 17762, 6500, -12224, -16028, -684, 15662, 13269, -4889, -16792, -8396, 10654, 16765, 3349, -14247, -14214, 3153, 16973, 10280, -8471, -16477, -4562, 13785, 15240, -922, -15814, -11392, 7171, 17520, 6857, -12133, -16013, -771, 15894, 13375, -5513, -17437, -8645, 10669, 17422, 3116, -15000, -15153, 2356, 17136, 11098, -8539, -18026, -6479, 12863, 16537, 84, -16513, -13792, 5119, 17819, 8838, -11021, -17975, -3839, 14423, 15377, -2611, -17822, -11761, 8117, 18027, 6277]
1405F277j9412l800J6645J6685k799j8977j2389Q771J9546P112j4146j7917o26
1418a5030J7695J4327n487j9180r302J1066J8466L491j5325j5467K455J7540J1258
1431A6507q155j7894o032J2879J6154K95j6124j2685N458J7223Q381j1065j6370
1444a1428k323J4416J3566l431j6393r440Q868J6144M300j3193j4359J454J5640
1457C821J0842o992j6108o706J2008J5062M54j5117j2131N425J6416P643j0051
1470D566j5873k802J3897J4009l277j5893j0052Q494J6434N115j2807j5012O63
1483a2538J5413J1978n984j6879p384J0952J6233K167j4677j3564L542J6719R852
1496A5830r139j6780m870J3325J5940j603j5831j2221O533J7345P063j1268j6353
$$ y = [6277, -13135, -16935, -290, 16395, 13596, -5381, -17770, -8999, 10547, 17659, 3513, -14404, -15030, 2665, 16992, 11505, -7675, -16977, -5911, 12555, 16046, 721, -14746, -12291, 5249, 16507, 8352, -9542, -15574, -2695, 13459, 13754, -2370, -15055, -9597, 7626, 16007, 4942, -11428, -13751, 665, 14231, 10800, -5593, -15033, -6165, 9979, 14279, 1086, -13273, -11819, 3821, 14663, 7671, -8437, -15143, -3135, 11927, 12381, -2736, -14867, -9442, 6974, 14617, 4566, -11307, -14109, -212, 13797, 10520, -5373, -15425, -6931, 9503, 14618, 1811, -13201, -12538, 2875, 14853, 8869, -8010, -15394, -4442, 11791, 13958, -719, -14283, -10741, 5978, 15830, 6691, -10089, -14959, -1634, 14306, 12703, -3128, -15349, -8816, 8529, 15592, 4324, -12029]
1509a2029j768J4926J3627l628j6545r738Q862J6218M856j2802j4677P77J5031
1522C110J1461n869j6114p346J0535J5304J764j3840j2389L181J5023R153q055
1535E918j5325l907J1764J3591j508j4099j0075N966J5153N916j0673j4082m06
1548a1767J3287J1325m750j4606o755Q657J4394K080j2031j2134K857J3855Q736
1561A3148p409j4007m159J0846J3227j005j3380j0144N683J4412N968r725j3671
1574a0216r44J2518J1912m219j4612p977Q654J4987K800j2121j2983J997J4257
1587D053J0035o955j5238n259J0885J4426J11j3909j1733M655J5378P573r052
1600D970j5040k704J2013J3196k071j4329r727O430J4950N715j0515j4102r55
$$ y = [-12029, -13797, 1129, 14756, 11128, -5417, -15155, -6293, 9925, 14781, 1979, -12698, -11921, 3110, 14571, 8702, -7412, -14758, -4223, 11081, 12845, -995, -13384, -10203, 4820, 13973, 5918, -9407, -13314, -1550, 12041, 10533, -3566, -13641, -7675, 7478, 13394, 2721, -11361, -11767, 1520, 12845, 8095, -6511, -13266, -4609, 9785, 11865, -166, -12300, -9443, 4412, 13148, 5739, -8268, -12427, -1581, 11646, 10641, -2739, -12883, -7200, 7212, 13180, 3455, -10216, -11160, 1358, 13270, 9051, -5561, -13538, -4884, 10103, 12903, 782, -12201, -10204, 4053, 14088, 7133, -8105, -13364, -2479, 11947, 12058, -1851, -13584, -8929, 6449, 14022, 4970, -10070, -12774, -761, 12435, 10364, -3965, -13692, -7262, 7688, 13403, 2888, -11214, -12169]
1613a2169J3291J1634l808j4854p958Q675J4623K947j1733j2653J591J3825R240
1626A2651o052j4389n183J0227J3019M06j2338j0502M019J3584P130q076j3308
1639h812k524J1331J0996j925j2655q079O085J3032M223r488j1859J18J2061Q806
1653A1310m262j2687n502Q016J2215J424j0894j0001K814J2233O658o833j2361
1666g870k612J0032J0821j694j2243p548N653J2573M022r369j1362K0J1688R223
1680A1334m728j2853n292Q016J2395J560j1280j0370K651J2704P605o944j2667
1693g869l768J0255J1456n87j2113r225M682J3385N634q515j2544j886J1613J0674
1707A1192k480j3162p719P128J2570M025j0127j1614O16J1914R673n161j2945
$$ y = [-12169, 1122, 12756, 8948, -5906, -13864, -5189, 9434, 12381, 648, -12005, -10414, 3411, 12651, 6599, -7790, -12973, -2746, 10273, 10679, -1659, -12161, -8142, 5442, 12572, 4496, -8812, -11336, -5, 10991, 9066, -3589, -11668, -5583, 7449, 11672, 2184, -9675, -9557, 2504, 11310, 7048, -5639, -11141, -3125, 9090, 10514, -380, -10381, -7567, 4666, 11324, 4491, -7870, -10482, -450, 10371, 8677, -3566, -11114, -5461, 7112, 11134, 1765, -9597, -9577, 2111, 11334, 6606, -6247, -11539, -3523, 8872, 10432, -848, -11218, -8567, 4137, 11742, 4798, -7869, -11637, -1382, 10074, 9487, -2626, -11851, -7169, 6216, 11850, 3335, -9209, -11095, 518, 11192, 8712, -4450, -12169, -5041, 7529, 11554, 1427, -10187, -9571, 2343, 12016, 6855, -6090]
1720f090n534Q428J2385J768j1282j0399K475J2734P446o748j2473l599R783J1100
1734I994n61j1432q733M343J2060N089p485j1500j400J0325R438k695j1350o650
1748a0557O249J1387K882r149j0180J115J1070P099n017j0903m092P980J0375
1761H259Kr723q384L544J1292M659o855j0756j459R582R168k444j0806o399O046
1776d274J0758K798q583r751J017J0493P391m139j1161m611P584J0970K93r842
1790a057q663L017J1176O162o556j1215k440R136J0097j677j0731p555N056J1507
1804F257M310q422j0735o39J0879Q741l576j1289n899O390J1583K244r357r522
1818i035J175J0692P605n006j1060m158P448J0405P40r718q745L071J0552N696
$$ y = [-6090, -11624, -3196, 9189, 10957, -325, -10724, -8249, 4485, 11931, 5183, -7290, -10889, -1106, 9994, 9433, -1999, -10732, -6389, 5671, 10760, 3275, -8225, -9625, 700, 10138, 7443, -3907, -10557, -4308, 7079, 9961, 812, -9368, -8253, 2817, 9916, 4899, -6004, -10096, -2116, 8259, 8261, -1462, -9846, -6302, 4990, 9649, 2794, -7962, -9421, 161, 9329, 6885, -3921, -10320, -4274, 6484, 9282, 699, -9052, -8035, 2458, 9849, 5710, -5451, -10062, -2478, 8492, 8785, -1057, -9720, -6703, 4473, 10635, 4079, -7136, -9576, -440, 9657, 7980, -2751, -10306, -5250, 6257, 10567, 2145, -8590, -9229, 1650, 10391, 6815, -4474, -10373, -3983, 7600, 9844, 487, -9035, -7860, 2832, 10437, 5431, -5629, -9787, -2339, 8066, 8806, -912, -9657, -6586, 3966, 9662]
1832I662n967j0694k232Q346R553j444r940o761M439J0503L553p258r565J45Q989
1847A329P247l079r933m493O189R312J472q459p751K042R618M988m859r445k303
1862h125P336Q759j210q933n953L709R413L419o405q995k65Q737O944k920r444
1877c933m228N436R570J314q148q117J984R370N733m918r934k471P585Q780n89
1892G434r517p040M124J0167L748o503r741o84Q912P671k262r967n684N377R880
1907E915K806q050q671K83R492O877l675r814m404O559R500J283q729q028K066
1922f590R710N816n156r674k736P185R168n97q929o800L543R617M061o218q949
1937f549j148Q313P631k317q915n355N197Q606K432o818q003N37Q638N790l217
$$ y = [9662, 3695, -6999, -9231, -885, 8668, 7224, -2716, -9477, -5038, 5465, 9018, 1760, -7805, -7660, 1329, 8576, 5497, -4436, -8929, -2740, 6572, 8044, -415, -8166, -6124, 3494, 8482, 3623, -5822, -8125, -789, 7970, 6760, -2173, -8126, -4417, 4996, 8415, 2010, -6985, -7250, 1487, 8431, 5511, -3933, -8161, -2725, 6845, 8159, 11, -8106, -6122, 3248, 8981, 4063, -5871, -8342, -757, 8023, 7434, -2083, -9123, -4999, 5168, 8916, 2413, -7328, -8012, 900, 8571, 6309, -3658, -9342, -3965, 5915, 8721, 671, -8000, -7717, 1775, 8652, 4977, -4837, -9241, -2682, 6818, 8101, -628, -8656, -6590, 3120, 8936, 3780, -5894, -8630, -1445, 7723, 7126, -1803, -8603, -5060, 4557, 8618, 2400, -6549, -7697, 616, 8247, 5930, -2985, -8340, -3143, 5463, 7895, 1077, -6926, -6389, 2249, 8039, 4822]
1952D822r076l358N834Q298L70p561o604K426Q186M680n227q137j761P052P031
1967F975j417q235n131M273Q257K694o592p196n0P977N856l322q177l492N642
1982a938P828P05p492o494K121Q225M696n006q459j501O826P421j009q282n682
1997h041M021Q631L249o454p906l43P914O592k703q584m149M968Q409J661p098
2012A67p283J258P929N810m085q398l122O304Q132L21q228o497K984Q812L919
2027H023n049q154j944P303O922j143q304n240L890Q353K554n612p871k0P531
2042A239O020k774p955l587M730P812J020o537o361J254P503M562l914p440k292
2057f720N641O790l39o909n331K942P614K523m812o977k69O610N562k273p182
$$ y = [4822, -4254, -7612, -1778, 6520, 6890, -671, -7275, -4849, 3337, 8017, 2790, -5347, -7108, -56, 6975, 5558, -2677, -7808, -3535, 4722, 7416, 824, -6372, -6422, 1555, 7411, 4089, -4088, -7580, -1938, 5890, 6595, -897, -7391, -5270, 2955, 7651, 2645, -5814, -7315, -489, 6932, 5923, -2359, -8041, -4020, 4611, 7860, 1406, -6500, -6843, 1071, 7663, 4960, -3624, -7773, -2805, 5604, 7265, 167, -7116, -5858, 2071, 7881, 3796, -4602, -7724, -1420, 6712, 7033, -1195, -7692, -4708, 4104, 8023, 2974, -5180, -7124, 179, 7101, 5958, -2346, -7586, -3696, 4657, 7211, 1599, -6272, -6292, 1239, 7259, 4485, -3470, -7057, -2327, 5485, 6505, -32, -6393, -5139, 2364, 6926, 3012, -4428, -6720, -1079, 5711, 5372, -1537, -6868, -3926, 3688, 6211, 1399, -5578, -5847, 763, 6325, 4052, -3130]
2072c130l639M287P394J187o264o081J433P187M275l697p506j776N412O909m19
2087E572o939n205K601P511L070m484p534n36O481N900j676p525m187M264P616
2102D929J953o164o840Q05P202N373l475p596k979N362P147N51o949o168K529
2117d320P133M296m355p651j785O108O691n00p256n270L006P525L150m998p333
2132e559r38O920N819j575p523l909M095P212J511n884n986P06O729M522k726
2147C414p247k353M626O589K09o158n067K003O720L159l859o298j319N529N306
2162E254r15o314l738L166O478K055n313n572K55O073M532k497o485k297M180
2177a138O022M09n852n194K118O449L256l949o169j040N296N167j204o256l865
$$ y = [-3130, -6769, -2482, 4912, 6099, -165, -6246, -4813, 2374, 6649, 2952, -4554, -6330, -918, 5991, 5572, -1367, -6572, -3971, 3540, 6610, 2126, -5408, -5944, 537, 6437, 4761, -2764, -6951, -2687, 4929, 6882, 718, -6122, -5317, 1885, 7258, 3783, -3813, -6792, -1430, 5717, 6268, -681, -6849, -4320, 2813, 7109, 2754, -4897, -6682, -574, 6117, 5617, -1639, -6909, -3903, 3622, 6772, 1774, -5559, -6497, 423, 6242, 4667, -2856, -6765, -2670, 4542, 6053, 169, -5817, -5111, 1618, 6140, 3414, -3833, -6186, -1560, 5029, 5238, -920, -5987, -3984, 2736, 5895, 2036, -4262, -5581, -52, 5254, 4339, -1975, -5713, -2547, 3931, 5986, 673, -4899, -4644, 1429, 5961, 3464, -3021, -5318, -1138, 4884, 5293, -559, -5753, -3635, 2814, 6070, 2121, -4048, -5088, 208, 5375, 4171, -2085, -5950]
2192e950L445O352J973n130n774J62O337M800k759o675k893M365O651Q51o311
2207e56n365J585O825L831m068o621j880N316O396n99o537m768L019O564L157
2222F299m561o824o86O078N662j636o820m065L784P157J616n407o072L44O928
2237A797M413k963o678k469M374O457M54n884n003J529O385L605l583o353j542
2252e461N329N496q90o002m145K784O273K173m374n615n9N434M363j934n832k999
2268e459L743O085N14n028m973J233N736L728l610n785j512M671N665q83n518
2283a393m003K627N907J911m168n363j36N207M561k002o193k612L777O008R81
2298E109n210n030J044O029L602l005o102j798M631N635j97n728m487K154O538
$$ y = [-5950, -2505, 3847, 5820, 690, -5084, -4922, 1415, 6215, 3456, -3219, -6112, -1747, 4904, 5755, -556, -5921, -4336, 2489, 6320, 2252, -4369, -6249, -933, 5463, 4864, -1673, -6441, -3422, 3142, 6299, 1738, -5086, -5772, 306, 5968, 4332, -2488, -6553, -2769, 4388, 6004, 597, -5475, -5131, 1797, 6210, 3247, -3431, -5900, -1526, 4931, 5385, -499, -5502, -3973, 2412, 6017, 2434, -3919, -5461, -132, 5364, 4474, -1528, -5673, -2889, 3384, 5557, 1183, -4432, -4491, 943, 5306, 3372, -2460, -5459, -1716, 4369, 4883, -145, -5118, -3885, 1851, 5579, 1969, -3816, -5328, -657, 5008, 4125, -1393, -5396, -2769, 3138, 5049, 881, -4482, -4618, 589, 5150, 3148, -3045, -5657, -1880, 4128, 5109, -101, -5131, -4087, 1942, 5544, 2539, -3563, -5361, -730, 4905, 4708, -1020, -5507, -3353, 3185]
2313C185K602m171n617j088N384N222j444o300l438L102O429J680m771n694N26
2328d393N630M416k285o380k547M002N737O65n222m907J403O043L394k994o076
2343c514j649M607N186j07n718m263K179O076K405l680n755n20N156M379j352
2358C430n741k894L346N425J195m829m636Q63N261L352k515n626j660M285M953
2373D209l72n066l446J788N491K146l435n102n35M751M291j435n461k602L064
2388a714N158J326m591m730P93N545L312k501n892j696M157N137J63n331l964
2403d828J833N722K661l684n748n37M903M607j216n827l099L104N550J455m249
2418F47n302M67N505L883k255n809k332L617N560P87n172m719J248N977L116l243
$$ y = [3185, 5787, 1616, -4001, -5089, 295, 5517, 4073, -2227, -5665, -2563, 3866, 5546, 775, -4919, -4393, 1237, 5653, 3368, -3012, -5559, -1557, 4180, 4845, -377, -5284, -3881, 2162, 5556, 2562, -3514, -5163, -556, 4630, 4523, -1195, -5458, -3279, 2797, 5202, 1522, -4233, -4753, 403, 4782, 3430, -2311, -5205, -1859, 3566, 4761, -68, -4704, -3841, 1420, 4772, 2257, -3369, -5029, -744, 4209, 3837, -1229, -4675, -2887, 2604, 4750, 1315, -3787, -4322, 429, 4720, 3285, -2176, -4778, -1714, 3444, 4770, 179, -4551, -3758, 1787, 5099, 2598, -3294, -4990, -833, 4304, 4467, -864, -4828, -2995, 2727, 5388, 1704, -4044, -4581, 322, 4929, 3713, -2114, -5213, -2109, 3441, 4896, 647, -4655, -4188, 1317, 5200, 2945, -2864, -5196, -1579, 3981, 4768, -404, -5123, -3875, 2102, 5218, 1975]
2434A975n319j774M447N316m35n357m218K419N681K353l836n353n52N061M391
2449D799j306n400l101L186N063J365m212m801P59M998L707k348n527j767L669
2464i16M912P3m521m134J637N370K325k949n180p19M057M557j179m857l037K710
2480a851N061J310m285l988L57M725L137j817n257j958L568M705K51m763l637
2495d442J536N175K503l095n221r47M577M512j133n295k970K805N120J519m245
2510C99m706J68N281L754k085n252k531L512N089Q57m697m509J161N516L112k967
2526B102n213j522M174M928j98n352l759J948N561K607l782n187n77M668M483
2541D881j258n400k972K718N317J470m173m677M75N036L423j939n518k180L723
$$ y = [1975, -3344, -5118, -671, 4645, 4210, -1147, -5365, -2946, 2735, 5088, 1252, -4101, -4653, 408, 4799, 3493, -1907, -5008, -1822, 3241, 4606, 394, -4407, -3648, 1350, 5057, 2709, -2818, -4585, -916, 3996, 4069, -452, -4586, -2949, 2421, 4746, 1797, -3383, -4102, -45, 4512, 3333, -1524, -4561, -1851, 3210, 4520, 235, -3753, -3396, 1329, 4466, 2649, -2608, -4566, -998, 3707, 3958, -805, -4442, -2906, 2269, 4772, 1677, -3544, -4491, 86, 4598, 3465, -1830, -4800, -1995, 3125, 4644, 399, -4307, -4139, 1142, 4896, 2811, -2441, -4972, -1460, 3629, 4486, -211, -4720, -3559, 1957, 5069, 2102, -3111, -4633, -459, 4469, 4271, -1081, -4840, -2892, 2669, 5276, 1494, -3693, -4270, 398, 4881, 3623, -1777, -4749, -2031, 3286, 4756, 583, -4094, -3619, 1417, 4840, 2901, -2617, -4797, -1074]
2556a074M768L08m430l779J087N285K348k792m743j372M269M135n41m956k998
2571d485K253M819J496l381m471k64M502L991j783m909k307L194M762M74m462
2586e71l655J196M870K419k627m700j092L929M203o04m676l122K039N091J896
2601D596l528m883p5M707L597j643n117k199L060N123Q20m490m277Q95N004L354
2617D944k655n152j576L779N025j60n053m063K113N503K170l372m991r43M620
2632A89M253j168m967l251K861N157J456l752m983K72M894L636j834n089k356
2647d682L211M909Q29m425m058O73N000L171k413n212j512L850M396l0m613l721
2663d627J752N135J904l091m706k47M313L630j138m840k308K605M662R23l811
$$ y = [-1074, 3694, 4002, -428, -4207, -3120, 2165, 4513, 1721, -3022, -4394, -125, 4010, 3469, -1487, -4485, -2232, 2587, 4083, 702, -3769, -4033, 469, 4460, 2677, -2232, -4539, -1345, 3417, 3891, -571, -4226, -3030, 1840, 4259, 1632, -3068, -4160, -231, 3972, 3368, -1308, -4430, -2391, 2700, 4596, 1068, -3815, -3890, 817, 4414, 2771, -2346, -4545, -1485, 3638, 4458, -32, -4309, -3414, 1590, 4944, 2289, -2863, -4439, -660, 4365, 4205, -848, -4911, -2798, 2705, 4875, 1503, -3488, -4431, 189, 4442, 3274, -1693, -4944, -2083, 3074, 4530, 778, -4205, -3933, 961, 4597, 2763, -2326, -4682, -1471, 3438, 4267, -158, -4216, -3543, 1457, 4628, 2215, -2997, -4509, -659, 3737, 3707, -906, -4627, -2875, 2260, 4164, 1073, -3633, -3880, 433, 4063, 2925, -1915, -4223, -1618, 3044, 3967, 156]
2678A56l925N55M560K701k083m541j628L645M339l60m147l336J640M849J783l099
2694A109m405m52M206L590j105m847k197K407M785J029l719m312P03M459K984
2709D235j828n229j402L410M625J1m615l629J578M844K453l056m875q23M295M272
2725D266j005m854l008K345N085J536l793m354l42M744L871j634n201k253K851
2740a746N061J062m220m300P17N008K948k001n324j457L675M326J09m276l984
2755d402J656M829K477l304m427q31M253L766q92m726k583K446M563J484l814
2770D95l996J22M278L206j519m559k138L097M499N10m388l634J060M912K200k538
2786A607m299j207L716L971p74m628k470K224M381J527l407m272J90M261L212
$$ y = [156, -3769, -3214, 1346, 4047, 1964, -2577, -4205, -560, 3779, 3419, -728, -4064, -2424, 2425, 4208, 1109, -3296, -3748, 458, 4048, 2943, -1904, -4101, -1694, 3091, 4120, 401, -3911, -3208, 1251, 4235, 2407, -2822, -4224, -814, 3811, 3822, -793, -4422, -2844, 2000, 4453, 1397, -3478, -4301, -6, 4266, 3261, -1593, -4601, -2256, 2829, 4365, 572, -3782, -4124, 620, 4491, 2857, -2344, -4597, -1746, 3315, 4377, 157, -4143, -3426, 1582, 4530, 2529, -2795, -4252, -577, 3749, 3858, -418, -4402, -2746, 2083, 4560, 1256, -3171, -4002, 251, 4017, 3125, -1601, -4184, -1738, 2825, 4309, 495, -3501, -3379, 899, 4105, 2586, -1973, -4111, -1014, 3485, 3995, -393, -4027, -2967, 1945, 4145, 1607, -2692, -3899, -183, 3788, 3014, -1614, -4084, -1860, 2521, 4048, 641, -3631, -3441, 820, 4032]
2801D032j707m448k288L045M571M56l859l971J130M654K651k618m541j207L741
2816c59M156l72m555l192J807N063J773l083m973r6M204L946r91n066k550K449
2832a839M903J326m007m308Q06M308L392k009m960k018L368M677L02m464l536
2847d059J332M363K688k545m756r58L534M278l22m341l683K096M668J983l239
2862A039m261n22M175L667j201m730k303K395M712J069l703m230N15M687K608
2877C917j971m470j506L339M042k34l905l292J569M659J573k606m226n77M072
2892C84L407j235m259k036K344M258Q21l534l739P06M124K623j712m506j370L177
2908e47M112j7m332l401J742M518K180k822m424q70M019L741p81m441k778K116
$$ y = [4032, 2325, -2123, -4411, -1366, 3205, 3661, -198, -4169, -3039, 1615, 4266, 1648, -2893, -4100, -359, 3797, 3425, -1130, -4322, -2515, 2548, 4321, 1238, -3735, -3831, 373, 4319, 3328, -1738, -4288, -1839, 3064, 4390, 383, -3925, -3119, 1189, 4581, 2572, -2388, -4406, -1038, 3639, 3941, -523, -4059, -2727, 1636, 4324, 1779, -2977, -3935, -401, 3877, 3555, -786, -4469, -2373, 2295, 4278, 1039, -3222, -3744, 431, 4098, 2897, -1833, -4136, -1741, 2971, 4040, 337, -3893, -3378, 1309, 3917, 1946, -2524, -4030, -691, 3351, 3117, -788, -4080, -2511, 2148, 3721, 1115, -3111, -3688, 384, 3791, 2556, -1703, -3739, -1395, 2863, 3684, 150, -3589, -2883, 1241, 3864, 2152, -2354, -3724, -547, 3565, 3548, -784, -4185, -2443, 2075, 4255, 1433, -2991, -3861, 158, 3899, 3118, -1323, -4101, -1985]
2924a985M712J437l644l907j78M498L235j775m578j894K837M610M65l794l821
2939c782L95N009K686k452m596j609L453M425K53m744l386J663M677K476l114
2954A354m337j069M066L863q94m213k964K093M666J465l537l950j67M221L268
2969C865j427m441k025K711M217O82l734l328O92M208K494k375m222p56L236L768
2985C565n73l784k910J989M040J343k901l835o4L837K866j241m016j964K348M181
3001B881P24l660l411J047L845K231j834m343j008L086L873m17m072k634J631
3016b061M332J567k812m097n10L957L479j387m199k479K625M334R33l517l906
3031c741M28M407K840j914m337j750L284L928M45m049l604J241M534K380k449
$$ y = [-1985, 2727, 4164, 520, -3387, -3565, 933, 4168, 2393, -2185, -4079, -1242, 3368, 3833, 39, -3782, -3387, 1622, 4308, 1856, -2740, -4349, -896, 3529, 3782, -962, -4348, -2685, 1992, 4468, 1354, -2983, -4052, 14, 3877, 2983, -1230, -4194, -2101, 2565, 4030, 493, -3457, -3624, 597, 3865, 2438, -2003, -4028, -1317, 2900, 3582, -152, -3480, -2788, 1420, 3914, 1539, -2683, -3439, -203, 3565, 2992, -792, -3702, -1713, 2327, 3670, 769, -3066, -3130, 707, 3573, 2332, -1684, -3648, -1300, 2881, 3605, -55, -3466, -2419, 1426, 3657, 1823, -2520, -3528, -442, 3431, 3014, -1058, -3692, -2061, 2271, 3838, 1026, -3071, -3581, 376, 3855, 2468, -1731, -4210, -1585, 2749, 3682, 165, -3741, -3313, 1094, 3934, 2020, -2317, -4067, -783, 3145, 3590, -459, -4063, -2822, 1712, 4092, 1643]
3046A643m558r83L417M182o42l997l259J960M544J725k980m263k14L716L436q87
3062B840m607j989K439M186P82l363l671L80L996K949j951m023j648K857M199
3077C376J52l903l108J359L791K034k195m128q68L380L389p23l816k568K056M139
3093B367J082l056l393j56L898K598j277m036j515K672L691k5l253l256J212L964
3109A517J799j800m270p90L622L273p53l880k411K102M047J208l238l638LL782
3125E73L207j273m293k233K879M156O58m034l369Q48M214K657k196m048j549L466
3141c37L628L15m061l279J388M179K095k659m192n63L484L457k62m466k631J936
3157a968M399J298l048l875r2M002K879j162m439j867K597L839P47l312l523O22
$$ y = [1643, -2915, -3898, -481, 3701, 3059, -938, -4197, -2237, 2307, 4032, 1052, -3211, -3425, 291, 3727, 2840, -1767, -3756, -1317, 2869, 3651, 288, -3383, -3003, 993, 3942, 1991, -2032, -3680, -823, 3376, 3528, -375, -3483, -2124, 1667, 3701, 1506, -2622, -3490, -110, 3279, 2556, -1260, -3828, -1772, 2367, 3449, 393, -3000, -3156, 742, 3340, 2063, -1973, -3488, -816, 2875, 2850, -403, -3659, -2447, 1517, 3316, 1516, -2754, -3544, 78, 3351, 2598, -1282, -3693, -1591, 2456, 3664, 426, -3212, -3209, 573, 3780, 2507, -1786, -4019, -1140, 3016, 3674, -360, -3729, -2881, 1333, 3990, 1794, -2254, -3803, -337, 3291, 3606, -455, -3734, -2346, 1833, 3928, 1269, -2923, -3486, -2, 3455, 3193, -1273, -3904, -1968, 2431, 3729, 681, -3194, -3286, 716, 3595, 2433, -2006, -3873, -1276, 2563, 3310, -2, -3525, -2903]
3173b903L788K530j585m315j018K717L731j4l494k873J444L961J531k529l630
3188b659l87L414K817j031l620k111K342L690P31l085l017L93L577K290j758l631
3204b045j326L050L278j97l492k920J616L768J748k656l630m17L461L086j134
3219B190l605k283K183M075R45l124l291JL810K807j774l777j817K718L500P79
3235C337l631l337J363L679K347k231m199p48L255L261j99l873k881J462M646
3250B251J237k769l691l41L575L188j162l872k284K340L955J041k916l933L12
3265c069L751K872j462m118j637K917L370M42l196l119Q81L876J782j926l782
3280b418q22L100L187l31l420k603J357L745J553k525l338j41L346K609j153l678
$$ y = [-2903, 885, 3415, 1830, -2485, -3503, -786, 2945, 2931, -563, -3436, -1992, 1969, 3500, 971, -2659, -3046, 368, 3185, 2154, -1466, -3577, -1235, 2455, 3186, 101, -2916, -2523, 1054, 3344, 1586, -2045, -3371, -321, 2957, 2760, -732, -3652, -2036, 1732, 3480, 824, -2806, -3223, 238, 3324, 2190, -1415, -3698, -1515, 2560, 3505, 381, -2910, -2909, 901, 3708, 1934, -1843, -3660, -942, 2558, 3337, -294, -3631, -2268, 1411, 3758, 1527, -2672, -3420, -165, 3096, 2897, -976, -3857, -2395, 2251, 3488, 719, -2972, -3313, 262, 3450, 2288, -1584, -3868, -1528, 2427, 3468, 552, -3381, -3069, 682, 3554, 2092, -2026, -3663, -746, 2624, 3066, -130, -3249, -2368, 1508, 3290, 1364, -2418, -3240, -140, 3047, 2716, -704, -3307, -1950, 1795, 3348, 823, -2515, -2656, 690, 3299, 2146, -1532]
3296a532j572K298L501K17k851l056P56L493K014j695l675p39K496L268k31l605
3312i13k508J527L653J606k650l441j39L219K702j030l583j860K249L604O75l055
3328E6l301M94L616K520j311m060j395K644L560J29l463k681Q87M046J655k304
3344A092l435j013L187L494o98l582k466J618L961J428k750l638O3L294K779j228
3360B106l515k110K277L774P15l086l147O68L522K063j510l576j375K505L178
3375B489L61l435k698J110L771J746k270l323p20K837L102m30l641j901J436L386
3391A820J244k738k879k6L363K096j089l668j172K081L295M44k845k829Q61L416
3407A374J702k107l136n38K753K724m94l247k170J892L338P99k428l049K72K891
$$ y = [-1532, -3104, -806, 2695, 2912, 61, -2995, -2239, 1254, 3268, 1573, -2102, -2841, -345, 2923, 2692, -913, -3421, -1894, 1759, 3365, 715, -2726, -2865, 354, 3056, 2026, -1557, -3417, -1168, 2436, 3111, 56, -3245, -2751, 865, 3385, 2074, -1986, -3381, -737, 2823, 2952, -511, -3192, -2305, 1741, 3396, 1092, -2343, -3356, -169, 3325, 2627, -955, -3421, -1803, 2158, 3586, 836, -2802, -2739, 555, 3334, 2106, -1409, -3519, -1242, 2532, 3247, 161, -2986, -2318, 1204, 3267, 1757, -1819, -3194, -689, 2489, 2850, -585, -3283, -2173, 1598, 3344, 1074, -2249, -2969, -132, 2970, 2540, -1101, -3002, -1566, 1820, 3064, 326, -2553, -2579, 784, 2880, 1791, -1877, -3049, -968, 2327, 2771, -74, -2903, -2042, 1374, 3076, 969, -2167, -2705, 48, 2772, 2278, -969, -3139, -1247, 2091, 2890, 462, -2587, -2315, 576]
3423E76K491j265l481j397K279L679j41k797k805P27L327K316j960l653r44K972
3439g6L119l39l524k263J252L233K003k524l541n15L591K805j108l393k009J727
3455a562L810R93k706l241K5L349K548j211l691j584K337L371L21k801l039Q11
3471b270L445J947j806l233j122K546L280k82l209k247J034L436J686k556l104
3486b455k45K831K664r00l192j524J857K778Q32k648k503M25K859K074j464l014
3502a625j034K206K915L7k927k241J069K908J491j863l142l80K701K793j066k797
3518i55j906J503L471M99k334k899K30L057K276j540l242j081K402L045k9k956
3534d59k200P95L394J622k153l412k39K610K891q12l223j802J644L257Q32k146
$$ y = [576, 3067, 1802, -1679, -3076, -797, 2882, 2741, -56, -2861, -2134, 1193, 3509, 1549, -2104, -3048, -76, 3043, 2704, -820, -3083, -1831, 1402, 3405, 881, -2660, -3175, 416, 3221, 2113, -1280, -3289, -1562, 2248, 3241, 535, -2706, -2681, 668, 3216, 2005, -1686, -3270, -933, 2438, 2759, -42, -3081, -2270, 1175, 3122, 1316, -1917, -3039, -493, 2787, 2505, -704, -2951, -1917, 1519, 3205, 649, -2455, -2700, 131, 2795, 1895, -1297, -2821, -964, 1814, 2646, -2, -2505, -2080, 779, 2853, 1389, -1625, -2659, -453, 2462, 2499, -428, -2669, -1600, 1308, 2799, 936, -2206, -2586, 115, 2908, 1842, -955, -2861, -1358, 2113, 2612, 278, -2621, -2391, 666, 2942, 1402, -1840, -2921, -519, 2526, 2497, -459, -2659, -1864, 1530, 3152, 999, -2413, -2652, -42, 2849, 2037, -1186, -2988, -1344, 1913, 2745, 599]
3550E99l348J56K973K536j070l254j735K185L285P02l150k699O28L070J873j285
3566A466l402j185K811K812J37l065k677R59L193K079k150l107q38K928K627l75
3582B213l209j874J478K997J107k008l255L34K656K438j156l070j382J827L130
3597B226L70k504k747J062K589J824j862k822m17K015K548j38k775j921J230K900
3613A578R64j908l015K35K714J887n82l437j303J951L072J34k422k419O13K935
3629I97J805j739k816r60K345K557J95l054k151R98K906J631k023k968k20K750
3645B53K191m65l050j714J546L044J028k374l115L27K941K195r89l296j385K131
3661g32K996J45k598k199L48L002K014j687k958j065K361K920m19k815k042J228
$$ y = [599, -2749, -2593, 380, 2916, 1846, -1408, -3143, -958, 2327, 3029, -121, -2820, -2192, 878, 2751, 1466, -1936, -3121, -310, 2502, 2639, -426, -3103, -2144, 1049, 3128, 978, -2129, -2967, -39, 2588, 2213, -996, -2870, -1392, 1605, 2712, 704, -2551, -2217, 439, 2877, 1721, -1349, -2731, -904, 2226, 2596, 92, -2655, -1593, 996, 2820, 958, -1864, -2281, -266, 2282, 2144, -631, -2552, -1322, 1578, 2542, 634, -2381, -2146, 568, 2455, 1873, -1564, -2867, -916, 2156, 2290, -132, -2551, -1938, 997, 2802, 1063, -1753, -2713, -368, 2189, 2384, -670, -2821, -1823, 1083, 2714, 691, -2277, -2497, 253, 2444, 1979, -1071, -2785, -1239, 1805, 2833, 459, -2656, -2329, 612, 2807, 1818, -1478, -2863, -732, 2264, 2409, -189, -2388, -2040, 962, 2976, 1289, -1669, -2734, -373, 2547, 2128, -687, -2729, -1501]
3677a501K883J392k067k741l25K459K804o01l094j872J340L260J19j559k983K21
3693b265K877J950j376k390j658K081K447P77k286k092l1K969J782j747k629m43
3709b034J729K806j111j818k151J021L463j50r34k737M95J553K555q52l281p95
3725b241J401K506N71k426j695M98K861O84j175k752l50K489K073o38k540j687
3741b421J151K834J226k555k440J19K415K408j308k723j245J725L045J26k362
3756ek427M55K831J639j292k967o90K031K776j30k969j913J011L173J030j613
3772I40k849m79K307K285k00k908j568J118K953N63j451k856j25K473K135o50
3788A688k895j260J521K806M12j915k618O55K353J583j448k301q70K224K106k08
$$ y = [-1501, 1382, 2774, 707, -2034, -2359, 100, 2904, 2303, -791, -2663, -1323, 1937, 2056, 497, -2486, -2265, 612, 2562, 1186, -1204, -2862, -781, 1666, 2443, 157, -1935, -1966, 1003, 2785, 1038, -1591, -2034, -305, 2501, 1390, -428, -2579, -1558, 1905, 1755, 821, -1916, -1421, 132, 2687, 1835, -1446, -2241, -840, 1666, 2237, -189, -1884, -1386, 1475, 2159, 984, -1768, -2118, 371, 2444, 1806, -734, -2421, -1270, 1564, 2790, 235, -2205, -2086, 329, 2737, 1429, -1294, -2539, -814, 2231, 2357, -5, -2432, -1977, 854, 2493, 1201, -1766, -2456, -425, 2351, 2221, -748, -2661, -1650, 1523, 2553, 940, -1909, -2388, -81, 2204, 2004, -904, -2472, -1354, 1599, 2162, 711, -2145, -2270, 203, 2338, 1688, -1207, -2467, -946, 1860, 2272, 357, -2261, -1606, 747, 2330, 882, -1419, -2289, -65, 2041, 1833]
3804A833k251j777N91K894J213j585k605m64K334K042n05k778r83J153K525O08
3820B245k247k234M73K478J736j461k375p35K033K128J9k344k105J124K591J188
3836B514j829k133o61K223K081p15k260j494J185K464R88k122k472L21K304K090
3852B484j376k512j252K030K578J50k166k249O19K690J372j215k924n62K028K566
3868B261k59k552j696R14K549J198j788k595j63K160K222n04k711j399J460K499
3884A596Q03k137k131J42K357J730j210k219q22J650J971L98k362j736N83K160
3900G73J507j244k510p59K094K145n57j974j628R32K372P23j569k058j22K263
3916C88J456p35k209j191J481K399M24k119j856M19K386J032j184k308l02J788
$$ y = [1833, -418, -2195, -1604, 1290, 2503, 918, -1687, -2151, 183, 2225, 1720, -1058, -2041, -888, 1637, 2245, -2, -2236, -1763, 715, 2451, 990, -1385, -2120, -87, 2041, 2060, -284, -2389, -1265, 1326, 2514, 685, -1448, -2109, 114, 2195, 1480, -780, -2274, -1089, 1375, 2363, 241, -2231, -1910, 394, 2484, 1108, -1404, -2656, -626, 1952, 2102, -64, -2313, -1694, 996, 2368, 1153, -1771, -2333, -305, 2261, 2002, -550, -2246, -1332, 1217, 2415, 627, -1968, -2131, 29, 2251, 1747, -964, -2363, -903, 1596, 2399, 262, -1869, -1727, 630, 2360, 1150, -1069, -1891, -241, 1730, 2128, -234, -1970, -1387, 773, 2280, 1036, -1474, -2233, -139, 2006, 1449, -525, -2153, -1221, 1151, 1874, 305, -1753, -1875, 388, 1844, 1109, -1100, -2291, -810, 1589, 2013, -106, -1962, -1543, 843, 1875, 691, -1617, -1919, -131]
3932a31K191m65k248j438J193J990J062j660k112k62K142J807o90k414j428J725
3948g38K375M51k196j892K91K375J525j186k641n94J857K184J53k378j638P66
3964a286K242J471j731k171m18J871K106l50k448j380J010K331Q31j724k269Q1
3980a834K320J649q93k246j334J582K184L42j862j861M04J988J514j176k160m33
3996a816J427K021O2k238j224K28K642R71j512j997R2J351J673m74j853j222J300
4013e69J666N05j561j815M57J694J435j092j901o12J312K078R3j802j880Q90J952
4030H50R03j299j906j30J787J561m31k252j014J324J843N70j774j628J24K007
4046E35J236q74k041o73J612J907Kk233j387P95K073J010j297k100l81J884J610
$$ y = [-131, 2060, 1595, -653, -2091, -898, 1092, 2154, 494, -1618, -1880, 262, 2069, 1379, -1035, -2463, -738, 1637, 2088, -108, -2000, -1709, 666, 2191, 1005, -1636, -2230, -373, 1811, 1964, -414, -2052, -1286, 956, 2427, 696, -1475, -1893, -22, 2084, 1734, -714, -2094, -1084, 1247, 2078, 354, -1915, -1834, 486, 2135, 1242, -1004, -2338, -756, 1428, 1770, -92, -1953, -1549, 439, 1953, 777, -1383, -1816, -389, 1632, 1694, -544, -1768, -1540, 1102, 2073, 561, -1436, -1344, 7, 1680, 1206, -647, -1869, -569, 1097, 1602, 41, -1774, -1317, 377, 1812, 720, -1181, -1793, -481, 1597, 1690, -112, -1992, -1102, 850, 1753, 454, -1452, -1582, 205, 1766, 1335, -917, -1931, -607, 1236, 1806, 32, -1596, -1472, 535, 1771, 897, -1144, -1817, -205, 1702, 1704, -529, -1916, -1121, 952, 1962, 665, -1435, -1816, 68, 1678]
4063A678k92j982j545R06K403M11j181k112r8K046J614q38j792j162J256J925
4079A237O49j755j833L01J858J482j000k029r10J569J992n0j792j469N77K047
4095H74J128j519j569n19J724J668n71j733j315J180J649O16j220j883O2J603
4111A75J477p29j541j067J216J831J87j715j281L32J782J357j526j570n11J415
4127a68J794k24j921j220R67J662Q55j432j846J43J769J346o10k009o79J072J649
4144A148M13j816j408K74J870J094j098j573o11J446J783j55j835j244N15J814
4160F17R07r56j742l19J878J296k92k072j105R27K229M64j618j851K62J689J564
4177A878p88j908q32J165J604N90j589j581L33J882R64j032j782l34J194J639
$$ y = [1678, 1386, -596, -2141, -1235, 1168, 1579, 398, -1714, -1812, 234, 1848, 1010, -782, -1944, -688, 1237, 1886, 131, -1702, -1401, 457, 1939, 939, -1090, -2000, -431, 1561, 1511, -281, -1750, -1173, 874, 2002, 483, -1086, -1605, 119, 1787, 1216, -517, -1832, -652, 997, 1613, 393, -1490, -1428, 175, 1652, 923, -618, -1685, -469, 1362, 1549, -166, -1447, -1115, 667, 2024, 498, -1072, -1583, -168, 1626, 1402, -519, -1739, -772, 890, 1745, 313, -1533, -1390, 379, 1725, 1115, -894, -1573, -501, 1148, 1561, -255, -1663, -1389, 481, 1575, 477, -1096, -1707, -261, 1522, 1367, -468, -1712, -1197, 617, 1524, 568, -1174, -1493, 385, 1681, 1389, -683, -1788, -861, 1368, 1832, 214, -1637, -1375, 314, 1878, 1090, -818, -1650, -485, 1119, 1709, 120, -1461, -1128, 754, 1718, 686, -1096, -1430, -236, 1403]
4193A403j0j730j415P81J979O11j305j711L00J367J161n28j518j046J041J579
4209I59O27j719j285J42J567J056n03j697p23J503J219J63j650j160P02J661O72
4226A534j067j581j64J376J164j58j832o86Q16J360N44j259j539K90J464J081
4242A343q51j279o40J162J556m0j465j264N15J643Q48r09j822M6J214J671l68
4259A360j891q60P08J961J25j066j592J28J453J408r40j677q04J200J828K40j767
4276a86j352N46J497J048p27j900m43J196J484M12j884j212O15J778P84j269j547
4293a160m18J475J490n31j207j071P69J469L79q94j355q2J256J197m38j621n70
4310a312P49J582K1j324j115N53J304O50n37j412k92J153J488m72j371j114N40
$$ y = [1403, 1393, -337, -1752, -971, 1008, 1619, 314, -1397, -1097, 270, 1431, 903, -615, -1661, -620, 959, 1586, -133, -1418, -1276, 291, 1347, 844, -853, -1576, -73, 1146, 1309, -341, -1501, -799, 862, 1534, 467, -1114, -1278, 98, 1262, 1104, -728, -1414, -598, 762, 1306, 47, -1492, -1202, 262, 1343, 492, -787, -1427, -265, 1291, 1251, -214, -1478, -963, 680, 1528, 619, -1203, -1157, 57, 1728, 1360, -531, -1391, -683, 1278, 1403, 337, -1255, -1127, 326, 1734, 794, -883, -1687, -487, 1341, 1581, -186, -1538, -992, 505, 1553, 826, -1074, -1517, -321, 1163, 1575, -309, -1521, -906, 872, 1656, 387, -1160, -1578, -103, 1387, 856, -351, -1422, -653, 816, 1195, 301, -1054, -1136, 120, 1317, 879, -742, -1312, -563, 1019, 1040, -284, -1399, -846, 458, 1108, 571, -841, -1133, 20, 1508, 1036, -335, -1449, -909]
4327i09J683L37p05j539R3J399R45m00j562o93R43J620q3j090j210K91J376N88
4345A084n25j473l28J124J378k67j440q90O11J458O54j299j126j20J195J119k61
4362H94j506p24P09J793J05j361j162K88J313Q43p58j075q09J193J278M6j204
4379a37j244O25J519O55j036j372k52J336J227l28j404q14O60J372O04j186j287
4396a062j11J544Q46o33j394o26R98J352J64j244r68M31J009Q10n08j661j8J011
4414f0J135Jj525m92M59J380L05r72j080j96J222R60m65j147o48O02J371M3j109
4433b16q35K11J120J137q95j516k07J148J147r9j003j203M40J287O55p30j457
4450a016j27J265J045m02j161q42N90J447M03j270j052J31J602O99o06j224p57
$$ y = [-909, 774, 1111, 406, -1133, -1040, 359, 1304, 904, -658, -1351, -408, 1212, 1129, 39, -1171, -880, 496, 1084, 559, -914, -1242, -118, 1260, 993, -447, -1337, -726, 732, 1386, 87, -1039, -1159, 36, 1155, 894, -612, -1336, -627, 1166, 1271, -90, -1252, -964, 349, 1192, 434, -641, -1450, -257, 1021, 1067, -137, -1381, -756, 763, 1418, 382, -990, -1242, 94, 1321, 993, -411, -1225, -565, 807, 1411, 225, -1062, -1173, 371, 1217, 584, -810, -1436, -438, 914, 1078, -166, -1134, -703, 306, 1116, 608, -1053, -1071, -60, 1075, 1076, -449, -941, -482, 898, 1203, 231, -849, -1045, 177, 1137, 672, -475, -1123, -521, 850, 893, -216, -1051, -840, 280, 1417, 522, -994, -1201, -53, 1094, 995, -8, -1211, -771, 516, 1171, 441, -1016, -1143, 122, 1167, 765, -396, -1238, -648, 799, 1202, -68, -1120, -989, 613, 1312, 706, -518, -1275]
4467a275R75J359J52j477q89N24J038N78m61j555K3Q60J291l24j159j073P05J384
4485F76P43j077j307k7J318P63k23j298r38R13J335L45j204j033K50J205P10n64
4503E87j288m05R41J247K6j095j043L06J481J59l36j689R5J043R77k29j323m90
4521a036N57J073J25p47r82K30R12Q62n94j019m63J026P91J66j003p89L63J142
4539F14N87o12j542j21J174P98l34j004n46N05J124L65r78q97j0J278O07m25j158
4558e75m69P29J252N8j156r07J53J543M16p59j017l53J341R19k77r62j317J097
4576b84R51M50q62j321J79J200P86m69j415k47N34J006N34j033r71J33J150O85
4594A006n41j094k88R23J085jj175r84N34P80Q82o13j109m04J130P96m00p82n28
$$ y = [-1275, -300, 1059, 1211, -266, -1155, -631, 407, 985, 524, -1031, -1008, -148, 1143, 819, -340, -1413, -708, 676, 1419, 342, -965, -992, 326, 1089, 866, -432, -1370, -457, 878, 1223, 19, -1014, -764, 441, 1151, 587, -701, -1106, -165, 1082, 1108, 13, -1030, -724, 757, 916, 580, -1109, -1014, 29, 1006, 777, -546, -1036, -479, 594, 719, -28, -1010, -780, 132, 994, 400, -619, -1082, -56, 735, 901, -102, -891, -528, 614, 1201, 589, -953, -1074, 100, 898, 564, -440, -986, -481, 643, 1008, 30, -867, -877, 401, 1008, 583, -575, -1044, -315, 937, 995, -161, -1068, -915, 628, 1044, 285, -732, -1085, 256, 1175, 898, -64, -1381, -284, 667, 1117, 255, -1066, -887, 313, 1099, 630, -785, -1032, -498, 508, 1042, 9, -962, -829, 321, 1006, 465, -629, -917, 6, 1091, 1090, -85, -1069, -535, 245, 1127, 514, -595, -999, 131, 927, 527, -255, -783]
4613g83M19J044M83j225q77R6J178N76o07r51j5K64J069P9q61j065O64Q76O52
4632A016q01r08k64Q77J096l61j097n46O35J029M8n83j018Q2J359M40m56j204
4650f56j98O46J013M6j031r21O23R43O65p22r55l22Q09R64j86j150n60M01J389
4669G98l4p19r10JJ027P64n76p80l78M35J020K35q60r40K99J131N42o36j110l91
4689a082J100J037j57j066q75N69J286J87p48j112J56P03R38l36j103o64O65J193
4707F91L11j037q87K55R05N65m29r03o67J112Q50j05q75q63L84J097M64n43j097
4726g72M9Q28P96l50j105j97L70R82J74o49p78j57J044O24p58m25l84O79O06K91
4746H68j134n96L16R62M60o52p61m14J030R33m19r48o44M40J340J9q45o38k53
$$ y = [-783, -364, 680, 1163, -62, -939, -843, 335, 911, 304, -647, -662, -398, 671, 750, -111, -1176, -512, 364, 1016, 215, -693, -957, -80, 1016, 655, -442, -988, -353, 676, 724, 141, -877, -795, 564, 1004, 548, -656, -854, -208, 805, 851, -180, -1101, -478, 465, 1130, 408, -547, -869, -60, 904, 718, -432, -992, -591, 798, 764, 45, -865, -864, 163, 927, 351, -429, -807, -372, 648, 883, 23, -917, -618, 513, 1055, 419, -691, -1082, 18, 1055, 898, -168, -1043, -474, 812, 999, 251, -861, -705, -2, 936, 600, -503, -1167, -502, 691, 1002, -35, -922, -667, 238, 803, 374, -529, -1196, -84, 766, 661, -214, -1077, -693, 404, 868, 325, -772, -723, 105, 901, 551, -554, -751, -381, 601, 775, 126, -652, -809, 235, 859, 101, -324, -708, -29, 577, 868, -266, -862, -546, 416, 876, 224, -537, -951, 79, 1012, 593, -355, -999, -559, 781, 800, -45, -683, -936]
4765i36J142Q36l84j258m08O43J257n7o98r15j6J241O35o65j282J19Q41P73K62
4784A130j552m45M63J093K16q58q34j3J074P43o15j011n78P00J188J23j004n70
4802g50J53Q80O55n12r88l28P39P91J37j128o21L45R00O08n09j015j53Q56N38
4821E98N9j060n62N12J113J66p50p41J51N40P23l96r19l01O43P79J04o66r23N81
4841c49Q86M50q19p72l36J091P85j90j283l04M53J010m1n39q94J80Q94R06q53
4860B75r23p4N25Q95J45r24r03N68J027L87r06r64j08P90J120r4j222l68M17R77
4880F40j32m43p26qQ54O90k58r27m45L77J174Q2p17j251N24Q59O77m63r77n27
4900i97R65J192m67r23p90Q00M51Q18r32q10k34R00R19l55q94l79L90R94N3n78
$$ y = [-936, 206, 1042, 658, -600, -1008, -365, 892, 835, 137, -778, -794, 447, 1082, 417, -865, -746, 95, 868, 1130, -422, -867, -404, 689, 905, 47, -787, -800, 274, 1017, 402, -609, -1187, -487, 701, 824, -180, -750, -597, 283, 938, 426, -562, -890, -151, 640, 777, -351, -972, -627, 273, 881, 372, -643, -796, 60, 598, 657, -403, -965, -453, 660, 826, 76, -665, -514, 26, 749, 353, -566, -867, -224, 555, 659, -7, -930, -349, 537, 987, 168, -604, -940, 151, 936, 746, -537, -841, -388, 622, 581, 42, -852, -672, 222, 1128, 275, -648, -722, -197, 698, 843, -81, -984, -416, 611, 998, 92, -872, -980, -190, 930, 836, -386, -754, -337, 640, 508, 65, -661, -669, 185, 875, 617, -310, -755, -378, 796, 878, 161, -1090, -566, 293, 970, 507, -470, -997, -32, 1160, 693, -230, -1020, -220, 231, 1049, 117, -693, -927, -27, 892, 537, -357, -736, -346, 648, 701, 123]
4920A23q48j02J177N10j33j517k13Q92L43L12m71q24L82P90K77k1j431N5L79J149
4940H29m10p0j438M58J180M15j013r76L96O11Q87p97r04o7K4J453K62p70k10m72
4960f12J274k42p5j177R5N75J314n74q27p11N22P42N78o90q52j99Q57R44m37r66
4980d61n88Q54R96J31p69j184J64J250N62p21p75m35Q20J112%r98r70M74P40O88
5000H90o46r81l03J133R57l99r98n83N60J021K62n65j131RJ000N62l37q88m58
5019h95O37R51P8r60o76M16P25O46n18q79k76P23Q83k83q11n36K98Q90M54p04
5039A63p34r8Q49P12j34j330o46R57R39K44r87p94L16J016M93n81j247k04J178
5058A12P22j24r94m89M61Q40J85n11j083P2J001O08k66p12o69N54Q70L80p83j156
$$ y = [123, -725, -827, 350, 860, 727, -790, -1003, -111, 232, 544, 73, -751, -369, 421, 698, 677, -754, -699, -320, 829, 419, 349, -1089, -631, 549, 964, -49, -1025, -629, -18, 869, 72, -832, -899, -875, 578, 840, 70, -140, -612, 662, 420, 345, -832, -737, -162, 1152, 578, -249, -960, -438, 304, 882, 192, -660, -859, -2, 942, 505, -461, -1049, -195, 801, 932, 163, -1021, -857, 393, 955, 234, -541, -976, -156, 956, 956, -42, -1012, -538, 202, 890, 244, -737, -1040, 93, 1050, 651, -347, -930, -370, 651, 913, 348, -783, -774, 226, 788, 451, -437, -895, -258, 693, 771, -189, -865, -449, 276, 922, 404, -475, -751, -28, 855, 572, -239, -775, -477, 413, 867, 163, -571, -669, 180, 892, 758, -572, -1218, -261, 678, 922, -65, -859, -543, 473, 966, 385, -862, -1066, 112, 834, 710, -284, -773, -312, 528, 713, 202, -881, -809, 192, 800, 534, -178, -847, -293, 577, 957, 174, -982]
5078i82L47R85O76o13r89m15J010R78l09r34o94L09J049O27o45j217K4Q69Q15
5097H91l21r43o01M35J287R5q59j006J38J040R95p38r71k92O53R60K8p66o70k14
5117h59J253K68k93q94l63P38R92j55o37j086M36J057M37o72q24j91J042N52k97
5136E04o20r48R27O56L56p47j088J91R68O24m28j139l9P36Q39Op92j030O00R17
5156D93N50p78j062L5O93R44k05j230l44N59R98M71j099q05K60O54P93n53j059
5175f85k09R49R06m2j137p73L26J271M01n68j289j15R55J028l98o09j227P89R30
5194E03M58p96j161j07J308Q53r31n16p47R21R90K30j215r78L50J103O60m09j324
5213h08l09R18R60R7j204n49K56J345M41r36r03k74Q91J132m02r55q44P00J271
$$ y = [-982, -635, 350, 1026, 413, -576, -991, 19, 997, 688, -246, -940, -631, 418, 1045, 400, -817, -793, 76, 891, 570, -373, -974, -539, 748, 843, -16, -1022, -884, 156, 1151, 413, -558, -850, -197, 763, 791, 25, -645, -859, 394, 662, 369, -525, -888, -150, 842, 687, 50, -1036, -600, 457, 894, 222, -602, -793, 249, 801, 504, -116, -1064, -137, 519, 875, 128, -960, -769, 199, 823, 395, -744, -783, -47, 792, 798, 6, -1024, -424, 493, 1043, 265, -797, -762, -69, 875, 670, -560, -904, -345, 653, 1124, 25, -780, -520, 134, 927, 374, -685, -894, 55, 961, 919, -218, -991, -665, 606, 1007, 439, -850, -965, -10, 1018, 620, 11, -1216, -427, 503, 961, 165, -996, -1103, 205, 1058, 127, -389, -1136, -215, 775, 1005, -210, -1188, -838, 265, 925, 516, -808, -1117, -199, 761, 858, -346, -895, -639, 706, 1147, 211, -692, -966, -75, 1057, 655, -300, -1144, -444, 827]
5232H27r4n14j043k2R65O63k06j183m27Q85O19K53r50p12M91Q79N11n78j142j58
5252i36J138N94L1j349k96L90R18L33p83q98P7J137P02l84j231j47M03R84J28
5271H11q98o68J48J137M15p26q18l31R18R34L4j167p19N40J016L20j006q77K35
5290g02O17J161l44j129o64O48J391o5p13j129K20J038N66k86j143n65J091O75
5308F67J42j035q05K64J252O65r78q84k32P17Q21J57j154n13L10J180L32n77r43
5327f14j71R24P19m48p63n63M56J352J0r27r48L27R22O74l67j337k11J001P46
5346G82Lr20p88M85J041L01q10p54l67J191P18k99j170l12O78R45J54o42j137
5365i01PJ374N09n02j186n62R95J225k17j218k61NJ119O16r11j017N2Q47J044
$$ y = [827, 733, 219, -824, -846, 119, 782, 576, -607, -1034, -149, 470, 723, -227, -939, -448, 431, 942, 364, -778, -936, 202, 796, 827, -522, -818, -428, 490, 823, 40, -858, -781, 356, 1058, 674, -557, -704, -301, 683, 811, -87, -755, -607, 530, 945, 219, -599, -930, -12, 922, 956, -211, -930, -390, 626, 946, -60, -937, -702, -85, 1076, 732, -397, -1061, -413, 978, 913, 200, -929, -709, 329, 895, 609, -534, -1099, -8, 667, 809, -226, -1031, -767, 485, 1150, 172, -712, -944, -227, 594, 751, -403, -916, -606, 574, 906, 329, -614, -785, 139, 858, 410, -353, -916, -460, 892, 902, -25, -973, -646, 276, 950, 583, -754, -965, 36, 782, 785, -135, -923, -438, 603, 904, 94, -660, -1027, 164, 882, 583, -587, -899, -221, 724, 878, 236, -901, -894, 480, 989, 487, -699, -1261, -266, 959, 742, -476, -737, -732, 387, 1003, 92, -925, -873, -26, 1018]
5384A018k48j113o23P24J029J62j081r26M59Q89N59k25r86p56O50J216N1j054
5402b55q49K21J068Q47o70j166k37Q10R84mj092r71P33J131M90m35j427j89R87
5421b4J009n27p74n17L90J187J71p17r86n8J066R29p46j075k99N16J199R4r62
5440a24q04K02J434L27n82j151p6Q00R38j62j086n17K87J195J96q85q17QJ299
5459D82M85n20j139j82O28J099l9j047r61N71R39O65p81j050RO78J099K9j212
5478b47q49N29J201L35p68j160m6J305M87l34r77o83R93J253N7q19j306M01J059
5497D31Q36n66j266n32J146Q25j04o57j240M06J218N54o73j400j08J267Q51k33
5515G55j046q18O77J060L09q93j010j33J538O92o73r35n53O79J015J69q52j009
$$ y = [1018, 770, -343, -966, -242, 787, 949, -132, -1058, -599, 290, 849, 624, -362, -1118, -468, 748, 799, -255, -1104, -883, 185, 1032, 362, -804, -1041, -231, 753, 749, -343, -1314, -581, 550, 1040, 605, -822, -1011, -24, 985, 458, -316, -833, -443, 744, 915, 198, -788, -846, 220, 1149, 403, -672, -971, -455, 744, 838, -124, -928, -726, 708, 1035, 453, -698, -774, 26, 964, 802, -284, -801, -514, 681, 877, -8, -825, -817, 482, 967, 447, -692, -874, -246, 853, 814, -233, -1194, -623, 316, 981, 200, -850, -841, -163, 936, 965, -247, -1096, -567, 634, 969, 201, -959, -1005, 300, 787, 453, -524, -1207, -214, 1039, 1096, 277, -1029, -628, 431, 1267, 701, -565, -1097, 49, 874, 770, 113, -1127, -721, 497, 1051, 378, -1022, -1130, 137, 988, 755, -291, -1109, -432, 628, 937, 44, -966, -1099, 439, 1131, 458, -477, -1030, -351, 664, 833, -19, -1028]
5533a028L14J072P69q18r60k27Q67Q85J61j288q02M17R50Q29j005r06k4J068N53
5552H27k94j241k36N57J264L77j260j023L29R17N54n89q21m17Q67J164k89j065
5570c79n42N00R38L55p28j024l9J076Q84m24j044p27Q18Q44N55j208r24K57J189
5589C77Q06q35q72m32P74J236j16j188o15o1J485L99o24j286r9R37R68j21j118
5608c85q18N30J396L9k84j110n50J134J169l83j171n40O60J011K39r30j033J81
5626h45R08R80n77j250k95R28J083o0r99o72J48J003O04q12q09l59J009Q63n1
5645G97j234m67L65J062N49q30j079O6R68N93k18r86n65L28J429J61j117q01K84
5664f95R88O98n49j038j15R10P22j75j074o20L75J284L33j074r64J01J036R46
$$ y = [-1028, -714, 358, 1127, 309, -651, -878, -11, 874, 1035, -253, -1055, -638, 312, 1141, 136, -770, -794, 274, 827, 533, -708, -944, -387, 877, 1254, -6, -1029, -700, 217, 771, 182, -639, -1056, -189, 975, 686, -379, -921, -421, 517, 872, 144, -880, -919, 157, 1041, 617, -427, -1154, -336, 508, 1063, -145, -1069, -812, 377, 1183, 348, -524, -956, -182, 1054, 938, -250, -865, -926, 559, 958, 334, -952, -1051, -114, 854, 733, -385, -1203, -673, 723, 762, 478, -632, -1182, -48, 1121, 738, -433, -973, -313, 698, 937, 7, -1026, -845, 63, 1043, 466, -784, -1079, -151, 932, 872, -127, -799, -651, 352, 956, 144, -665, -1024, -15, 848, 797, -437, -904, -539, 523, 1072, 242, -837, -771, 197, 790, 572, -414, -979, -651, 778, 939, -178, -979, -695, 293, 991, 442, -596, -711, 199, 921, 746, -328, -948, -573, 711, 1044, -30, -994, -893, 143, 1089]
5682A089o34q75p32Q60J180K36j173j095N74R03P46o12j405k54J113R96q4q78
5700d5j152N07J179M87q28r85j39J034P46J73j445m73P52R94K76r54r61k58J387
5719B95R01n40j173m55N50J349Q1j032q19J66J143N45o87r24m55Q20J153L1j176
5738b27n83N62O92P29r77j029j31J152Q32l88j051n60P96P72M62q99r61Q5Q97
5757A73P38p36p32l24Q25Q95O4j137p46K39J090M65m47q93n81J105R79l58r37
5776c18o56P21J139Q1q26r83J47R80O72m59j041o46J108J177p1j271p48J45J512
5795F63L27p54j140R7O38J072j18j138n45J24J318O74j163r18k9Q89R09j06j071
5814b71r83J015J055K28j032p69N5Q19R96n38j139n81Q81J249j64q74p50J30J041
$$ y = [1089, 455, -420, -1152, -292, 888, 1124, -49, -1144, -570, 333, 1079, 467, -938, -1192, -79, 917, 833, -45, -1197, -690, 489, 976, 148, -837, -976, 58, 804, 977, -468, -941, -189, 805, 1081, 127, -834, -1092, 295, 1196, 656, -517, -972, -422, 927, 1008, -24, -843, -677, 466, 1011, 324, -600, -1055, -235, 918, 949, -227, -810, -248, 444, 1173, 196, -833, -964, 188, 1020, 632, -419, -979, -183, 589, 1051, 152, -809, -724, 173, 911, 175, -557, -881, -56, 839, 903, -234, -980, -741, 349, 814, 367, -526, -1107, -2, 977, 619, -318, -974, -253, 886, 967, 141, -842, -695, 285, 957, 498, -543, -1189, -81, 1096, 1025, -246, -994, -849, 663, 990, 236, -904, -807, -169, 903, 785, -353, -898, -774, 544, 1218, 55, -863, -892, -3, 906, 800, -271, -1254, -239, 816, 1044, 12, -757, -702, 117, 1113, 575, -564, -1145, -264, 985, 821, -53, -803, -673, 368]
5833C68Q58q86j047m97R65J169L7j435p23N71J200M08q60r39j38J171O76k62j429
5852g93l45R50R20J55r73p77J62R29N68m29q96n10P72J291l26r92n04K68J164
5871F34K80r00j084L69P67R82j34j464o16Q63J004L81j190o33L24N84Q08m05r94
5890d24n92Q00P84L21j035q35L91Q38P43q38r16K1P52Q29J44j358o01P16Q82O00
5910A222r43r74l49J412N78k16j503k42N72J300J12q31j107Q4J067O86l64j477
5928i73p5P81J115J35r78j352P34R29Q12q43j289q7J016J173o07j211j87M53J090
5947F36L44p63r75l13J373Q50o58j049n53O69J273j48n30r82M92R15M78r92o71
5966f04k16R15Q68j37j326p32P07J137L68n08j274p0Q80R78l75j164m20P01R45
$$ y = [368, 1226, 340, -707, -1204, -239, 930, 967, -468, -1191, -620, 580, 988, 128, -811, -949, 222, 898, 636, -793, -1138, -188, 732, 887, -86, -863, -701, 228, 796, 367, -529, -1039, -267, 1024, 698, -294, -798, -530, 634, 914, 14, -1070, -701, 66, 1048, 914, -550, -1166, -303, 701, 1082, -108, -741, -417, 167, 975, 570, -424, -1016, -216, 568, 889, -146, -981, -590, 248, 991, 153, -763, -742, 10, 839, 983, -375, -976, -260, 622, 1222, 279, -695, -1044, 368, 946, 730, -773, -1015, -443, 857, 969, 138, -969, -885, 182, 868, 504, -973, -1048, -267, 848, 983, 5, -1347, -613, 316, 1128, 285, -1004, -1091, -75, 1098, 491, -720, -907, -454, 636, 980, 217, -758, -1071, 302, 1152, 494, -555, -1108, -439, 834, 686, 156, -826, -334, 581, 1059, 67, -604, -820, 95, 963, 826, -500, -1232, -525, 612, 980, 472, -802, -872, 8, 986, 611, -553, -973, -272, 673]
5985F73O8q55p33O7J109O08o27j027j51Q53O84K03j110r42J009Q22L34p25j267
6004a007p5J229Q25j19j404l02K37J393J86r47r39M09O07R52m73j481K67O43Q93
6023H94L70j599j064N27J248N95n23q81o77J011R01j68o42q83M22Q44P06r19r52
6042g90j90J111Q02l78q99n71O76N65N47q14p48j6J289J60j32j231l28P87J025
6061H65K12j436m95L13R42L64n23p49o3J035k54J34o24n74M75J067m0r67l66k89
6081i73J129Q55j113o67J63M34J610m35j512l46P72N24N52j020n60j37J027O89
6099I92k60j135o44Q60P95L04q31r26O4J196N32k99j061l42M68J079N9p69r65
6118h83j16J583M15m88r40l69J008Q72l5j236q94M70J357L27o89j068j51Q27R03
$$ y = [673, 741, -114, -847, -780, 329, 937, 310, -717, -868, -15, 669, 872, -238, -1180, -171, 651, 985, 260, -1007, -1082, 147, 972, 853, -551, -853, -616, 777, 963, 16, -923, -514, 93, 1045, 572, -909, -642, 1, 894, 1264, -335, -1399, -872, 376, 971, 448, -433, -1110, -99, 802, 634, -8, -891, -469, 375, 1081, 162, -790, -980, 131, 933, 555, -344, -915, -239, 326, 873, 59, -689, -705, 584, 744, 612, -619, -947, -160, 865, 1077, -359, -854, -541, 401, 765, 242, -507, -570, 465, 211, 345, -279, -853, -378, 689, 649, -318, -684, -973, 156, 1011, -102, -769, -606, -172, 1438, 1003, -509, -855, -83, 441, 993, -27, -587, -724, 303, 992, 732, -403, -1047, -187, 608, 912, 81, -845, -781, 415, 947, 648, -413, -755, -287, 792, 851, 82, -883, -999, 584, 999, 511, -429, -798, 210, 1082, 1047, -189, -1083, -613, 744, 1071, 382, -686, -837, -10, 893]
6137H93k37j097o39N90Q84N27p72r10j30J038J088r38n45o20M52J225K9p94q11
6156g67Q0J065O85p20j100l32J096R47k27p94q01M40P71M83p12q77n8J208N34
6175I21l77j115l19Q02P10k9n95p90K16Q52R64o87r73n11Q95Q27m8o18r02L17
6195d60Q74M35o20r89r9J002P17k40r84m76M69J177J21r13q63J87R31O79n29q62
6215d43o65O73J046J62r35q11L51J010O82o88j085k08Q09R56j15q00q77M46R48
6234D56O16r70p01l59R02R28l75o62r00N19J309K53r38j154M60Q69P54n12j080
6253e85l44Q43Q17J75j069m29J46J119M29j015r82o8J033R55m01q78n56L15J097
6272F02J99o44q08j35J080N52k98j012k93M70J009N3r22p69L31R66N31l82j196
$$ y = [893, 656, -441, -1080, -490, 394, 921, 149, -761, -891, 147, 1235, 297, -248, -868, -416, 809, 838, 44, -767, -687, 378, 1063, 343, -757, -1089, 7, 954, 727, -67, -868, -428, 343, 826, 114, -763, -821, 387, 921, 544, -571, -890, -88, 622, 593, -2, -792, -576, 276, 1240, 553, -420, -931, -36, 791, 743, 125, -777, -460, 414, 849, 229, -760, -859, 143, 860, 620, -364, -840, -371, 806, 927, 14, -849, -662, 269, 948, 419, -443, -1108, -435, 611, 773, -162, -973, -622, 388, 1070, 382, -703, -911, -102, 854, 739, -61, -938, -492, 456, 1072, 102, -599, -958, -56, 872, 497, -165, -1065, -546, 763, 1016, 78, -1076, -616, 253, 1007, 495, -585, -929, -86, 731, 906, -163, -592, -446, 673, 1102, 87, -895, -963, 70, 1025, 624, -254, -810, -495, 602, 801, 157, -651, -786, 294, 846, 548, -464, -757, -287, 722, 775, -147, -916, -585, 381, 912, 530, -666]
6291f66l8O39R55j44j142n49O29O44O52p64q25j81Q84J073n62j162l75Q24O86
6310E78J49q39p71J07J161M64l63r77m36Q72R62j83p52j056M55R63N72n83r06
6329e83j10O50Q07j60q49p83N07R81M64p29p46J3O89P96l61j117m38Q46Q90J72
6349I39r69p81K15Q71O35n12j041l19J003N69K48j290n81P06Q50L30o45j118m1
6368i31Q49P52k87q70n57P64P50L01p83q52R9R89P08n52r42l94Q16R24j97r10
6388c23n92N75Q98K39n32q38j98Q33Q89n76o24n08M43J017J84p80p70J97N28O60
6408G22k71r23l49N50R77K69j099q55O78P83N99q83p04l81R03P04qq04p34K94
6428e32J171N07r71r85K66P83O25l24r72m94O46R36K2r04o47K12R17O12l76r34
$$ y = [-666, -704, -65, 890, 746, -396, -945, -316, 328, 980, 216, -609, -790, 94, 1167, 605, -557, -932, -108, 578, 727, -112, -883, -776, 385, 849, 486, -491, -927, -55, 907, 724, -28, -1084, -629, 334, 906, 323, -583, -693, -43, 764, 604, -245, -1028, -521, 460, 924, 195, -551, -538, 151, 947, 586, -531, -969, -123, 767, 939, -30, -811, -596, 275, 910, 398, -643, -962, 41, 610, 858, -432, -1013, -307, 543, 873, 228, -890, -931, -82, 670, 383, -487, -1044, -280, 470, 771, -12, -864, -765, 224, 932, 380, -562, -956, -140, 784, 587, -323, -915, -340, 558, 797, 265, -573, -771, 62, 951, 375, -249, -757, -314, 703, 887, 107, -663, -466, 62, 722, 451, -472, -821, -271, 706, 975, -124, -979, -301, 482, 1081, 198, -506, -887, 16, 720, 712, -92, -826, -532, 639, 1146, 175, -810, -544, 239, 864, 540, -432, -926, -280, 656, 678, -226, -873, -661, 256, 868, 492, -442]
6448d42m91P62Q53K3q39o55M18O35N01m82r25l32R85P41k98o54m54K93J072K33
6468I44j062o64L80M59P04l76r53j76N98R31j26n52o97oO38J012r32n80o6N52
6488B8O10j47q77l33K46R24K87m88p53j72P64P81n08o99o08P90O99K16r28o81
6508h49L19Q61M97o53p90%O44O54m7p65o10K27Q40P33r79r83J03Q16P39j44p04
6529i1p67O01Q75L17q03q91n0J057O98k86r35n86P70O63J99r09o06J25Q46L85
6549F12k33j044l94J019Q45q5j051m32K47J004L42n66q38k32J137K97r4q96n29
6568h91L83J003M6o98l93j72J101M12o02p95j46O19Q71j92p24o14L53P08L13l89
6588A93j128L01Q01M03j67p81k91M37O85J42n68p73L26O37N89m69q72L9K45J042
$$ y = [-442, -933, -171, 682, 705, -134, -789, -371, 264, 765, 283, -642, -974, 11, 752, 454, -200, -654, -361, 711, 944, -118, -782, -402, 57, 761, 385, -568, -744, -146, 785, 659, 107, -590, -596, 42, 1054, 122, -458, -524, 28, 638, 491, -386, -719, -473, 451, 738, 250, -503, -675, 89, 870, 362, -337, -945, -155, 544, 760, -168, -849, -530, 331, 828, 175, -615, -615, 29, 683, 636, -129, -739, -512, 328, 1061, 82, -901, -798, 18, 757, 613, -91, -858, -257, 618, 935, 132, -759, -809, 248, 946, 660, -275, -861, -91, 572, 771, -138, -744, -619, 227, 612, 379, -665, -1059, -40, 805, 720, -331, -763, -516, 488, 830, 264, -574, -806, 331, 628, 534, -362, -891, -508, 495, 541, -157, -550, -722, 379, 791, 189, -606, -752, -133, 738, 546, -178, -792, -439, 269, 582, 193, -935, -634, 167, 570, 403, -378, -669, -232, 453, 595, 27, -746, -420, 217, 806, 337, -535, -496, -251, 791]
6608G91k33q01o58N33O86N62o87j081K56P92P18l77p40n24M80Q66L3m89o60l35
6628h68J002O34m14q05k58M91R23Q7o84q36K62Q88K99o19l74l14N94Q55r6r24
6648a57o17M83P72J84m64q44j8O51L12L49j001n79M86J040No40m89N9M85O18j74
6669D61r77k67O55P43J60r84m15K00N88L84l19o85M8M16P55n78k70o42N49P01
6689E23K52n97q78K51Q95L61m79r36j0L24R19kp45m35K40O88K67n89m84m14R53
6710A04M94o7q10l87J81J140Q6p32o90q6Q72N46j91p20o44O51J019j75m02j000
6730h11L21O95K78k11n68l50M02O66K75o99o90J45R19N30o64q80k26P27Q97j54
6750F02q60l61O9J106K41o12r10K25O87O46J47j240l94K93Q51K63o45r73O53L56
$$ y = [791, 558, -243, -901, -368, 318, 880, 193, -888, -632, 160, 878, 501, -239, -763, -283, 583, 616, 127, -533, -868, 134, 768, 354, -451, -709, -218, 705, 792, 108, -728, -466, 422, 721, 102, -272, -586, 8, 863, 767, -157, -774, -291, 481, 665, 201, -643, -661, -10, 302, 651, -350, -929, -443, 597, 602, -38, -527, -468, 17, 635, 461, -516, -783, -128, 615, 775, -209, -624, -424, 164, 548, 229, -456, -408, 8, 763, 185, -85, -727, -178, 523, 775, 178, -700, -449, 446, 807, 328, -608, -618, -294, 625, 623, -122, -557, -317, 371, 638, 49, -435, -849, 104, 598, 531, -279, -666, -485, 655, 741, 9, -681, -767, 105, 651, 460, -260, -904, -253, 766, 591, 189, -811, -490, 205, 483, 272, -296, -646, -244, 422, 697, -2, -692, -547, 372, 902, 238, -642, -868, -141, 756, 602, -258, -619, -550, 556, 797, 185, -725, -500, 187, 833, 980, -260, -654, -361, 490, 753, 108, -865, -212, 144]
6770A44L39l07n10l83O71P38k11n09p82M16N63N13m75q92J81N76R39n65p92m0
6790c86J72O04J15n97o98L27Q03L58m21p32m47O60J060n9q97n88L51P01L74o44
6810E6p83J78M84J114o99p03k67L81P24L7l10j057K59P99N46m84r11k52P43N56
6830D11K09p76n30p3J038N91o79p68O8N86N09J15q52o16N60N93M66n74p30l11
6850g63J020L92j55q46l27M64N96L34p04p38L76N67K50q3r67J64K74O21K34r38
6870b29l17n4J064L84o82p31j27P01O06j09n68n22M16N22K84o21o49J97P30L21
6890F16l77n98k92O14O79j63m67q34O33J96O78m31r02J58M31P64m26m87n67N90
6910a85N53K25n88m71k31O30N32j85n09o40Q34M81K19p90m96J10R38J14k92q14
$$ y = [144, 483, 176, -334, -717, -46, 692, 481, -28, -810, -394, 169, 682, 207, -685, -504, 72, 1011, 446, -346, -386, -214, 390, 505, -92, -790, -463, 340, 698, 277, -455, -902, -242, 818, 759, -138, -726, -375, 326, 700, 56, -727, -549, -65, 1049, 350, -353, -620, -239, 485, 522, 212, -845, -586, 213, 759, 275, -636, -888, -145, 411, 620, -156, -686, -759, 279, 870, 191, -577, -509, 77, 586, 701, -151, -767, -207, 386, 852, 278, -452, -763, 257, 649, 494, -352, -679, -215, 381, 715, 11, -727, -351, 216, 466, 383, -584, -420, -146, 475, 709, -229, -546, -600, 464, 848, 166, -565, -692, 9, 615, 506, -62, -584, -168, 354, 638, 17, -632, -435, 295, 616, 239, -359, -651, -37, 642, 479, 12, -822, -189, 7, 685, 254, -648, -490, -59, 705, 279, -208, -775, -185, 368, 593, 5, -466, -697, -67, 465, 280, -229, -869, -35, 446, 665, -125, -621, -511, 427, 541, 249, -565]
6930e65p2N12P62k47n14m92J56Q37K13n06r68L25Q16N40l21q04k35K82P81L95
6950H95q69p67N66L36N32j80r57k24M23Q37p3n86m06J68O37M54o21m91m19N91
6970a54Q45k80n05m21K52O58K39m67o65r4O93M71l69o44l19N75N09J30n33o28
6990g07J72P20M87m62o36l41P16O11l28k27n76N22O47J0n48o77J09P39J75L4p36
7011b96l27N97N01P1m52o84J55P99K42l17n48m84O66O49j66n42l74Q3N93N55p56
7032c5l62k14P18O13m29m16m00K80N47K20p33l73k64Q62P39m13o20m14N49P72
7052F27k41n30l97K61N86M90m53p97J71N42M16Rq07n72K15R85J87n96n36N5L27
7073e8P87k48n57l25K81M73K06o17o19M67L22M95k04n70m41L23N67J47m43m08
$$ y = [-565, -637, -125, 637, 390, -124, -616, -460, 377, 590, 84, -884, -559, 257, 797, 476, -328, -563, -281, 500, 895, 26, -741, -175, 161, 693, 513, -444, -668, -245, 592, 519, -67, -473, -305, 332, 786, 165, -326, -745, -154, 691, 411, -94, -515, -263, 395, 634, 167, -498, -592, 101, 572, 203, -441, -760, -185, 324, 454, -79, -707, -535, 185, 672, 210, -426, -767, -51, 560, 232, 5, -571, -49, 598, 608, 60, -617, -508, 231, 406, 440, -296, -623, -26, 475, 546, 94, -590, -435, 364, 606, 289, -259, -743, -77, 572, 406, -136, -510, -427, 166, 721, -35, -397, -611, 107, 720, 291, -125, -525, -245, 302, 522, -211, -584, -848, 14, 753, 340, -280, -694, -145, 627, 386, -144, -541, -280, 306, 796, 343, -454, -283, 259, 675, 684, -123, -695, -480, 505, 692, 96, -440, -385, -58, 729, 481, -76, -401, -120, 353, 559, -58, -677, -210, 112, 607, 403, -167, -608, -285, 282, 429, -14, -422]
7093d22K62L93K54j78q51K54M55L1J71n82l83L53P37j19l65l59N3N37M11k41q71
7114d60j1L77N40j05l32o46L80N19M85m23r18J28M80N71k53n01l84K84O59K81
7134F71o91l55K2M24M30j59n74m37L11N53L46p05l36R6O91K53k41o47l15N07O14
7155D58J83p53m24K63P86K48o77n09J21R6O17m8l94o89L41Q99k2k00q41p3Q51
7176B33L60k92o27k61L45O47J20m97m67K60M02L03k63q16J15M72M66l41l17k14
7196c72P1O70Q3k38q30m4Q86K02o6o84k33N34M74k9l81n74J63N35K95m23m00j26
7218d87J69O83K5l91l17J34M97L14m47o16M7Q22K90l14q47O9O7M41J47L3p24q8
7240d93P03K31j70p00kM94L87q0o30j51K67K96M56m07n75j92O92N27k16r54JR2
$$ y = [-422, -160, 233, 487, 309, -542, -288, 167, 198, 369, -213, -596, -243, 494, 375, 10, -349, -296, 241, 652, 411, -460, -471, -94, 446, 341, 9, -637, -257, 262, 747, 324, -594, -466, 14, 585, 332, -169, -553, -269, 390, 671, -20, -375, -353, 71, 501, 342, -232, -669, -358, 195, 541, -164, -500, -404, 287, 540, 299, -348, -663, -156, 458, 641, -112, -536, -273, 513, 761, 84, -425, -304, -208, 409, 361, -33, -722, -381, 518, 496, 296, -545, -618, 233, 593, 301, -326, -587, -242, 405, 525, 28, -439, -179, 223, 526, 263, -553, -438, 34, 500, 159, -158, -372, -301, 369, 452, 214, -616, -660, 226, 428, 362, -322, -555, -21, 453, 424, 43, -531, -368, 167, 462, 39, -361, -487, -318, 365, 390, -1, -318, -184, 313, 627, 180, -436, -389, 433, 723, 409, -438, -369, -302, 139, 286, 319, -405, -493, 210, 441, 271, -429, -431, 63, 450, 370, -260, -411, -144, 152, 608, 201, -374, -566, 126, 653, 437, -517, -516, -424]
7262d24R98L4p10n02J43P43K49q2o24l70J83R78j0n00n58K10M54L26m44l94j83
7283d83N28L67O6n47m66J39O46K34l09n40j99Q19J40j58m87j38J75O86k6m79l24
7304c56K52K46K42k41l51j80N04L45k53l81l22K33M95L86n26m88k95O64O82k96
7324C60m91l77M63P08k83m61l39mO17L33k89n02k07J56P73k7m31p24K51R58J76
7345F60o32l88O2K10M82Q3n80n89K53R66J5m15o59K35N08K85Oq09l62M02N67K21
7367E21o19p29M85M37N66l12p13l00N66L76J24m21m31K01O79J37n69l67j21N50
7387F0N48k24o76m30M69N62J51n61l33PP32J73k54o86j82O77L55j06n15j56J10
7408b79L97M00n16o19K76L71M24m7n20k33J52N21J32l74m74K1L33M64r6n21l44
$$ y = [-424, 574, 608, -102, -604, -461, 282, 531, 449, -175, -545, -362, 616, 606, 106, -452, -242, 212, 538, 94, -300, -483, 45, 412, 478, -69, -535, -396, 250, 484, 175, -365, -564, 255, 395, 237, -250, -388, -213, 473, 447, -32, -356, -104, 142, 384, 143, -208, -388, 116, 461, 208, -173, -495, -262, 233, 619, 93, -395, -690, -26, 656, 360, -131, -508, -45, 663, 380, -81, -420, -424, 193, 526, 237, -265, -472, -316, 457, 430, -1, -725, -474, 484, 660, 28, -360, -298, -88, 394, 477, -103, -692, -439, 527, 542, 127, -532, -297, 211, 496, 502, -307, -669, -267, 300, 521, -98, -827, -342, 95, 661, 349, -364, -664, -98, 278, 402, -19, -450, -249, 430, 567, -2, -369, -490, 60, 608, 384, -292, -722, -253, 309, 460, -101, -434, -427, 305, 478, 224, -462, -644, 33, 388, 282, -233, -389, -279, 118, 518, 2, -617, -341, 30, 454, 407, -113, -346, -194, 327, 459, 85, -389, -368, -35, 429, 333, -188, -532]
7429e32N33L86K4n55l58J35O04J89k01q29J53M19L96J10o70k98L35L19L47m43
7449F4o89L5Q98K34j78n67n09O76N41J08p85l92K47N18N74n34o14pJ32Q21k31
7470C42m22m41L5O53N68m86o92j17Q08K09J8o25l82J28P12J58l21n88j5O05M02
7491E49j78m77k71K26M98K26p13l92J98O87K09l99n00k68L49P61k7o23m46K41
7511c50P16q0R2n29k99N91M31k45n99j79K24N69R1n05l65M5N99M00k57o48k12
7532e10L95N65M2n56n04K81N93M79o66n95k72Q74L24j25o23l22M91N98j14j28
7552B27r24N20N49J25J44r39j66L00N15K64o19n93L28O19Ml53m13k0M95N56l3
7573E86n68o15K73N80L24m74n07l2N20M60k08o47l06N94M91j51n27m77L75N25
$$ y = [-532, 1, 387, 411, -144, -502, -367, 237, 426, 225, -604, -451, -32, 364, 474, -196, -494, -159, 160, 507, 64, -625, -590, 308, 542, 364, -203, -712, -36, 505, 613, -172, -564, -317, 201, 775, 241, -373, -380, -248, 573, 342, -80, -521, -486, 167, 735, 249, -443, -560, 248, 457, 475, -150, -532, -404, 308, 466, 145, -443, -458, 147, 549, 371, -106, -377, -151, 347, 573, -140, -532, -334, 353, 562, 163, -337, -605, -256, 505, 478, -145, -591, -350, 366, 286, 378, -151, -450, 141, 572, 327, -272, -451, -227, 342, 433, -72, -437, -392, 207, 607, 350, -298, -510, -115, 450, 492, -64, -568, -287, 306, 785, 119, -476, -748, 126, 450, 325, -298, -620, -129, 469, 355, 227, -697, -177, 372, 497, 641, -298, -464, -164, 351, 615, -4, -597, -269, 350, 354, 1, -412, -432, 63, 619, 586, 18, -597, -324, 256, 580, 106, -401, -433, 87, 547, 339, -308, -614, -20, 471, 320, -207, -684, -309, 216]
7593B16K41l73m10n8K16N88j43k14o48L85O09p7l79k42j90N39R1J73n02j85J91
7614a72K80L69k96q43L90O32O1m8p00k15M79K89J55n68l14K6P24J69l82n03J28
7635c39N29K34o7n80n31M73O47M62q14m64J82L28M26k31o64k79O44K87K12p20
7655b65j36R0O66J88k94o87J15L04Q17k31n81p27K77R00J89m85q17L38K54M58
7675C73r9m47n07M12O86l0l84l16L5K76M01N8p11j22K68O03J89j048k73N17K35
7696A16M06l80l75j14M18N27m14n39n33O98M58K54l55n03k9M05N53l84n15j55
7716d61L77O11R0q82r1L6O16J34p3o22l09M92N29j17n95j90K39O15o2m02n40K77
7738c28L28P14j67q30l40M34N76K56n70o62Q2N77N88m45n41o6N86L35j34m92n93
$$ y = [216, 457, 84, -326, -384, -168, 420, 277, 63, -585, -200, 409, 332, -47, -289, -479, 60, 151, 324, -178, -363, -172, 108, 477, 181, -662, -272, 360, 421, 373, -327, -542, -63, 226, 381, -187, -501, -475, 249, 418, 36, -467, -339, 190, 424, 357, -223, -754, -281, 366, 828, 14, -450, -268, 60, 486, 255, -409, -688, -44, 243, 455, -265, -401, -311, 355, 543, 249, -438, -323, -19, 798, 567, -14, -741, -464, 436, 625, 140, -677, -339, -85, 373, 274, -173, -680, -268, 418, 388, 4, -312, -277, -1, 400, 458, -253, -375, -107, 496, 685, -363, -636, -119, 116, 522, 142, -233, -347, 71, 598, 184, -355, -888, -190, 268, 522, 167, -336, -365, 40, 593, 209, -306, -461, -84, 527, 617, -265, -356, -320, 296, 430, 357, -265, -574, -82, 447, 330, -265, -455, -216, 399, 337, -65, -605, -328, 0, 714, 547, -283, -623, -189, 387, 643, 73, -589, -507, 70, 658, 213, -328, -394, 192, 527, 393, -99, -692]
7759f92L75M60K46l09k71k41L31M82j78j70m39L79M88K16o43n30Q7M97N44m08
7779B24m95l51M98M66Pl50m91Q4Q66J31m66m01j63M36L56J93q85p8q0O77N61n83
7801A56l41l2M24J90L22j056k91L44O68Rm74k57K48K77J53k71n49R0J75M68k1
7822B32k37m93K50P68J77l45p74j11P47K23M9q23k34L06P92j58j77q27J65Q12
7842C42Q3k80p37P5O09L00J95p18n38L28N78L62n28o16J59N20L42p8o23k56J04
7863c77R66k3m69n38j93O44O82n19m69k81N37O60j81n40k81l5Q20L5k40o09k29
7884f40M38O82L8o93j97P8O23K88m72o02j68N12N02J6p50k33N70L20P6m70k86
7905c68o9M19M13l5p07r6L48O32n7o86k17J73N28o9k20o54L06L18L59j9m70n73
$$ y = [-692, -317, 143, 389, 80, -191, -432, -101, 381, 203, 33, -406, -27, 461, 677, 34, -496, -409, 88, 632, 224, -271, -622, -124, 342, 349, -1, -492, -408, 458, 589, 123, -278, -441, -5, 351, 544, -341, -419, -499, 178, 739, 156, -185, -217, 207, 397, 719, -337, -628, -284, 384, 393, -81, -338, -90, 187, 340, 69, -480, -390, -215, 253, 232, -5, -498, -248, 520, 697, 352, -422, -533, 214, 437, 486, -337, -571, -265, 527, 369, 192, -635, -470, 342, 425, 145, -592, -517, 92, 392, 587, -131, -669, -341, 237, 599, 71, -545, -386, 134, 476, 398, -225, -481, -377, 589, 566, 97, -441, -634, 10, 692, 173, -296, -577, -40, 620, 439, -101, -382, -417, 403, 438, 198, -411, -640, -202, 480, 518, -175, -372, -294, 329, 617, 145, -457, -625, -113, 389, 405, -345, -578, -8, 312, 388, -82, -368, -437, -18, 395, 360, -347, -443, -95, 537, 480, -206, -423, -250, 278, 209, -11, -665, -359, -41, 318, 299, -171, -744]
7927g44N48M86J64m56k58o4P18J87m94o08P9J81P84j4o41m80M78N55l4l01m59
7948c73k83O07O78r8o00l71M46L18K99m86o92Q1N24M30l12l29j88K66N21J65o39
7969c6n83J65N78L31j17o48n44O79O45On59l58L9O63J79k47o67j91N56L35K80
7990E06q38k57L35N81L11m33p00j4N30M80j98p08j84L69N39N1m31l63P1M10K61
8011C18k22m81j94N74N13j69n20o38M19Q14n5m13l37j35M60O23j65m83k25Q9N64
8032C37O4m56j88p0O63J05k22p20n4P98J94j59m56l20n3R72m9j56q16K43L54O19
8054F30j49q17k52N85K89M0j72o35K50L84L80l36p25k15N32P18j99q17J50J35
8074b24N15M92k96n16l24K55N25P3n85m81R2Q41K72p47o38L34M50M37j88l90m15
$$ y = [-744, -196, 290, 454, -2, -260, -324, 394, 581, 87, -521, -442, -261, 523, 509, -132, -612, -134, 421, 387, 86, -373, -656, -49, 629, 531, -69, -440, 6, 324, 623, 137, -555, -474, 50, 480, 168, -161, -349, -83, 438, 603, -36, -619, -454, 124, 455, 338, -310, -854, -175, 470, 476, -83, -441, -402, 261, 440, 193, -474, -665, -109, 226, 506, -332, -589, -254, 327, 638, 205, -495, -509, 21, 501, 303, -405, -589, -220, 319, 370, -61, -424, -353, 57, 318, 96, -385, -579, -5, 508, 339, -181, -819, -400, 414, 359, -54, -391, -526, -66, 557, 392, -91, -316, -227, 337, 401, -55, -243, -313, 350, 455, 233, -487, -541, 257, 451, 292, -164, -484, -537, 435, 386, 230, -586, -343, 11, 630, 481, -336, -588, -3, 286, 326, 154, -481, -231, 153, 533, 197, -528, -743, -211, 507, 308, -509, -359, -224, 291, 783, 487, -29, -353, -98, 427, 500, -85, -566, -474, 367, 639, -108, -746, -412, 38, 475, 287, -103, -518]
8095e18M62M56n2k79n52K5P24L21m77n58k83P32N97k83k81m81K11L12L63l91l87
8116c39k06N85O98l64o81k01J44P38Q9n59l07K01O15R7k45o62j20L60P26k96l44
8137g1l70j3O71K04m61n37K19M35K97j58m91k78L68L51K66k71o60J9N27M89k67
8158B69o94l04M29R23Lo59l68L4N25M63j53p11l32M31P98j16p93k04J50O10J93
8179D94l21r10J22Q45L46p3j038J3J79O36K16l05
$$ y = [-518, -56, 400, 348, 69, -483, -458, 266, 587, 110, -448, -731, 1, 598, 315, 34, -447, -236, 76, 439, 48, -339, -545, 40, 738, 374, -307, -508, -364, 374, 463, -96, -403, -202, 413, 510, 265, -397, -517, -157, 569, 273, -71, -441, -454, 217, 421, -40, -577, -358, 77, 374, 216, -275, -553, -185, 166, 432, 161, -499, -480, 47, 536, 269, -425, -729, -300, 623, 626, -33, -401, -367, 158, 621, 468, -243, -575, -144, 654, 538, -255, -459, -309, 301, 494, 173, -737, -615, 230, 576, 503, -535, -522, -343, 293, 509, 204]
8191B04
$$ Imaginary data points
##PAGE= N=2
##DATA TABLE= (X++(I..I)), XYDATA
0@%%%%%%%%%%%%%%jRj6J6j6J7k5L2l4M2m8N6p2Q1q9J04j20J37j56J79k03K29k59
37a37K90l24L62m03M48m97N50o09O75p44Q19r05R99j101J212j335J471j624J798
56I45j991K213k470K767l122L551m082M759n661O924q837J2116j9240O5440q4485
71c1173j42847R5218J68726P5392j28420j63627j8529J62772J34667m3935j76830
82f8586q6872R2988J66521L8791j30607j47542J5125J56331J08671o8850j58365
93h2395o1015J07572J45119J3571j39081j19644M1593J51544P7044q6267j44610
104i6569l0708J19941J25543j9368j40949q9390O8267J40604M5433j03639j25217
115a06052J591J27645R8048m8995j35259n6590Q8051J24384J4673j14447j03084
$$ y = [0, 0, 0, 0, 0, 0, 0, 0, 0, 0, 0, 0, 0, 0, 0, -1, 8, -8, 8, -8, 9, -16, 16, -18, 24, -24, 32, -40, 41, -48, 56, -64, 73, -83, 96, -107, 122, -137, 153, -171, 191, -212, 236, -261, 289, -320, 355, -389, 430, -475, 524, -577, 635, -700, 771, -853, 945, -1046, 1167, -1303, 1464, -1658, 1893, -2189, 2570, -3091, 3833, -5004, 7112, -12128, 53312, -31173, -174020, -78802, 89924, 165316, 36896, -126731, -145260, 17512, 152179, 108244, -68586, -155458, -62470, 104051, 142842, 12235, -135307, -120182, 36149, 144820, 75970, -82395, -143410, -35838, 109281, 122852, -16229, -135873, -94280, 57264, 134308, 48041, -96569, -127277, -7336, 118207, 98839, -42110, -131500, -63233, 77371, 122804, 19165, -106052, -104461, 23184, 121232, 72237, -63022, -119612, -31561, 92823, 107496, -6951, -110035]
126a10035L0994J28259O9823p2385j25147k8489J02718J08755j3477j21858q2209
137a13051N6754J26577M4600r1986j16601k726J15534R4762m0451j27725o1597
148a15910P9731J23058K0687j07641j07075K1875J24233P7927o2548j27021m1052
159a13736R4817J15431n15j16022r3240M1632J24212O0277p6955j20147k1433
170a05679J02649J03427j8734j17480p6393N6537J19759M1094q6204j10084k153
181i3261J06662Q8726l5714j15508n8058O9940J12075K1661r3819r7004J6603
192g7697J08228P1632n1224j10817l7629P9571J01390J537r8084q1140L4524J05942
204D6233N1097o4190j01757j6457Q6616Q6370j8940r8813o0363N0256R9432K8556
$$ y = [-110035, -79041, 49218, 119041, 46656, -78491, -106980, -4262, 104493, 91016, -30842, -113051, -56297, 70280, 114880, 22894, -93707, -96433, 19101, 113863, 73412, -54313, -115910, -36179, 86879, 107566, -75, -107150, -85275, 38958, 116885, 54337, -72684, -113736, -18919, 96512, 95997, -20025, -113265, -71633, 52579, 112856, 35901, -84246, -105679, -3030, 100397, 81663, -35817, -112210, -55673, 64086, 105180, 18976, -91108, -93261, 13401, 102127, 66413, -49095, -107153, -37213, 74862, 96523, 2704, -94300, -77697, 30531, 102163, 50939, -59878, -97507, -17936, 83454, 84991, -13093, -94233, -59709, 46233, 97330, 33140, -68617, -85074, 1542, 87912, 68972, -29841, -90204, -39948, 59484, 88040]
216H8040p5559q9051N893R1401O7732l8416r7297l8488O5417R0721N958q5095
228h744p5074K6958R5043M9200n6469r4425j8012P8702Q2465j4659r3527o0663
240h9205M5140R7475L1412p1205r0221Q05Q9915P1696l2921r8386m5199O1327
252b9367R5159J4215q2736q1507J8167R5829N8448m7832r7355k9312P2482Q8731
264G4922j522q9423p0037L2088R7149M4839n9176r3975j4969Q0737Q0640j5078
276F6195r3683n9135M4948R6498L1533o9704q8168j026Q7274P0342k9622r4104
288c8652m5399N5938R0894J6308p6812p6743J3913Q7380N4933m1679q8338k8578
300g6835O3940P8820M2p8738o1515K7654Q3329L8038n1807p9199j1466O9466O5351
$$ y = [88040, 12481, -76570, -70677, 20724, 88456, 50040, -47257, -85745, -20328, 70393, 76351, -8744, -83818, -56860, 38183, 87383, 30914, -63511, -81523, -2821, 79644, 64985, -28542, -89205, -44065, 53410, 84822, 13617, -76604, -75799, 14116, 85812, 52891, -45495, -90694, -29367, 65792, 80007, -2729, -84236, -66069, 29760, 88208, 40376, -56979, -86291, -13809, 74922, 73400, -16023, -86060, -53972, 43177, 88016, 28840, -65135, -80104, 633, 81273, 66195, -27488, -86623, -41675, 54823, 86356, 16652, -71516, -72542, 14732, 85074, 55452, -38652, -84051, -28113, 62781, 79089, 2277, -74466, -60553, 26827, 81760, 40081, -48257, -76835, -12895, 65925, 65967, -12771, -74286, -46632, 36697, 74735, 22928, -56271, -67737, 1729, 67080]
313F7080j5825p8853m5908M1433P8675K1109o2147o9611N761P5348N2492l2704
325C6850p8858k9191N5344P2620L232p1087n8149K4003P7641L7322m7848p4698
337e2819j1947O5765O3677j4246p5222m5307L9131P6004K2505n8827o8420L044
349e6662P2303N4019k8346p7274l3364N1235P3736R333o7763o3480J7067P7705
361B8509M5466m2128p8724k1642O1689P1250m053p5489n6467L0483P9826L4875
373G3595n2461p6672r756O8694O4909j6719p7411m6275L9910P7284K3168n8751
385I515o9848J853P0455N5143k6095p5261l5187M7238P1721J1067o2249o1282
397f2930J3445P0800M4124l6101p1370k1810N3635O4214j868o5134n0469K5473
$$ y = [67080, 51255, -27598, -73506, -32073, 46602, 67711, 5564, -64047, -58286, 17062, 69554, 36850, -42008, -71199, -15855, 56765, 59997, -11090, -69239, -45236, 32405, 69727, 21879, -52819, -64766, 999, 64676, 50430, -24792, -70099, -30968, 45036, 67541, 8714, -59706, -56662, 15641, 69660, 41314, -35960, -69324, -18089, 55647, 64980, -2783, -66263, -49196, 28509, 73975, 31847, -46877, -68519, -6830, 64420, 60367, -15122, -71589, -41106, 38720, 73595, 21134, -55538, -65294, 3400, 68309, 51590, -25821, -72096, -32186, 45098, 68266, 9515, -60333, -58480, 11975, 67118, 41023, -34238, -69425, -22187, 49534, 60601, -1648, -62930, -49485, 21315, 65439, 29338, -42032, -63842, -10207, 54007, 52139, -12995, -63464, -37991]
409c7991O9681L0525m4833o5984p174N9131N4460j5571o5825l7253L5979O5565
421D0710J6415n1801n7677O823O1465M2895k6937o4536k3670M4882N9730J980
433E0279n6857m8187J9424O3100L0861l8488o1568j0414N3055N3189j1739o1826
445a9171l8319L1820O3959J8500m8963n8353K778O0315M6027k4626o5511k7853
457e9397M2953O3144O798n7301n3686J4739O5180L7421l4795o6271j7530N1158
469g587N9385l714o2104m6021K4200O6162K8492m2713o3206p486N6376N2627j3071
482D1340o3404l7782L3010O4231J8057m8271n7316K378N9102M4916k2469o2791
494b8999k7487L9983O0184P987n3118n0416J2286O0189L5800l1283o0453j6675
$$ y = [-37991, 31690, 62215, 17382, -48602, -55776, 3355, 57815, 42244, -23581, -60834, -24855, 40710, 57125, 5324, -52353, -45530, 15935, 58830, 31893, -32643, -56313, -11431, 48299, 50279, -6578, -54765, -35341, 27759, 58620, 20132, -41436, -51850, 1205, 54394, 42655, -19171, -57490, -25670, 38289, 56789, 7826, -50527, -47749, 12566, 58593, 33967, -31544, -59397, -16444, 46700, 53498, -3803, -57489, -42750, 22430, 59851, 25056, -41215, -58745, -7587, 51798, 48084, -14020, -60041, -35841, 30321, 58813, 16100, -47106, -54592, 1784, 54411, 41340, -22064, -59846, -26836, 37395, 55452, 7181, -50135, -47757, 11345, 56261, 33792, -28999, -56486, -16503, 43681, 51668, -1450, -51866, -39580, 20609, 56409, 25126, -35327, -52002]
506e2002M6275N3733l156n5786m0604K1982N8695K3693l8591n4157n241N0236
518E077M4021j4033n5394k9403L1178N3961J1604m4359m6731O978N1985L4082
530D8966k4784n3826j8392L9817M9431k69n0351l9537J9008N4753K4309l5749
542A3376n2717o661M8255M4804j2955n5192l0806L0395N5299J4271m5102m9184
554d6217N327N3801L7562k3342n6409k2115L9035N2959L993n0092m3557J4413
566c4642N5820L0526l1104n5591j3698M5133M9485m638n3557l8565K2968N7073
578B9210K2983l8541n4128n072N0380M5236j3488n6083l2010L0956N6012J4607
590E0062m4096m9784L555N2971L8142k1696n5143k3206L6074N1397N901m6356
$$ y = [-52002, -5727, 48006, 44850, -10936, -51540, -29558, 29137, 52830, 14239, -39918, -45159, 5077, 49098, 35065, -20329, -49732, -18554, 35407, 47011, 2652, -44079, -37101, 14884, 48966, 24182, -29644, -48036, -8219, 41212, 40943, -9408, -48945, -29937, 24816, 49125, 13376, -39341, -46002, 2253, 47057, 34102, -21090, -51896, -21501, 33798, 48069, 2967, -46217, -40890, 12911, 50473, 27131, -29278, -51393, -12358, 40601, 44594, -5498, -49055, -34642, 21178, 51704, 20600, -34991, -48689, -3556, 45929, 41291, -12266, -50831, -27863, 29210, 52193, 13652, -40476, -45548, 4832, 50068, 36580, -19503, -51513, -20557, 35455, 50062, 5966, -43818, -40263, 12708, 50850, 29154, -25989, -49195, -13121, 38276, 44177, -2179]
602b179m3075J1981N0986L0219k7711n0959j4067L9309M5331l086m7208l5108
614d5567J9499M9658K0256l2987m6621m251M2958L8549j2989m7655k5536K7739
626a6947M7086R633l8934m0973P168M5765K9719k2676m6982j5040L5208M2924
638C5951j140m3035l3470J6609M6821K0517l0300m4478m985M0410L7482j0807
650B9575m5549k6068K5201M6313J1712l7173m1440M298M4682L2177j9899m7735
662b3906j8440L3136M5449K503m2726l7885J3202M8283K5707k7972m8523j0539
674d1711L9409M3106n414m7169l2943K0731M9347J9042l3848m6649l583M3321
686C639L8767j2631m8100k6673K6101M8431J1459l7637m2384L809M4742L2512
$$ y = [-2179, -45254, -33273, 17713, 47932, 20221, -30738, -44805, -5496, 39835, 36749, -10459, -45567, -26068, 23590, 43846, 10859, -35762, -40013, 2945, 41494, 28505, -19150, -44686, -16947, 30139, 39772, 838, -40135, -32967, 12798, 42517, 19841, -27141, -42181, -6973, 35951, 34811, -8224, -41694, -25085, 21736, 42253, 11953, -32525, -37510, 2900, 40382, 29575, -15974, -42042, -16841, 29472, 41184, 4011, -37429, -33131, 11551, 43728, 23829, -23906, -42346, -9210, 36239, 38742, -3984, -41869, -28667, 19616, 45323, 17351, -31172, -41711, -2302, 40804, 35390, -11779, -44722, -23991, 25356, 44398, 10550, -36099, -39682, 3639, 42406, 29775, -18325, -44998, -18897, 29534, 40993, 3356, -39028, -35219, 9523, 42035]
698D2035j8758m7497j8811L1306M4323M230m0377l6885J1328M5416K4649k4447
710A6512m5106j0536L5405L9574m245m2360k9250J8407M4367J6578l0470m1017
722c2141j700L9199L2647j2603m2576k1019K5253M1439P481l5373l4848O974M0847
735A3580K4715k0173m1172j2171L1175L6675j565l8581k8630J5633M1081J6922
747C7489k7550l8993l757L6357L2464j0504m1246k2142K3220M1138R675l4313
759A838l6581M531M1013K7587j8820m2889j5819L0908L9808K117l9274l2825J2090
772b6316M3051K2021k5033m1978r216L4931L7093m505m1327k7964J8089M2633
784B1479J6610k9596l9658l047L7480L3101j0376m1644k2945K3186M1319J0472
$$ y = [42035, 23277, -24220, -43031, -11725, 32598, 36828, -3549, -40434, -29106, 16310, 40959, 16512, -28594, -39130, -3725, 35849, 31604, -10756, -40006, -21599, 22768, 39346, 8876, -32141, -33841, 5358, 38005, 25402, -17174, -38193, -12940, 28499, 35980, 607, -34241, -27267, 13580, 38295, 18122, -23050, -35221, -4046, 32629, 31064, -7517, -36147, -20514, 20567, 37489, 9939, -29054, -32811, 3546, 36010, 25506, -15740, -37882, -14662, 26476, 36151, 1838, -34743, -30212, 10801, 38388, 19568, -23321, -39140, -8232, 31576, 33693, -5581, -38406, -26316, 16735, 38756, 13723, -28255, -37471, -2540, 34553, 30048, -11279, -39243, -21154, 21479, 38089, 8493, -31165, -34212, 3268, 36369, 25993, -15651, -38596, -15410, 25909, 36381]
796C6381l2963l6785L501L9367K8371j7151m0938j6566K8273L8616L026l5901
808b769l1477J0317L9470K1674k2543l8491r129L1154L3596m242l6029k5136J6430
821a7175L6870J4036k6259l3969j851L2655K7458j0669l5580j8081K1423L4792
833B3650O058k9781k9771O234L4246K1213j7721l5414j0064K7289L1811k518l3251
846h019k4670J4667L5450J4220k4903l3845j827L2037K7983j0631l5588j8410
858c3536K1498L5385P008l0028l0986N358L5189K3260j6817l6314j2554K6264
870f273L4426K09l2848k8045J1502L6956J8531k2332l6603o575L0822L2124n668
883B6226l6250k4003J7808L7516J2833k7127l5097p85L4342K8212j1330l7561
$$ y = [36381, 3418, -33367, -29866, 9501, 37872, 20721, -20217, -36783, -8510, 30106, 33132, -2769, -34246, -23929, 15541, 37215, 14672, -23819, -32948, -1794, 31802, 27560, -8469, -33605, -17175, 19695, 33731, 7472, -26497, -28348, 4307, 31765, 21096, -14484, -32565, -11142, 23650, 29708, -73, -29844, -23610, 10636, 31849, 14128, -21286, -31350, -4061, 27750, 25232, -8019, -32689, -18022, 17428, 31648, 6745, -27100, -28927, 3110, 31093, 20462, -15126, -33536, -12038, 23347, 30355, 327, -30659, -25301, 9888, 33148, 16331, -19983, -32537, -6273, 28153, 28362, -4486, -32531, -21029, 15927, 34458, 12126, -24477, -31052, -230, 31894, 26226, -10024, -34027, -16219, 21297, 34130, 7003, -28094, -28879, 5463, 33675, 22345, -15216]
895a5216j8464K1897L6667O758l0218l1808N057L5119K3298j5844l6466j2790
907c2010K4890L3377J521l1516k7202R615L4744J7758j9782l3970o845K7534K9073
920B7187l976l2330k1673J4988L3141J1540k3762l0434j44K9926K3834j0885l2309
933a4897j4532K0213L1135M158k7578k5848O698L1274J8082j6562l1431q136K4828
946b596K8006k597k9672k0837J2561L1387J1985k1542k9423j357K7967K3985q749
959A9118l1599j5521J8500L0842N667k6138k6761M691L0653J9868j4986l1788
971a7454j0774K3908K9262Q1k9856k3859J0459L2649J5781k0440l1715n683K7600
984d1K7357n068l2481j9941J5467L2914J0594k4123l0017l35K9802K3953j0111
$$ y = [-15216, -33680, -11783, 24884, 31642, 1424, -30384, -25327, 9792, 33090, 17246, -19220, -32010, -7120, 26257, 27778, -3738, -30940, -21325, 13419, 31177, 11395, -22575, -29420, -1886, 27187, 23211, -9119, -30792, -15804, 17337, 28877, 5115, -25319, -25463, 4463, 28297, 17412, -14897, -29429, -9216, 21919, 26077, -1501, -27349, -20651, 10623, 28705, 12143, -19288, -27424, -2596, 25410, 22813, -6859, -27696, -15135, 16252, 28237, 6695, -22728, -24085, 3882, 27867, 19118, -12481, -28002, -9502, 21340, 27007, 869, -25892, -21201, 9452, 29320, 14334, -17454, -28228, -4320, 24942, 25023, -4833, -28692, -18233, 14416, 30197, 9757, -21958, -27641, -41, 27316, 22248, -10233, -30174, -14707, 18207, 28801, 4678, -25339, -25674, 4128, 28081, 17970]
997A7970l1955j5698J9082L1055N880k6323k6537M413L0313J9682j4101l0893
1009a7112j1003K2584K8111R95k7625k3014R385L0414J4774j8342k9038n189K5151
1022I1K4907n107k8308j8254J4605K9107R092k2387k5818J198K6486K0058j0788
1035A4882k7916j1770J8650K6276K518k4153k1538O620K7097J4637j5724k6463
$$ y = [17970, -13985, -29683, -10601, 20454, 26334, 11, -26526, -22113, 8200, 27882, 13781, -17112, -28115, -5531, 22580, 23575, -4050, -27064, -17679, 12735, 27509, 9167, -19871, -25060, 91, 24998, 19891, -8417, -26671, -12066, 17041, 26133, 3746, -22072, -20874, 5612, 25670, 14882, -13034, -24804, -6154, 20122, 22640, -1513, -23051, -16431, 10666, 25303, 9579, -16884]
$$ [...]
8191f90
##END NTUPLES=NMR FID
##END=
