##TITLE=1H_Pr Br
 CD3OD
 8 sc, 
 18.10.2022
##JCAMPDX= 6.0         $$ Bruker NMR JCAMP-DX V2.0
##DATA TYPE= NMR FID
##DATA CLASS= NTUPLES
##ORIGIN= UXNMR, Bruker Analytische Messtechnik GmbH
##OWNER= root
$$ XWIN-NMR		Version 3.5
$$ Tue Oct 18 17:03:51 2022 Russian Standard Time (UT+4h)  she@DPX200
##.OBSERVE FREQUENCY= 200.1313499994
##.OBSERVE NUCLEUS= ^1H
##.DELAY= (6, 6)
##.ACQUISITION MODE= SIMULTANEOUS
##.ACQUISITION SCHEME= undefined
##.AVERAGES= 8
##.DIGITISER RES= 18
##SPECTROMETER/DATA SYSTEM= spect
##.PULSE SEQUENCE= zg30
##.SOLVENT NAME= MeOD
##.SHIFT REFERENCE= (INTERNAL, MeOD, 0, 15.7039)
##AUDIT TRAIL= $$ (NUMBER, WHEN, WHO, WHERE, WHAT)
$$ ##TITLE= Audit trail, XWIN-NMR		Version 3.5
$$ ##JCAMPDX= 5.01
$$ ##ORIGIN= Bruker BioSpin GmbH
$$ ##OWNER= she
$$ F:/spectra/data/she/nmr/H-F/1/audita.txt
$$ ##AUDIT TRAIL=  $$ (NUMBER, WHEN, WHO, WHERE, WHAT)
(   1,<2022-10-18 17:02:30.68 +0400>,<she>,<DPX200>,
      <created by zg, POWCHK disabled, PULCHK disabled
       configuration hash MD5:
       00 E9 B6 7A A2 85 ED C7 34 08 36 98 17 FE 4E 26
       data hash MD5: 16K
       79 76 DE B4 16 D0 90 A9 CB AA E1 06 FD 0F 3E 71>)
$$ ##END=
$$ 
$$ hash MD5
$$ 3D 63 E9 09 13 CA 4A 76 3E 57 6A 11 05 EB 6C E3
##$RELAX= 
##$RELAX= 
##$RELAX= 
##$RELAX= 
##$RELAX= 
##$RELAX= 
$$ Bruker specific parameters
$$ --------------------------
##$DU= <F:/spectra>
##$EXPNO= 1
##$NAME= <H-F>
##$PROCNO= 1
##$TYPE= <nmr>
##$USER= <she>
##$AMP= (0..31)
100 100 100 100 100 100 100 100 100 100 100 100 100 100 100 100 100 100 
100 100 100 100 100 100 100 100 100 100 100 100 100 100 
##$AQSEQ= 0
##$AQ_mod= 1
##$AUNM= <au_zg>
##$AUTOPOS= <>
##$BF1= 200.13
##$BF2= 200.13
##$BF3= 200.13
##$BF4= 200.13
##$BF5= 200.13
##$BF6= 200.13
##$BF7= 200.13
##$BF8= 200.13
##$BYTORDA= 1
##$CFDGTYP= 0
##$CFRGTYP= 5
##$CHEMSTR= <none>
##$CNST= (0..31)
1 1 145 1 1 1 1 1 1 1 1 1 1 1 1 1 1 1 1 1 1 1 1 1 1 1 1 1 1 1 1 1 
##$CPDPRG= <>
##$CPDPRG1= <>
##$CPDPRG2= <>
##$CPDPRG3= <>
##$CPDPRG4= <mlev>
##$CPDPRG5= <mlev>
##$CPDPRG6= <mlev>
##$CPDPRG7= <mlev>
##$CPDPRG8= <mlev>
##$CPDPRGB= <>
##$CPDPRGT= <>
##$D= (0..31)
0 1.2 0 0 0 0 0 0 0 0.06 0 0.03 0 0 0 0 0.0002 0 0 0 0 0 0 0 0 0 0 0 0 
0 0 0 
##$DATE= 1666098150
##$DBL= (0..7)
120 120 120 120 120 120 120 120 
##$DBP= (0..7)
150 150 150 150 150 150 150 150 
##$DBP07= 0
##$DBPNAM0= <>
##$DBPNAM1= <>
##$DBPNAM2= <>
##$DBPNAM3= <>
##$DBPNAM4= <>
##$DBPNAM5= <>
##$DBPNAM6= <>
##$DBPNAM7= <>
##$DBPOAL= (0..7)
0.5 0.5 0.5 0.5 0.5 0.5 0.5 0.5 
##$DBPOFFS= (0..7)
0 0 0 0 0 0 0 0 
##$DE= 6
##$DECBNUC= <off>
##$DECIM= 32
##$DECNUC= <off>
##$DECSTAT= 4
##$DIGMOD= 1
##$DIGTYP= 9
##$DL= (0..7)
0 120 120 120 120 120 120 120 
##$DP= (0..7)
150 150 150 150 150 150 150 150 
##$DP07= 0
##$DPNAME0= <>
##$DPNAME1= <>
##$DPNAME2= <>
##$DPNAME3= <>
##$DPNAME4= <>
##$DPNAME5= <>
##$DPNAME6= <>
##$DPNAME7= <>
##$DPOAL= (0..7)
0.5 0.5 0.5 0.5 0.5 0.5 0.5 0.5 
##$DPOFFS= (0..7)
0 0 0 0 0 0 0 0 
##$DQDMODE= 0
##$DR= 18
##$DS= 0
##$DSLIST= <SSSSSSSSSSSSSSS>
$$ [...]
##$SUBNAM2= <"">
##$SUBNAM3= <"">
##$SUBNAM4= <"">
##$SUBNAM5= <"">
##$SUBNAM6= <"">
##$SUBNAM7= <"">
##$SUBNAM8= <"">
##$SUBNAM9= <"">
##$SW= 18.0517283424941
##$SWIBOX= (0..15)
0 0 2 0 0 0 0 0 0 0 0 0 0 0 0 0 
##$SW_h= 3612.71676300578
##$TD= 16384
##$TD0= 1
##$TE= 0
##$TE2= 300
##$TE3= 300
##$TEG= 300
##$TL= (0..7)
0 120 120 120 120 120 120 120 
##$TP= (0..7)
150 150 150 150 150 150 150 150 
##$TP07= 0
##$TPNAME0= <>
##$TPNAME1= <>
##$TPNAME2= <>
##$TPNAME3= <>
##$TPNAME4= <>
##$TPNAME5= <>
##$TPNAME6= <>
##$TPNAME7= <>
##$TPOAL= (0..7)
0.5 0.5 0.5 0.5 0.5 0.5 0.5 0.5 
##$TPOFFS= (0..7)
0 0 0 0 0 0 0 0 
##$TUNHIN= 0
##$TUNHOUT= 0
##$TUNXOUT= 0
##$USERA1= <user>
##$USERA2= <user>
##$USERA3= <user>
##$USERA4= <user>
##$USERA5= <user>
##$V9= 5
##$VALIST= <valist>
##$VCLIST= <CCCCCCCCCCCCCCC>
##$VD= 0
##$VDLIST= <DDDDDDDDDDDDDDD>
##$VPLIST= <PPPPPPPPPPPPPPP>
##$VTLIST= <TTTTTTTTTTTTTTT>
##$WBST= 1024
##$WBSW= 4
##$XGAIN= (0..3)
0 0 0 0 
##$XL= 0
##$YL= 0
##$YMAX_a= 614156
##$YMIN_a= -1042251
##$ZGOPTNS= <>
##$ZL1= 120
##$ZL2= 120
##$ZL3= 120
##$ZL4= 120
##$ABSF1= 10
##$ABSF2= 0
##$ABSG= 5
##$ABSL= 3
##$ALPHA= 0
##$AQORDER= 0
##$ASSFAC= 0
##$ASSFACI= 0
##$ASSFACX= 0
##$ASSWID= 0
##$AUNMP= <proc_1d>
##$AZFE= 0.1
##$AZFW= 0.1
##$BCFW= 1
##$BC_mod= 2
##$BYTORDP= 1
##$COROFFS= 0
##$CY= 11.3945322036743
##$DATMOD= 1
##$DC= 2
##$DFILT= <>
##$DTYPP= 0
##$F1P= 2.36226072786647
##$F2P= -0.459571619588291
##$FCOR= 0.5
##$FTSIZE= 0
##$FT_mod= 4
##$GAMMA= 1
##$GB= 0.15
##$INTBC= 1
##$INTSCL= 1
##$ISEN= 128
##$LB= 0.24
##$LEV0= 0
##$LPBIN= 0
##$MAXI= 10000
##$MC2= 0
##$MEAN= 0
##$ME_mod= 0
##$MI= 1.114404
##$NCOEF= 0
##$NC_proc= 0
##$NLEV= 6
##$NOISF1= 3.799351
##$NOISF2= 2.8
##$NSP= 1
##$NTH_PI= 0
##$NZP= 0
##$OFFSET= 15.70392
##$PC= 1
##$PHC0= -18032.68
##$PHC1= 6.800703
##$PH_mod= 1
##$PKNL= yes
##$PPARMOD= 0
##$PSCAL= 0
##$PSIGN= 0
##$REVERSE= no
##$SF= 200.130013532006
##$SI= 16384
##$SIGF1= 3
##$SIGF2= 2
##$SINO= 400
##$SIOLD= 16384
##$SREGLST= <1H.CDCl3>
##$SSB= 0
##$STSI= 0
##$STSR= 0
##$SW_p= 3612.71676300578
##$SYMM= 0
##$S_DEV= 0
##$TDeff= 0
##$TDoff= 0
##$TI= <>
##$TILT= no
##$TM1= 0
##$TM2= 0
##$TOPLEV= 0
##$USERP1= <user>
##$USERP2= <user>
##$USERP3= <user>
##$USERP4= <user>
##$USERP5= <user>
##$WDW= 1
##$XDIM= 8192
##$YMAX_p= 0
##$YMIN_p= 0
$$ End of Bruker specific parameters
$$ ---------------------------------
##NTUPLES= NMR FID
##VAR_NAME=  TIME,          FID/REAL,        FID/IMAG
##SYMBOL=    X,             R,               I
##VAR_TYPE=  INDEPENDENT,   DEPENDENT,       DEPENDENT
##VAR_FORM=  AFFN,          ASDF,            ASDF
##VAR_DIM=   8192,          8192,            8192
##UNITS=     SECONDS,       ARBITRARY UNITS, ARBITRARY UNITS
##FACTOR=    0.0002768,     1,               1
##FIRST=     0,             0,               0
##LAST=      2.2672688,     0,               0
##MIN=       0,             -1042251,        0
##MAX=       2.2672688,     614156,          0
$$ Real data points
##PAGE= N=1
##DATA TABLE= (X++(R..R)), XYDATA
0 0 0 0 0 0 0 0 0 8 -8 8 -9 16 -24 32 -40 48 -56 72 -88 108 -128 156 -184 216 -256 297 -348 404 -465 534
30 534 -608 696 -792 896 -1013 1140 -1283 1437 -1608 1793 -1996 2220 -2464 2728 -3018 3333
46 3333 -3680 4058 -4472 4927 -5427 5980 -6591 7270 -8032 8888 -9862 10979 -12271
59 -12271 13792 -15611 17833 -20620 24229 -29111 36116 -47075 66740 -112969 451448 -63985
71 -63985 -692393 445329 148987 -483438 -49073 215387 -340363 112551 608507 -170829
81 -170829 -660051 41974 58139 -411963 -77387 315190 113213 305993 497554 -30888
91 -30888 -305091 97435 -42851 -474909 -175485 191378 32263 95476 193218 -138753 -192586
102 -192586 108724 -97418 -343052 104107 411396 117352 113597 287173 -55180 -272503
112 -272503 -29965 -155033 -424593 -63411 308313 94413 -15304 181507 62866 -155448
122 -155448 -35422 -40000 -192927 63379 329937 106596 -42448 122579 16124 -293934
132 -293934 -230387 -55957 -152930 -63358 276310 248063 1039 71242 162728 -72232 -237562
143 -237562 -83629 31040 3620 86257 150108 16285 -75143 -53354 -119494 -208575 -132941
154 -132941 36062 127422 161796 187985 133937 43878 -10094 -103069 -184063 -122583 -5211
165 -5211 46663 59527 65286 32775 -26957 -61376 -110285 -139730 -24499 106573 115385 141969
177 141969 184745 84167 -52949 -74843 -114545 -213583 -130148 68687 52875 -16695 105057
188 105057 126919 -52840 -105922 -33303 -52825 -35915 118884 155432 59286 86278 88608 -99417
200 -99417 -182489 -109691 -120823 -94824 63742 104944 37830 108197 145568 -53772 -152356 -12452
212 -12452 10986 -48014 56655 118589 38629 35258 32721 -120235 -192480 -77346 -33558 -50430
224 -50430 77067 160377 82486 80188 86338 -66391 -132691 -24599 -13230 -71126 27485 127136
236 127136 41147 -24935 -9892 -88381 -130980 -33200 2813 335 110841 169904 74172 19289
248 19289 26521 -72199 -155163 -68508 -18074 -54259 33145 125558 41139 -39476 -10830 -24614
260 -24614 -79906 -37316 41747 52216 83610 125775 56326 -27242 -46038 -99537 -142747 -74188
272 -74188 3662 7918 38233 108852 78014 -13409 -15251 -13657 -64776 -36086 47935 62618 49561
285 49561 59973 25403 -57020 -90105 -86498 -104097 -57842 40659 61038 63801 111047 84937
297 84937 -13272 -43261 -21468 -49450 -58124 25136 64754 17162 10336 9648 -53074 -89103 -71718
310 -71718 -50895 -7094 64144 97478 85403 84706 54826 -38351 -73272 -40842 -59340 -64952 10608
323 10608 54560 22582 3588 8571 -33618 -76992 -39155 8234 24443 65731 96388 76349
335 76349 44717 -603 -61016 -89170 -72538 -53598 -40344 13521 66282 44322 11040 8668
347 8668 -16230 -44646 -23408 20848 43326 48945 63440 53469 1732 -41576 -74200 -96063 -74091
360 -74091 -30568 6722 45987 71582 58609 21007 4698 7 -35832 -42530 12398 39776
372 39776 26608 28095 25324 -17434 -69207 -76285 -56762 -40836 293 47868 65100 76058 64384
385 64384 17497 -15871 -30865 -48148 -47139 -6714 28067 12842 5725 22534 -15276 -68179
397 -68179 -50454 -12498 -3003 16882 62843 85322 61371 30866 -4537 -52072 -62916 -49824
409 -49824 -44988 -15234 21308 23575 18134 23183 1158 -42189 -33988 17077 20839 17145 64799
422 64799 74305 21513 -14829 -32621 -63056 -76936 -51514 -25981 -6589 40161 61561 28533
434 28533 17517 14779 -22136 -24963 12633 17164 8392 40553 51768 -12086 -54951 -34797 -48410
447 -48410 -73391 -36257 6589 31083 65834 69878 27186 2161 7490 -15114 -40183 -9934
459 -9934 9631 -4246 21467 35752 -21097 -53550 -29256 -29776 -47277 -9852 47041 54055 50546
472 50546 54490 21327 -10106 -15818 -43080 -55135 -15257 10766 2341 12192 28765 -3144 -38238
485 -38238 -17500 -7077 -24133 9983 56254 47737 28857 26345 7868 -32085 -54059 -49680 -38228
498 -38228 -10573 18806 19780 25240 34543 7272 -18099 -10132 -6129 -12087 6073 40865 38945 7233
512 7233 -2875 -14378 -42787 -51571 -40110 -18574 12086 31557 38428 40584 30860 6207 -18562
525 -18562 -18980 -13042 -17154 2349 29049 16385 -8316 -13846 -16419 -32897 -44890 -23186 12954
538 12954 31203 40224 42669 38152 23395 -9519 -32852 -31311 -25169 -12679 2552 10665 8375
551 8375 -2499 -5869 -7433 -23557 -29769 -6064 31209 48200 31367 24795 31015 1160 -38315
564 -38315 -40200 -28342 -26653 -18436 8989 24904 14281 9891 4618 -14407 -15589 -4686 5937
577 5937 24266 31514 21170 15050 9355 -17143 -50098 -43255 -15596 -16534 -9119 26723 38171 24696
591 24696 11696 -1828 -10772 -8550 -3415 -2599 6111 21662 15430 -502 -4789 -29703 -50280 -22299
605 -22299 2850 -3742 7424 42581 48432 18393 3019 -193 -18123 -21570 -12900 -13594 2805
618 2805 20690 5510 -11904 -9841 -15173 -27638 -12776 14657 12866 17275 48713 40114 -569
631 -569 -10522 -11187 -29242 -37406 -20197 -188 7375 11426 7076 -1533 4121 -2612 -20725 -2717
645 -2717 23637 18955 18516 32746 21456 -14224 -27190 -21656 -35201 -36821 -5691 9560 8928 18302
659 18302 20344 12680 4729 -7117 -13113 531 19983 15164 4578 15631 6472 -26758 -30996
672 -30996 -21099 -26893 -22107 3705 24105 26207 25973 24196 6124 -5798 -6379 -12762 -6762 5829
686 5829 858 758 9266 -2526 -25994 -28150 -11084 -9062 -8835 17973 35884 28505 21427 11129
700 11129 -2225 -10520 -20057 -22067 -11604 -212 2815 3278 8179 -256 -19942 -14627 1766 904
714 904 5347 22015 31050 22874 6052 -2656 -9786 -24226 -30875 -23392 -3749 8647 4540 9748
728 9748 16493 922 -9251 -720 3927 335 5127 19974 21289 5512 -3920 -12225 -22650 -25396
742 -25396 -25613 -11883 11612 15688 11206 18459 20031 4461 -10123 -3789 65 -8691 1113 15290
756 15290 7166 -3898 -10338 -17257 -18840 -16106 -10331 2010 17204 23852 17450 18778 18830 -6681
770 -6681 -21567 -8935 -6139 -11399 -2761 8323 3224 -7196 -5155 -5945 -12753 -6588 1629 8589
784 8589 25504 26726 10617 6847 3547 -15315 -27642 -15268 -5687 -14475 -4091 18006 9604
797 9604 -3487 2405 991 -5587 -1930 7681 14652 17031 14018 1484 -6193 -4472 -20993 -32730
811 -32730 -12290 -221 -5527 6877 24203 16427 -114 1739 5387 -6526 -4802 7869 5983
824 5983 4542 5431 -3746 -8210 -10892 -21973 -22167 -3847 11052 7096 12154 27534 14942 -4831
838 -4831 781 628 -12185 -11459 -809 3791 1476 644 -2003 -9089 -9673 -10816 -10290 7916 17298 9513
854 9513 14142 21098 7274 -9474 -10645 -8123 -16960 -15721 1821 6946 2735 3779 207 -1435
868 -1435 -1474 -5121 -303 9732 12125 8319 9569 12765 -2916 -21875 -15930 -9689 -14345 -7788 5179
883 5179 10700 9053 6899 8152 3930 -3457 -4686 -289 8397 8724 856 3213 2063 -13981 -19368
898 -19368 -11696 -7775 -8922 -1941 14530 19055 11858 9305 5862 117 -4375 -9000 -3092 5438 -289
913 -289 -4477 -520 -1534 -11338 -15531 -5733 -1546 -2693 10541 20523 15643 10834 4733 -1745 -5232
928 -5232 -9994 -11517 -5420 1422 -944 -5611 3175 5913 -11113 -11874 2580 4124 4627 12542 16812
943 16812 10124 1743 -399 -6326 -12857 -11908 -12956 -5627 7249 2994 -996 8916 6273 -8173 -6847
958 -6847 7932 7956 -1765 7178 14077 1806 -4026 -5029 -12737 -13699 -10057 -5995 3020 10385 8678
973 8678 4249 8895 8269 -7695 -6160 8231 -919 -8425 5802 10593 -3412 -11312 -7736 -8313 -9804
988 -9804 -728 3352 4027 13939 13290 5088 7107 1541 -11576 -9485 774 -2262 -8525 2397 8369
1003 8369 -7143 -10056 1101 -2009 -5252 1829 6489 10692 14244 9539 745 -2137 -2987 -13186
1017 -13186 -14114 -141 -1811 -7450 4775 8256 -2181 -3772 3146 2219 -3826 2724 11071 8562
1031 8562 7169 3149 -6241 -5548 -6876 -15062 -9432 1620 573 -2192 7980 14692 861 -6093
1045 -6093 3697 2311 -3488 2669 6389 3905 932 -3044 -4731 -6383 -8245 -10132 -5720 6299 6390
1060 6390 2451 12061 10918 -3630 -4182 2267 -303 -7331 -3510 5164 2664 -2300 -1838 -4138 -4236 -4529
1076 -4529 -6927 2339 10533 6415 4770 8253 4964 -4295 -6664 -1542 -6496 -10598 570 6152 1821
1091 1821 -696 -2114 -478 940 -2504 -1508 4729 8701 4642 763 5701 1717 -10700 -9357 -4516
1106 -4516 -6393 -3040 3131 5155 3634 1890 3148 2079 -88 -1716 -3334 4597 8105 -2020 -1815
1121 -1815 4181 -3533 -12856 -8968 -370 -997 -1730 6713 8400 4357 5350 2774 -1506 -1383 -4506 -3995
1137 -3995 3192 2614 -3717 -3483 1835 -3381 -12078 -1892 6445 -1732 363 11011 10741 4701 817
1152 817 -1758 -4301 -4931 -3656 -5420 -1345 2932 -3327 -2150 5045 -1966 -7081 1393 6537 1876
1167 1876 3003 11245 7200 -4420 -2710 -863 -7385 -6877 -6058 -4720 3244 5142 -526 476 5660
1182 5660 1985 -6160 1593 9383 886 -515 7097 1302 -6183 -3746 -3415 -8153 -8720 -1502 3200
1197 3200 4437 5949 1838 1342 7739 442 -7432 1972 5618 -2753 -3931 4188 2379 -8150 -6288
1212 -6288 -1329 -5503 -2490 4813 4544 5466 5936 3042 2684 1390 -4001 -7139 -1157 2876 -4895 -4065
1228 -4065 6538 1021 -7946 -2949 1665 421 702 4199 5791 4182 4301 1693 -3081 -2772 -5953
1243 -5953 -8683 -477 1970 -3553 -182 5634 2538 -3990 14 5485 274 -1452 4671 4684 3125
1258 3125 767 -4518 -4885 -3818 -6366 -5283 85 2662 -433 1875 9035 3569 -4080 899 3174
1273 3174 -931 -418 2826 3271 -909 -4338 -3615 -2815 -3085 -5395 -4847 4150 5989 500 4878 7867
1289 7867 -126 -3955 370 2528 -2713 -3627 2197 1266 -2160 -1744 -2807 -1875 -1702 -4721 231 7289
1305 7289 4985 714 2787 5429 -1531 -6234 952 907 -5851 -1799 3681 1474 -736 -1563 -1725 -1003
1321 -1003 -1247 -332 1025 5152 3805 -2184 2355 4527 -5146 -6069 1 -558 -3483 236 5496 2258
1337 2258 -1784 814 -150 -1283 653 -1740 -752 4308 1427 -2896 583 1847 -4656 -6987 1140
1352 1140 3258 -2393 2260 6576 1194 -178 1339 -369 -1722 -2465 -2357 -680 2754 1463 -4203
1367 -4203 -1447 2677 -4208 -4117 5055 2944 -2256 2692 7898 3132 -3000 -996 -1150 -4488 -2051 -1299
1383 -1299 -1217 2341 -413 -3242 2452 2792 -2989 -3118 4223 4245 -1459 2878 7175 -2041 -5273 -579
1399 -579 -1348 -3562 -2997 -613 1004 1594 1837 -69 1216 2498 -3266 -2623 5367 2525 -2781 1593
1415 1593 3080 -2404 -4849 -498 73 -4625 -1892 2932 1987 3395 1770 -1146 1275 940 -3222 -1624
1431 -1624 2736 913 -3712 365 4192 -2654 -4820 923 -122 -2164 1122 3501 3623 1922 -104
1446 -104 -753 -221 -213 -4449 -3832 2675 269 -3450 2424 3854 -2232 -2999 1569 2391 -512 1087 3747
1463 3747 836 -262 226 -1861 -1133 -3187 -6173 -969 3768 680 -1606 2022 4042 -1145 -1621 3930
1479 3930 1221 -2544 1402 2236 703 -133 -2434 -2925 -2370 -2136 -2464 157 3697 689 -1381 5150
1495 5150 4887 -2931 -1509 2153 41 -2082 -156 2233 -712 -2394 -1507 -2568 -814 45 -2260 1503
1511 1503 4672 1079 675 4437 2251 -3771 -2879 2294 -171 -3772 421 1328 -1699 -1503 -786 -419
1527 -419 540 -862 -787 2885 5100 1440 -1601 2534 1154 -5472 -2016 2424 -2228 -3622 1069 2683
1543 2683 -715 -1330 998 319 -661 945 557 2379 3928 -1678 -2163 2561 -50 -5044 -2647 1782
1559 1782 -979 -2687 2912 3706 -1591 -110 1492 -378 544 756 -26 610 1139 -745 -1407 1247 -666
1576 -666 -6165 -1265 4602 -262 -1495 2857 2795 -958 -694 1396 -155 -2092 -335 -612 700 2611
1592 2611 -1233 -2547 1552 -492 -3073 1260 3727 -78 -1954 3513 3391 -2785 -2126 878 -1668
1607 -1668 -1844 -557 -34 1692 730 -1651 -782 1939 1268 -2615 574 4161 -935 -1419 3547 1052
1623 1052 -4021 -2357 100 -1124 -2360 267 1602 483 947 -30 538 3019 -612 -3443 2049 3625
1639 3625 -1002 -1608 1764 187 -3978 -1767 1661 -1613 -1703 1578 1370 1503 1510 602 217 427 -863 -1306
1657 -1306 1426 2551 -2408 -2435 3106 395 -3558 -613 1078 -1065 -999 1571 2418 628 -44 -429 -804
1674 -804 1028 -441 -2299 861 1486 -1913 195 2916 309 -3684 -809 2592 -151 -1088 2067 592
1690 592 -572 116 -1422 -418 -133 -2072 -1635 1936 2799 -839 -797 3222 167 -3304 1452 2291 -1923
1707 -1923 -1723 969 877 -1299 -1676 -691 -865 -211 -439 -420 3185 2963 -1677 742 3431 -16 -2757 -39
1725 -39 1343 -2500 -2380 1568 98 -2645 -636 -520 -399 875 197 907 2930 1913 -484 1065 3046
1742 3046 -1416 -4610 138 1157 -2977 -1459 1145 -656 -1849 -183 1114 328 205 1008 782 2518
1758 2518 2833 -1263 -70 1234 -3001 -3333 821 732 -3028 -2129 2193 1078 -1867 1036 1026 -484 936
1775 936 944 974 2655 343 -2170 -537 1270 -1478 -3409 690 1120 -2655 -268 3796 74 -1798 244
1792 244 974 -10 7 575 429 11 117 -1759 -300 1721 -2571 -2804 2210 1723 -1058 582 2493 69
1810 69 -2223 993 1518 -1509 -885 116 -286 841 -136 -1683 11 767 -1455 -844 2415 2201 -2014
1827 -2014 223 3638 -650 -2286 383 -41 -1844 -1161 -107 389 -51 -143 -983 236 1713 -716 -404
1844 -404 3334 1061 -2104 1043 2491 -910 -3181 -847 435 -1842 -228 1206 -148 -22 51 256
1860 256 1866 1378 -1598 -261 2905 1161 -1578 -2 1475 -2556 -2872 1477 267 -2183 -236 1066
1876 1066 1037 515 394 180 591 669 -807 -483 2299 -15 -2821 838 1051 -2366 -1476 887 481 -1706
1894 -1706 275 2256 350 -336 314 -793 119 658 -1023 188 1245 -722 -1608 946 1644 -2241
1910 -2241 -2339 1952 1004 -976 1492 1316 -180 -281 33 252 128 -550 -1065 -196 2111 85 -2463 1172
1928 1172 1458 -2173 -575 2034 642 -1565 507 1897 -715 -1247 525 -65 -639 -157 -1140 685
1944 685 2170 -414 -1551 925 923 -1285 -1026 2297 -133 -2975 777 2038 -701 -1396 -627 -150 202
1961 202 389 244 627 767 -299 -516 1815 826 -3173 -865 2284 -222 -1495 668 1115 -1236 -770
1978 -770 1299 603 -649 401 401 443 1395 -517 -928 1503 34 -2181 -478 1760 18 -1853 900
1995 900 1227 -1613 -314 1672 -106 -489 323 644 1117 382 -669 -1308 373 476 -2091 -305 1763
2012 1763 -1097 -1453 1707 1501 -1135 -1261 1021 935 -456 469 122 -446 408 -731 -928 826 -310
2029 -310 -2008 463 1829 -448 -1238 1596 1645 -1621 -575 1464 67 -276 575 -30 13 -131 -652 -124
2047 -124 251 -636 -2100 490 2839 -880 -1638 1535 776 -1260 261 1221 -440 -1418 476 1254 -57
2064 -57 -244 -914 -764 1129 133 -1282 1035 1256 -1080 -568 1818 953 -2241 -873 1936 -593 -1166
2081 -1166 831 441 -1 -265 -524 181 789 -120 -747 570 1463 -781 -574 1889 -360 -2790 0
2098 0 1353 -241 -687 526 773 -233 631 680 -115 252 -130 -636 1549 1004 -2058 -1003 1268 -23
2116 -23 -1930 -409 1211 -924 -851 1797 741 -404 404 260 459 676 -574 -821 603 490 -1187
2133 -1187 -1274 1125 -275 -1954 765 1455 -1166 7 1861 871 -623 -418 868 484 488 -146 -1197
2150 -1197 329 593 -1464 -269 998 -1275 -1990 876 2015 -349 -1006 1604 650 -644 598 476
2166 476 -590 -238 -204 -159 761 -461 -1317 -474 1302 -308 -1887 938 1741 -1179 -553 1546 416 -1012
2184 -1012 -125 367 -235 -726 333 285 334 -228 -1486 151 1598 -894 -1478 866 1166 -789 -422 1375
2202 1375 -314 -2238 197 778 -482 -404 -169 7 943 346 -548 40 639 -487 -998 1423 1006 -1893
2220 -1893 -155 1506 -735 -1231 231 867 -38 -174 545 375 21 437 -636 -497 495 -725 -777 1688
2238 1688 352 -1729 -596 1244 135 -1388 427 440 -912 667 1072 143 -169 -252 -216 974 632
2255 632 -1149 -1053 753 909 -1499 -38 1475 -1070 -1452 825 627 -526 -83 724 985 -32 -259
2272 -259 -124 69 404 -1130 -1016 1340 303 -1652 399 1236 -848 -1034 1408 1280 -1177 -224 1111
2289 1111 254 131 33 -999 -22 367 -581 277 552 -489 -1321 440 2055 -918 -1639 1443 354 -821
2307 -821 321 586 -334 -690 -146 430 -59 45 -674 -128 1457 165 -1613 673 996 -1132 -658 727
2325 727 412 -807 -103 1318 -656 -570 571 64 257 142 -1020 169 1306 -199 -877 -100 321 -918
2343 -918 -624 1714 244 -1723 353 1089 -141 -192 -105 129 37 328 48 61 352 -304 -1005 820 894 -1745
2363 -1745 -674 1218 346 -1003 328 1258 -362 -791 771 190 -330 277 -256 -274 201 -794 -731 728
2381 728 353 -1494 -1301 1490 679 -993 381 948 -858 -274 1032 83 -486 -585 243 368 316 -636 -1240
2400 -1240 294 671 -890 88 1524 -495 -872 1046 1358 -658 -906 611 392 -588 56 -252 -222 241
2418 241 -615 -302 693 310 -495 207 1385 -154 -1328 1127 1333 -1113 -784 176 -306 -492 -30 70
2436 70 -343 -501 325 285 450 400 -1081 154 1717 -365 -1199 490 193 -1188 -272 781 -38 -1213
2454 -1213 556 675 130 203 -173 -148 977 223 -998 510 355 -716 -1259 664 523 -1481 -161 936
2472 936 -202 -400 736 714 322 207 -316 67 529 400 -781 -335 797 -908 -852 1434 -10 -1632
2490 -1632 -122 1075 442 -274 536 635 -341 34 234 -174 54 -741 -1184 651 610 -1145 -826 911 721
2509 721 -544 302 1351 -347 -582 1096 275 -394 -422 -347 -239 46 -550 -521 366 538 -728 -167 1664
2528 1664 115 -718 689 1170 -550 -480 633 388 -1000 -724 61 -445 259 -28 -528 525 451 -474
2546 -474 234 1229 -3 -810 389 1238 -655 -870 558 -233 -635 -108 110 -342 -46 -324 98 376 347
2565 347 -415 -141 980 -92 -1205 786 788 -1162 -760 548 286 -446 -14 824 -265 -130 642 133
2583 133 602 384 -1417 25 756 -516 -993 65 383 -705 -610 1168 332 -904 122 955 452 93
2601 93 -45 -144 318 -331 -433 -98 317 -251 -1153 877 1115 -775 -102 1430 76 -697 316 895 99
2620 99 -508 71 41 -245 11 -1003 -66 509 -587 -37 1269 397 -605 -203 1089 411 -1002 601
2638 601 423 -899 -79 74 10 -29 -355 -142 334 537 -118 -123 1039 775 -906 293 1358 -431 -955
2657 -955 148 113 -284 -367 229 -75 -431 228 -11 215 1015 -266 -489 1154 217 -608 163 595 -636
2676 -636 -1097 500 509 -1012 -459 455 82 289 294 -134 350 171 -11 19 462 97 -1228 -223 904 -637
2696 -637 -933 567 347 -745 -37 749 308 6 65 188 93 481 -469 -493 753 -202 -1051 186 662 -392
2716 -392 -589 674 865 -38 444 487 -152 -327 437 -354 -137 -288 -638 -234 221 -116 -764 205 948 -511
2736 -511 -503 1437 668 -439 8 538 -204 -419 91 -89 -513 -147 -234 -451 521 43 -845 769 1022 -500
2756 -500 119 874 102 -942 -9 800 -437 -731 -326 -134 -236 133 112 228 400 46 -11 748 760 -535
2776 -535 -610 887 -23 -1065 110 329 -533 -585 186 163 -212 -108 78 485 635 377 -302 649 516 -872
2796 -872 -160 576 -627 -1071 -141 450 -393 -736 590 252 -171 367 45 353 532 -354 -414 256 169 -612
2816 -612 -374 649 -357 -1082 628 761 -389 -140 574 328 5 214 529 199 -128 -224 -382 404 -260
2835 -260 -1053 22 809 -175 -503 293 486 -103 -399 825 493 -516 82 41 -211 261 -573 -146 323
2854 323 -21 -321 352 953 29 -400 966 927 -698 6 581 -354 -689 -221 104 -48 -443 -439 -277 326
2874 326 493 -148 342 574 -256 -379 1048 174 -972 -562 54 -202 -422 0 -118 -409 33 -25 255 663
2894 663 -230 -51 422 567 -174 -588 370 206 -1008 43 488 -526 -596 320 130 -81 73 68 322 259
2914 259 242 -223 319 455 -459 -709 581 -8 -731 -46 573 -117 -431 671 497 0 -166 316 -164 338
2934 338 79 -458 428 43 -651 -356 625 215 -798 46 996 -233 -327 706 155 -103 2 67 28 -185
2954 -185 -158 -222 -15 105 -533 -563 842 32 -513 906 664 -481 -498 247 164 -626 -58 251 -446 -301 -182
2975 -182 37 553 465 -535 18 952 321 -213 253 552 -501 -745 758 117 -879 -221 -206 -56 -59 94
2995 94 18 233 47 24 55 751 40 -683 204 361 -562 -383 303 -81 -421 -311 495 82 -100 328 468
3016 468 441 723 -90 420 403 -468 -276 41 296 -1007 -737 625 -73 -594 476 630 -110 122 291 251
3036 251 425 20 -146 -305 216 -40 -825 284 92 -818 -147 865 -28 -379 296 747 424 -211 527
3055 527 -102 -133 -34 -316 -245 323 -884 -495 408 381 -622 59 754 76 -552 860 802 -194 -143 154 -227
3076 -227 -189 -247 -216 -138 -120 -127 -56 626 598 -543 286 776 78 -284 409 222 -637 -181 278 -194 -463 47 -27
3099 -27 -42 275 -74 78 754 142 -342 173 449 -176 -714 227 166 -728 -8 327 -52 -274 214 121 237
3120 237 500 66 -26 595 257 -502 -161 702 -555 -802 264 -233 -502 -71 214 82 163 384 269 114
3140 114 94 -166 -335 590 -176 -763 -126 328 -401 -448 274 437 -839 -106 925 -103 -122 206 307 251
3160 251 -5 -190 -131 -23 -375 -479 101 651 -467 -660 699 262 -454 451 570 -182 -378 2 101 -410
3180 -410 54 -240 -456 267 -288 -432 393 266 -601 -26 854 435 -306 299 581 -323 -406 353 -322 -147
3200 -147 -24 -287 253 69 -36 -91 87 682 -148 -162 899 -213 -578 431 176 -548 -251 -113 -134 -389
3220 -389 -4 264 -68 129 195 -177 255 191 -618 -373 480 -268 -807 -84 323 -412 -679 295 313 -216 366
3241 366 112 -3 544 -104 -73 216 42 -719 -625 375 -260 -718 239 125 -543 108 681 206 -53 211
3261 211 308 217 -194 -191 -457 -242 61 -667 -68 117 -446 -462 298 452 -291 42 653 335 -153 183 475 -301
3283 -301 77 -96 -46 82 -342 -269 25 485 85 -366 603 446 -718 -119 713 36 -346 106 134 -292 -176
3304 -176 146 -6 -47 -49 -275 142 733 -530 -200 471 286 -395 -125 445 -151 -502 391 88 -269 -257 144
3325 144 97 170 236 48 166 273 -394 -18 209 160 -552 37 497 -476 -224 -46 49 -147 -158 187 545 219
3347 219 173 -154 45 149 -452 -444 411 -121 -931 -307 79 197 -421 152 274 -239 360 143 326 -58 -200
3368 -200 43 349 128 -338 -201 265 -12 -576 140 600 -300 -478 643 526 -350 135 145 69 -210 104
3388 104 -37 177 71 -356 -455 274 -234 -683 376 476 -50 -37 653 360 -265 11 285 -262 -193 150 -191
3409 -191 -38 -66 -392 117 296 -95 -86 442 561 -207 -155 499 106 -686 331 126 -424 -347 54 70 -178 71
3431 71 -255 -253 312 263 -309 303 301 -379 -108 88 -241 -484 104 39 -393 -140 494 -234 62 6 -162 143 470
3454 470 37 -248 276 427 -180 -248 580 58 -379 94 253 24 180 26 -6 82 -45 -144 13 219 -193
3475 -193 -430 430 184 -683 -69 593 -36 -77 444 137 -161 -123 333 199 -60 10 -63 60 255 -323 -568
3496 -568 409 -42 -356 -304 512 -148 -490 189 387 -254 -129 267 -162 -196 -244 -79 -228 -134 106 -74 171
3517 171 157 -338 -34 679 -314 -68 408 252 -324 -257 293 -65 -25 15 70 -73 84 -196 71 239 -125 -272
3539 -272 226 242 -102 -321 299 124 -591 -325 444 -106 107 154 -204 -4 338 -81 -5 78 94 -310 -240 513
3561 513 -322 -387 358 189 -215 -2 300 84 -196 258 264 76 258 84 94 81 -387 -245 -57 118 -297 -428
3583 -428 31 597 -361 5 414 -256 97 238 194 -1 -101 -298 -80 31 0 -406 -235 435 -452 -387 404
3604 404 136 -483 339 478 51 -244 -151 114 -51 -114 -89 -151 -104 -68 -477 325 235 -556 100 257 325 -92 -105
3627 -105 502 -104 -454 192 -124 -27 -139 31 45 61 -54 -44 289 41 18 -173 614 223 -344 236 263 -416
3649 -416 -287 276 301 -307 -98 203 14 -5 35 -179 411 501 -463 54 270 -26 -488 210 370 -178 -433
3670 -433 397 77 -171 0 146 230 68 -7 200 192 336 -345 -324 140 51 -340 353 258 -392 -214 78 -18 -3
3693 -3 210 276 210 142 65 29 8 130 -376 169 305 -112 -223 -22 283 -42 -255 485 62 -350 202 175 -161
3716 -161 178 -527 -80 138 -272 1 -74 243 -34 -308 346 322 -272 71 340 -131 -400 303 148 -153 -100
3737 -100 109 -145 71 92 -260 -104 221 145 103 108 82 -144 -229 333 4 -389 426 130 -454 26 -46 -126 105
3760 105 -140 22 66 -24 -192 -101 367 193 -638 -273 568 -451 -594 88 92 -265 -8 284 -129 43 -82
3781 -82 69 -59 149 -62 -254 74 -56 -458 321 -32 -76 -245 73 121 -117 -306 70 158 223 214 -158 118
3803 118 84 -188 -163 329 -118 -327 -161 500 43 -213 233 119 -310 -6 340 86 -324 62 -28 123 -58
3824 -58 -145 -105 -2 4 -219 205 269 -125 -410 276 198 -128 -97 185 -55 -326 -119 -99 3 57 -309 71 128 -94
3848 -94 -95 -140 315 -282 62 278 0 -397 -21 229 5 -60 121 41 -193 50 -85 99 409 -219 -450 409
3870 409 270 -277 -57 -88 -166 -372 91 -7 -126 -175 -24 -86 -74 -18 -113 67 186 34 -64 248 37 -231 -97
3893 -97 155 -170 -581 23 431 -254 -181 176 -135 -103 72 -209 5 48 -148 -313 142 201 -376 29 134 -168
3915 -168 -379 33 325 -215 -325 406 -50 -67 52 -28 -126 202 -99 -123 -2 -106 -37 -155 342 14 -138 286
3937 286 166 -27 -234 209 120 -92 -165 -116 185 -13 -170 -68 -6 -91 -344 -244 544 -247 -150 364 -60 -289
3959 -289 -77 409 78 -29 75 93 -219 -298 -29 101 322 113 -382 133 17 128 -235 284 148 -574 -46
3980 -46 191 -76 -249 29 -86 14 53 77 -181 -20 173 -250 -103 345 -285 -87 370 182 -60 -527 227
4001 227 159 -15 301 216 -147 243 308 223 -84 57 -228 -101 23 -150 -457 419 380 -395 23 361 243 -323
4023 -323 79 65 7 75 -165 91 -213 -6 45 157 158 -110 -52 275 122 -285 111 206 -259 -325 119 -103 -371
4046 -371 58 -8 -271 105 -307 185 -19 152 -146 -36 140 120 -214 -133 113 -127 -104 160 -45 4 -188 309
4068 309 -46 218 -68 130 24 236 209 -39 253 -215 21 58 -38 -217 -107 -115 -44 -189 -155 127 -161 -70 176
4091 176 -39 119 -175 43 107 122 104 -267 21 152 -246 69 459 78 -249 1 145 -19 257 -52 154
4112 154 57 -38 -97 51 253 -223 -475 -9 3 -297 34 5 282 -74 -28 207 175 -215 -96 -27 209 100 -27
4135 -27 -40 -9 -216 -97 316 324 -208 -189 355 139 -237 19 217 -308 -96 113 259 -138 0 -241 114 235
4157 235 -161 111 265 -54 24 -41 229 -138 0 21 5 -83 -58 185 35 71 11 -200 33 193 -131 -103 198
4180 198 120 -34 110 206 -43 -124 -51 160 -276 -115 -66 -84 50 195 -224 64 168 43 -2 67 66 -139 -117 208
4204 208 -276 -29 102 -22 -89 -303 238 -205 -102 165 60 -22 -50 -45 68 31 247 -188 147 310 -79 -175
4226 -175 103 225 -64 -16 -63 213 -196 -41 25 159 58 -113 -217 64 173 33 -409 391 -110 -55 -65 270
4248 270 -86 -37 50 215 -167 -216 118 -78 -20 -160 -37 326 -152 -180 217 191 116 -48 26 351 -193 -293 184
4271 184 -170 -136 31 144 -260 -48 54 53 -166 -359 -172 61 296 50 -18 376 153 -86 -281 39 78 -61
4293 -61 -35 212 -119 92 270 -1 -22 282 -136 -323 143 11 62 125 -160 -137 -75 230 8 -181 87 -30
4315 -30 -93 -59 -228 1 4 33 148 240 114 -119 -290 216 177 -79 193 276 -35 114 76 -57 -20 87 -148 33
4339 33 56 -236 136 -57 38 -360 -193 142 29 -36 13 57 28 -115 -106 -62 -50 203 17 61 73 -154 -239 -142 20
4364 20 -157 -26 250 164 -248 7 72 -154 -176 23 -166 17 -127 169 74 102 -163 182 218 198 -152 315 117
4387 117 -265 -59 32 130 119 145 -37 139 -248 -8 68 -319 -158 -230 -89 206 172 -22 -103 129 84 -61 293
4410 293 236 43 -128 111 -112 -119 45 240 336 -228 -160 30 13 -6 -108 -18 -11 43 -143 182 144 16 5 107
4434 107 -267 -287 -56 273 -216 23 63 108 -41 235 -3 -213 269 -121 -74 -91 -9 -333 32 115 140 -263 -98
4457 -98 -19 -123 13 -55 32 -20 156 67 -172 151 -12 47 54 140 -230 -282 306 69 -144 13 72 -3 48 -104 10
4482 10 -3 95 132 -50 67 158 -24 43 -274 -94 -129 293 -72 -205 85 -31 -285 -47 59 -400 -135 -222 128
4505 128 8 -44 -127 -33 194 -78 31 -2 87 -127 32 182 268 20 -70 -36 -229 85 -113 -78 26 210 -218
4528 -218 -70 161 299 45 98 -122 109 -84 278 -153 -130 15 270 37 -97 73 101 -286 -38 -113 -170 111
4550 111 10 -403 91 112 -280 -103 106 -175 129 81 8 4 138 -44 145 16 -239 -54 -58 43 -217 -249 -208
4573 -208 38 -199 -132 154 163 -271 4 -80 -100 138 -20 -2 -41 140 27 126 -101 2 -254 54 113 115 -1 105
4597 105 -202 -44 -50 66 -87 -54 -105 72 -324 63 192 -41 -152 16 -199 185 48 98 1 134 27 -67
4619 -67 137 258 -121 -44 -39 -69 201 -72 -335 72 -51 94 -78 98 71 -137 -60 -53 -61 -17 -19 -127 -172 -69 19
4644 19 -42 -59 -144 -17 -58 50 237 -82 -61 299 179 -160 51 62 39 140 259 -149 40 136 -148 75 46
4667 46 198 -20 239 94 40 108 -36 -100 -108 197 -212 39 15 84 -99 -38 141 30 -5 140 191 -28 258 39
4691 39 104 -121 174 -214 168 121 -63 -79 -170 178 -151 50 274 -46 322 27 47 -83 -19 7 -78 4 -68 -87
4715 -87 72 -38 -178 259 75 346 -105 36 132 -99 -133 35 84 -61 -258 260 5 22 -153 128 25 -67
4737 -67 -93 39 188 93 -471 53 82 -81 -263 -1 415 -434 -318 156 105 -40 -30 -309 178 129 225 -53 34
4760 34 -247 -32 -6 152 -285 250 277 188 168 -174 135 59 -127 49 20 -197 208 51 98 -37 -121 -147 45
4783 45 181 151 128 221 196 48 93 145 173 -23 82 58 -9 134 -143 164 119 -100 -307 -114 146 273 -59 19
4807 19 106 -66 -12 155 49 -41 1 92 -176 -26 107 -297 21 -86 -34 -74 23 -98 -23 -62 -13 -64 -40 10 62
4832 62 -55 234 242 -34 -2 -97 -152 -30 40 16 117 172 -162 -129 -61 156 38 34 -147 -164 -26 149 -182 157 -42
4857 -42 -19 119 45 -122 -23 110 -140 -110 66 111 0 132 -242 323 -162 17 109 200 67 147 -136 18 191
4880 191 172 -127 103 21 -16 -193 145 240 10 -201 172 -2 1 -151 224 -71 132 -77 -31 203 107 79 -8
4903 -8 160 -133 320 184 245 -68 -289 234 -41 93 -50 10 -128 208 157 -99 44 -92 -73 -74 -93 -108 -185 -55
4927 -55 87 -127 121 294 -210 10 26 -153 -210 -40 -54 48 57 0 26 -69 -291 -112 120 185 -133 -88 -16 63
4951 63 -50 185 106 121 83 161 -123 -213 -35 -65 -122 -98 101 146 24 201 -253 51 170 251 -204 -156 28 44
4975 44 -178 184 11 -9 -213 77 210 103 -19 -36 -81 98 -219 74 126 79 -28 -186 40 -69 4 -127
4997 -127 53 137 173 82 228 62 -17 202 174 -42 -117 64 -14 115 -91 -91 296 111 105 -187 20 94 32 143
5021 143 -172 -3 -91 -235 -87 126 -242 18 100 18 -38 -129 8 -20 -152 304 -17 -63 -178 10 -274 -83
5043 -83 88 74 15 42 45 -31 198 13 -81 70 202 110 -14 -27 -62 -190 -161 -192 -167 174 -82 13 149 117 72 -44
5069 -44 31 24 -126 -51 18 70 -136 -204 159 54 -162 139 -66 -180 55 120 -75 31 86 -86 -143 221 -65 -105
5093 -105 5 185 -110 -99 67 -132 -29 135 -69 -59 -102 150 24 263 -101 -187 165 -11 -7 -50 138 169 -84
5116 -84 87 138 -82 -20 -174 -90 -248 129 213 -180 -144 -158 -19 16 -40 218 94 163 31 -226 118 -102 6
5139 6 -132 290 -18 -25 34 -211 -91 -321 -186 125 -120 -244 -310 286 301 82 259 353 -85 -260 173 -168 -29
5162 -29 -155 -131 -169 160 -34 -30 298 -125 60 -104 76 194 -27 -170 -18 -79 -148 79 -174 -115 14 213 -108
5185 -108 -27 -239 27 -72 104 -41 -197 -57 123 -84 -19 -178 -81 9 -69 -57 -108 -203 -155 -168 63 47 -109 -45
5209 -45 48 -244 68 148 93 -215 -16 115 -25 -57 87 153 -50 -77 110 87 -46 67 100 66 94 -28 -47 -156
5233 -156 49 -175 289 61 -240 -14 246 4 -82 71 187 303 162 -193 -3 -149 -9 -90 117 -69 145
5254 145 -74 122 162 -159 -141 110 329 -151 134 82 154 88 38 152 -114 -96 -44 273 332 -105 21 -119 192
5277 192 -134 -118 28 -21 -223 4 -32 -117 -290 -197 -84 -296 -182 83 117 -39 -150 -20 -148 287 -15 -86
5299 -86 82 -254 -332 -106 220 162 -22 166 -58 336 -103 215 66 120 -94 12 -37 110 -67 -21 164 -244
5321 -244 -333 -169 -56 -244 109 194 -325 0 13 -2 212 284 173 56 280 168 310 -135 -6 -150 -17 149
5343 149 -10 0 -280 31 220 -92 -144 216 -68 -55 -87 -265 -168 -47 -27 -231 22 -39 -187 37 -35 75 157
5366 157 -147 167 -118 -342 -50 155 153 337 11 -92 33 41 23 169 139 -9 -75 179 284 -119 143 59 269
5389 269 -21 -131 52 64 -62 84 2 152 38 -70 193 76 1 2 131 -33 -146 28 -225 -164 -210 -63
5411 -63 -58 -209 75 88 -103 149 117 -67 90 116 152 74 340 29 -212 42 -166 214 79 232 188 -124 -18
5434 -18 2 -90 157 -79 168 51 -199 -59 49 39 -188 -167 50 41 -112 151 -31 91 -52 164 58 172
5456 172 -132 -19 -91 -71 -30 8 -27 25 -100 83 -53 -154 118 -108 1 -225 6 -53 207 200 11 -109 -54
5479 -54 -11 14 -42 52 -98 -171 94 -107 29 -87 41 -29 288 127 -239 -17 -129 78 -79 -68 -26 2 -323
5502 -323 387 41 -216 223 76 131 158 335 189 274 146 -143 -23 162 76 191 -198 -162 -170 -357 209 87
5524 87 -60 2 25 223 112 193 -97 -121 -118 156 -154 51 -41 -167 -55 -201 46 86 -73 107 27 -209 -20
5547 -20 -56 -23 -87 46 -77 -148 38 -58 20 46 -82 -58 131 -5 13 106 -22 -142 -115 257 157 196 150 81 -241
5572 -241 366 138 162 40 86 73 -31 68 -76 95 27 -128 31 50 -22 -114 24 161 79 -258 -208 -24 224
5595 224 -19 -15 -142 104 -46 -75 235 -133 19 140 -196 16 62 -88 -21 -200 -50 -116 161 -121 18 -187
5617 -187 -189 -68 -6 -42 55 -7 98 -157 -98 92 128 -51 -265 193 -181 -57 175 -26 -307 21 37 -57 301
5640 301 -210 70 114 57 107 -230 94 -224 7 193 51 -183 -189 213 -203 179 137 -205 -42 -77 -93 -72 132
5663 132 22 84 -41 173 -130 -117 -7 -4 -190 -106 -13 210 130 -59 171 -122 -116 -38 -35 -68 -15 -276 283 110 -262
5688 -262 38 101 -29 -367 -91 399 -254 83 111 -76 -18 -166 -112 -62 29 181 2 47 -43 68 -222 5 -174
5711 -174 193 -6 -143 111 -74 -7 78 -51 -156 10 -39 156 -55 -70 -187 -128 150 -64 18 -98 -101 21 -74
5734 -74 -82 -57 164 151 -139 -114 34 -52 -57 43 7 -11 56 -27 -75 265 52 -152 115 265 22 27 -90 -42 -34 -155
5760 -155 95 61 -41 54 180 -34 117 300 -293 -117 -25 165 -211 -19 -6 -136 -9 242 -73 61 -100
5781 -100 34 -123 62 209 66 19 52 -10 -15 -20 222 0 0 -138 89 64 -96 26 32 -35 -15 41 -146 -206 -147 27
5807 27 37 36 -52 9 36 52 99 -186 2 215 -204 -328 -214 -112 138 40 -101 -31 116 82 4 141 -28 56 -77
5832 -77 207 167 -183 57 199 213 -137 170 -73 23 -116 -67 -24 -125 -49 -40 257 135 -75 -47 -59 142 56 -108
5856 -108 335 -137 -87 75 150 86 -23 -241 73 -9 -30 -69 -21 225 -217 -51 157 -46 125 7 -208 -137 -121
5879 -121 148 -204 38 -96 182 143 27 -15 -236 -25 -79 80 -22 -140 -115 74 -53 -35 -96 37 -80 67
5901 67 40 -163 -199 143 -202 148 214 31 -125 -139 -45 67 159 -157 198 26 -125 -107 67 60 290 -25 141
5924 141 -153 -54 202 -73 92 9 -8 -18 35 -144 -166 -155 155 -109 -11 149 189 -118 88 49 93 -140 -39 272
5948 272 -59 -75 -74 94 -79 -95 228 7 -96 67 67 180 -110 -373 32 -1 -185 -76 -165 -134 99 -169 30
5971 30 69 -8 10 65 -24 89 177 137 -2 -21 -211 36 -83 23 -381 66 -116 -161 -46 -178 -72 -111 50 -152
5995 -152 71 27 209 -197 149 235 -76 7 190 -108 165 93 -76 -38 243 -118 78 -1 -150 149 -161 84
6017 84 -222 -197 10 53 31 249 -63 -106 -189 31 187 -278 2 -37 -249 243 -75 -54 -106 -41 5 -25 -17 -101 -61
6042 -61 95 -99 -258 118 -68 -13 52 -131 -106 -77 -138 -115 419 -12 88 54 -158 215 -114 -172 -7 103 -295
6065 -295 -181 159 -35 -3 154 8 -8 -6 -84 -163 33 117 165 -81 -117 -356 -245 15 26 -261 -70 133 -93
6088 -93 -111 -201 -36 -166 36 -59 -50 94 169 185 162 154 34 -71 38 106 -53 159 143 279 7 -132 36 -58 -240
6113 -240 30 -273 85 204 -169 115 -23 -98 148 -207 -100 -150 -326 90 72 93 -43 -39 -220 -73 -80 143 -133
6136 -133 -170 -86 111 -49 -36 131 -44 -133 -136 6 30 -203 -5 147 -26 -86 133 -176 126 120 73 86 143 106 64
6161 64 238 -198 275 -9 -158 -191 19 -89 207 4 -44 12 -81 -8 -230 79 127 -40 90 -163 -81 -21 47
6184 47 147 -19 64 -142 82 105 47 -58 -88 193 18 -10 -9 178 -128 183 -155 -52 65 117 38 122 -73 15
6208 15 -117 -33 156 40 -40 47 -181 -95 -62 4 26 173 259 -6 -172 -22 120 -182 54 -283 8 168 -77
6231 -77 -244 71 -144 -122 71 313 -40 -17 -136 -142 -95 -60 -103 -17 -153 68 138 -114 -150 -115 141 -68 121 129 -174
6256 -174 324 -93 272 193 100 178 -6 -69 139 291 182 43 -71 330 -147 58 -49 90 -103 10 -62 -3
6278 -3 32 -87 121 265 -171 -45 -143 -282 -17 -89 -173 27 -139 41 184 -87 -71 36 -80 -10 -104 162 28
6301 28 97 175 33 83 120 -23 -87 -58 16 -18 30 -13 -121 -65 -178 185 110 -113 -17 43 73 16 148 108 -56 -96
6327 -96 -56 -35 145 -81 -139 119 -40 -223 149 223 -157 120 -36 -236 28 51 -56 -80 270 -284 172 61
6349 61 58 -148 -91 96 -77 32 -135 28 -211 -8 50 136 -32 -27 -15 -220 132 20 214 -191 207 -26 -222
6372 -222 139 -127 66 -94 -105 -115 -89 4 -204 115 245 -80 -66 -120 31 219 214 207 335 112 140 122 -274 -13
6396 -13 12 -7 -122 -179 46 -84 48 178 94 -6 22 84 97 175 -210 -46 -299 -85 50 -7 89 203 -106 -78
6420 -78 -165 64 240 -222 -122 57 -34 -122 -67 -227 -79 -74 -217 119 -195 -29 284 41 -141 52 -152 -81 141
6443 141 -57 -24 -274 152 12 53 -60 10 -45 99 178 -140 18 15 -71 87 -1 136 -68 35 18 94 -141 161
6467 161 -52 -151 -139 -24 -47 -92 183 -157 83 152 -53 96 107 8 -305 139 -267 27 143 -26 -194 -248 109
6490 109 -375 44 76 -59 -309 143 109 -123 137 132 133 -19 4 211 103 15 4 -59 84 -42 -94 119 6 10
6514 10 29 121 -177 -226 44 200 137 -139 96 -129 -28 -66 -72 128 36 59 87 54 -74 -281 -272 178 -75 -156 39
6539 39 47 40 73 -245 211 127 98 -84 -108 -28 -64 35 -119 -75 -97 56 -41 9 -133 187 219 4 21 96 30 38 92 -14
6567 -14 -151 -77 -123 -141 323 48 -131 -56 96 -197 -50 46 319 -88 209 -60 20 121 92 47 -232 88 -112
6590 -112 -158 -20 -259 -76 -115 258 -142 11 22 -63 175 -97 -117 213 -37 165 -29 174 -2 -123 -29 -120
6612 -120 295 96 112 -20 -61 -21 -218 260 -35 50 400 -41 -243 -196 -42 -33 -178 -148 -6 24 315 13 40
6635 40 118 -221 143 52 -112 -59 19 -27 -115 195 181 -185 -49 -38 12 -53 -97 77 57 -28 4 -36 -126 -59 102 -174
6661 -174 -84 187 -225 -171 4 42 17 22 123 -46 -230 -20 -34 -127 -50 -109 -177 33 -191 118 32 80 -25 99
6685 99 -28 -85 67 16 -66 -35 -94 -16 156 6 -82 -130 -160 -174 -56 -164 -91 219 -69 -60 212 -64 70 120 19
6710 19 143 -302 10 -17 -117 -192 -10 -217 -281 -28 -100 -203 57 127 -22 234 -152 38 186 157 -256 132
6732 132 -44 39 -12 49 -59 6 36 -4 139 17 182 -246 -93 302 127 -61 -121 -14 19 187 -107 142 44
6755 44 210 203 116 27 -61 -251 -215 25 64 176 317 182 -78 -94 -316 90 118 513 -105 -145 -59 88 150 83 193
6780 193 -16 178 -310 35 128 -2 59 -58 215 146 52 10 -4 371 -69 160 130 64 -166 51 -33 -82 -93 157
6804 157 -111 -167 -2 40 -72 -13 228 -70 113 -65 64 68 -131 156 -337 90 -6 87 34 -5 68 -20 -97 -155
6828 -155 34 172 182 -9 28 100 -142 -86 1 -27 -167 28 111 -22 10 -95 138 225 112 13 182 260 -146 -211
6852 -211 44 173 112 -78 -78 -120 -68 58 -216 -128 -108 77 -155 51 16 -150 -128 23 -103 25 148 -167 -135
6875 -135 170 244 44 -178 79 -176 160 225 -53 -229 64 -65 -42 158 257 -263 94 153 -4 72 -55 333
6897 333 -30 -86 144 -14 -109 -29 11 300 -11 -29 73 93 13 97 -57 150 -30 -62 -17 -65 109 -9 -118 141
6921 141 -86 107 161 -139 -41 15 88 97 170 230 193 23 -107 -274 -168 -224 -26 -126 -158 51 178 24 0 154
6945 154 66 -111 146 -88 -36 -162 81 -109 30 -44 -27 109 -57 62 -84 33 -240 56 -6 -143 -62 -36
6967 -36 53 254 -56 -255 -47 -85 -164 -313 147 67 -154 -109 130 -70 -68 9 295 390 -13 81 -224 115 137 123
6991 123 -106 55 87 43 159 -145 -3 -176 -53 -201 105 15 -229 118 -69 43 -188 1 4 81 -41 -167
7013 -167 -29 -229 102 -100 -134 81 180 4 138 -166 103 150 -165 70 41 -84 12 -33 -25 -163 -107 -286 107
7036 107 19 -58 38 -107 383 -63 47 10 -97 -72 -132 396 159 163 67 115 -31 146 92 57 72 -133 -103 241 141
7061 141 -52 58 203 -78 -293 87 82 136 -40 156 84 -118 203 -43 58 142 38 2 181 -9 70 -30
7083 -30 -165 -103 -52 24 -51 174 120 26 -30 -124 82 -280 82 30 -2 96 13 15 -202 189 75 272 -147 207 31
7108 31 247 -131 98 -151 -92 -224 -276 194 -151 -188 241 170 122 -51 264 -30 108 227 97 121 13 -7 -179
7131 -179 -89 16 5 -208 112 -143 -166 98 -267 -112 -40 17 -14 -18 -7 -25 -178 26 157 48 -52 -127 -118 63
7155 63 152 -36 154 55 418 -128 -170 14 -51 298 150 37 20 114 -430 -282 131 155 34 7 66 -73 63
7178 63 74 11 -120 154 311 123 67 -70 267 -148 -51 -216 4 33 259 -89 129 -140 112 -17 40 -59 -492
7201 -492 -99 26 -255 -71 -30 -23 -220 -40 -91 -73 107 114 -60 167 101 112 91 -29 43 -39 -22 -81 -161 -86 90
7226 90 214 248 42 31 -51 288 133 -114 2 58 -217 -12 220 0 -27 117 -15 47 27 109 21 113 -25 -141
7250 -141 169 -15 -144 171 -107 -168 287 -3 122 27 -288 -300 360 -258 -152 177 99 -28 152 -207 69
7271 69 -129 -214 -128 0 71 -5 201 -109 -140 -22 180 -105 -64 24 -66 198 -195 92 -126 -262 164 198 37
7294 37 -126 -128 -133 39 -7 40 122 -75 168 -61 -157 245 41 -69 -13 -78 -56 5 88 -49 -10 87 68 -36 105 106
7320 106 104 126 296 244 35 -167 314 89 19 -126 75 -196 -81 -139 270 -106 194 -221 124 -62 111 136
7342 136 -206 47 -193 -162 -83 -54 3 52 -95 37 392 -182 -175 31 -4 67 -30 5 -140 148 -201 9 112 46
7366 46 -92 146 24 -59 -183 -74 149 -129 243 124 -137 -77 6 -96 -27 -210 170 -303 -127 -25 -56 -291
7388 -291 83 -28 -294 99 -63 47 -163 269 -16 -153 117 -66 105 227 47 125 -3 147 142 -69 230
7409 230 -125 32 -88 -21 83 -210 -35 -152 -50 -27 -114 174 266 80 -194 -27 268 121 85 23 75 250
7431 250 48 -250 126 23 28 74 9 -44 -127 21 -123 -85 -196 -60 309 -35 -128 116 -124 -39 41 135 -23 -203
7455 -203 -54 -102 -1 49 -55 37 166 -40 139 -26 63 -21 42 -192 177 -65 29 61 178 -96 67 -5 -215
7478 -215 -240 204 -95 3 135 -353 -48 -47 -4 21 358 -49 -2 -131 -123 67 -109 35 156 -289 102 -126 -61
7501 -61 -54 198 -185 155 219 200 30 146 23 -78 -143 99 -119 -116 -50 -93 -213 184 38 -19 212 0 -31 185
7525 185 144 -103 -9 197 -88 -241 226 27 -41 31 63 -62 -51 99 27 -26 -18 230 52 225 -89 4 -173 95
7549 95 74 -5 240 63 -247 -66 31 -140 121 39 -63 158 -76 -64 41 -129 35 7 -26 279 50 87 -87
7572 -87 -2 18 -67 183 48 202 66 20 -183 -72 6 -6 -15 144 138 -177 152 -225 -25 105 70 19 49 -129 -58
7597 -58 19 48 30 -247 -112 152 22 -123 -36 -6 -171 103 -160 -37 107 59 98 91 -11 33 59 221 -108 23
7621 23 111 -15 125 -168 135 -9 36 113 -83 -75 70 31 -198 -8 -42 -146 67 -121 33 29 -31 -136 168 390
7645 390 -157 54 242 8 326 -26 -43 28 166 2 -116 106 -45 199 -47 76 -241 240 -36 1 -69
7666 -69 59 -89 -72 94 50 -41 -48 -106 -17 113 -82 75 -143 -134 -152 87 17 122 -82 -241 202 228 -43 -133 37
7691 37 171 30 38 89 119 50 52 121 89 -215 86 -241 124 -67 70 56 -164 -100 -19 18 164 -58 -89 206 54
7716 54 -76 -94 86 156 82 214 30 -204 166 -6 -159 80 228 354 -11 75 -348 -18 177 -179 29 -48
7738 -48 -1 -35 -327 77 53 76 30 103 348 29 168 41 -64 -6 -31 61 -194 96 24 201 66 90 143 -29
7762 -29 38 -79 36 196 305 -109 -20 -135 -263 -117 -459 300 -261 -150 -44 -166 72 129 -199 -141 254 -74
7784 -74 -239 116 14 -259 78 -121 148 -201 -34 47 -186 -6 -234 -111 -31 -26 -69 -26 -176 -36 -57 -41 -171
7807 -171 -144 175 -89 -94 87 206 -107 -107 -16 74 320 203 80 82 146 -6 -182 80 -36 274 -207 257 127
7830 127 82 229 -245 -71 55 117 23 118 145 -230 -360 -32 17 -125 -159 98 29 -70 153 -174 138 -13 155
7853 155 106 35 162 107 -28 -279 -16 121 110 -107 -77 206 181 24 -20 266 -50 233 187 -115 -210 377 176
7876 176 25 -16 -109 56 -124 119 -126 222 204 46 77 40 -79 -179 -398 -135 -5 6 44 -77 10 55 22
7899 22 59 -172 -283 41 38 -31 -70 104 -56 -172 5 6 -100 -222 -82 164 -95 -37 -196 112 -37 -312 -78
7922 -78 -195 -21 97 52 -137 73 -138 266 144 88 -101 239 -143 179 41 111 136 -129 42 62 220 -183
7944 -183 136 -77 -124 102 128 77 -213 -174 -60 74 85 81 -91 -55 -169 122 65 -88 -124 -132 -73 21 234 250 65
7969 65 80 52 -88 31 -194 -223 -8 -83 31 78 -65 -7 228 -18 70 -31 -124 103 -81 -42 -34 -30 38 -21 -105 -81
7995 -81 -25 63 -131 -79 -6 -100 62 177 -156 -216 -222 -19 192 -103 146 87 105 -30 -194 16 -363 -148 -253 -4
8019 -4 -172 30 -122 -198 -52 141 139 15 85 -10 28 71 -17 -83 260 -163 -67 179 -121 79 15 148 66 75 55 -251
8045 -251 -30 87 -247 104 -110 -260 -240 21 -89 108 309 24 3 -58 51 -193 -111 -2 -131 -107 -197 16
8067 16 49 -134 19 -177 239 216 86 29 30 -177 -95 -146 271 14 139 -113 96 24 -79 24 -154 301 -45
8090 -45 -20 -263 -116 -197 -97 156 96 -129 56 61 -5 13 -48 -13 -39 31 37 -120 -169 -106 -97 243 -49 -262 -86 -6
8116 -6 -138 44 -207 -23 -36 197 -217 -34 -9 -123 -14 139 -38 157 -25 192 0 -13 99 20 -9 11 65
8139 65 -90 106 -99 -109 -113 48 21 98 60 -14 -75 -22 -30 247 -136 -42 96 311 92 95 -126 2 307 -56 -99
8164 -99 114 110 -155 -169 -185 -208 46 188 -187 -69 72 -10 -332 24 1 80 16 51 -120 -78 21 -50 -74 112 172
8189 172 259 103
8191A03
$$ Imaginary data points
##PAGE= N=2
##DATA TABLE= (X++(I..I)), XYDATA
0 0 0 0 0 0 0 0 8 0 0 -8 8 -8 9 -16 16 -24 32 -36 41 -52 64 -76 88 -104 120 -140 164 -188 213 -244 280 -320
32 -320 358 -406 458 -514 576 -644 717 -799 888 -986 1090 -1204 1330 -1469 1618 -1782 1964
49 1964 -2162 2384 -2628 2896 -3199 3542 -3930 4376 -4891 5500 -6227 7114 -8227 9657
63 9657 -11583 14314 -18467 25489 -39511 77968 -404072 -1042251 274668 439532 -327687
74 -327687 94361 614156 60773 128581 563185 -176100 -789777 -53341 189651 -380780
84 -380780 -159551 339635 77603 1822 206274 -170218 -407198 111456 217358 -175089
94 -175089 79283 488980 194501 -32569 19889 -262938 -384745 -44700 -81017 -298538
104 -298538 108570 451197 90729 -73420 151260 -47989 -265842 44337 103271 -148078
114 -148078 109715 419344 77434 -224611 -62860 -97408 -308855 -144231 29429 -46725
124 -46725 146682 394843 140247 -106357 47023 24619 -246409 -166127 92700 25735 -10264
135 -10264 208361 124388 -203147 -165993 6321 -124447 -205120 49873 242439 176711 154261
146 154261 163302 -6999 -142598 -103804 -113691 -164464 -68226 90687 120886 60135 23057 -30435
158 -30435 -95302 -84862 -61451 -42017 73869 195866 185859 101861 26051 -53097 -133930 -160850
170 -160850 -150072 -121981 1788 129364 103358 60408 75744 -998 -102704 -62962 -1481
181 -1481 -22175 51534 203442 133191 -44528 -18300 -11314 -190972 -226402 -69801 -8844 12456
193 12456 142054 174028 42862 20980 50613 -83078 -139296 -1738 40431 18983 103816
204 103816 96202 -45642 -57188 -20110 -158360 -209550 4497 112063 45583 111336 172885
215 172885 53732 -10996 -5327 -110092 -156793 -14407 58178 -519 47368 96306 -23416
226 -23416 -78272 -34314 -102578 -115879 51966 121260 54122 98276 159097 28212 -97085
237 -97085 -75125 -99062 -129074 -18670 45219 13534 67427 102504 -8008 -72711 -22081 -36700
249 -36700 -70436 41840 123139 56895 59788 96746 -28923 -146771 -103708 -67590 -88964 -27952
261 -27952 74242 83038 70713 86958 21428 -60024 -42512 -30647 -40503 28451 90246 49538
273 49538 7675 18541 -32332 -127400 -109475 -41282 -36819 13159 112613 119120 67778 48977
285 48977 12543 -59328 -76889 -38795 -29593 -4379 60513 45897 -11755 -6099 -27202 -99896
297 -99896 -86673 -759 30649 40415 110266 132325 44247 -8809 -15175 -71663 -102556 -60702
309 -60702 -22340 6323 46234 49256 8579 -11541 -18420 -59813 -50967 31909 55457 43112 87947
322 87947 95001 12616 -50791 -59098 -85148 -108705 -52636 17998 30093 46437 64754 32641
334 32641 -2757 -19527 -36333 -23821 20391 48125 43766 48314 48914 -14380 -81157 -81844 -75954
347 -75954 -72259 -21172 43375 68408 62413 59527 43783 -4226 -35318 -33993 -28793 -998 32829
360 32829 35298 24055 4748 -34194 -71924 -71415 -39270 -25129 -694 69588 100243 64892 39467
373 39467 22748 -22880 -66026 -58576 -23548 -7715 9295 30655 17754 -2583 -17559 -45911
385 -45911 -47668 -16022 10614 35515 72615 87197 44600 -956 -9577 -45902 -94349 -65433
397 -65433 -9662 129 7525 38094 45891 11680 -16209 -20442 -26160 -6904 32058 41964 45683
410 45683 49891 15682 -27293 -44576 -63641 -85919 -57966 12066 33485 23829 58180 67336 10651
423 10651 -19943 -10082 -13020 -13263 13005 29603 17969 16700 5267 -48232 -70109 -48888 -48346
436 -48346 -26597 35897 59317 47496 61661 62356 -1255 -46591 -17093 -11278 -39376 -12070 22892
449 22892 15256 9071 -5101 -46575 -56532 -21433 -2683 -703 40974 73640 48498 40550 37297
462 37297 -26628 -67331 -35891 -22694 -38410 -10489 35902 26393 -2051 -1475 -14900 -30074 -7123
475 -7123 4027 8168 47968 64277 29067 4565 -1513 -38005 -73799 -46497 -12919 -19257 8204
488 8204 53631 37472 5953 6764 1654 -20154 -22727 1534 19356 28266 32809 8899 -16178
501 -16178 -20942 -42518 -57899 -29023 1000 10806 32246 59288 48705 6701 -8262 -8361 -26554
514 -26554 -28655 -8279 7200 18084 14855 -952 -13073 -23760 -33624 -32758 -8365 22149 31583
527 31583 43067 57127 30023 -10702 -21100 -22828 -34523 -39923 -16957 14636 18375 8407 2347
540 2347 -4333 -10442 -20004 -18071 8975 30976 38928 40788 27755 4660 -19973 -33839 -35179 -41606
554 -41606 -36855 -4809 28060 34358 12308 547 11871 -812 -23861 -7409 19823 22282 17999
567 17999 23583 17435 -13914 -34036 -35615 -41994 -31112 -2464 16008 30701 35987 21310 11115
580 11115 6843 -9403 -27525 -13327 17620 12997 -672 14239 9729 -21121 -35085 -33222 -23625
593 -23625 -3692 15727 25645 32165 39209 25986 -1865 -11600 -23948 -37749 -11439 13821 -1685
606 -1685 -6413 15227 12544 -20352 -28822 -8982 -3417 4521 26312 30037 31052 33085 4370 -26176
620 -26176 -27357 -26883 -33264 -18785 9132 8864 2827 24345 19350 -17286 -16374 5508 3837 3420 21239
635 21239 32037 19485 901 -15275 -31151 -30248 -25987 -32045 -9291 25707 23076 15437 26446
648 26446 19077 -9969 -15094 3727 1766 -3981 16665 19932 -3394 -12007 -16219 -27101 -28986 -23967
662 -23967 -11818 13501 36373 33185 16937 20046 14382 -16940 -21263 -3699 -7603 -10367 5231
675 5231 11851 -1016 -12841 -14621 -20228 -19479 -901 10778 20740 35099 27820 14324 12101 -4615
689 -4615 -29723 -30117 -11449 -6604 -11261 5464 18027 2279 -8328 -7662 -8427 -1834 5229 11066
703 11066 23100 27318 17608 2939 -6991 -18739 -36384 -29540 -5615 -2246 -481 15504 21584
716 21584 11258 -1953 -3430 1246 -1959 -1465 9094 19612 17912 -1317 -12836 -12282 -25682 -32658
730 -32658 -13419 1880 5258 13461 27058 26353 7944 -2296 -3383 -8711 -8196 -4509 2245 13314
744 13314 5365 -11509 -11632 -9081 -18029 -20686 -2224 15699 14270 20285 31739 16870 -3374 -9320
758 -9320 -14876 -15933 -12023 -7440 42 6277 5296 -4066 -6272 -90 -10193 -13940 11131 23910 15572
773 15572 16989 18754 4073 -15178 -18607 -16750 -21894 -14987 -1211 4279 14222 15066 -942 -2128
787 -2128 4615 -2715 -5882 10134 20043 6776 1851 11713 -4627 -27611 -22064 -14911 -15864 -5506
801 -5506 10056 18390 18492 14236 5304 -735 3184 -3539 -13397 3721 14363 -1941 -4230 3889
815 3889 -8862 -26015 -18757 -2989 -2943 3194 21678 22422 13857 12881 2658 -6035 -7368 -14345 -14603
830 -14603 507 9136 -1405 -6684 3499 -3961 -20008 -6215 8084 3160 7912 20717 20671 10059
844 10059 567 -6139 -15560 -17164 -13475 -11319 1845 11037 626 409 9437 843 -9768 -2454
858 -2454 8696 6018 4384 16054 13952 -3234 -10098 -14155 -17460 -13497 -10512 -2913 9858 13164
872 13164 8987 8868 11190 749 -13150 -3226 8495 906 47 6657 2412 -7271 -13566 -12358 -10486
887 -10486 -10977 -3032 8790 18104 18899 9259 7320 6977 -7472 -12785 -3449 -1090 -5687 -4520 4202
902 4202 3058 -9056 -11079 -6881 -5234 212 5142 13579 22032 13783 3590 3220 -1319 -12683 -17449
917 -17449 -8847 -3114 -6872 628 8570 722 -4516 -3383 -2854 1827 5055 7460 13557 14795 6901
932 6901 -4229 -3836 -3837 -19593 -21600 -2799 1801 -752 6425 10421 4230 -1528 674 2298 -457
947 -457 2889 5110 5904 11056 1190 -11998 -6929 -7628 -18872 -13363 5374 10123 1115 8144 17495
962 17495 5061 -3567 552 -3514 -5106 137 1619 2886 3276 -3785 -10514 -7213 -3225 -10911 -5979
977 -5979 14431 11699 1832 13992 17021 -1578 -11917 -6276 -4195 -7879 -2999 1403 -2262 1942
991 1942 2647 -6270 -3185 769 -4813 1390 14953 12799 2955 6137 8461 -9403 -17786 -5250 -5397
1006 -5397 -11105 -2712 4007 4786 6674 3209 -2019 -1176 3691 707 231 12163 9840 -3724 621
1021 621 1541 -12949 -15967 -6337 -3985 -6292 1195 12290 10077 5097 4311 -1776 -889 2751 -3411
1036 -3411 -404 7549 2166 -6208 -2267 1233 -10818 -17104 -1739 4611 22 7114 13246 8310
1050 8310 3775 549 -1935 -3108 -4609 -5363 -2503 4696 2556 -5791 -718 1045 -10584 -7859 5472
1065 5472 6617 1831 5551 12426 7200 -2576 -3887 -5276 -7111 -5866 -6374 209 7208 1374 -2498
1080 -2498 1926 1669 -3716 -2723 5187 4448 -428 7180 9880 -1281 -7512 -7966 -6885 -4343 -5307 -2862
1096 -2862 4275 8421 4794 728 4482 4267 -6085 -4210 4297 1704 755 3440 948 -4602 -7363
1111 -7363 -5465 -4254 -4131 -1039 1825 8266 12409 2797 -549 5662 -625 -9723 -4809 3067 986
1126 986 -4030 117 1739 -4578 -4036 -1925 -3539 802 3271 4964 10680 8927 63 -2407 446
1141 446 -3890 -12608 -5068 5009 -3864 -5245 5611 4941 -2382 -3148 -692 1527 3474 6080 5062
1156 5062 4441 5488 -2470 -7163 -1796 -6527 -12827 -2803 4403 -315 244 7817 6240 -3997 -958
1171 -958 5622 610 -290 2600 1354 3270 1912 -6778 -8339 -3223 -4430 -9013 -940 10759 4196
1186 4196 63 9273 5989 -2852 -72 1707 -2929 -4179 1138 3081 -614 -3026 -6081 -6605 452
1201 452 -730 -6005 4911 11947 3309 1044 7603 4966 -6694 -6869 -52 -3674 -4139 2317 736
1216 736 -2485 -476 -1663 -879 876 -372 -216 6042 9743 1572 -1932 5278 -340 -11891 -6399
1231 -6399 -171 -2494 -2590 1248 3321 1610 2097 1686 -1014 606 1571 -643 4847 6310 -2517 -3406
1247 -3406 446 -3761 -9915 -5384 2184 -312 -2175 5933 7452 3377 2110 -832 -1256 1639 -435
1262 -435 -1242 1129 1013 -3276 -4560 517 -2893 -9684 -2161 4875 1817 2975 7005 6534 2015 -1676
1278 -1676 -750 -10 -1895 -3517 -4122 1590 3271 -4401 -3010 1819 -3500 -5474 2227 6609 2996 1201
1294 1201 6132 5191 -1719 -2176 -2774 -3529 -2615 -3979 -1504 4415 1417 -3639 -1373 2566 -1272 -4557
1310 -4557 3488 6404 -1255 929 6208 1427 -3261 -3993 -3534 -2450 -1959 -772 972 3475 2956 -2374
1326 -2374 237 4526 -3172 -4743 2977 3294 -1483 416 3860 -468 -5859 -2296 -361 -2099 1132
1341 1132 1279 1221 5528 3093 -2538 -122 1804 -3862 -6197 1686 4546 -2885 -1657 3768 -1396 -3643
1357 -3643 219 433 -9 1015 2021 3730 4167 1800 -4218 -3521 1153 -4309 -6000 2968 2297 -4366
1373 -4366 263 5800 1216 -4193 -480 3095 475 1557 3465 949 1600 -773 -5217 -1702 -84
1388 -84 -5333 -4917 3103 4538 -1624 944 6503 -532 -4615 2152 3193 -764 7 1557 1152 -218
1404 -218 -1822 -3390 -2759 -722 -3358 -2570 6020 5043 -1818 2013 4534 -1322 -3797 507 2023 -3135
1420 -3135 -1962 2628 727 -1007 -1081 -3382 -1248 1326 -1458 619 5202 3417 -1594 250 3831
1435 3831 -2307 -6384 351 753 -3127 -57 2610 1280 -362 -1404 -466 1139 1393 -467 -658 4541
1451 4541 2753 -3882 -166 1780 -4915 -5552 1 1726 -778 223 3995 1701 -304 1433 703
1466 703 133 -54 -2648 847 4422 -629 -4719 -1619 446 -3470 -4399 2343 2431 -1623 2506 5154
1482 5154 2025 567 -803 -1104 -12 -647 -747 -353 1153 -1345 -4784 877 2427 -4408 -2603 4165
1498 4165 3241 617 2557 4339 889 -2549 -1263 -1469 -1638 -264 -2588 -1263 2468 -1398 -2598 1679
1514 1679 1245 -3150 -1089 5375 3593 -1351 1782 3562 -1926 -2467 -1501 -1809 -1182 -1863 -1959 1404 3169
1531 3169 12 -2745 1503 2837 -2710 -232 5368 669 -2494 1654 2359 -2778 -3970 -1345 -910
1546 -910 -2044 72 1025 1470 3219 -685 -1814 3208 1758 -3322 -728 3474 850 -3011 1126 1930
1562 1930 -4154 -3567 579 -618 139 1642 869 1764 2079 253 -678 924 -36 -4108 -1306 4712 -124
1579 -124 -3641 954 1499 -2509 -1285 1472 840 -835 1270 2003 1259 2192 -1186 -3734 226 174 -3564
1596 -3564 280 3202 -608 -2538 2207 3436 -2687 -2298 2628 736 -826 1162 1203 739 -312 -3087
1612 -3087 -2298 502 -201 -2740 -310 4292 269 -2184 3558 2306 -3256 -833 2417 588 -1348
1627 -1348 -63 1311 -1187 -1998 -1536 -1120 719 -781 -2942 2417 5019 -258 -1313 2190 1891 -2836
1643 -2836 -1362 2607 -794 -2638 849 832 -1031 -762 -1376 -1023 279 -58 176 2438 3009 -849 -1869
1660 -1869 2839 1151 -4123 -1142 1611 -1053 -1212 1038 1640 -911 -1390 -391 -357 1193 1418 -1327 935
1677 935 2548 -1389 -1027 2002 -744 -3941 -956 2969 557 -1637 1433 1429 -932 -34 -290 -205 759
1694 759 -1324 -1455 1528 1826 -1686 -2587 1333 465 -3239 1376 3792 -575 -568 2460 1793 -985 -1178
1711 -1178 -394 -834 -819 -836 -1134 1029 1359 -2913 -1273 3211 206 -2108 1757 3935 380 -543 2575
1728 2575 1047 -2744 -1445 -580 -1806 -1182 -908 -1149 1044 317 -1382 386 2935 486 -2489 2429
1744 2429 4380 -717 -1046 1793 -917 -2912 -1187 -806 -1109 -1456 -313 97 1180 1995 -618 -176 2913
1761 2913 132 -1372 3190 2475 -2099 -1769 1316 -25 -3580 -1587 19 -1274 -238 1048 598 1927
1777 1927 919 -1047 819 2352 -52 -1894 1181 1990 -2524 -1527 2453 -1373 -3866 -411 1085
1792 1085 232 104 1362 836 580 548 -622 -435 1590 -1678 -2867 1929 1639 -2323 -1012 1473 -227
1809 -227 -2266 646 2826 -724 -337 1549 496 632 -174 -2231 -718 388 -1643 -1634 1649 1368 -2107
1826 -2107 -657 3156 80 -2200 1636 1975 -345 -17 1187 675 -719 -1347 -1438 -1114 342 -935 -1525
1843 -1525 2088 1104 -2168 840 3283 -77 -1821 880 2162 -465 -617 1062 -672 -1947 -480
1858 -480 -858 141 217 -2039 -332 2975 1488 -1046 305 2251 -495 -2015 2213 1334 -2357 -806
1874 -806 847 -122 -1095 -1344 -752 -378 407 198 371 2473 994 -1894 772 2157 -1571 -1746 1344
1891 1344 380 -1872 -645 1863 -117 -1787 -165 -418 21 1631 139 306 1771 81 -1178 814
1907 814 1658 -1906 -2539 1716 1346 -1860 5 1319 -1043 -539 552 340 163 -112 -123 440 1708 45
1925 45 -2428 206 1630 -1973 -1367 2396 552 -1602 254 1701 4 -1459 344 415 -746 129
1941 129 -489 144 1796 -764 -2084 443 1251 -1440 -716 1957 754 -2564 919 2784 -1263 -2125
1957 -2125 36 76 -187 49 -93 -122 180 -300 -592 855 1158 -2167 -631 2977 774 -1506 496 1043
1975 1043 -1104 -1618 689 422 -1544 -175 473 184 862 -116 -1223 1354 695 -1435 -97 2086 506
1992 506 -2120 -92 1273 -1657 -1158 1223 -437 -1065 167 867 958 469 -629 -517 635 1433 -936
2009 -936 -580 1634 -441 -1738 972 1049 -2086 -1865 781 1198 -250 220 738 -61 854 125 -1028 756
2027 756 249 -1546 405 1521 -1000 -1736 781 1260 -2107 -1572 1801 437 -558 664 654 52 241
2044 241 -297 125 127 -402 -1348 410 2082 -882 -2799 1208 904 -1439 136 1375 -165 -1183 740
2061 740 1799 -414 -977 -536 -692 1002 517 -1475 187 1318 -1140 -538 1559 672 -1652 -375 2085
2078 2085 155 -1312 918 442 -812 -568 -554 119 307 -359 -610 403 1661 -354 -1024 1844 647
2095 647 -2267 273 2125 -463 -1124 -173 240 -742 -465 389 -588 -287 500 -2 1399 1335 -1617 -590
2113 -590 1997 415 -1780 -441 1508 -927 -1497 775 449 -1771 -361 555 431 708 155 262 981
2130 981 835 -484 -820 1181 318 -2599 146 1188 -1534 -992 1286 391 -997 -741 863 985 332
2147 332 575 -256 595 1356 -681 -618 958 -1013 -1776 713 1344 -1219 -1804 1109 1147 -1205 30 885
2165 885 -185 73 329 233 761 -239 -1099 -507 645 -99 -2044 556 1916 -1249 -962 1643 476
2182 476 -956 171 748 76 -447 406 670 -254 -69 -928 -61 1546 -532 -1941 880 1152 -1001 -421
2200 -421 1353 241 -1834 441 1602 -406 -754 159 -65 775 91 -694 4 632 -12 -553 884 1123
2218 1123 -1383 -563 1938 47 -1679 421 885 -591 -379 380 260 -404 -38 -466 -341 900 -123
2235 -123 -521 1526 457 -1746 -25 1552 155 -1578 -351 876 -833 -355 986 -319 -647 45
2251 45 -104 1042 1055 -502 -554 1196 1069 -1108 -863 1246 -755 -1739 826 663 -1074 -385 533 608 -80
2270 -80 21 413 435 651 -344 -533 1452 535 -1513 -147 956 -1050 -1372 700 1032 -1361 -987 1449
2288 1449 584 -513 133 -350 -155 725 -237 158 461 -282 -903 286 1540 -924 -1868 1351 871 -1125
2306 -1125 328 577 -336 -516 193 351 -202 -212 -285 -149 953 472 -1456 551 1336 -1156 -912 932
2324 932 662 -622 -147 1085 -605 -1152 634 283 -90 31 -586 -52 1273 210 -842 -110 770 -134
2342 -134 -681 1137 272 -1881 -6 1404 -331 -730 -275 -28 231 -5 141 110 32 132 -426 1119 1184
2361 1184 -1411 -868 1333 202 -1413 -228 971 -506 -1064 570 539 -243 546 195 172 515 -62 -436
2379 -436 678 356 -1419 -887 1256 520 -1565 -118 836 -895 -474 1222 294 -324 -162 600 953 339
2397 339 -307 -1017 63 748 -923 -428 957 -631 -755 1078 1114 -582 -882 935 962 -369 0 176
2415 176 -315 91 -330 -786 8 -221 -935 -60 874 -365 -1215 870 1728 -770 -386 1284 356 -109 -103
2434 -103 -281 -353 -634 -277 -161 -59 -183 -750 300 1793 -54 -1313 650 731 -503 -35 946 -71
2452 -71 -1273 -52 710 -431 -353 -172 -575 832 475 -794 273 1113 -255 -524 634 1035 -994 -534
2470 -534 1076 -399 -1192 296 239 -285 -113 -85 273 640 320 -107 16 638 -337 -549 910 120 -1879
2489 -1879 -369 990 45 -843 -61 375 -87 63 791 -151 103 55 -511 530 672 -1150 -1214 688 152
2508 152 -1194 -453 1138 -171 -776 901 928 -343 145 614 216 333 -184 -324 180 89 -986 -1074 923
2527 923 396 -1251 381 976 -264 -157 1091 967 -514 -493 527 167 -308 -19 -762 -409 110 -422
2545 -422 -135 900 -284 -902 477 1630 -132 -896 889 630 -763 86 322 -456 -258 -653 -42 169
2563 169 76 -359 -399 512 253 -923 611 1193 -504 -652 694 305 -740 -518 127 -313 -483 243 192
2582 192 -5 70 -610 -41 1152 -150 -951 340 652 -401 -887 760 87 -1643 -81 828 17 -192
2600 -192 142 104 341 180 120 181 507 -40 -900 419 930 -1023 -883 1085 14 -789 63 717 168 -372
2620 -372 706 408 -152 220 -322 -291 653 -509 -775 756 22 -1209 -642 958 301 -848 432 1063
2638 1063 -554 68 555 -36 -139 -349 -458 -93 -19 -289 -683 184 618 -929 -51 1445 40 -1024
2656 -1024 793 714 -129 -384 97 -141 -910 36 -23 -133 78 -414 -620 969 566 -641 66 841 -9
2675 -9 -558 461 796 -985 -697 475 -48 -75 -100 -365 -160 498 -120 165 656 238 -730 64 1200 -201
2695 -201 -1087 660 585 -882 -227 365 -158 -705 -228 360 296 79 63 -350 457 230 -1076 167 712 -738
2715 -738 -827 -38 617 -691 -224 731 -214 -456 588 393 166 109 -290 -69 251 -129 -789 -242 260 -867
2735 -867 -992 818 653 -1257 125 1014 419 -4 436 664 32 -432 -23 -144 213 -418 -1256 60 383
2754 383 -812 -347 983 450 -403 124 1484 117 -750 397 353 -17 -327 -459 -301 219 -376 -278 644
2773 644 423 -291 -329 1253 643 -562 317 525 -606 -166 100 -250 -442 -596 2 -265 187 -81 -474
2792 -474 484 947 -31 87 1031 32 -851 13 547 -237 -572 353 -206 -891 -70 72 -67 309 -106 -388
2812 -388 661 587 -322 -4 611 -190 -1104 184 793 -763 -706 397 305 -411 -141 402 329 505 239 51
2832 51 117 375 -920 -501 1001 -567 -905 200 257 -573 -438 1090 268 -565 69 585 58 438 -27
2851 -27 3 166 61 -520 220 308 -209 -838 250 684 -614 43 854 219 -296 412 372 -68 -162 -386 -273
2872 -273 25 123 -302 -179 625 -528 -553 838 542 -506 -51 937 452 -202 -28 166 -665 -169 -88 -333
2892 -333 263 -231 -570 288 622 -47 -450 444 779 -682 -199 874 -178 -826 101 6 -392 -256 -51
2911 -51 -219 -254 39 101 329 769 -168 -605 625 426 -538 -111 433 -279 -581 -242 350 -380 -338 -40 52
2932 52 290 497 -282 312 546 -421 -45 462 -285 -988 -126 582 -217 -898 402 244 -353 142 481 389
2952 389 -188 29 24 180 254 -413 -615 234 -144 -748 340 903 -284 -386 590 429 -303 46 729 37
2972 37 -19 89 -177 215 -136 -555 -218 546 201 -324 243 521 -324 -430 1140 586 -885 -71 513 -112
2992 -112 -448 -75 -359 -465 14 -230 -85 550 86 -771 571 933 -381 -92 934 64 -575 -304 0
3011 0 -148 -578 33 -155 -17 398 -28 93 573 -35 -131 418 626 -159 -493 346 364 -737 99 343 -406
3032 -406 -256 48 93 356 86 47 352 637 67 -699 215 476 -947 -307 661 -251 -925 113 534 -196
3052 -196 -32 387 164 -32 307 -4 -64 499 -490 -736 168 127 -748 -549 537 55 -574 259 871 52
3072 52 -118 317 86 -45 258 -187 -289 -85 -300 -550 268 347 -975 -598 748 435 -441 573 773 -10
3092 -10 103 524 224 -748 -114 -67 -244 -98 -159 -308 125 -82 -440 484 955 -141 -324 510 775 -334
3112 -334 -124 440 -291 -361 -87 -184 -164 -59 -187 -7 283 454 -298 219 874 -218 -596 708 214 -753
3132 -753 -138 -14 -359 -379 -59 146 -464 -11 61 -19 689 316 -638 144 683 -435 -396 280 270 -733 -185
3153 -185 427 -264 -522 128 23 50 339 287 373 -47 55 -370 11 213 -208 -766 567 -165 -749 -14 519
3174 519 -137 -137 453 531 74 -98 553 -143 -48 -58 -775 -133 76 -688 -286 736 313 -369 96 753 23
3195 23 -380 495 275 -284 -102 11 364 -3 -501 -554 -139 163 -308 -155 530 34 -839 639 764 -520
3215 -520 -408 157 -12 -556 -144 233 -270 -403 221 -228 167 639 -386 145 729 -1 -444 213 472 -463
3235 -463 -486 377 8 -726 2 146 -381 74 -14 67 536 261 95 205 577 7 -529 35 147 -614 -210
3256 -210 266 -272 -589 -222 400 156 64 94 -76 266 287 -414 -91 503 -314 -277 87 225 -504 -322 240
3277 240 193 -160 248 383 -274 56 1 26 144 224 -419 -2 372 -366 -644 263 455 -608 -71 939 43
3298 43 -151 311 516 101 93 194 104 -84 -131 -400 -16 347 186 -375 459 311 -182 18 672 429 -248 397
3320 397 411 -382 -356 111 -20 -50 100 -183 58 182 -191 -274 515 403 -470 -157 536 -355 -508 370 197
3341 197 -314 -237 -266 -9 -211 -7 -96 104 121 113 -175 544 53 -466 237 456 -174 -302 -149 46 -411 -111
3363 -111 282 -176 -90 52 169 187 330 -64 -134 129 109 -435 -240 305 -245 -566 428 -66 -379 -76 241
3384 241 44 107 369 295 288 132 -182 -133 271 -50 -629 179 8 -288 -450 476 348 -421 -90 570 58 -404
3406 -404 67 -59 126 9 -119 -269 128 -291 -669 -132 565 -219 -197 279 210 -274 -3 188 -41 -372 136
3427 136 189 -2 -67 -88 0 53 84 -233 241 558 -496 -155 485 203 -273 -145 203 12 -331 221 368 -328
3449 -328 199 -93 -117 365 -111 -83 204 390 -134 -154 417 135 -735 -55 249 -350 -417 253 80 49 43 259
3471 259 270 286 319 -92 60 434 -383 -376 215 -89 -391 168 91 -81 -462 252 165 -64 314 15 -20 303 -120
3494 -120 -321 195 34 -523 -85 405 -55 -528 4 478 -261 -139 323 274 -140 84 304 -6 81 137 -292
3515 -292 -107 19 -456 -95 529 -271 -367 426 320 -268 -167 477 73 -447 -7 -92 -217 180 79 -107 159
3536 159 61 -323 107 131 96 -284 278 327 -186 -161 405 -170 2 -123 -229 -54 -231 -91 -38 53 -10 -168 159
3559 159 651 -261 -314 376 215 -333 -85 378 -173 -278 202 158 -108 -142 -18 -216 155 533 -323 126 82
3580 82 -242 -193 388 -72 -256 -355 237 -78 -293 438 132 -63 -107 64 215 270 -17 -423 -78 123 -177 -430
3602 -430 195 102 -891 298 338 -56 -246 370 255 55 117 342 -26 -8 -154 -294 168 189 -231 -266 -8 -94
3624 -94 -272 -103 436 -12 -416 537 465 168 -89 3 -117 103 -78 98 112 -307 -352 -309 503 300 -426 70
3646 70 307 -16 84 452 159 -266 -334 -211 335 -160 -16 -153 -160 168 64 59 597 96 -185 -88 190 -3
3668 -3 -297 27 246 -283 -136 106 -352 -51 71 -129 -160 143 -115 80 444 191 -253 154 461 -624 -320
3689 -320 302 88 -348 36 12 21 -258 213 -76 205 352 -165 55 139 135 -461 -41 150 -114 -64 481 -7
3711 -7 -554 -4 310 -224 -150 404 -66 -174 21 -61 -230 39 -258 -429 25 144 164 -97 446 -93 -236 188
3733 188 301 -246 -319 -17 272 -92 92 -255 81 414 -380 -13 470 74 -378 38 331 150 -175 -10
3753 -10 259 -164 -57 415 -181 -237 67 -188 -71 192 -176 -316 190 141 -227 -12 384 -42 -186 246 148
3774 148 -270 175 73 168 -117 98 60 -118 -78 71 -345 82 275 -69 41 248 -126 -296 53 69 -404
3795 -404 -491 96 50 -33 136 -155 136 129 -105 -5 84 -131 -256 296 367 47 -289 435 81 -78 35 160
3817 160 39 -7 -45 118 336 -134 -73 -167 73 -23 -538 174 393 -391 -313 140 189 -212 -186 319 2 -301 96
3840 96 130 14 -420 -405 -184 224 -29 -9 -201 218 -62 114 375 297 -281 -170 381 -15 -145 29 -529 22
3862 22 97 259 -236 -200 -43 -299 18 188 -66 189 334 152 -209 33 335 -77 -404 -88 255 -52 239
3883 239 44 -86 97 71 -318 57 217 83 -244 132 44 -525 -81 104 -189 -105 68 -25 -209 -61 33 -29
3905 -29 181 63 -477 87 179 14 -143 317 -273 -336 -13 75 -1 -184 286 58 -303 276 203 26 201 -45
3927 -45 -21 89 106 -96 -172 21 -42 -141 42 486 -156 -210 143 134 48 204 157 269 -21 90 25 87 169 -95 -120
3952 -120 71 -93 -393 306 179 -342 -226 123 63 -101 -32 298 111 239 111 -189 -53 -24 -65 124 111 -287
3974 -287 -123 -54 30 -127 79 377 128 -319 58 12 -67 -216 -159 133 129 -61 60 -5 297 -92 -182 143 -69
3997 -69 -246 -147 87 -15 -111 140 282 7 -65 134 -30 614 43 -62 42 152 125 -183 171 85 -237 -272
4019 -272 276 76 -162 114 39 -23 78 112 -255 84 8 173 201 86 -5 -16 91 163 -369 41 310 69 -114
4042 -114 275 260 -160 70 390 33 -163 -79 -82 114 312 52 -36 183 116 90 49 254 -14 -80 272 275 -377 -95
4066 -95 189 -98 -138 4 89 -110 108 44 -407 83 428 -118 197 391 -232 -98 188 8 -157 -186 103 124
4088 124 -299 239 -318 244 96 -211 -119 334 -125 -42 -60 34 -19 -26 223 71 -261 -3 376 -60 85 -37
4110 -37 123 154 217 -70 47 42 303 -199 157 -76 -187 -102 297 -33 245 -219 255 190 -58 203 201 4 179
4133 179 -1 -38 138 -20 -292 136 306 -156 -263 304 280 -254 -122 415 -88 199 -29 -155 154 72 -35
4154 -35 220 35 -96 -102 -99 369 -198 -446 476 -27 -405 182 155 -141 -175 -80 128 127 161 24 -100 349 24 -5
4178 -5 79 91 -103 207 234 22 -134 -10 235 -198 -272 46 -85 -15 21 134 -158 -182 271 209 -42 -20 -168 90
4202 90 270 123 -520 40 -135 -92 -52 113 41 -17 12 42 -312 8 -77 49 93 88 -172 77 303 6 136 -15
4226 -15 75 -258 -24 230 238 -176 -6 -54 -103 322 -9 -187 195 -1 -349 10 268 -343 -331 90 61 -45 -145
4249 -145 10 39 -44 -259 109 41 248 -230 61 138 129 -9 -39 87 -106 -166 44 271 -213 -406 153 -78 -309
4272 -309 359 -231 -349 -51 293 172 78 -229 -213 50 18 177 -264 67 286 -31 163 187 96 -272 43 165
4294 165 -192 -160 -317 42 87 104 -117 7 279 -9 52 -24 228 -118 75 75 85 -105 132 -132 0 81 -15
4317 -15 196 -38 -34 16 1 -122 -345 -90 9 118 -325 -154 255 -218 -237 305 11 83 -249 -11 48 -144 54
4340 54 -16 174 151 -39 33 152 86 -206 -63 54 26 -238 26 131 -207 95 84 -160 -363 249 165 -20 -65
4363 -65 201 -185 35 156 -208 111 101 -382 -243 206 -52 -115 57 -129 106 62 -87 -88 -283 160 -60 15
4385 15 164 -226 -18 151 53 -194 -160 3 120 7 -14 -116 -232 -21 -101 -41 130 174 -267 -58 137 -90
4407 -90 -304 111 173 -211 -7 -197 -13 -125 145 116 -165 173 103 -45 -161 -14 46 -128 241 -12 -275 32
4429 32 206 -233 86 311 154 -262 -192 8 -69 179 201 13 115 10 -20 -239 11 -82 290 69 -156 -57
4451 -57 -61 168 -97 -240 222 72 -14 -12 -14 22 -135 31 -17 -16 -3 129 -281 35 188 -60 -186 348 -8 -161
4475 -161 -188 300 323 48 414 -82 -93 -83 39 -40 80 -125 -41 169 28 -315 -179 117 51 -56 59 181
4497 181 -361 8 102 35 -241 -14 103 47 -163 73 41 83 268 -92 37 -139 -4 -15 66 -41 7 -260 97
4520 97 -1 -149 106 -234 -150 142 48 11 33 74 -158 -16 53 172 -178 286 187 9 63 374 -216 -36 126
4543 126 -118 90 -112 64 -40 26 21 -43 -130 264 -143 -255 60 111 107 -249 185 -4 -33 -27 88 -111 -265 112
4567 112 152 -83 -55 -117 275 15 -238 -120 -29 222 -202 359 140 31 -68 29 45 103 191 -27 217 -173 57
4590 57 91 321 118 -120 -114 330 -25 -172 133 320 50 -284 -100 82 -331 -228 -13 36 75 178 95 -2 -17
4613 -17 -307 -149 259 -4 -46 -223 -4 -111 -221 -120 -71 -76 -189 158 260 -145 62 115 -79 -118 40 -73
4635 -73 -160 97 -183 18 132 164 -324 -68 116 -174 -132 31 -35 -91 177 -132 169 122 -102 -30 93 -252 32
4658 32 -64 3 -88 -74 224 160 232 148 242 79 -112 -6 66 -116 -16 -5 -147 250 25 -260 -99 41 147 118
4682 118 -156 37 -186 -25 14 67 39 46 -42 229 65 -144 -121 283 129 -93 -30 86 -25 -15 44 -61 139
4705 139 -130 184 68 145 41 2 255 -311 -128 81 -20 98 -86 -229 -21 -254 69 209 159 -108 -78
4726 -78 -103 155 -62 64 -34 -169 51 88 181 -152 -98 141 311 12 -291 -49 76 238 -136 -49 112 -33
4748 -33 -149 -59 45 -9 -146 -134 165 342 126 132 -37 -48 -33 -18 28 18 23 -120 118 -16 72 -135 73 -33 84
4773 84 114 -44 120 -111 55 113 -11 -109 99 121 191 -108 116 124 52 -25 -21 -63 -117 11 -92 247 225 339 -54
4798 -54 -112 74 -189 -17 52 43 -175 127 178 -30 -36 179 134 -47 -15 -27 -96 132 -177 -169 204 215 -329 7 31
4823 31 54 -12 124 -14 164 59 216 -112 -1 -69 -53 -193 194 -4 3 142 163 2 -8 174 25 69 -13 145
4847 145 -454 -94 -99 17 65 72 -166 -51 154 12 124 130 83 -235 -23 89 -120 69 266 18 -213 -253 -23
4870 -23 77 -335 -181 82 -274 314 51 76 111 82 -108 136 79 -75 64 -68 260 -311 -103 242 58 -98
4892 -98 182 -111 99 -208 -9 30 -145 263 -8 18 108 -136 -39 172 -83 86 130 -239 -69 -124 50 43 -258
4915 -258 -70 -82 123 33 239 -240 271 130 -189 -26 107 247 -69 -34 58 2 -264 -62 77 -140 54 -107
4937 -107 149 -336 -15 -178 79 230 21 136 80 -177 -72 -42 72 83 -249 171 -127 74 -7 30 -143 81
4959 81 -31 12 21 91 156 83 -104 -19 -48 26 337 -260 119 -91 122 -127 -86 -9 -72 -75 -23 -11 -108 180 55 164
4985 164 116 8 -302 -42 44 -4 -108 155 -42 -26 106 135 297 19 -52 -61 23 -146 28 137 -40 112 -344
5008 -344 -158 252 -64 34 -52 112 -49 -195 -52 60 -124 33 -15 -78 186 55 193 -21 -11 40 37 223 -266
5031 -266 -72 191 -37 11 52 64 -221 36 163 63 86 -167 131 107 187 48 2 -178 -41 -69 17 182 7
5054 7 76 10 -74 -128 19 148 -25 -171 -145 86 152 -26 -196 -89 -123 10 -137 141 164 109 141 42 172 -412
5078 -412 -283 151 94 -307 -195 92 134 1 40 -134 -43 183 -205 114 221 21 -55 129 106 -67 -23 123
5100 123 -61 43 -317 -110 86 -29 -36 -18 -6 -90 30 -149 -131 -44 -197 155 186 -228 -153 67 86 -230 -61
5123 -61 1 49 0 -65 -159 142 87 -76 59 220 -193 -12 72 170 -250 205 -150 9 -47 -67 62 206 -101 -187
5147 -187 -135 64 -37 -143 169 98 -125 -99 98 -163 -29 -112 79 98 234 358 -228 -63 194 -116 -99 244
5169 244 -144 -82 47 173 -133 206 -21 138 -80 104 90 -48 -25 63 -36 -67 -82 -160 102 15 99 98 131 -16
5193 -16 86 -32 -185 103 104 103 -116 -207 -54 25 206 -83 118 -16 -15 21 -113 -35 18 229 -37 -296 159 149
5217 149 -9 -160 148 -50 49 -57 -186 -24 -74 -50 26 205 24 -109 -162 93 -306 -179 123 32 -297 79
5239 79 59 25 -29 13 -1 187 -42 47 21 -38 -146 -39 152 -217 39 -72 16 -23 -79 95 -133 -7 -59 311
5263 311 -307 -2 339 17 49 108 163 -146 183 -23 97 -15 -52 -171 -135 202 -27 219 -151 -101 228 -104
5285 -104 -87 67 -231 -199 -74 72 -136 30 -186 -12 174 -16 305 -84 104 -270 150 71 318 -157 -35
5306 -35 27 -149 -134 103 -47 79 -87 -277 -12 -118 -44 -224 53 240 47 -350 102 -88 -20 217 -80 14
5328 14 56 -8 99 118 -81 -106 -99 55 -119 52 425 251 -87 121 52 -52 -278 207 -147 -206 128 98 -206
5351 -206 90 2 7 171 -184 -22 45 114 -93 -27 -208 -10 -32 50 -75 304 84 69 150 -42 -173 44 -159
5374 -159 82 -122 -66 -306 -286 -135 -235 94 -92 135 -229 -16 -2 -11 -42 151 -23 45 2 -76 -62 -57 -47 -74 -77
5399 -77 -190 13 -182 95 -115 -169 -45 143 18 -234 50 -138 51 -271 84 -381 -299 195 169 211 123 -116
5421 -116 104 -130 -64 -84 -123 24 8 -313 -114 -66 141 -99 -145 201 -39 -76 -248 26 270 98 -222 323
5443 323 -17 78 316 138 -73 3 -46 -42 67 133 96 211 -146 104 243 -84 -227 -95 -78 101 60 -136 -19
5466 -19 -49 -243 38 19 -83 43 50 -120 -147 -178 2 -69 153 -95 -172 -51 105 203 -317 125 46 210 -61 82
5490 82 116 104 111 -54 8 -121 -37 24 99 -241 55 36 -107 -251 -96 63 -58 -221 194 83 33 -152 59 147
5514 147 -6 78 19 223 -201 -97 -109 190 133 -30 168 -23 37 -189 152 -221 -142 197 -40 -124 -128 -96 115
5537 115 44 149 9 212 28 -91 -119 204 284 -203 -66 -169 72 -200 -33 -57 -20 -113 -99 98 150 -230 84
5560 84 51 288 27 -145 178 -38 -76 209 -10 -88 49 69 104 -416 -89 68 111 -161 170 95 70 -4 9 -110
5584 -110 -168 230 -148 -255 -39 54 20 -81 -64 193 -58 21 -78 143 -44 13 -156 -279 -121 -85 -172 109 378
5607 378 -61 -26 1 136 -206 273 58 -93 176 268 -44 97 -93 -127 -105 112 64 -191 -29 -78 190 133 70
5630 70 -12 42 250 -57 -175 -16 -26 127 -49 175 -120 -84 -44 -281 104 125 198 -265 -73 135 -113 -54 66
5653 66 108 24 197 -114 -68 7 121 -64 71 -279 86 154 62 132 118 189 98 115 1 62 -153 -129 131 11 -276
5678 -276 -152 287 130 -159 -66 -151 28 74 89 -157 79 -54 -223 243 381 -245 -52 339 -120 -289 109
5699 109 209 -149 -157 146 -129 -196 -65 -131 -267 -51 -83 -132 216 -84 -121 -13 -37 195 -64 -42 14 -122 118
5722 118 14 -62 37 83 -231 -223 -66 94 68 98 -57 -112 317 138 -34 -36 -35 40 -24 121 -205 -27 103 46 174
5747 174 -117 76 24 0 -51 400 -45 -124 -37 47 -70 41 -176 5 168 -41 -323 -62 84 -12 191 192 -104
5770 -104 67 47 -127 4 -60 179 62 38 -15 210 -102 89 105 -125 -28 9 -213 -93 -129 77 114 -138 -41
5793 -41 275 -120 -191 36 35 183 -148 78 136 33 -8 13 -33 161 33 165 82 41 22 -116 -118 22 223 -18
5817 -18 219 115 -61 -29 123 146 -97 -314 -122 -95 40 29 -141 61 211 3 -100 159 178 17 -230 -24
5839 -24 3 141 28 -11 157 182 42 -19 -226 -23 33 70 -115 -42 -157 339 -50 -153 -36 73 -87 112 -117
5862 -117 -83 -187 -95 102 86 38 -232 13 91 47 -55 310 15 -123 139 97 108 90 -223 -51 -3 109 289
5885 289 -178 -66 49 154 -158 54 -12 105 -54 195 156 59 -4 -227 12 -139 -13 -51 -135 -22 81 -31
5907 -31 -33 9 -106 226 34 9 84 -312 208 -48 -203 49 116 146 -81 -176 38 58 -83 -125 -120 -164 78 -107 -127
5932 -127 214 -187 80 249 88 36 36 75 -70 198 -6 -155 -117 205 255 31 54 -91 35 -79 55 -45
5954 -45 59 -20 -126 57 228 107 40 177 -154 117 -286 316 153 -60 -220 76 -19 -191 -137 -192 -339 45
5976 45 96 -85 37 189 94 -165 58 -198 62 -87 -53 85 76 -172 257 148 -89 -77 295 -21 -70 0 40
5999 40 121 190 105 -104 -244 78 152 33 -159 -36 69 162 66 7 -16 -1 -4 -126 -13 -26 -111 -170 98 -20 12
6024 12 -134 76 232 14 25 146 69 -213 -210 5 41 85 -178 126 -43 337 -10 45 -9 -35 152 -29 211
6047 211 -220 58 48 44 144 209 105 -71 -19 -191 -193 27 -36 -56 -94 -83 -97 -90 -72 -295 -105 -55 188 25 -33 72
6073 72 -10 91 -126 43 72 106 -58 -29 28 121 -120 27 69 104 -309 4 50 10 34 -60 83 -257 -15 -67 33
6098 33 -68 215 -99 64 198 13 111 236 -12 -70 -74 -137 116 -168 -21 -149 -263 -3 212 -25 -154 -145 90
6121 90 137 -27 -193 10 160 15 -194 -145 183 98 -51 94 -53 127 -77 168 -10 -137 162 2 16 167
6143 167 -53 -28 338 -25 29 314 -101 -67 172 186 -114 -147 391 -250 -11 76 -281 23 268 -58 73 172
6165 172 131 129 147 -240 -64 -56 147 105 -34 106 164 56 -156 -82 -165 142 -30 114 -167 246 136 152 -137 25
6189 25 -59 -370 221 159 -184 -75 -130 -84 -115 -269 68 -45 113 -46 -203 243 -112 3 53 234 -156 -274
6211 -274 12 54 -101 263 160 -107 13 49 73 -30 119 40 82 -150 -49 -31 25 -53 -42 41 -43 16 -397 -178
6235 -178 77 330 62 -46 -129 -23 166 19 -240 260 -93 137 -114 -2 21 -32 -150 -132 84 -35 -73 -5
6257 -5 -145 -116 -5 -19 -137 -140 -92 -124 -6 -5 66 31 -184 19 297 115 -77 -42 -114 82 101 111 -66 294 228 72
6283 72 137 37 -29 -261 -23 144 218 -103 162 332 -150 83 179 203 100 -197 -85 48 253 -47 49 89 -268
6306 -268 -107 181 160 122 -8 179 105 -189 -78 193 116 47 153 -159 -50 -282 168 87 171 153 229 -91 122
6329 122 -26 -37 -163 -98 -85 -74 268 230 -212 211 310 79 -38 -230 298 93 95 -52 163 -64 53 -14 -139
6352 -139 -166 -99 99 85 6 -178 -21 80 -5 -277 77 168 -254 36 64 16 -149 -192 -185 267 34 -253 -196 168
6376 168 -228 -111 102 -99 -36 -267 -41 -74 93 80 40 102 -147 -88 -144 -47 -168 134 -162 -21 -58 -197 175
6399 175 58 129 -318 74 -247 73 6 -231 -178 186 -1 98 357 -70 -169 114 23 -180 103 -188 162 -101
6421 -101 230 51 -137 137 -43 -257 70 140 103 -107 13 301 122 -40 52 -16 261 -96 -166 -148 17 196
6443 196 -22 91 162 -72 -138 164 28 6 -119 -317 -184 179 65 -253 -383 184 -65 21 44 95 39 -237
6465 -237 204 74 -70 74 -152 -50 -215 6 -63 -10 -52 -103 -176 70 23 134 50 100 -126 113 -105 246 26
6488 26 -108 -308 -276 -9 18 -167 -150 27 25 -75 203 146 -198 -61 -51 -206 -155 27 102 85 -8 284 279 145 -32
6513 -32 121 -1 13 31 -284 129 -97 73 198 -262 22 -376 50 -117 -2 -159 202 -119 31 330 -342
6534 -342 -48 147 233 -15 -77 -98 28 103 51 95 267 184 -31 263 -16 -27 19 54 169 82 92 -26 -90 191
6558 191 287 185 -161 110 211 229 -44 5 153 107 372 -155 -60 -5 -25 -123 -15 69 -8 -196 -128 70 -35 263
6582 263 278 -123 130 -113 -79 127 84 108 -81 -98 -223 -294 13 415 32 62 29 142 -153 153 -38 -33 158
6605 158 168 105 66 259 9 -78 -113 -217 -79 13 92 -155 -208 -85 63 -93 3 -51 -104 41 157 -57 -2 -90
6629 -90 -1 -28 0 -55 -146 137 114 6 47 -175 4 -48 110 108 -181 222 56 -336 -84 133 33 151 -17 -58
6653 -58 37 -195 -98 -155 129 -5 62 -116 -203 45 -242 63 -32 -7 -141 23 -107 -4 -67 34 -103 7 272
6676 272 240 55 123 -77 -62 -93 -190 57 29 75 59 -44 75 72 111 240 -125 -54 -130 -2 132 -153 -24 -127
6700 -127 98 -109 12 -79 -184 209 96 -195 -25 44 -105 284 -58 -95 216 224 138 22 295 -173 94 94 26
6723 26 24 -105 148 -3 -113 306 313 62 267 -121 148 -82 -93 -124 161 -149 268 -225 65 83 182 -4 109
6746 109 -195 -60 -125 -26 -121 85 19 -197 -14 142 -17 -80 158 103 -182 173 240 -63 -197 -33 88 -258
6768 -258 38 -411 -192 153 -49 144 34 68 -7 -42 -59 15 -10 149 -81 -112 148 -78 42 -177 374 75
6790 75 89 -20 127 34 82 146 32 -106 66 79 -323 17 -275 43 160 -351 -28 34 50 -101 -373 74 -60
6813 -60 -95 -124 -209 85 53 134 110 5 17 -49 -108 192 -88 91 1 76 -2 -110 81 29 -15 78 -159 87 -26
6838 -26 148 173 -110 -53 -265 128 104 -65 46 213 257 25 -95 120 52 -168 25 82 -85 -44 89 4 -94
6861 -94 77 -68 -78 183 41 213 10 194 85 -315 244 71 216 -106 -114 79 -45 30 83 24 175 43
6883 43 -134 182 67 -174 95 120 -121 138 26 -20 -171 9 -72 0 -77 -46 96 56 148 -27 424 -44 230
6906 230 65 90 81 -158 28 145 -131 214 -18 39 196 46 -87 58 193 -23 114 63 -176 -57 128 -14
6928 -14 22 -222 -336 99 -100 72 301 66 50 -8 -34 -249 163 -36 -160 -46 259 -31 228 -34 282 -152
6950 -152 5 96 -245 154 260 220 226 -97 274 190 -43 20 -297 96 -117 -27 41 228 60 170 -1 128 53
6973 53 -39 -141 31 -154 -203 2 186 -1 138 162 -99 7 -91 8 -31 -175 -129 178 67 47 115 -151 -40
6996 -40 -127 34 -139 163 130 101 -160 -47 -151 -96 -39 154 55 112 -158 249 -235 -346 40 -20 -111 -72 -94 58
7020 58 -122 -213 -58 -257 35 74 101 -235 116 -136 47 1 -115 -38 -86 135 57 35 -60 -195 25 241 -54
7043 -54 -138 -113 52 -23 77 229 -128 -38 171 241 3 -1 -61 87 197 44 -199 -84 -14 113 -44 141 81 47
7067 47 -53 -8 41 31 121 143 159 182 124 147 -103 277 -36 -69 329 2 45 142 -187 -166 -123 -100 -45 110 73 -217
7093 -217 35 -114 -107 20 -55 84 77 66 68 292 53 135 178 1 9 134 -150 -12 178 -117 180 191 -148 34
7117 34 -123 -158 -344 -84 319 -167 -345 55 -1 -48 61 -25 75 -427 -71 -11 18 164 22 -38 6 203 147
7140 147 -18 121 37 -200 164 -103 -156 62 -105 10 24 -90 163 29 30 -80 -145 71 146 -38 128 32 17
7163 17 -168 121 -30 -92 -19 -103 111 108 47 237 196 -39 210 173 -122 16 -92 39 61 -72 -234 -113 -33 -113
7187 -113 -46 252 163 -153 -233 63 -1 -138 -89 167 101 -102 31 -168 -95 77 -213 95 149 -24 -113 109 -10
7210 -10 75 -181 77 224 19 -205 -132 -143 45 -1 -130 -31 -72 -65 -33 56 77 -149 221 218 -21 -90 256 -95 -74
7235 -74 -156 117 24 129 83 127 149 -154 -40 126 408 -11 363 148 95 -81 -10 129 100 -146 -106 -169 -98 108
7259 108 55 -29 87 46 -27 187 103 2 85 -42 -140 -177 31 -139 -45 159 -70 -29 16 37 -135 154 -183 -57
7283 -57 76 -222 -289 189 287 -12 -38 233 -123 88 115 -145 74 108 130 -17 27 17 178 -130 10 -221 79
7306 79 -67 -1 63 11 -19 -30 -113 -167 45 -20 97 195 -4 -8 -342 -15 48 64 274 2 121 34 94 -28 -65 -98
7332 -98 -53 -116 33 108 -93 -212 29 -22 -81 -50 193 -39 79 249 138 82 49 -227 -8 33 -66 -55 -97 74
7356 74 119 6 -25 -65 1 379 47 -280 207 -103 -20 -75 -121 50 -151 27 186 21 88 65 74 213 -146 156
7380 156 129 -67 136 32 153 -41 -80 -69 249 -142 -282 185 -276 -15 96 -234 -7 137 -43 75 60
7401 60 -209 -121 134 26 -260 22 -116 174 160 68 77 21 56 215 210 -11 -203 138 49 17 -98 -202 95 177
7425 177 -42 46 -38 233 15 115 -61 -87 79 260 246 -131 62 -142 -97 14 -116 119 231 109 -120 9
7447 9 -90 -294 -13 43 240 -59 -1 -1 -42 -91 -294 -22 -21 173 -9 -9 -164 -38 56 7 -110 24 3 258 177 -51
7473 -51 21 231 -339 114 35 -21 142 -245 70 -159 -73 4 26 -99 30 184 -173 7 37 110 268 76 140
7496 140 -66 -168 23 123 -1 233 -277 0 175 -148 -228 -146 48 -262 -11 34 -43 -117 222 109 133 93
7518 93 2 -154 194 67 76 76 185 -119 133 -11 32 -416 -106 464 46 19 114 -44 -82 54 13 -36 -60 -91 182
7543 182 123 7 96 -51 64 -95 -56 19 65 198 -199 259 81 44 -6 -206 -4 -273 99 -78 -140 -53 -68
7566 -68 -79 3 68 222 81 34 156 49 89 139 -66 59 118 -169 -8 98 -163 19 98 156 -162 -166 -170 20 -22
7591 -22 -45 -81 126 -41 -203 16 177 76 -97 198 94 -1 -14 55 -34 -144 67 -25 -30 -185 -48 80 66 -66
7615 -66 -69 -5 -270 90 -169 -86 -1 -172 -84 16 20 -85 151 -75 -295 13 -45 34 4 37 75 192 249 25 -64
7640 -64 -103 136 133 -117 -38 43 35 -49 119 76 -101 -82 102 -154 -70 -45 51 -12 93 23 -80 219 45 -161 56
7665 56 -89 44 29 -119 66 7 -314 -232 -353 49 118 -64 -7 109 -119 -11 -70 -121 29 -197 32 -164 -32
7688 -32 101 -72 75 -68 -85 218 54 113 -44 69 59 -11 118 305 -98 -41 -80 -152 125 255 -387 -74 -68
7711 -68 -27 -179 68 -72 -285 -32 83 -30 7 -212 204 -113 -62 190 71 -122 63 -65 -75 -45 -128 446
7733 446 94 -19 -225 72 180 -46 10 -137 -90 -74 402 92 -102 39 292 -222 -162 62 48 -102 241 6
7755 6 -88 -56 -165 -100 -142 -11 120 -123 121 114 101 92 -63 19 -144 7 112 -41 327 -55 -106 64 114 174 131
7780 131 342 -156 95 -206 -227 49 84 71 -112 4 2 121 72 -283 89 -47 -206 1 202 -90 243 93
7802 93 107 -377 -60 43 -87 -15 29 100 69 167 -60 211 -132 166 118 131 68 -206 -143 14 41 -144 143 -283
7826 -283 226 208 -41 -38 -233 62 24 -58 -251 -132 81 -16 3 221 195 52 -82 98 106 62 54 -115 -26 -164 98
7851 98 -61 -61 -171 230 3 -107 47 -88 -55 -57 -143 -284 -10 157 -112 -164 -249 119 59 13 -118 -114 8 101 49
7876 49 4 -29 -154 -189 126 -17 -92 -155 134 -46 -31 126 60 262 -200 168 96 -114 26 183 69 3 -230
7899 -230 -257 -97 157 -225 1 36 4 135 -115 -58 -3 -11 192 -54 -139 -63 -47 -168 29 39 -134 114 -16 170
7923 170 183 -54 169 -218 52 -216 -74 80 147 58 -173 -101 29 -46 98 -91 165 -73 -151 -85 -477 120
7945 120 64 -166 32 -76 211 -124 30 -361 -118 -67 122 143 -43 -73 -92 35 -3 -99 120 112 -138 88 -198
7968 -198 -106 23 -82 235 -148 85 -77 -112 113 126 -139 170 -188 -96 -184 33 -93 321 123 284 -113 -3
7990 -3 -89 40 -66 -35 36 -51 32 -46 122 -89 98 152 117 276 258 -1 104 -260 3 105 -49 -174 156 56
8014 56 -55 -75 54 90 164 148 62 98 87 183 1 310 -158 -89 108 -217 -146 22 170 -138 -130 43 31 -24 8
8039 8 34 194 -132 -74 150 201 -65 -161 -112 28 30 -35 8 152 63 -62 -64 2 60 -200 -26 116 -129 -7 -18 114
8065 114 250 -262 47 20 -176 -15 271 81 140 20 51 -21 -174 73 -170 -73 170 112 85 -38 43 -81 -70
8088 -70 -46 -17 -27 -20 97 -133 -2 -41 -85 -65 -23 114 33 19 27 11 -132 -117 -35 77 160 34 -27 226 -23 86
8114 86 34 212 80 80 -10 -31 -128 -51 -74 -63 164 123 43 -66 206 127 26 -82 106 -32 -37 -63 -217 67 -56
8139 -56 76 -8 17 82 155 212 -86 2 -259 -13 -403 102 53 52 23 116 -10 290 242 -214 -13 -144 276 59
8163 59 -56 246 39 45 37 123 146 317 -153 -144 109 -145 160 -52 -39 230 83 -68 -164 -129 -14 -294 -2 198
8187 198 134 107 -71 -134
8191a34
##END NTUPLES=NMR FID
##END=
