##TITLE=1H_Pr Br-5
 CDCl3,8 sc, 
 2.04.2021
##JCAMPDX= 6.0         $$ Bruker NMR JCAMP-DX V2.0
##DATA TYPE= NMR FID
##DATA CLASS= NTUPLES
##ORIGIN= UXNMR, Bruker Analytische Messtechnik GmbH
##OWNER= root
$$ XWIN-NMR		Version 3.5
$$ Fri Apr  2 13:52:22 2021 Russian Standard Time (UT+4h)  she@DPX200
##.OBSERVE FREQUENCY= 200.131506
##.OBSERVE NUCLEUS= ^1H
##.DELAY= (6, 6)
##.ACQUISITION MODE= SIMULTANEOUS
##.ACQUISITION SCHEME= undefined
##.AVERAGES= 8
##.DIGITISER RES= 18
##SPECTROMETER/DATA SYSTEM= spect
##.PULSE SEQUENCE= zg30
##.SOLVENT NAME= CDCl3
##.SHIFT REFERENCE= (INTERNAL, CDCl3, 0, 15.7039)
##AUDIT TRAIL= $$ (NUMBER, WHEN, WHO, WHERE, WHAT)
$$ ##TITLE= Audit trail, XWIN-NMR		Version 3.5
$$ ##JCAMPDX= 5.01
$$ ##ORIGIN= Bruker BioSpin GmbH
$$ ##OWNER= she
$$ F:/spectra/data/she/nmr/H-F/1/audita.txt
$$ ##AUDIT TRAIL=  $$ (NUMBER, WHEN, WHO, WHERE, WHAT)
(   1,<2021-04-02 13:51:01.78 +0400>,<she>,<DPX200>,
      <created by zg, POWCHK disabled, PULCHK disabled
       configuration hash MD5:
       00 E9 B6 7A A2 85 ED C7 34 08 36 98 17 FE 4E 26
       data hash MD5: 16K
       29 67 63 1B F1 54 3D 61 8D F0 D4 74 6D 96 5D 55>)
$$ ##END=
$$ 
$$ hash MD5
$$ 30 3E 75 B0 16 AE B0 48 57 2C 06 C9 48 5A 26 49
##$RELAX= 
##$RELAX= 
##$RELAX= 
##$RELAX= 
##$RELAX= 
##$RELAX= 
$$ Bruker specific parameters
$$ --------------------------
##$DU= <F:/spectra>
##$EXPNO= 1
##$NAME= <H-F>
##$PROCNO= 1
##$TYPE= <nmr>
##$USER= <she>
##$AMP= (0..31)
100 100 100 100 100 100 100 100 100 100 100 100 100 100 100 100 100 100 
100 100 100 100 100 100 100 100 100 100 100 100 100 100 
##$AQSEQ= 0
##$AQ_mod= 1
##$AUNM= <au_zg>
##$AUTOPOS= <>
##$BF1= 200.13
##$BF2= 200.13
##$BF3= 200.13
##$BF4= 200.13
##$BF5= 200.13
##$BF6= 200.13
##$BF7= 200.13
##$BF8= 200.13
##$BYTORDA= 1
##$CFDGTYP= 0
##$CFRGTYP= 5
##$CHEMSTR= <none>
##$CNST= (0..31)
1 1 145 1 1 1 1 1 1 1 1 1 1 1 1 1 1 1 1 1 1 1 1 1 1 1 1 1 1 1 1 1 
##$CPDPRG= <>
##$CPDPRG1= <>
##$CPDPRG2= <>
##$CPDPRG3= <>
##$CPDPRG4= <mlev>
##$CPDPRG5= <mlev>
##$CPDPRG6= <mlev>
##$CPDPRG7= <mlev>
##$CPDPRG8= <mlev>
##$CPDPRGB= <>
##$CPDPRGT= <>
##$D= (0..31)
0 1.2 0 0 0 0 0 0 0 0.06 0 0.03 0 0 0 0 0.0002 0 0 0 0 0 0 0 0 0 0 0 0 
0 0 0 
##$DATE= 1617357061
##$DBL= (0..7)
120 120 120 120 120 120 120 120 
##$DBP= (0..7)
150 150 150 150 150 150 150 150 
##$DBP07= 0
##$DBPNAM0= <>
##$DBPNAM1= <>
##$DBPNAM2= <>
##$DBPNAM3= <>
##$DBPNAM4= <>
##$DBPNAM5= <>
##$DBPNAM6= <>
##$DBPNAM7= <>
##$DBPOAL= (0..7)
0.5 0.5 0.5 0.5 0.5 0.5 0.5 0.5 
##$DBPOFFS= (0..7)
0 0 0 0 0 0 0 0 
##$DE= 6
##$DECBNUC= <off>
##$DECIM= 32
##$DECNUC= <off>
##$DECSTAT= 4
##$DIGMOD= 1
##$DIGTYP= 9
##$DL= (0..7)
0 120 120 120 120 120 120 120 
##$DP= (0..7)
150 150 150 150 150 150 150 150 
##$DP07= 0
##$DPNAME0= <>
##$DPNAME1= <>
##$DPNAME2= <>
##$DPNAME3= <>
##$DPNAME4= <>
##$DPNAME5= <>
##$DPNAME6= <>
##$DPNAME7= <>
##$DPOAL= (0..7)
0.5 0.5 0.5 0.5 0.5 0.5 0.5 0.5 
##$DPOFFS= (0..7)
0 0 0 0 0 0 0 0 
##$DQDMODE= 0
##$DR= 18
##$DS= 0
##$DSLIST= <SSSSSSSSSSSSSSS>
$$ [...]
##$SUBNAM2= <"">
##$SUBNAM3= <"">
##$SUBNAM4= <"">
##$SUBNAM5= <"">
##$SUBNAM6= <"">
##$SUBNAM7= <"">
##$SUBNAM8= <"">
##$SUBNAM9= <"">
##$SW= 16.9725357007746
##$SWIBOX= (0..15)
0 0 2 0 0 0 0 0 0 0 0 0 0 0 0 0 
##$SW_h= 3396.73913043478
##$TD= 16384
##$TD0= 1
##$TE= 0
##$TE2= 300
##$TE3= 300
##$TEG= 300
##$TL= (0..7)
0 120 120 120 120 120 120 120 
##$TP= (0..7)
150 150 150 150 150 150 150 150 
##$TP07= 0
##$TPNAME0= <>
##$TPNAME1= <>
##$TPNAME2= <>
##$TPNAME3= <>
##$TPNAME4= <>
##$TPNAME5= <>
##$TPNAME6= <>
##$TPNAME7= <>
##$TPOAL= (0..7)
0.5 0.5 0.5 0.5 0.5 0.5 0.5 0.5 
##$TPOFFS= (0..7)
0 0 0 0 0 0 0 0 
##$TUNHIN= 0
##$TUNHOUT= 0
##$TUNXOUT= 0
##$USERA1= <user>
##$USERA2= <user>
##$USERA3= <user>
##$USERA4= <user>
##$USERA5= <user>
##$V9= 5
##$VALIST= <valist>
##$VCLIST= <CCCCCCCCCCCCCCC>
##$VD= 0
##$VDLIST= <DDDDDDDDDDDDDDD>
##$VPLIST= <PPPPPPPPPPPPPPP>
##$VTLIST= <TTTTTTTTTTTTTTT>
##$WBST= 1024
##$WBSW= 4
##$XGAIN= (0..3)
0 0 0 0 
##$XL= 0
##$YL= 0
##$YMAX_a= 114414
##$YMIN_a= -70477
##$ZGOPTNS= <>
##$ZL1= 120
##$ZL2= 120
##$ZL3= 120
##$ZL4= 120
##$ABSF1= 10
##$ABSF2= 0
##$ABSG= 5
##$ABSL= 3
##$ALPHA= 0
##$AQORDER= 0
##$ASSFAC= 0
##$ASSFACI= 0
##$ASSFACX= 0
##$ASSWID= 0
##$AUNMP= <proc_1d>
##$AZFE= 0.1
##$AZFW= 0.1
##$BCFW= 1
##$BC_mod= 2
##$BYTORDP= 1
##$COROFFS= 0
##$CY= 11.3945322036743
##$DATMOD= 1
##$DC= 2
##$DFILT= <>
##$DTYPP= 0
##$F1P= 15.9154993809931
##$F2P= -4.1035820241983
##$FCOR= 0.5
##$FTSIZE= 0
##$FT_mod= 4
##$GAMMA= 1
##$GB= 0.15
##$INTBC= 1
##$INTSCL= 1
##$ISEN= 128
##$LB= 0.24
##$LEV0= 0
##$LPBIN= 0
##$MAXI= 10000
##$MC2= 0
##$MEAN= 0
##$ME_mod= 0
##$MI= 1.114404
##$NCOEF= 0
##$NC_proc= 0
##$NLEV= 6
##$NOISF1= 3.799351
##$NOISF2= 2.8
##$NSP= 1
##$NTH_PI= 0
##$NZP= 0
##$OFFSET= 15.70392
##$PC= 1
##$PHC0= -11122.57
##$PHC1= 12.20092
##$PH_mod= 1
##$PKNL= yes
##$PPARMOD= 0
##$PSCAL= 0
##$PSIGN= 0
##$REVERSE= no
##$SF= 200.130013532006
##$SI= 16384
##$SIGF1= 3
##$SIGF2= 2
##$SINO= 400
##$SIOLD= 16384
##$SREGLST= <1H.CDCl3>
##$SSB= 0
##$STSI= 0
##$STSR= 0
##$SW_p= 3612.71676300578
##$SYMM= 0
##$S_DEV= 0
##$TDeff= 0
##$TDoff= 0
##$TI= <>
##$TILT= no
##$TM1= 0
##$TM2= 0
##$TOPLEV= 0
##$USERP1= <user>
##$USERP2= <user>
##$USERP3= <user>
##$USERP4= <user>
##$USERP5= <user>
##$WDW= 1
##$XDIM= 8192
##$YMAX_p= 0
##$YMIN_p= 0
$$ End of Bruker specific parameters
$$ ---------------------------------
##NTUPLES= NMR FID
##VAR_NAME=  TIME,          FID/REAL,        FID/IMAG
##SYMBOL=    X,             R,               I
##VAR_TYPE=  INDEPENDENT,   DEPENDENT,       DEPENDENT
##VAR_FORM=  AFFN,          ASDF,            ASDF
##VAR_DIM=   8192,          8192,            8192
##UNITS=     SECONDS,       ARBITRARY UNITS, ARBITRARY UNITS
##FACTOR=    0.0002944,     1,               1
##FIRST=     0,             0,               0
##LAST=      2.4114304,     0,               0
##MIN=       0,             -70477,          0
##MAX=       2.4114304,     114414,          0
$$ Real data points
##PAGE= N=1
##DATA TABLE= (X++(R..R)), XYDATA
0@%%%%%%%%%%%%%%%%qJ6j6J6j6J7k5L2l3M1m8N6o5P3q6R8j09J22j38J59j81K00
38A05k24K54k83L11l46L83m22M68n17N69o25O89p60Q37r23J019j126J246j382
57g27J536j716J928k180K489k874L373m048N011o523R239j5665O1357O3214l0009
72H4405K0127n987j6789k5592n501j3619j9678n961J5699n912Q615K1069J0111
85F0987N900L221L242n438k1737j1580j5598k4385j5830r033q496k179j85J4274
99b6837O819K287J4107L667m194l161q278j0014j4680j3137l707j0589k760R636
113f0841L470J1347J1840J3103J2891L448N532M346p230n245l305p732m232l689
127b6297O569L423K483J7460J0129N295J2158P705n30j153k344m861j2113n723
$$ plain form
0 0 0 0 0 0 0 0 0 0 0 0 0 0 0 0 0 0 -8 8 -8 8 -8 9 -16 16 -17 24 -24 32 -33 40 -46 52 -57 65 -73 86 -95 105
38 105 -119 135 -148 163 -183 200 -222 246 -271 298 -327 362 -398 439 -484 535 -591 655 -727
57 -727 809 -907 1021 -1159 1330 -1544 1829 -2219 2792 -3731 5508 -10157 51200 114414 84405
72 84405 104532 98545 81756 56164 50663 37044 17366 11405 27104 21192 29807 50876 60987
85 60987 66887 70108 73350 67912 46175 34595 18997 -5388 -21218 -30251 -38747 -40926 -41111 -26837
99 -26837 -20018 -17731 -3624 43 -4151 -7312 -15590 -25604 -40284 -53421 -57128 -67717 -70477 -60841
113 -60841 -57371 -46024 -34184 -21081 -8190 -4742 790 5136 -2094 -7339 -10644 -18376 -22608 -26297
127 -26297 -19728 -16305 -13822 3638 13767 19062 31220 38925 38395 37242 34898 30037 17924 12201
141A2201j569j0750L18L681K53M627O294M654K483j29j93n329r487m703j2077
156i726r342n512p828k313n14O50L443L861L521K708m25J512l891n948k108q298
172d0210m676k205k786J304K202M640O869N336O554P203J881M168n58j32j045
187a1455l899Q77j632j177L936L876L308O741N832M993L254L507K518m289k23
202A6167j898o396k667j167l539j345J672J376J273J305M237j821r03R56n522
217A728l944l073n558n710k778k535k031r73K786M48N13M591k10m47J178j994
233a8009k201k106j829j980j507O83J832P00N277L103L430M985K554L340J338
248c90P06O69m42j162J270l85J315K052J819M359J543M192L027R73J823Q02j792
$$ plain form
141 12201 10632 -118 200 3881 4134 8761 15055 19709 22192 22063 21870 16541 7054 2351 -9726
156 -9726 -19068 -24580 -32408 -34721 -35235 -34585 -31142 -27281 -23760 -21052 -21477 -19965 -23856 -29804 -31912 -40210
172 -40210 -44886 -47091 -49877 -48573 -46371 -41731 -34862 -29526 -22972 -15769 -13888 -9720 -10278 -10410 -11455
187 -11455 -15354 -14477 -16109 -17286 -13350 -9474 -6166 575 6407 11400 14654 18161 20679 16390 16167
202 16167 14269 7873 5206 4039 500 -845 827 2203 3476 4781 9018 7197 6294 7250 1728
217 1728 -2216 -5289 -10847 -16557 -19335 -21870 -23901 -24874 -22088 -21640 -21127 -16536 -16746 -17193 -16015 -18009
233 -18009 -20210 -22316 -24145 -26125 -27632 -26949 -25117 -24417 -19140 -16037 -12607 -7622 -5068 -1728 -390
248 -390 316 985 543 -619 651 266 1581 3633 5452 9811 11354 15546 18573 19546 21369 22171 20379
265B0379j429o95k958k039j799J39k304j51K491j556M49J741j391j825n51k450
281F051l360l042k115l129l844Q78k302n97J953K97k66J791Q63q76L12o2l18k464
299a0230R44rj606K145J534J343K720L079K230K960K212K293J089J001J103q09
315A1999J257N38L38J372R41J468K086J924J137J882L19M18m88n90j390j629j074
332B0508k329j642p12p80j537K91r26j119k79o71j940k248r04k951k454j457k224
349c374k627j66l06j718Q19M29l56KQ72n2q52P39k72o97l25J355n53J002K175
368c905Q59J520K672K140R91K410J386J022M99J775J53kJ838j42Q77J317Q39P49
386A6998J289N67L60M12k57J21j786k49j858j517p79k028j414p09j531r71j92
$$ plain form
265 20379 18950 18255 15297 13258 11459 11598 9294 9143 11634 10078 10527 12268 10877 9052 8501 6051
281 6051 2691 -351 -2466 -5595 -9439 -8561 -10863 -11460 -9507 -9210 -9476 -7685 -6822 -7698 -7386 -7448 -7766 -10230
299 -10230 -9286 -9295 -10901 -8756 -7222 -5879 -3159 -80 2150 5110 7322 9615 10704 11705 12808 11999
315 11999 13256 13794 14132 15504 16445 17913 19999 21923 23060 24942 25261 25679 25191 24601 23211 21582 20508
332 20508 18179 16537 15825 15045 13508 13799 12873 11754 11475 10804 8864 6616 5712 2761 307 -1150 -3374
349 -3374 -6001 -6167 -6473 -8191 -7372 -6943 -7299 -7297 -6425 -6477 -7329 -6590 -6862 -7559 -7884 -6529 -7082 -6080 -3905
368 -3905 -3046 -1526 1146 3286 4277 6687 8073 9095 9594 11369 11522 11520 13358 13216 14093 15410 16249 16998
386 16998 18287 18854 19214 19626 19369 19490 17704 17455 15597 14080 13301 11273 9859 9150 7619 6648 6456
403F456j932p16j666j303j759k308o05k868j770o54k027j383M93j411q8L91m52
420a3602L71m37J217n32m41J543n28n15J998Q5M72K335R91J282J371K080J740
437e70j73K715Q64k40J843O07p3J199L14N32J175L02R61m48J032K24j165P41o32
456I208j349k06j323j843n8j877o44j000j284k66k054k28j161j822j87j547k069
473i710l89j622j316r5j631N30j383m2M31j093J016N82q02R91M43q32J820k97
491a3399O83R09M18J746K6K064J705j10K058J357L3K156O31j10J548L8J179P2
509C004L06J421o89R15J059j251Q45L92j425P58r91n50m59j355R1j481r90M0j787
528b147n59K33j847K75q29j468K62j434m19m25j206L67j292k45O20o98P09O72
$$ plain form
403 6456 4524 3808 2142 839 -920 -3228 -3833 -6701 -8471 -9125 -11152 -12535 -12042 -13453 -13541 -13150 -13602
420 -13602 -13231 -13668 -12451 -12983 -13424 -11881 -12409 -12924 -10926 -10841 -10369 -8034 -7043 -5761 -4390 -2310 -570
437 -570 -743 1972 2836 2596 4439 5046 4973 6172 6486 7018 8193 8495 9456 9008 10040 10264 9099 9840 9208
456 9208 7859 7653 6330 4487 4429 2552 1908 908 -376 -642 -2696 -2924 -4085 -5907 -6094 -7641 -9710
473 -9710 -10099 -11721 -13037 -13132 -14763 -14233 -15616 -15658 -15227 -16320 -15304 -14722 -15524 -14533 -14090 -14922 -13102 -13399
491 -13399 -12716 -11807 -11389 -9643 -9617 -7553 -5848 -5958 -3900 -2543 -2510 -354 277 167 1715 1753 2932 3004
509 3004 3310 4731 4042 4957 6016 4765 5610 6002 4577 5335 4344 3794 3335 1980 2071 590 -400 -360 -2147
528 -2147 -2706 -2473 -4320 -4045 -4874 -6342 -6080 -7514 -7933 -8358 -9564 -9197 -10489 -10734 -10114 -10812 -10103 -9431
546i431q84J189J45K01J134k22J362j18P55J054j83Q16J893k11J493J052K0J749
564A814j30J406L2O33J163m35J77J096l26J23J113j279J098k68l22L12p36N91
582F062j068p35M90j402m32L12j897j09m8j318K48r23n15q4r57L79j063o45N73
601c132q72o75N14j010Q07n4l56R22j88Q65L74o50J658J71p5J881p62Q11J395
620A624n45J730K02P45J114J44J108L64OJ607m88OR76p42P17J53p13Q14q09M31
640H444k11j042R06q56r55M57j042q01N1j562j89q64m26n89j045Q5m56j053M14
659g34q67q09J042j432k00K51p79O10o92K39N40n00J002L43n46J432j61J72J459
678C70n08Q26N32N60O22%Q40P64m30J496L81k90J543l52J05O60m22P22l89J11
$$ plain form
546 -9431 -10315 -9126 -8981 -8780 -7646 -7868 -6506 -6624 -5869 -4815 -4998 -4182 -2289 -2500 -1007 45 65 1814
564 1814 1684 3090 3122 3755 4918 4483 4660 5756 5430 5553 6666 5387 6485 6217 5895 6207 5471 6062
582 6062 4994 4259 4749 3347 2915 3227 1330 1221 1173 -145 103 -820 -1335 -1419 -2376 -1997 -3060 -3705 -3132
601 -3132 -4004 -4679 -4165 -5175 -4368 -4422 -4778 -3856 -4044 -3179 -2805 -3455 -1797 -1626 -1701 180 -582 229 1624
620 1624 1079 2809 3011 3756 4870 5014 6122 6486 6492 8099 7611 7617 8593 7851 8568 8721 8008 8822 8013 8444
640 8444 8233 7191 8097 7241 6286 6743 5701 4900 4951 3389 3200 2336 1910 1321 276 361 -95 -1148 -734
659 -734 -1601 -2410 -1368 -2800 -3000 -2749 -3528 -2918 -3610 -3371 -2831 -3331 -2329 -1986 -2532 -1100 -1261 -1089 370
678 370 -138 688 1220 1780 2402 2402 3242 4006 3576 5072 5453 5163 6706 6354 6459 7119 6697 7419 7030 7141
698G141J47l75Q4J99j361R39n80j294R73j536j02l76o08k40j308k65m07j415r6
717d80j38j587O00q51p81J11j026L44o44m45L01q08J9P30j135J067J11r22J175
736d359p3M62N45J10Q24J25N89N83j38Q07R96m98J353L33n2Q30L56M11L67RM50
757D030P6j45P81q01N18K25j264O53l54o05J27l35m60j80n32k71o63p19j49j092
777a160j20n70r64L97p79m02m27l57l83m07n09N73o63jJ51o50M30P9r3L63k17
798e709N18M41m6Q79L2J96Q86k55O60P08m91J043M22M25K22M26N16K06J46Q77
818B102l80J5R11q26P74k18j9j17o5k9j99l58j81k38j77N9q79k74ko67n0j53p23
841a694k29l31l85k57k82O7l38m43M56p11K66L22m24JK20n0K07J05J84R0R6N51
$$ plain form
698 7141 7288 6913 6997 7196 5835 6774 6194 4900 5873 4337 4235 3859 3251 3011 1703 1438 1031 -384 -480
717 -480 -618 -2205 -1605 -2456 -3237 -3126 -4152 -3808 -4452 -4897 -4596 -5404 -5385 -4655 -5790 -4723 -4612 -5534 -4359
736 -4359 -4432 -3970 -3425 -3315 -2491 -2366 -1777 -1194 -1332 -525 471 -27 1326 1659 1607 2437 2793 3204 3571 3580 4030
757 4030 4106 3961 4742 3941 4459 4684 3420 4073 3719 3114 3241 2906 2446 2266 1734 1463 800 81 -68 -1160
777 -1160 -1280 -1850 -2814 -2417 -3196 -3598 -4025 -4382 -4765 -5172 -5681 -5108 -5771 -5772 -5621 -6271 -5841 -5762 -5855 -5492 -5709
798 -5709 -5191 -4750 -4796 -3917 -3885 -3689 -2803 -3058 -2398 -1690 -2181 -1138 -716 -291 -69 357 873 1079 1225 2102
818 2102 1722 1737 2648 1822 2596 2378 2359 2242 2177 2148 1949 1591 1410 1172 995 1054 175 -99 -101 -768 -818 -971 -1694
841 -1694 -1923 -2254 -2639 -2896 -3178 -3111 -3449 -3892 -3436 -4147 -3881 -3559 -3983 -3982 -3762 -3812 -3605 -3500 -3316 -3226 -3130 -2579
863b579Q1K94K10L30P20K57J89m0O24M68r3M19K13J28M26M16k95K82J1K71j32
884B200r2J86l22J52k05k51l50L23q02L7J96n50q2m96K36q14J32j03k16k42j64
905a227m44R2m4k41q6J07L72l56J20J09k83L63J21K33J06K76l0J38M64K24O4K13
927B91O23k85N40J90j37M31L84k22K36J10P9Q7K01m1j21L46J3m15J21m8k52k05
949A926J75j46l80k60k98O9m46K49q27r2J27o80j37r5l52J41j15l69M3pk6k35
971a735j7K88k66L71j06M0K33J71j50M84J6N28L5J82N10oK27L66j23N04K99m4
993A807P2L84j4M13k39L56k25l3N46l22q9M02o25j00l2k21J37k66j12k25m92K61
1015A383p04j60L2o38m0J03n21k00r5l80Jn54M09j84p03P70q41J47K52np9p5K15
$$ plain form
863 -2579 -2498 -2204 -1994 -1664 -944 -687 -498 -538 86 554 461 880 1093 1221 1647 2063 1768 2050 2061 2332 2200
884 2200 2108 2294 1972 2124 1919 1668 1318 1641 839 876 1072 522 440 -56 180 -634 -502 -605 -821 -1063 -1227
905 -1227 -1671 -1579 -1623 -1864 -1950 -1843 -1471 -1827 -1707 -1598 -1881 -1518 -1397 -1164 -1058 -782 -812 -674 -210 14 78 291
927 291 914 629 1169 1359 1222 1653 2037 1815 2051 2161 2240 2327 2528 2487 2366 2712 2725 2310 2431 2383 2131 1926
949 1926 2101 1955 1575 1315 1017 1086 640 889 62 -30 97 -583 -720 -815 -1167 -1026 -1141 -1510 -1467 -1474 -1500 -1735
971 -1735 -1752 -1464 -1730 -1359 -1465 -1425 -1192 -1021 -1171 -687 -671 -143 -108 74 584 578 805 1171 1048 1552 1851 1807
993 1807 1879 2263 2249 2662 2423 2779 2554 2521 3067 2745 2656 3058 2433 2333 2301 2080 2217 1951 1839 1614 1122 1383
1015 1383 679 519 551 -87 -127 -24 -545 -745 -840 -1220 -1219 -1773 -1364 -1548 -2251 -1481 -2322 -2175 -1923 -1928 -2007 -2082 -1867
1038a867N9n2J77M02n87J052j61j76O67J16M6M25j42N54L61l55P55j63M18J55
1058A684l14M88j28L39J47m15J92L71k09r7K21m78L17m79L02l36n68M58p85j63
1078E47J89l63k37k6o85J59m09Q7Jn50j4k85j74J46l07k40J44k68M18l7j29L84
1100a649l61K89o5j14N54j65M8M96n6J47N87l10O76j51J61O57n51N40K45MM26
1121A408k32J27M53n67K45L84k99K82m02K87k83k51L57l27m24N10m87l34L75n50
1141B72J76m27j80L22l16j48j40o22K75j3n49L28j14j11K00n43L91l18J38N18
1161h61p05N25J77m49N67l0k37M46o8L25J05k09P35m92L43N49o99P88J64m50N80
1182A104k62M0N57n79L72k25J08K42m57R4K03m57J6J88n64N51p14O4K32n99N5
$$ plain form
1038 -1867 -1808 -1860 -1683 -1281 -1868 -816 -977 -1153 -486 -370 -324 101 -41 513 874 519 1274 1111 1529 1684
1058 1684 1370 1858 1730 2069 2216 1801 1993 2364 2155 2058 2279 1801 2118 1639 1941 1605 1037 1495 710 547
1078 547 736 373 136 110 -575 -416 -825 -738 -737 -1287 -1301 -1586 -1760 -1614 -1921 -2161 -2017 -2285 -1867 -1904 -2033 -1649
1100 -1649 -2010 -1721 -1786 -1900 -1346 -1511 -1463 -967 -1023 -876 -289 -599 77 -74 87 744 193 733 978 982 1408
1121 1408 1176 1303 1756 1189 1434 1818 1519 1801 1399 1686 1403 1152 1509 1182 758 1268 781 447 822 272
1141 272 448 21 -159 163 -153 -301 -441 -1063 -788 -801 -1350 -1022 -1136 -1247 -1047 -1590 -1199 -1517 -1379 -861
1161 -861 -1566 -1041 -864 -1313 -746 -776 -1013 -567 -635 -310 -205 -414 321 -171 172 721 22 810 974 524 1104
1182 1104 842 882 1439 860 1232 1007 1115 1357 900 994 1197 740 756 944 380 931 217 281 513 -86 -31
1203c1l04k65L06m26O8J10p77N69o38N27k76o57P24rk01L50l26m8Q30p11N19L
1225f63l2K70k26K68L03j14O87m78N25M38m07K90K37k61L42J37l45L98l18K26
1245A277L3k23K58l90P4L49n89J49n4n95K71m25j63J42l78L2m77j48K06k41o30
1266a522M38p99M72l55k65L39j38k9l9n11N07J6m0K52J94R1NK9L48N2q8L32j10
1289h21N76R4J14M16j88J97O53m4m4K56l02M32q5K88l8j02O95p53K57K86l71j45
1311A371M5l46J60k58k49Ok46j45l96k4Jl33m13K80m41k67j40p4J33l04k87L22
1333a605m33K55k46l3k5K00k86L33k72K85J77p4L51J47J80J42P6M19J28o0P11
1354C70l31K76M60n0J72p6L03K47j58M56L4K2K34j18r7L75k18j81J06l73O4k21
$$ plain form
1203 -31 -335 -600 -294 -720 -652 -542 -1319 -750 -1388 -861 -1137 -1794 -1070 -1079 -1280 -930 -1256 -1304 -474 -1185 -666 -663
1225 -663 -695 -425 -651 -383 -80 -194 493 15 540 978 571 861 1098 837 1179 1316 971 1369 1051 1277
1245 1277 1310 1087 1345 955 1029 1378 789 938 884 289 560 135 -28 114 -264 -232 -709 -857 -651 -892 -1522
1266 -1522 -1084 -1883 -1411 -1766 -2031 -1692 -1830 -1859 -1898 -2409 -1902 -1886 -1926 -1674 -1480 -1389 -1384 -1355 -1007 -955 -1043 -711 -821
1289 -821 -245 -151 -37 379 191 388 1041 997 953 1209 907 1339 1254 1542 1504 1402 2097 1344 1601 1887 1516 1371
1311 1371 1416 1070 1230 972 723 729 483 338 -58 -82 -81 -414 -827 -547 -988 -1255 -1395 -1469 -1336 -1640 -1927 -1605
1333 -1605 -2038 -1783 -2029 -2062 -2087 -1887 -2173 -1840 -2112 -1827 -1650 -1724 -1373 -1226 -1046 -904 -828 -409 -281 -341 370
1354 370 39 315 775 725 897 821 1124 1371 1213 1669 1703 1725 1959 1841 1744 2119 1901 1720 1826 1453 1517 1296
1376A296k2K48p23J87Rn15J63q8m46j80k67J84l73l5k07k12l8j85k4K15l92j80
1398a585J74k98J80Q4j67k0K25K6J20M14J43j19K17q1K23J09N39j07J7J27N32
1419G53J09n0L72j8Q9O6K04l2M03k16K65j54O4J25k04lo1j79m2o7k59K53K5m70
1443I73J9j76j16k23j78K4k47n9N7n37J27l25N7k1j04l0j51rj78J82J56k04J65
1466g98j31J45J15q2J40K05J06q9K71J22K89ok6L95o5J88n6K96k35K66k0j35K84
1489A179J22j83J73J40j82J27k39L06l00n5K5k4j42l47K3k54K78m31J84l53j12
1510f5P9N5l92j55j57J98j3m56J93m9k77K22n08K37K48k56K71k80J13J85K50j58
1532g15L74k55L93Q3m0M67l97L57k08K59L59k88jM16k83K73J47l39N90m69K61
$$ plain form
1376 1296 1274 1522 799 986 995 480 643 555 109 -71 -338 -154 -527 -562 -769 -981 -1019 -1204 -1228 -1013 -1405 -1585
1398 -1585 -1411 -1709 -1529 -1445 -1612 -1632 -1407 -1381 -1261 -847 -704 -823 -606 -687 -464 -355 184 77 94 221 753
1419 753 862 812 1184 1166 1255 1321 1525 1493 1896 1680 1945 1791 1855 1980 1776 1773 1712 1533 1491 1424 1165 1418 1443 973
1443 973 992 816 700 477 299 323 76 17 74 -463 -336 -661 -604 -625 -729 -759 -910 -919 -1097 -915 -759 -963 -798
1466 -798 -929 -784 -669 -751 -611 -406 -300 -389 -118 4 293 287 261 656 591 779 723 1019 784 1050 1030 895 1179
1489 1179 1301 1118 1291 1431 1249 1376 1137 1443 1143 1088 1113 1089 947 600 623 369 647 216 400 47 -65
1510 -65 14 69 -323 -478 -635 -437 -450 -906 -713 -762 -1039 -817 -1325 -1088 -840 -1096 -825 -1105 -992 -807 -557 -715
1532 -715 -341 -596 -203 -120 -160 307 -90 267 59 318 677 389 388 804 521 794 941 602 1192 723 984
1553I84J95p4j92Jj34q9n3l07R7K3m8k11k03j63j32j69P4j42k16j01l46k2k4J95
1577a057l9m80L33k89o5j3M5M26j37k24J99j3L33m8j50J38J56m0K53J44L27O6
1599a35Q8J13K73j11L02J76j66J13mL24Q0K3kq6jj65K1J66N6k86J03%j41P2m39
1624C74k5M4j92J43n75k66P5k55K01l59j47J82l12m0k46l4p1k67O7r9K6J02J40
1647a534l04N07p7j80K92j48K77J12K0Q1K04J67K03J27J13K31o6N55k07K06L81
1668I60j74L90Kk33K76j63M24j36p1K6L81l76K92n20l8L25m26J84k69l5l52j55
1690C12k1J65n79L44n38l9j60l89M14k11p3k6k77k97J44l26J46J56m4K39l94K62
1712a192j08M06k76N7J25K63o1J68L14j57M35l71L41M01j10O38n4J1O3J33Q6R7
$$ plain form
1553 984 1179 1105 913 914 780 691 638 331 428 451 403 192 -11 -174 -306 -475 -401 -543 -759 -860 -1206 -1228 -1252 -1057
1577 -1057 -1096 -1576 -1243 -1532 -1597 -1610 -1565 -1139 -1276 -1500 -1301 -1314 -981 -1029 -1179 -1041 -885 -925 -672 -528 -201 -135
1599 -135 -47 66 339 228 530 706 540 653 649 973 1053 1076 1074 988 987 822 843 1009 1065 779 882 882 741 813 374
1624 374 349 393 201 344 -231 -497 -422 -677 -476 -835 -982 -800 -1112 -1152 -1398 -1432 -1503 -1770 -1703 -1802 -1776 -1674 -1534
1647 -1534 -1838 -1331 -1408 -1588 -1296 -1444 -1167 -1055 -1035 -954 -750 -583 -380 -253 -140 91 25 580 373 579 960
1668 960 786 1176 1178 945 1221 1058 1482 1346 1275 1301 1682 1306 1598 1078 1040 1365 939 1123 854 819 467 312
1690 312 291 456 -123 221 -317 -356 -516 -905 -491 -702 -775 -801 -1078 -1375 -1231 -1557 -1411 -1255 -1299 -1060 -1454 -1192
1712 -1192 -1300 -894 -1170 -1113 -988 -725 -786 -618 -304 -461 -26 -397 -56 345 235 873 819 830 893 1026 1112 1209
1734A209j0K64j75o1N02l37P8n2N0R1k69N2jj76L6m5m14J94J8m20k64Mn5Kk28
1759gj1k46k38J29l84L21n3n51M79j62L3Ln45L19J6m40N79J44k85K92j75N87k79
1782d74p9K31J53J34J13j49M24o3j25L97j25J38L23j65K74l44K85l1L65j72j36
1803I74l5R9J41k03J16k72K46J56n95J67oK9j61l16R0k99l03K12j57m08M62l69
1825d32O7o1k24J36j55J43J79n07N21l50n0R1p0K2J55k08K79Q0Q4R6k96M21j60
1848b39k1J55J66P3M12m28K82L1j79L59mj05L40k58J4L15l78M84n50K00K10l07
1870E72P6J51k81j00J68k23k34j38J19j24k55J61k31p1k12O0%N7j42p4j26K14
1892f33p2k95K03n1k4J17K68l70K40q2K26j52K16kl0J7K42K90q5L8N1L78k55K15
$$ plain form
1734 1209 1199 1463 1288 1227 1729 1392 1470 1418 1468 1559 1290 1342 1341 1165 1201 1156 742 936 954 534 270 274 219 221 -7
1759 -7 -18 -264 -502 -373 -757 -436 -489 -1040 -561 -723 -690 -687 -1232 -913 -897 -1337 -758 -614 -899 -607 -782 -195 -474
1782 -474 -553 -322 -169 -35 78 -71 353 290 165 562 437 575 898 733 1007 663 948 917 1282 1110 974
1803 974 939 1038 1179 976 1092 820 1066 1222 627 794 788 817 656 340 430 131 -172 40 -117 -525 -63 -432
1825 -432 -365 -426 -650 -514 -669 -526 -347 -854 -333 -683 -733 -642 -712 -690 -535 -743 -464 -384 -300 -204 -500 -79 -239
1848 -239 -260 -105 61 134 546 118 400 431 252 611 607 502 842 584 598 913 535 1019 469 669 879 572
1870 572 648 799 518 418 586 363 129 -9 110 -14 -269 -108 -339 -410 -622 -562 -562 -505 -647 -721 -847 -633
1892 -633 -705 -1000 -797 -848 -872 -755 -487 -857 -617 -699 -473 -625 -409 -411 -441 -424 -182 108 23 61 112 490 235 450
1916D50J00l62K18O3K88j40j32K54j24k5L9J14l44L47k54Q5l7l44N3K13l49j54
1938d1N2p8j63k6l2j00Q1r3j76N7j50P6j62j72K60k00P3M2j49k24N73j62j5l8
1962g67k26M49o4R1J4L7J70j9J61j60L61J6K10r3J65J58J15J02j43o0K19K82l77
1985F41J39Mk8O5J83q9k40P6l1J04l21j62K85p9k90j28j35nJ35N2n39P3j99j1
2009e00j09n8l8k73J75q6pj20K14k79Q1Q0J35l27M62r7j1J42k9L29k36L32pn7
2033b84K52O6L6K10j65P4L90k75L10q6J4J14K17J12P5p9n2P6j59j38L54l05J93
2056I50k82K03k07j43NJ12j13k41Q6j24j96N9j07k75J39R3l05l1j25q7kk88m5
2079i24P0K9J39j98l02L90l3K32k20M16l39K10j05lL79j57K9J73N4o8K62J33j32
$$ plain form
1916 450 550 188 406 469 757 617 485 739 615 590 629 743 399 746 492 577 540 196 249 462 113 -41
1938 -41 11 -67 -230 -256 -288 -388 -307 -400 -576 -519 -669 -593 -755 -927 -667 -867 -794 -752 -901 -1125 -552 -714 -729 -767
1962 -767 -993 -544 -608 -517 -503 -466 -296 -315 -154 -314 47 63 273 180 345 503 618 720 577 517 736 1018 641
1985 641 780 784 756 821 1004 915 675 751 720 824 503 341 626 547 257 129 -6 -11 124 176 -363 -290 -489 -500
2009 -500 -609 -667 -705 -978 -803 -889 -896 -1016 -802 -1081 -1000 -920 -785 -1112 -650 -747 -758 -616 -645 -316 -552 -220 -227 -284
2033 -284 -32 34 70 280 115 189 579 304 614 528 542 656 873 985 1060 981 929 1005 846 708 1062 757 950
2056 950 668 871 664 521 526 638 525 284 370 246 50 109 2 -273 -134 -41 -346 -377 -502 -589 -591 -879 -924
2079 -924 -854 -825 -686 -884 -1186 -796 -829 -597 -817 -401 -740 -530 -635 -638 -259 -416 -387 -214 -160 -228 34 167 35
2102C5J42J00M78k61j49J02K14m8K91j95R9J24q0J78k12K3K0K0j37nJ8J5L3m57
2126C48k57Q9L47l89j90L57m78j75NJ24q4K7j78k07j4K41j77k40J65j77q5M45
2148e03j90J08j36O9j9K3K12k30K62k04L94l52K58K17M8R1k26L46O3j50J28N7
2170B66K4pK69k7O4k12L85l64J93j36q9J49J70l26K25m11J60J67j88R0j77j58
2192F7J46k11j57L06n26K38J49q1j67j77N1R2j85l5j09L2J13m5%J93l34M65l58
2215e33M0K49k10P9j03N19k73J10K43p6R9j0K76l34J92l08N5L50m3J37j52K13
2237E20R1l03J46j00o8K00j60P9J91l43O1l9n0k12L10l73L02j28j5q9j42M1l44
2260d25L05q7J6R3m03J32jM0L7R1k17J30q3K39j9l20M1P9J52r0J93k45L71j86
$$ plain form
2102 35 177 277 755 494 345 447 661 613 904 709 808 932 852 1030 818 841 861 881 744 739 757 772 805 348
2126 348 91 180 527 138 -52 305 -173 -348 -343 -219 -303 -276 -454 -661 -675 -434 -611 -851 -686 -863 -948 -503
2148 -503 -693 -585 -721 -652 -671 -648 -436 -666 -404 -608 -214 -566 -308 -91 -43 48 -178 168 231 81 209 266
2170 266 290 283 552 525 589 377 762 398 591 455 366 515 685 359 584 173 333 500 312 402 225 67
2192 67 213 2 -155 151 -375 -137 12 -69 -236 -413 -362 -270 -455 -490 -599 -567 -454 -499 -499 -306 -640 -175 -533
2215 -533 -493 -244 -454 -375 -478 41 -232 -122 121 45 144 134 410 76 268 -40 15 365 322 459 307 520
2237 520 611 308 454 354 286 486 326 405 596 253 314 275 225 13 323 -50 252 124 109 20 -122 -81 -425
2260 -425 -120 -207 -191 -98 -501 -369 -370 -330 -293 -202 -419 -289 -372 -133 -152 -472 -431 -352 -200 -290 -97 -342 29 -157
2284a57K83k22J97J86j72L2kL15K2K6l38M50p8Nj20M1K2o6O5O9k14L30k0k80n1
2309C23J57j44K53l61j84J82j7j20l16K73k11O1j52l66M25L17m12lMJ9j93L17
2331a48l73K70r3L0Q8k89K88p3j86N11k07k70M51k76K41Q4j6K58k53J30K48r6
2353C19j0N8R9j15N5J29J37k14N9j19R9J33q2LJ56n01J30M0j72L85j16p2j9k45
2377A37k89M26n94J37J36j8lk84J58l97J32K8k12M2p4P0J82k76J25P1L8j24J32
2400d57k24K94m8l5Nj83K47l71K86J78K04L04j19n88P33j45k61L86QL69j99k5
2422C59J89L6m2K3k2k79L36m5l1k64N1Pj8K02j76p1J13k36m0j65k0L10k26k79
2446b88K02m67Q6J98k97L20l03n6P6k14J76k48J79J53m95J85mR7k77K86O5j1J69
$$ plain form
2284 -157 126 -96 101 287 115 147 145 460 482 508 170 620 542 547 427 468 490 424 489 558 344 674 654 374 323
2309 323 480 336 589 228 44 226 209 89 -227 46 -165 -104 -256 -622 -197 120 -292 -295 -291 -272 -465 -148
2331 -148 -521 -251 -344 -314 -226 -515 -227 -300 -486 25 -182 -452 -1 -277 -36 48 32 290 37 167 415 319
2353 319 309 367 466 351 406 535 672 458 517 398 497 630 548 551 707 206 336 376 204 589 473 401 382 137
2377 137 -152 274 -320 -183 -47 -65 -68 -352 -194 -591 -459 -431 -643 -601 -675 -605 -423 -699 -574 -503 -465 -589 -457
2400 -457 -681 -387 -435 -470 -465 -648 -401 -772 -486 -308 -104 200 81 -507 226 81 -180 206 214 583 384 359
2422 359 548 584 542 565 543 264 600 555 524 260 311 318 300 502 326 255 368 132 92 -73 -93 217 -9 -288
2446 -288 -86 -553 -467 -269 -566 -246 -549 -605 -529 -743 -567 -815 -636 -483 -978 -793 -797 -700 -977 -691 -626 -637 -468
2469d68j16J45M3K67k57K56J30j80j1J75j5J02Q4JK06M9o2q1J75K3j2kJ52l65
2493B39L99m06L25j20J91l16n5J29L4k1l20M59m21J37k34q3j54K09k57O5j7k2
2515b39j59M2j20J46j86J00k5q4J26k39K20j26j1K9m0J64n7J17L45m10J92j95
2537d10L83j31J31k17M00p6K33n6q5L55k70Q6P0p6k8O3Q6J73j97J27kj20m9k8
2561C62K73k14j84L33k03k0q6j0J46j26J87k11j24l98N90k43k70K13p3m3j01r3
2583b95ML5l1j36J15N2L8J00J1n6q5L10j28p9m7M71j68k05M11l51M27J36l83J95
2607C41k07K00Q0n2K9J65j0j3j45K7n2P3j48m1J70j77R4O3p6j21K58k98J57j25
2631A92J00r4K90m84L6J52J11k12l58L98l52k7N3J66l32L31k95L10k4k2N5k87
$$ plain form
2469 -468 -584 -439 -396 -129 -386 -130 0 -180 -191 -16 -31 71 155 156 362 411 349 268 443 466 454 452 604 239
2493 239 638 232 557 437 628 312 257 386 420 399 79 538 117 254 20 -63 -217 -8 -265 -200 -217 -239
2515 -239 -398 -356 -476 -330 -516 -416 -441 -525 -399 -638 -418 -544 -555 -526 -566 -402 -459 -342 3 -407 -215 -410
2537 -410 -27 -158 -27 -244 156 80 313 257 172 527 257 343 413 337 309 372 458 631 434 561 559 439 390 362
2561 362 635 421 237 570 367 347 261 251 397 271 458 247 123 -275 315 72 -198 15 -58 -101 -202 -295
2583 -295 -291 -256 -287 -423 -308 -256 -218 -118 -107 -163 -248 62 -66 -145 -192 279 111 -94 317 -34 393 529 146 341
2607 341 134 334 414 362 391 556 546 533 388 415 363 436 288 247 417 240 334 397 321 200 458 160 317 192
2631 192 292 198 488 4 40 192 303 91 -267 131 -221 -248 -195 -29 -361 -30 -325 -15 -39 -61 -6 -293
2653b93K78l2j3j7J6J40j35N7L2K5J89J70N4o5m23J19O8P0J02r9K31k4l1k90L46
2678D75q8n8j44R4J02j26K23j70L1j72k30K55j61O6J56l63l71J31N86m65J56l18
2700c91p1l1M34k54O9k92P0K51oj36j34R3k39J10K61j58k27N01k35K20J40r7M9
2723g3j56J21Q5L6J77Q4j57j01J52o6J94n1jJ96p6j54J90m9N5j95m6L36o9r1j83
2748A58j70O8mJ62j04j71J19l21J62j33r2Po7J85j51j71j39J20J12o6K1J42l25
2771f58M3kJ6J17Q7k88L11p9j15J59Q3Kp7J91J14o7kk4K48R3o7m57L95K23j85
2796F1K23j60J59j55J52o0K87k08L0r5l1L92m41J31J53k30L1J05j11M0j87QK93
2819C87k38j20k07N1J16k84K69l25J09r2k72K25J80l11Po6K8K61k59k0K56j55
$$ plain form
2653 -293 -15 -47 -60 -77 -61 79 -56 1 33 58 247 417 471 406 -17 102 170 240 342 243 474 450 419 129 475
2678 475 387 329 185 279 381 255 478 308 339 167 -63 192 31 97 253 -110 -481 -350 236 -229 -73 -391
2700 -391 -462 -493 -59 -313 -244 -536 -466 -215 -221 -357 -491 -398 -637 -527 -266 -424 -651 -150 -385 -165 -25 -122 -73
2723 -73 -229 -108 -23 13 190 274 117 16 168 102 296 245 244 440 364 210 400 351 406 211 165 501 432 341 158
2748 158 -12 56 52 214 110 -61 58 -263 -101 -234 -326 -319 -386 -201 -352 -523 -662 -542 -430 -496 -475 -333 -658
2771 -658 -615 -617 -601 -484 -397 -685 -374 -453 -568 -409 -326 -324 -401 -210 -96 -163 -165 -189 59 152 85 -372 23 246 61
2796 61 284 124 283 128 280 220 507 299 329 234 203 595 154 285 438 208 239 344 233 273 86 94 387
2819 387 149 29 -178 -127 -11 -295 -26 -351 -242 -334 -606 -381 -201 -512 -505 -571 -543 -282 -541 -561 -305 -460
2841d60J43Q5q7j40K58P4K07r8l71L48k5K42j34J1k44P47j67m09m3N35k18j66
2863H8N28r4J44k62r0j19J7J95J57k52K9Q7Q0r4l14J21L01l77J14k84L90k26k77
2886a38K34k76J41p5j2M6J41m40J42j9K43j95j01J1K13j20Q8L9k10K80j25l3R4
2909g2oJ88l57J08J22m2L71j18J02pk90M17N2K05l57n2K52j60J01mk05K45Q2j13
2933D62P5l02J48k41K50j77J8o6n5J7j5n1R4k22K01p2J0j77j93M39k70L2J58k77
2957b14Q7j13N4J18j57K55o0k65K84K00l82p3Q3R2K87k40RJ12N5k57J90j09L22
2980B78l0k7P3k73L73l2NJ03k91J39k04J21j00J0K8k17L39r5p4K7l7k1j16K39
3004B18l61J10J78k70j39K6K58j91N9k1r8j8K61j60J8l7k8J55j2m1L8k59L15m6
$$ plain form
2841 -460 -317 -232 -319 -459 -201 -127 80 -18 -389 -41 -66 176 42 53 -191 556 389 -20 -63 472 254 88
2863 88 616 522 666 404 314 195 212 407 564 312 341 428 508 414 100 221 522 145 259 -25 365 139 -138
2886 -138 96 -180 -39 -114 -126 -80 61 -379 -237 -256 -13 -208 -309 -298 -85 -205 -117 -78 -288 -8 -133 -166 -72
2909 -72 -78 110 -247 -139 -17 -59 312 194 296 289 -1 416 468 673 316 264 516 356 457 453 248 493 575 462
2933 462 537 235 383 142 392 215 233 167 112 129 114 63 157 -65 136 64 74 -103 -296 143 -127 -95 63 -214
2957 -214 -127 -240 -186 -68 -225 30 -30 -295 -11 189 -193 -266 -183 -91 196 -44 -35 77 132 -125 65 -44 278
2980 278 248 221 294 21 394 362 367 470 179 318 114 235 135 145 173 -44 295 200 126 153 116 95 -21 218
3004 218 -143 -33 145 -125 -264 -238 20 -171 -112 -133 -231 -249 12 -148 -130 -167 -195 -40 -52 -93 -55 -314 1 -45
3028d5j03O1j17R5K89j96J06p0k4pm36N24k45L47m7R0k30L35j76J15j28J50k29
3051E9ko6q9K84q7k57L46J1k00j04M22j44l06K42k44K75q3j35j12K07k8m07K14
3074b04J27k79j72K75m8k07L42o8p6k7L5K16m9R7p8j18r4o8L34M9j96P4n9J45
3098d9j09j40M00R7l62J84K75Nj88j13R7J3k6K08J76k11j28j0j50K12n5J91l51
3121c4J22J13j01o9l4j0J16N1k78J16j56J67j77m8J9KJ54l68l2K80j54k28K46
3144c03j30o5R1K3K61j28o4J28j80J35J71k4m6l7J49N0m3j0L6k78K82O1n9J11
3168A31k01L51Q1j10o7L16k57Q3k53J81n8P9K12k51Jm7j6k13K37k61L58k38n7
3191Ap4R9j54L8M0J1p2k85M02q1J21k57O0j32j98K66RN7k38N6J67k40J91k29K63
$$ plain form
3028 -45 -148 -87 -204 -109 180 -16 90 20 -4 -11 -447 77 -168 179 132 222 -8 327 151 266 138 288 59
3051 59 57 -9 -98 186 99 -158 188 199 -1 -105 317 173 -133 109 -135 140 57 -78 -190 17 -11 -418 -204
3074 -204 -77 -356 -528 -253 -301 -508 -166 -234 -310 -337 -302 -86 -135 -38 -116 -234 -328 -396 -62 -13 -209 -135 -194 -49
3098 -49 -158 -298 102 199 -163 21 296 301 113 0 97 110 84 292 468 257 129 119 -31 181 126 317 -34
3121 -34 88 201 100 31 -3 -13 103 154 -124 -8 -164 3 -174 -222 -203 -201 -47 -415 -447 -167 -321 -549 -303
3144 -303 -433 -498 -407 -384 -123 -251 -315 -187 -367 -232 -61 -85 -131 -168 -19 31 -12 -22 14 -264 18 79 20 131
3168 131 -70 281 362 252 185 501 244 327 74 255 197 276 488 237 238 191 175 -38 199 -62 296 58 1
3191 1 -73 26 -128 -90 -50 -39 -111 -396 6 -75 46 -211 -151 -283 -481 -215 -206 -149 -387 -331 -164 -404 -213 -442 -179
3216a79P7q7K51m4j74K34j31Jj24J21r9O6K00j30R0R4J46P5J02k36k07l4J26j18
3240B0K99q8j72K05j16J4m2m1j05r6L53l17K00J10j93p5K6Q2k76M07k76K29l26
3263a78O3j73K67n9j32K16j33k80K2J51J45p8n0J26Q3j41J54nq0jn9Op5J12K98
3288A99l17K41N7j14O7k39J7k2M05l49J85j0j36L22l30K18j15J09k09J27j33Q6
3310E9M1J2r0j20L1Q1P2k70J28P4J38m32L3K68n8j6K46n95M18k69K58j62J28r6
3334a21J71q9J12j42M0M5j8J47P2l02J52o8o9J84o9J13J31j71L3L9r3k7n3P2j09
3359b0K41k62L55m18o1L74l10K40L6k76j17J43j60K55p9Q3K8l47K79J51l02m5
3381b12O9R0o8p5R3r2k35N03j70J69p2j85J14n2J44o7P5m5J08R1k38K49k48J98
$$ plain form
3216 -179 -102 -189 62 18 -156 78 -53 -52 -176 -55 -154 -88 112 -18 72 166 312 387 489 253 46 12 138 20
3240 20 319 231 59 264 148 162 120 79 -26 -122 231 -86 114 224 31 -44 -18 64 -212 195 -81 148 -178
3263 -178 -115 -288 -21 -80 -212 4 -129 -409 -387 -236 -91 -169 -219 -93 -10 -151 3 -2 -82 -83 -142 -136 -211 -99 199
3288 199 -118 123 180 66 133 -106 -89 -111 294 -55 130 120 -16 306 -24 194 79 188 -21 106 -27 59
3310 59 100 112 22 -98 -67 14 86 -184 -56 18 156 -276 -243 25 -33 -49 197 -398 20 -249 9 -153 -25 -121
3334 -121 50 -39 73 -69 -29 16 -2 145 217 -85 67 -1 -70 114 45 158 289 118 151 190 97 70 17 89 -20
3359 -20 221 -41 314 -104 -165 209 -101 139 175 -101 -218 -75 -235 20 -59 24 52 -295 -16 135 -167 -212
3381 -212 -143 -53 -121 -196 -103 -195 -430 73 -97 72 0 -185 -71 -123 21 -46 29 -16 92 183 -55 194 -54 144
3405A44j26m6K17QQ2j11j46K12q9J16k6R4N7k77K17j22K6k01M82j27k04q2j36
3428c8K6j08K54j95J04l6J56j54l4P2j49J68j38K50k50j45R2M6K6K6j59J90L2
3451C6k08ok22J75K88l37K02Np0pK12J2k46J71O3L7j15J20J90m12o2K06K55J33
3475D20j25r7k09K59O9n6j84K76k77J17K37m09LN8O5K9j88oj8j31J73J03j52l6
3499g9J48J82m65K6K1Q1l17L49q0lj63j35K66O5ok8lJ1J09Rn6R6k3k64KP2K87
3526A02l20J39j1J09j49k3L22l69K86l77K73K75m7M1l62J42J03qr5k41Q8J18L8
3549C4j63K41j99J14m8K16n1j38k39n4J35O8J2N0k88K40M6k47P5p7J18J45Nr6
3573a01j83j54K61Q0R0j78K79l28J32P6k46L4O7jL9J18l3K19l32K73l33L84j85
$$ plain form
3405 144 18 -28 189 197 279 168 22 234 145 261 235 329 386 109 326 204 230 29 511 384 180 98 -38
3428 -38 -12 -120 134 -61 43 7 163 9 -25 47 -102 66 -72 178 -72 -217 -125 -79 -53 -27 -186 4 36
3451 36 -172 -178 -400 -225 63 -274 -72 -67 -137 -144 68 80 -166 5 68 105 -10 110 300 -112 -174 32 287 420
3475 420 295 198 -11 248 317 261 77 353 76 193 430 21 24 82 147 176 -12 -18 -36 -167 6 109 -43 -79
3499 -79 69 251 -214 -188 -167 -86 -403 -54 -134 -137 -300 -435 -169 -104 -110 -138 -141 -130 -21 -12 -68 28 5 -259 -257 -185 102
3526 102 -218 -79 -90 19 -130 -153 169 -200 86 -291 -18 257 210 251 -111 31 134 126 31 -210 -122 -4 34
3549 34 -129 112 -87 27 -21 195 144 6 -233 -287 -152 -84 -72 -22 -310 -70 -24 -271 -196 -273 -155 -10 -5 -101
3573 -101 -284 -438 -177 -97 -7 -185 94 -234 -102 -26 -272 -238 -171 -172 -133 -15 -48 171 -161 112 -221 163 -22
3596b2N8j79j90N07m36J33L33ol48L80j61p6N3k14o7K41J04k54J88k62Q9J22j58
3619a65j15K30J2K0K2K5j96J55k89J39J95k25l4q6q9N44j05j74Q1o8K58j52l5
3642e2J83%j13R5j13Q9K36k11j00j63K18J00j00K57k97J39k58k9M60m32M52k62
3664I9K09oj86Q8n6n6P2L2j46J58j39j98K08l6njj89J36j41L5J69j69k0K8q0K35
3690D1j8P2l28n0L67J19j29n2j84M28k98J64k1j09L0K5J90j40P0k1P8J7J88k13
3714B26j15K71q6n9M15k46M6k4k39R9l09J71K0J92m2j49l2M2j27mJ9J12J05k44
3738D2oJ08j14M0J01m69J89j28K14o4n7L3R8P4M5l56K17QJ70k24P1K19j28n1O2
3763I4j60J77K2k9J43k22K02j03O6K61l72J30J28L9j69l7J46k10K26j9m6j12n2
$$ plain form
3596 -22 36 -143 -333 174 -262 -129 204 198 -150 230 69 -7 46 -168 -235 6 110 -144 44 -218 -129 -7 -165
3619 -165 -280 -50 -38 -18 4 29 -167 -12 -301 -162 33 -192 -226 -312 -401 143 38 -136 -55 -123 135 -17 -52
3642 -52 131 131 18 113 0 89 325 114 14 -149 69 169 69 326 29 168 -90 -119 341 -91 361 99
3664 99 308 302 116 204 148 92 164 196 50 208 69 -129 79 43 38 37 -152 -16 -157 -122 47 -122 -142 -114 -194 41
3690 41 23 95 -233 -283 84 203 74 22 -162 266 -32 132 111 2 32 57 247 107 177 156 234 251 439 226
3714 226 111 382 296 237 652 406 452 428 189 288 -21 150 170 362 320 171 139 181 54 50 69 181 286 42
3738 42 36 144 30 70 171 -298 -109 -237 -23 -87 -144 -111 -13 61 106 -250 -33 -25 145 -79 -8 211 83 32 94
3763 94 -66 111 133 104 247 25 227 124 190 451 79 209 337 376 207 170 316 106 332 313 267 155 103
3786A03L7m3Q7J37k39J53J08O6l63K07n9j92p8P2J1l73L20P2j6j24l14L32j85
3809b81J1q1J87k39K30J58j24j72j42L13l7K78rp5k03l7J01mq7K92j46j2M3o0
3833i6l0R4p2K24j33L15k42J29m7k75K61m1K62k71P9Q8j39j7R5j43k8J78l97L93
3857A87N9p8k68M8m9j15K1L2L6l1k04M66k00j52J6k04L71j04j01N8R4j01L95j85
3881il55K02P5k58K47k84J28J8K12j46J21J35k14M5q6J75l0R3L5j6J03l70J11
3904f8J1K14l20K21k23J0L61k20J43o4p3J11p2r2nJ22K9j53J7j25K77j76o3L9
3928i9p3k7m3J86%j93Q1o3j51J31P7k9q5qrk1K12O3J24r3k14N9N5O5n6L08j79
3955A8j00Q1P9r0O2J00l14J71J39qj14J4J30j70j22L05j20n7Q2J5n9j20P8r1K80
$$ plain form
3786 103 140 97 184 321 82 235 343 409 46 253 194 2 -76 -4 7 -366 -46 26 10 -114 -428 -96 -281
3809 -281 -270 -351 -164 -403 -173 -15 -139 -311 -453 -140 -177 101 92 17 -186 -223 -122 -126 -213 79 -67 -79 -36 -96
3833 -96 -126 -32 -104 120 -13 302 60 189 142 -133 128 87 349 78 157 245 106 89 184 41 13 191 -206 187
3857 187 246 168 -100 -52 -101 -216 -195 -163 -127 -158 -362 104 -96 -248 -232 -436 -65 -169 -270 -212 -118 -219 176 -9
3881 -9 -364 -162 -87 -345 -98 -382 -254 -236 -24 -170 -49 86 -128 -83 -169 6 -24 69 104 88 191 -179 -68
3904 -68 -57 157 -163 58 -165 -155 206 -14 129 65 -8 103 31 -61 -66 56 85 -68 -51 -176 101 -75 -138 -99
3928 -99 -172 -199 -242 -56 -56 -249 -168 -231 -382 -251 -174 -203 -288 -296 -305 -326 -114 -51 73 -20 -234 -175 -120 -55 -111 197 18
3955 18 -82 -1 78 -12 50 150 -164 7 146 138 24 38 168 -2 -124 181 61 4 86 101 42 -78 0 -91 189
3980A89j66R7k36j44J68k6M6J6o5J54j82j45R1NJ15j70L7J57K47l35K6K1r6L3
4004a63K79j15J45J23l13K86o5j60J69j72OK07Q2O5l14J26L29m90L7K50Kp9j49
4027H6K44k22L05q6j38l20K77J15M6j78L43n39K15o5J77m23L10j63J06m0q0j32
4049a62%Q0q5M26l08K%nK02q6m16L75p7J09k89J42J3n5L45k96j72N15m04J87J46
4074A87k95L19j16R5J79l32LM07k13k8k1R3J48p4p9O8J0j33j38L19k28J03q6r4
4098I4j8J20j42mN0K17j90j14m7k2K4m1q3j97K75m5K58k10n5M7n0j15M38n92P2
4123c30O7J68K84l32NK56j50K90k92j69J57K7j70K13K2j10J44m7Q9J77k77l5K96
4146B83l32K0L87k79J07J47k60K44nq7j24K40n69L66l00K20k03M0L01k04q8K13
$$ plain form
3980 189 23 120 -116 -260 -92 -118 -72 -56 -121 33 -149 -294 -203 -198 -83 -253 -216 -59 188 -147 -121 -100 -196 -163
4004 -163 116 1 146 269 -44 242 177 17 186 14 20 227 309 374 60 186 515 25 62 312 314 235 86
4027 86 330 108 413 327 189 -131 146 261 307 129 472 -67 148 83 260 -163 147 -16 90 50 -30 -162
4049 -162 -162 -82 -167 259 -49 -47 -47 -52 150 64 -352 23 -54 55 -234 -92 -79 -134 211 -85 -257 258 -146 41 187
4074 187 -108 211 95 190 369 37 40 447 234 206 185 278 426 352 273 341 351 218 80 399 171 274 188 94
4098 94 76 196 54 50 100 317 127 13 -34 -56 -32 -73 -156 -353 -78 -123 135 -75 -130 -83 -133 -248 190 -402 -330
4123 -330 -263 -95 189 -143 -138 118 -32 258 -34 -203 -46 -19 -189 24 46 -64 80 33 122 299 22 -13 283
4146 283 -49 -29 358 79 186 333 73 317 312 225 101 341 -228 138 -162 58 -145 -105 196 -8 -96 117
4168A17j32j18N8r0K16k93o4J92J01l2m28L63j37J24j41k7J21k99L84J97l64j8
4190b70J94mj7q1j61R9k06L60j7l29N20k3j64J23j04J76j08M7LLJ19%m8j61J45
4215I6p4O6jO5j73O9J49r8l82R2k38N57m05J50q7K14j04M4j26K2j9L3K7l5j14
4240b72J71k17J31J08j22q4l2p0j7K44p9J53J84j47o5J35J7K5k26J8K97j42j0
4263@J21Nr1k0p5Q3P8Mk67L26k4j83K31j15Kj02k2L76j53j74l0j66L47k34j60
4288b43K63Q6l69L63q4L2k25J9m9L76m09M2j6J53j56j33L35M0j61j49K90j25R9
4311b1k8k2rJ4J0j83M04m4K38n50P7L58k49Q9Q3P7N3q3k2k7R7j37j04mL06o2J51
4338D12m12K44j20j40K61k24r5J08k8J68k15K71l22l0J83k54L8K39m10K58J82
$$ plain form
4168 117 -15 -133 -75 -165 51 -242 -306 -114 -13 -45 -473 -110 -247 -123 -264 -291 -170 -469 -85 112 -252 -270
4190 -270 -76 -80 -97 -178 -339 -240 -446 -86 -103 -432 88 65 -99 24 -80 96 -12 35 38 41 160 160 112 -49 96
4215 96 22 88 87 152 -21 48 197 99 -283 -191 -429 128 -277 -127 -214 0 -104 -60 -186 -164 -183 -150 -123 -158 -272
4240 -272 -101 -318 -187 -79 -201 -285 -317 -387 -404 -160 -239 -86 98 -49 -114 21 38 63 -163 -145 152 10 0
4263 0 121 126 35 15 -60 23 101 105 -162 164 140 -43 188 73 75 -27 -49 327 174 0 -30 -196 151 -83 -243
4288 -243 20 106 -263 100 16 48 -177 -158 -207 169 -240 -198 -214 -61 -217 -350 -15 25 -136 -285 5 -120 -21
4311 -21 -49 -71 -80 -66 -56 -239 165 121 359 -191 -114 244 -5 84 167 244 297 214 192 165 262 125 21 17 323 261 412
4338 412 0 244 124 -16 245 21 -74 34 6 174 -41 230 -92 -122 61 -193 -155 84 -326 -68 114
4359A14Q7l23J62n3K21k06k10J34j07J73K2O7M5j29m4p2J70N5R3J09j20N5k40
4382Cj04J69J60k74K98P4j39O2m8k15K26p3J09l52P4J93pJ07O6k29l6k4J84k8
4406A96J88l00k8j4P1LP5k40rJ25k68K08q0O4j11L9J23k55J09J30r6j13L07m23
4430b99Q4K07j98J18O1q1o3O0J9O3L4N9q0L3k38N3L35j28o9K80j63qJ84l15K37
4455A85J98j14j96J38N7j53J47j32J19j22J91m18L04L9m09O1N3N9J69l07J2j46
4477b65O7K99k20K04j25p0j59J93j25J66M0R7k69r6L02M0l52J49K48l17j96JR2
4500b96R0l4K50l2k7j01p5K30m03L04K01nj20J67L1k01lJ85j1o7nQ5k09J81O2
4525A97j75N7l2j79L73j95O0p9J53o8k16N7k0m3L9k04K14j6r5J79j51M8r9Q3j96
$$ plain form
4359 114 201 -122 40 -13 208 2 -208 -74 -181 -8 14 81 126 -3 -47 -119 51 106 199 308 188 243 3
4382 3 -101 68 228 -46 252 326 187 249 201 -14 212 139 248 -104 -30 163 156 263 329 100 64 40 224 196
4406 196 384 84 56 42 113 116 191 -49 -58 67 -201 7 -73 -9 -120 -81 42 -213 -104 26 -70 -183 124 -299
4430 -299 -215 -8 -206 -88 -27 -108 -171 -111 -92 -29 5 64 -16 17 -221 -168 167 39 -30 250 87 79 263 -52 185
4455 185 383 269 73 211 268 115 262 130 249 127 318 -100 204 243 -166 -105 -52 7 176 -131 -119 -265
4477 -265 -198 101 -119 85 -40 -110 -269 -76 -201 -35 5 102 -167 -263 39 79 -273 -124 124 -193 -389 -388 -296
4500 -296 -206 -240 10 -22 -49 -150 -225 5 -398 -94 107 102 -18 149 180 -21 -24 161 150 83 78 163 -46 135 197
4525 197 22 79 47 -132 241 46 106 27 180 112 -104 -47 -67 -110 -71 -275 -61 -77 -172 7 -144 -96 -195 -112 -308
4550c08J7J76J79n61L79j08J42Q4m8l13K58k1J76qp2m4j8j3P3m9q1O1J75p9k0
4575b3J36J37k97J97j44J32k59Q2J00n0N0o2n2J00M3r9k28M00L7n9M0n2j90O5
4599Dj02J57k56J57j82M0J40j5j16l9J22L8n8J55L3j91j40M09k45k2J0m7J03P
4623c8R4J09l98M27k04k93L83j91J39Pn7p2r9K96N1Q5k00J64j42J84j44j64L11
4646B48j01r2r3l0O1j07M03j88K3Ok03J57J01q3O8j75j09K0J59j23KnJ29k15K86
4671A39L8l80M6K90M2m07K25p0O0j19J38J65l24J57lj44K82j44J94M8j64J51k19
4694AO6K32m05PJ47R4J36j22J3l47K81O9j61L63o22L69j64K8M9J86O9k70m2o0
4718h3K46k49M1q7J20L6K8r5J53m53M91j12j38n4J16J46k01K10j33R7o1j29j09
$$ plain form
4550 -308 -291 -115 64 -497 -118 -226 -84 0 -48 -361 -103 -124 52 44 -28 -72 -90 -103 -30 -79 -160 -99 76 -3 -23
4575 -23 113 250 -47 150 6 138 -121 -39 61 11 61 -1 -53 47 90 -9 -237 163 200 141 181 129 -61 4
4599 4 -98 59 -197 -40 -222 -182 -42 -57 -173 -212 -90 -52 -110 45 78 -113 -253 156 -89 -111 -101 -148 -45 -38
4623 -38 56 165 -233 194 -10 -303 80 -111 28 35 -22 -94 -193 103 154 239 39 203 61 245 101 -63 248
4646 248 147 55 -38 -68 -7 -114 289 101 124 130 -73 84 185 102 170 -5 -114 -94 65 -58 -56 -61 68 -147 139
4671 139 177 -203 -157 133 175 -232 -7 -77 -17 -136 2 167 -157 0 -3 -147 135 -9 185 233 69 220 1
4694 1 67 299 -106 -99 48 142 278 156 169 -178 103 172 11 374 -248 121 -43 -15 34 220 289 19 -23 -83
4718 -83 163 -86 -45 -132 -12 24 52 -43 110 -343 148 36 -102 -156 -40 106 -95 115 -18 79 18 -111 -220
4741b20nl9K15N2j27k0K75l00J13j29K29p5K04K4J59k33k17M0K87j56P1k34L47
4764B61R4j1j27j45k7K04%J18k67k4J6J26M0j4R9o04M32j14j00mm1O0j46K08J69
4789B03l09lJ68J85m96K19k93L0J2L23N2L1k49L3rN8k22L76R8k05l9L0j9n9K94
4814B09k14p3J87j55k4L06k11J36l15K95r8K66r1k89K71M2j76J67k64J37j66N3
4836gM9J66o6l05M72k48j16p1J48L5j45L76l05J15j33K9J66j44n5k97q7L17j97
4859c03M02j88J20n8p0Q1J23m56J73J97j71L26j10p5K26j97k15K93J52l47p9K72
4881I6l02N37l59k04K30N4r0K06Jj17J5j08J00o4J63j9J89k57L3r4P6J0K60k42
4905A14k64J45k26N0m2K06k69R6L13j35J77o0j68m7J89j91J07P8k48K64j94k3
$$ plain form
4741 -220 -225 -264 -49 3 -124 -144 131 -169 -56 -185 44 -31 173 197 356 123 -94 -54 233 77 148 -86 261
4764 261 355 344 217 72 45 249 249 367 100 76 92 218 258 244 343 -261 171 57 -43 -47 -88 -28 -174 34 203
4789 203 -106 -109 59 244 -252 -33 -326 -296 -284 39 91 122 -127 -94 -103 -45 -267 109 207 2 -37 -7 -26 -85 209
4814 209 -5 -78 109 -46 -70 236 25 161 -154 141 43 309 218 -71 200 242 66 233 -31 106 -60 -7
4836 -7 42 208 142 -163 309 61 -55 -126 22 57 -88 288 -17 98 -35 -6 160 16 -39 -336 -423 -106 -303
4859 -303 99 -89 31 -27 -97 -16 107 -349 -176 21 -150 176 66 -9 217 20 -195 98 250 -97 -176 96
4881 96 -206 331 -28 -232 -2 52 -38 168 169 52 67 -41 59 -5 158 139 328 71 104 10 86 96 356 114
4905 114 -150 -5 -231 -181 -223 -17 -286 -190 123 -12 165 105 -63 -110 79 -112 -5 73 -175 89 -105 -128
4927a28J82p1J46j16q9M16m57N0O0l44K08K47J6j53M8J15m03J15K62j67N0K08
4949A95k48n1J28m9J79j14o7K62j61M8M3l71L54J23k70j02p7L59j38j11N1j64
4971a81K16J44j03j86K83o5j55J55O2j49k39K06m9k5K51L9j62k7o9j25L83l30
4993a26J45j32rq7L10j13K98l97o4L7Q3K84j51J39j98J61N4j44J79j31N4l01J90
5016H1n6K01j65q9j13R7J35k21J88J6J81j49Nl0L6N9km87J32K27j84K06p9j15
5040a26Pj76L12k17L58k53M2q3P5J06j36No6P7Q8n8Q8k06Rl8j14J51L29l3K0j82
5066b1K58l90J61Q5l4Q2q8M9j64K58m3LR9k96j40K46n4J23k49N1j0J29J55J2k69
5091d7O5o5J01j44K11q1m2k73L09j07K36l55K46j36J87j44O2k26K41j53K02j66
$$ plain form
4927 -128 54 -17 129 13 -76 340 -117 -67 -7 -351 -143 104 120 -33 15 130 -273 -158 104 -63 -13 195
4949 195 -53 -104 24 -25 154 40 -27 235 74 122 165 -206 148 271 1 -101 -178 181 43 -68 -17 -181
4971 -181 35 179 76 -110 173 108 -47 108 170 21 -218 -12 -61 -86 165 204 42 15 -54 -179 204 -126
4993 -126 19 -113 -122 -209 101 -12 286 -111 -175 -138 -55 229 78 217 19 180 234 90 269 138 192 -109 81
5016 81 25 226 61 -28 -141 -44 91 -130 58 74 255 106 111 81 117 176 174 -313 -181 46 -138 68 -11 -126
5040 -126 -119 -295 17 -200 158 -95 -53 -136 -61 45 -91 -86 -152 -75 13 -45 43 -163 -154 -192 -306 -155 174 141 161 -21
5066 -21 237 -153 8 93 59 141 53 102 -62 196 153 156 255 -41 -181 65 11 134 -115 -64 -74 55 210 222 -47
5091 -47 18 -47 54 -90 121 40 -2 -275 34 -73 163 -192 54 -82 105 -39 23 -203 38 -115 87 -79
5113g9l6K27j38j09J55n8L1Jq6K34m1j36k23L31O7j85J09J78j40k11K38j1J10
5136B28k01N7j30P3J5l14M07P7nJ90j38l32K32K9k20j00K31Mm7k10J88R2j66P5
5160C5J08o0k29J94l5j00l7K75k6j18P8k60J43r2LJ42pj16J26j1k85K52P6k86
5184b30J60K22l22J89j18J34K30l28Q6J52j8j6j7R5l49L19p2J7J9r4J19J81l67
5207hj21J97k46L82k30j21P9j22j2J56Q3k35K25kl0m0L8l3J23j77P3o4K21l44
5231b08R1R9N5j18O5K4n0K61j94j59R0P9m9o6M7N0N6j4l5m5LK85k19K2k10J68
5257B8J49j27Lp5j7p6oM29l17m0q9R7p6RM19j96m8J69j43J12j93j5P4q2m9K0o8
5284a08L85l72J91l20J62J34m9j06L3J18j79j67N11j82k11J25m1O1j8L35m25K71
$$ plain form
5113 -79 -115 112 -26 -135 20 -38 -7 -6 -92 142 101 -35 -258 73 140 -45 64 242 102 -109 129 118 228
5136 228 27 84 -46 27 42 -272 135 212 207 397 259 -73 159 188 -32 -132 99 103 56 -154 34 126 -40 35
5160 35 143 83 -146 48 13 -87 -124 151 125 7 85 -175 -32 -124 -121 21 14 -102 24 13 -272 -20 56 -230
5184 -230 -70 152 -170 19 -99 35 265 -63 23 175 157 141 124 219 -130 189 117 134 153 59 178 359 -8
5207 -8 -129 68 -178 204 -26 -147 -68 -190 -202 -46 37 -198 27 25 -5 -45 -7 -40 83 -94 -21 -85 136 -208
5231 -208 -117 -18 37 -81 -16 8 -42 219 25 -134 -44 35 -14 -80 -33 17 73 59 24 -21 -18 267 48 70 -140 28
5257 28 177 50 53 -22 -39 -115 -121 308 -9 -49 -138 -41 -117 -108 311 115 67 236 93 205 12 -3 71 -11 -60 -40 -108
5284 -108 277 -95 96 -224 -62 72 23 -83 -50 68 -111 -278 233 51 -160 -35 -76 -15 -33 302 -123 148
5306A48j26Q6J10n48K53J76m2R5p0%k10J14L06l65j76L64rk97L36k27OK49k11
5329c8j1p3O9J33p5q1N8j80Q9JK21k96N1K85k92J3J42k5l6L07o3k99L04j91O3
5354G6k50L82Q4l37K12l30K98k8q7j21Q7m8P4j63K66K22m69K69o3nR2k13p4R2
5378c4j04L57K3l88P6L0j6L3o6L8K95l43O8p7J43J7Lj22k69L63j3o1J3n7Q7M0
5404C6j75J13L4o5O8J20j72K8R7j65N1M7j16R6P3J52m17R6J01K09p2l12K6nR5
5429e7K9J55q2p3J08j74l5J12J97j75J07m5j41K28l04J12L07l81K27q2j57J23
5451ar4K0K9k2J59n2J29j22m2k23J75J36l52N41m70L76l15o0O7M5K38J11l54O3
5475a8K01m21J02L38j22j65K46p7l9j24j9l0J13j47L29L9k02J37k44M6K18k95
$$ plain form
5306 148 22 108 218 -330 -77 99 57 152 82 82 -128 -14 292 -73 -249 115 106 -191 145 -82 -76 173 -38
5329 -38 -49 -122 -53 80 5 -76 -18 -198 -109 -108 113 -183 -132 153 -139 -126 16 -9 -45 262 199 -100 204 13 76
5354 76 -174 208 292 -45 167 -163 135 107 20 -101 -14 -62 12 -151 115 337 -132 137 74 69 161 -52 -126 -34
5378 -34 -138 219 242 -146 -70 -40 -56 -23 -89 -51 244 -99 -31 -108 35 52 55 -67 -336 27 14 -47 -34 -91 -4 36
5404 36 -139 -26 8 -57 11 131 -41 -13 84 -81 -30 17 -99 -3 70 222 -195 -99 2 211 139 -173 -147 -152 -57
5429 -57 -28 127 45 -28 80 -94 -129 -17 180 5 112 67 -74 154 -150 -38 269 -112 115 33 -124 -1
5451 -1 -95 -75 -46 -68 91 39 168 46 4 -219 -44 92 -260 281 -189 187 -128 -188 -121 -76 162 273 -81 -18
5475 -18 183 -238 -136 202 80 -85 161 84 45 -79 -98 -128 -15 -162 167 206 4 141 -103 -57 161 -134
5497a34P4K1j35K82l1l9r5j03J69j73J16Q2K06k11Ol5N1Q8m80M34r2r3L55k80
5521a7R0Q6l52L73k60K59j7J4k54J77j31m2J56M9k72K0M9n1N2K6m4l4J22j07K13
5546A05l0r2j61K45j08J34q5j38K01j27P6lM0Q8l29K78l2r8J52Rp8p9n7K23j60
5571b6L3R5o1k51K68j22K00m06L42k24P9R4j44o4J96j00J54R0j12p7j58K14j27
5594a07m4l1M12m06P4K64j97J02j12K84k11k15L0K43j91P4O2j78L04k95K52j94
5616h0K29k04rR7l3p9N4j3KJ2J68j14j27k0j17J48J89NMj58l5j98K06K23l07K97
5642A40j70Q6J48l57L42j60m6j43J39R0L13m84J62o5K15j95O2N9j02k22P6J64
5664E2j72J87P0Jk43k6q9L28m7Q7k02J91j29j0p2P4j1j59J03Q2p6%k52K49K12
$$ plain form
5497 -134 -60 -39 -174 108 77 38 -57 -160 9 -164 -48 34 240 29 35 0 51 139 -341 93 1 -92 263 -17
5521 -17 73 159 -193 180 -80 179 162 176 -78 99 -32 -74 82 131 -141 -121 -72 -123 -71 -45 -89 -123 -1 -108 105
5546 105 75 -17 -178 67 -41 93 8 -130 71 -56 20 17 57 145 -184 94 62 -36 116 125 47 -32 -89 134 -26
5571 -26 7 102 41 -210 58 -64 136 -270 72 -152 -73 21 -123 -187 9 -91 63 153 41 -36 -194 20 -107
5594 -107 -151 -182 230 -176 -102 162 -35 67 -45 239 28 -187 -157 86 -105 -31 31 -147 157 -138 114 -80
5616 -80 149 -55 -64 33 0 -79 -25 -38 -36 -24 144 30 -97 -117 -234 -86 103 108 112 -46 -81 -279 -73 150 -157 140
5642 140 -30 56 204 -153 189 29 -17 -160 -21 69 382 -102 60 -5 210 15 77 136 34 -188 -112 52
5664 52 -120 67 137 138 -105 -131 -220 108 61 148 -54 137 8 -2 -74 0 -11 -170 -67 15 -61 -61 -313 -64 148
5689A48j43J67k3J8j49m1R9N3k33j68K64j36j37K34K99k70MJ86j41q5Q9p7J7K93
5713B68l6j44k60K41k14J21Nm0J20r9K31j59L0j0j16Q8k40J18L00l53K71J0j70
5736c8J02P2P0k15O0R1j64k5r7K30k22K24Q0m5j08q9K6m4K28j50j11J52L5k9K0
5761E3j64J28n2Q3K7q8K00k15p4J43L2r7j97R7N5M1Pq4J78q0M2j91J52n3J17q5
5787b5J58M2J6j09N0j51N8r1J33j6J7J42m30L57j55K0j26J86L4l18K15j20J00
5810a3J18j12J23K4j20j03O0j26R8K51k98L58k01K1j0L7j34J44j36j76L97l33
5832a31j2K13l5j42K32k94P7j34J38M2R9k85M12k45K21l86K95j16K51N9m64K01
5854dJ39R3o11K75K36k19R3n2k9R3j65J01J4J54l77K31J14m6J62k73J03K77l20
$$ plain form
5689 148 5 172 149 167 18 -23 76 129 -104 -272 -8 -144 -281 -47 252 -18 -14 172 31 -54 35 -42 -25 268
5713 268 232 88 -172 69 -145 -24 -19 -59 61 -38 193 34 64 54 -62 26 -214 -96 204 -149 122 132 -38
5736 -38 64 136 206 -9 51 142 -22 -47 -144 86 -136 88 168 123 15 -74 -48 -92 136 -14 -125 27 62 33 53
5761 53 -111 17 -35 48 75 -13 187 -28 -102 41 73 -24 -221 -124 -69 -28 -21 -105 73 -7 35 -156 -4 -57 60 -25
5787 -25 133 175 191 82 132 -19 39 -52 81 65 82 224 -206 151 -4 16 -110 76 110 -208 7 -113 -13
5810 -13 105 -7 116 140 20 -83 -23 -149 -51 200 -98 260 59 80 70 107 -27 117 -19 -195 202 -131
5832 -131 -143 70 35 -107 125 -169 -92 -226 -88 -46 53 -232 180 -65 156 -230 65 -51 200 259 -205 -4
5854 -4 135 228 -383 -108 128 -91 2 -50 -79 14 -151 -50 -36 118 -259 -28 86 40 202 -71 32 309 -11
5877a1q2K65k77K02j14k09J00J46o7J5K77k70N4J06j85J8L33m7k83j29J77k03
5899a84K74j13O8R9k25J91j81L0J03n5J90j35j01J16l8P4j14J9K71k22J3j64K
5922h2R6k23J63k98N04k22PJ8O1j28J08m5J7M2j44J00Po5j58K59j07K18k62J78
5946D4j91K21j93p6K07L9j09j44J84J76l2j56J29k21P8L0J41r9l0J65J00l07K59
5969B15j41q5r1P3J65j70K94k18J31k40J8r8J80j33K57j36P9j32j9J4kJ49j36
5992b6J24Mk68J78K7k47M85m15n9K13j96O6J26J15o5J07k7O5j14Mn8j09O0j15
6016a25J74l20L71k36J74m3m9J28k84J02j39K86M2l11K70kj0K1k5q4J66L7j48
6039eP0q8J96o5p5k05Q1J04l8j1j05J21N3J21n02N27j09r3r4L3J77k8j30K05j93
$$ plain form
5877 -11 -93 172 -105 97 -17 -226 -126 20 -47 -32 245 -25 29 135 -50 -32 301 254 -29 -158 19 -184
5899 -184 90 -23 45 144 -81 110 -71 -41 62 7 197 62 -39 77 39 113 -1 18 289 67 80 -84 -82
5922 -82 14 -209 -46 -344 160 -62 -55 -37 24 -104 4 -41 -24 18 -126 -26 -19 -84 -242 17 -90 128 -134 44
5946 44 -147 74 -119 -195 12 51 -58 -202 -18 158 126 -30 99 -122 -44 -14 127 28 -2 163 263 -44 215
5969 215 74 -11 -102 -29 136 -34 260 42 173 -67 -49 -147 33 -100 157 21 100 -32 -51 -37 -39 110 -26
5992 -26 98 102 -166 12 39 -208 277 -138 -197 16 -180 -114 12 127 62 169 142 207 93 97 39 -70 -10 -125
6016 -125 49 -271 100 -136 38 -5 -54 74 -210 -108 -247 39 81 -230 40 38 28 49 24 -60 106 143 -5
6039 -5 65 -23 173 108 33 -172 -91 13 -25 -36 -141 -20 33 154 -348 179 70 -23 -117 -84 93 65 -65 140 -53
6064e3j7O7P2j47l0J87j85K55q6p1j34Q9J9J55k71N4J38J8L3j22M6M3o0o8j63
6089b31K87r4M8L5q2Qo7k5J83j08J2o6K77k59J41J84m38J66N2J73k44J89k8j00
6113A3O9l38L17k16K97k31N7J56n3j91o6J93K15k91L11n77L48j14K68J07k49J33
6135A58j40j22K09l2j23J06K4m1k1M4J10J60m76O4KK22l85J35J33q2r7K93j72
6158c1J08j55K5l0K40J9k82J09J69n0n0n5l46M41j18K21k84k1K27j53j31K11q7
6181b3O6O7l31J73J98P7r2m4L2j65M9j29l7J84K53k1k33O8r6J78l29J78l99N01
6205A25q8qj95K97l55J66j00K42P7O5k15N5k09K93o5j28J31n8N2N5k13K7j7o6
6229a32l8R4M4K61k62p1J83l67K74l8O4M2j31j07K87q0J26k88n1J96j00m2N0L03
$$ plain form
6064 -53 -70 -3 69 -78 -108 79 -106 149 63 -8 -142 -53 -34 121 -150 -96 42 60 93 -29 17 60 0 -68 -231
6089 -231 56 -38 10 45 -37 -29 -96 -121 62 -46 -34 -100 177 -82 59 243 -195 -29 23 196 -48 141 113 13
6113 13 82 -256 61 -155 142 -89 -32 124 71 -120 -186 7 222 -69 242 -335 13 -101 167 274 25 158
6135 158 18 -104 105 73 -50 56 80 39 18 62 172 332 -144 -80 -78 144 -241 -106 27 -55 -152 141 -31
6158 -31 77 -78 -53 -83 157 176 -106 3 172 122 72 17 -329 112 -6 215 -69 -90 137 -16 -147 64 -23
6181 -23 43 110 -221 -48 150 227 135 91 123 -42 7 -122 -159 25 278 257 24 92 -4 174 -155 23 -376 125
6205 125 37 29 -166 131 -224 -58 -158 84 161 226 11 66 -143 150 85 -43 88 30 82 137 -76 -49 -66 -132
6229 -132 -170 -76 -32 229 -33 -104 79 -288 -14 -52 12 54 -77 -184 103 23 149 -139 -190 6 -94 -136 -86 217
6253B17l31j80J96J3J54o2K2J23p5l4k48L23k00j1Q3J0q0Q9j23K8J14n4k7J14
6277F1j33N2m0RO4o2kK69o6j41j14J98k78J71R1k67K66l2k05J94n9m8J70r0J81
6302A89j68m7J3R3J12L0mJ9j64L0r0L43n30J85q9J7p2j02L02r8mN6J11j94p0K32
6328A00k05P3O1l4N9k12K30j81J60k14J47R6l0k48J06J05p0M4OJ1j49L37M9l06
6352f5M2l6J9J48q0O1j6j85K21L1rm30M71o1N2M0m06K07M6r0m6K80k48L12k23
6377C5Pj61O3P2J89j4m61K06K5K76j16j84J9J75K2k18J11l54M73n0j50K11l25
6400a49K5j27L30m2k87K18J28l64J4K38q7J40K2r5J44Q2l97K04j94R2J43j21K44
6423A61Oj87J72m7k58J91o9r2K55j36l2J47M8j3k4j10J80j90n7k16K37k8L00j58
$$ plain form
6253 217 -114 -294 -98 -85 69 7 29 152 77 43 -205 118 -82 -93 -10 0 -80 9 -114 -86 28 -26 -53 61
6277 61 -72 -20 -60 -51 13 -49 -51 218 152 11 -103 95 -183 -12 79 -188 78 46 -159 35 -24 -72 98 8 189
6302 189 21 -26 -13 80 192 222 218 237 73 103 13 356 -174 11 -78 -61 -133 -235 67 -31 -35 21 132 -62 -132 100
6328 100 -105 -32 29 -5 54 -158 72 -109 51 -163 -16 80 50 -198 -92 13 -57 -13 -7 4 -145 192 241 -65
6352 -65 -23 -59 -40 108 28 89 73 -112 109 140 131 -299 172 111 163 203 -203 4 50 -40 -86 194 -54 258 35
6377 35 42 -119 -56 16 205 191 -270 -64 -39 237 121 -63 -44 131 153 -65 46 -308 165 115 -35 176 -149
6400 -149 -124 -251 79 37 -250 -32 96 -268 -254 -16 -103 37 59 -36 108 190 -207 -3 -197 -105 38 -83 161
6423 161 167 -20 152 105 -153 38 -31 -123 132 -4 -36 111 159 146 122 12 192 2 -55 -271 -34 -62 238 80
6447H0o3J0j13J2J82k87K48k24P1L6R8Qo6L3J88k43j36K2L03l29J69k07K84o7
6471IK13l65N1J8J72k16L2J28j4J49j56j17jL92m5l70R1Q3L0J30j20j07k11J49
6495g5L6J87j86J45l6k0M3o7Kr1K08J19l62l7Q9j55k6J27J63R5l33L2J42k11L47
6520A36n15K96K57k07K62n21M40k38%J98k36J95j51K18J26l37M22j84k07J18l82
6541c10K85m2J56j47K8J56k21j67J23L1J37L4K28l58p4K17LJ54k98J16J99m50
6563b00K25o2j39pL00L4j79jJ82j96k30K29P1r2k0M6K42j64P6o3l8j5r1K09j19
6588bp7L94m18K77j93L6m8K51m91K19J05j77K05m9O9O0l46K70K4j93K77r2l35
6611b34K84K78m52J86n3k17K78J1R9k40L1K1P8j85K60o8k40J58j8M3M0k1j59M1
$$ plain form
6447 80 17 27 -86 -74 108 -179 69 -155 -84 -48 50 58 -8 25 213 -30 -166 -144 159 -170 -1 -208 76 9
6471 9 222 -143 -92 -74 98 -118 -86 42 28 177 21 -96 -97 295 250 -120 -29 54 84 214 94 -13 -224 -75
6495 -75 -39 148 -38 107 71 51 94 27 29 -62 146 265 -97 -134 -45 -200 -226 -99 64 159 -174 -142 0 -211 136
6520 136 -379 -83 174 -33 229 -292 148 -90 -90 108 -128 67 -84 134 260 -77 345 161 -46 72 -310
6541 -310 -25 -67 89 -58 -30 126 -95 -262 -139 -108 29 63 291 -67 -141 76 79 233 -65 51 250 -200
6563 -200 25 -37 -176 -183 117 151 -28 -29 153 -43 -273 -44 27 -65 -85 -39 203 39 115 52 14 -1 -92 117 -2
6588 -2 -79 315 -103 174 -19 17 -31 220 -271 -52 53 -124 81 32 101 161 -185 85 109 -84 193 101 -234
6611 -234 50 328 -124 62 9 -208 70 81 180 -60 -29 -8 70 -115 145 77 -163 -5 -23 20 60 39 -120 -79
6635g9J46L43n43K86k2k5l65K57m6l8J20k5J7r8J69M3k6j61j3lK06n84N62j30
6659iN7j21R1n1J41k10J61kj55l2po7L17j97j07K01l30N68n2J3Q4j90j47P8j55
6684a21J03O0j6k18R1J54K15l94K0j4J41K3K7M1l31K42k13K53K0j63N9J35j43
6707b9K59l85J08P6l0K54l66p4K94J94l83J95K7r7l11J42J74J19j84J45k71Q8
6729e5K30l07M08m33K41j27K13j53N0p9L17j31k35J72J2r8N8j31P5J14K5k22K61
6752B05k49R0j64M29l35N5M8j7j85K46Jn1j0k97J65N2j40Rm8J57L24l68L0k85
6776c38M00nO7j59J7J64j64o9J56n8P3l7Qk6j53M6J88J22j35k13M7L1K86l46r5
6801a93K98j31p0R8m6J49j44Q6l3J74j89L0J15k9r7J05L4l45N3R7K17l11M5K45
$$ plain form
6635 -79 67 410 -133 153 131 106 -259 -2 -48 -86 34 9 26 -72 97 140 114 -47 -60 -63 143 -441 121 -9
6659 -9 48 -73 18 -33 108 -102 59 57 -98 -130 -137 -204 113 -84 -191 10 -320 248 196 209 293 103 -44 34 -121
6684 -121 -18 42 26 -192 -101 53 268 -126 -106 -120 21 44 71 112 -219 23 -190 63 83 -80 -21 114 -29
6707 -29 230 -155 -47 29 -1 253 -113 -187 107 301 -82 113 140 43 -268 -126 48 167 -17 128 -143 -55
6729 -55 175 -132 276 -157 84 -43 170 17 67 -12 305 174 -61 111 123 25 83 -48 27 141 166 -56 205
6752 205 -44 46 -118 311 -24 31 79 62 -123 123 124 73 63 -234 -69 -17 -157 -148 -196 -39 285 -83 -53 -338
6776 -338 62 57 124 -35 -18 146 -18 -87 69 11 84 47 55 29 -124 -78 110 232 97 -116 -69 -38 248 -98 -193
6801 -193 105 -26 -96 2 -44 105 -39 47 14 188 -1 29 144 115 18 123 157 -188 -135 -38 179 -132 -87 158
6825A58J1j63k97K60o0K4K92m01K62r7K6N3j84R4k24J21K57p5l07J11J67j10q8
6848a70M3J21qk15O8m8K26o5J05j01n2N4j64m9K83J76k44J05j55J02K03j43Jn9
6872A4J95l26K19q1Q3J72j58j85L7j88L39J37k17J0jlJ11l74K41O9p5N0j85L47
6896B31n25L49j89K9J23K76k94J25k08m5L51l00L73l03r1Q5k3%J17j86p1K85o5
6919D4o6k63J04L24l18n0L28k25Q7o1j45K95j34J69Q5r5q2j4J75K2j18O2l40L44
6943A28J76j75k27J02O0j5j61K96j58J4J49r2j38P8o1J86l60K55j73J57n5l88
6965d02N18j01mk2L23l29Opj36L48j61q5m7j1J9Q4j00j0J80m9%M1j32j09K69o3
6991B0J18k46o3J35K5r1P0J01J62j55K59l61J17K2n2j07o8K67k41J94k6p7p9N7
$$ plain form
6825 158 169 6 -291 -31 -91 -67 225 -176 86 -11 15 68 -116 -22 -246 -125 132 57 -250 -139 28 -82 -170
6848 -170 -127 -6 -14 -229 -161 -209 17 -48 57 -44 -96 -42 -206 -255 28 204 -40 65 -90 12 215 72 73 14
6872 14 209 -117 102 21 104 276 118 -67 -30 -218 121 258 41 51 50 47 158 -216 25 94 19 69 -116 231
6896 231 -294 55 -134 -105 18 294 0 125 -83 -128 223 -77 296 -7 -98 -13 -36 -36 81 -105 -176 109 44
6919 44 -22 -285 -181 143 -175 -225 103 -122 -35 -96 -241 54 -80 89 174 79 -3 -17 158 180 62 124 -216 128
6943 128 304 129 -98 4 64 49 -112 184 26 40 189 97 -41 37 -24 162 -198 57 -116 41 -14 -402
6965 -402 116 15 11 -11 312 -17 -11 -18 -154 194 33 -52 -99 -110 -91 -7 -107 -117 63 14 14 55 -77 -186 83 20
6991 20 138 -108 -171 -36 -11 -102 -32 69 231 76 335 -26 91 113 61 -46 -114 153 -88 106 80 3 -76 -19
7015a9J51p4K37k65q2K3J53j00n8J39j85k23J71j30J59K7L46k46o9k21N72j06
7037B00p34R90l1m95k86L20q68J006j68k93J101k93k46k2J2J03m53J79l1K94j31
7058A54k6k98L77m17J79J72L0l03J50LJ62l01L53k72Oj39N44k33p0l8J9J35o0
7081A27M7j65R8j51l8J07n3n2j67K83q2nK5R9m7k43L52j83R5j22L3k6K14j93N7
7106A0L1l5K31k88L06j97j30J18k44K83j41K2j60J42M4L6L80n33k19L89j36J25
7128C4M5Jm03K68k65L07j78Q0J53k0j08R3j77J44J85N9k03R7J59J7k56n4J98j56
7152B0m8J14J7l0J33r4m09L82k79no5L31j09j14P3Kj49m7M71k17J0L45k91j64
7176a23J60q8P8k31J85j05L23k26j7m1N9O6r3R7K65k73P7q7M5q4k8j26L14m26
$$ plain form
7015 -19 132 58 295 30 -52 -29 124 24 -34 105 -80 -303 -132 -262 -103 -76 270 24 -45 -266 306 200
7037 200 -534 456 425 -70 -356 -36 -904 102 -66 -359 742 449 203 181 193 296 -157 22 -9 285 154
7058 154 128 -170 207 -210 -31 141 171 -132 18 21 183 -118 235 -37 -31 -170 374 141 71 33 52 187 127
7081 127 174 9 107 -44 -82 25 -28 -80 -247 36 -46 -51 -26 73 26 -217 135 -48 47 -75 -42 -68 146 -47 10
7106 10 41 6 237 -51 255 58 -72 46 -198 85 -56 -34 -194 -52 -8 28 408 -125 -344 45 -91 34
7128 34 79 80 -323 -55 -320 -13 -191 -111 42 22 -86 7 -170 -26 159 218 15 112 271 288 32 -22 176 20
7152 20 -28 86 103 73 206 112 -297 85 -194 -199 -264 67 -42 -156 -83 -81 -230 -277 194 -23 -13 332 41 -123
7176 -123 37 -51 27 -204 -19 -124 199 -27 -44 -85 -26 40 -53 44 309 36 113 26 71 -13 -41 -167 147 -279
7200b79K47k12J08K48j97N6q5P3J3r8L12k53N2R1j13J44O1j1MJ9j50k4j78L58
7224A86l32n4K18lk79K53O0j55j67J52N1l9J06K23j18J37k97J7j0J08J13k54n8
7247a42J96q3Lj98K54M1J55o5k55J50Q0k64J82O2j45M9K28j74J15J25m16J48j78
7270a32J48MK2j59J95j80J91k77m2pK23N9j66K40j75J50j78J01j17J55k1J93l00
7293g3K11l67K75J64k57j5K22o5r9o3l2n4L20j11K99k75k32O9N6J32k52J33Q7
7316G3j22J42J7l33M16o6j55j43J60k15M36k53L7O5K53l18k56L49r7rJ00k35K01
7339D7k8KJ35Q0m72J13J04Q9r1j18L6J52J19p1k45J02L07l68K82k55J72k17m1
7362a66Q1K48k36K48m7k5k7j5l40K74J40q4J72j30P5j0l57J76K4P5j13j66J28
$$ plain form
7200 -279 -32 -244 -136 112 -85 -29 -114 -41 -28 -126 186 -67 -15 76 -37 107 168 157 161 180 30 6 -172 186
7224 186 -146 -200 18 15 -264 -11 49 -106 -273 -121 -70 -109 -3 220 102 239 -58 -41 -51 57 170 -84 -142
7247 -142 54 -29 -26 -224 30 71 226 161 -94 56 136 -128 54 116 -29 20 248 74 189 314 -102 46 -132
7270 -132 16 20 42 -117 78 -102 89 -188 -230 -237 -14 45 -121 119 -56 94 -84 17 -100 55 34 227 -73
7293 -73 138 -229 46 210 -47 -62 160 95 -4 -67 -99 -153 167 56 355 80 -152 -83 -27 105 -147 -14 73
7316 73 -49 93 110 -223 193 127 -28 -171 -11 -226 210 -43 -6 59 312 -6 -262 87 -10 -19 81 -154 47
7339 47 19 21 156 236 -236 -123 -19 70 -21 -139 -103 49 168 97 -148 -46 261 -107 175 -80 92 -125 -166
7362 -166 -85 163 -73 175 128 103 76 61 -279 -5 135 51 223 93 168 158 -199 -23 1 76 -37 -203 -75
7385g5K09n5l9L0r9n8j10P7l9J87J44k41R4k4j90r7O8L54k5n9L6k07O1j29J94
7410Gk06Q4N3K97l96J13o4K65k56r2K96k04Q1J42o1J26k38M3J38j29J26k6j55
7433e6OK59L9j90k20K29o4Q7l5kK7j01r0PJ12J4j15k63J56l5M75j90N7j96J29
7458D0K97m93M2N9l64L27k56J97K00N5O8j58J57r8J05j48j24K85K8l40K00K10
7480B89l58k2J3J51j79J48J2r7Rj52K24j05k01K61l7K5J89N6k58K1J61r6J85j61
7504G8k99J50l2K72j3j28l21K39mo8jJ25j73M00j62j15J52K5j9J96j54l53K1N6
7528a28L84k24j34L2j22K75j93k2NR5j10K36j47P7OM6j86j09P5J12Q8P1n6k6M4
7553H9j1j48R7k01K26k15k2M32k66J45j40q0J14J68j89l2j6p4k7K83j54N7l49
$$ plain form
7385 -75 134 79 40 70 -29 -87 -197 -120 -159 28 172 -69 25 1 -189 -286 -218 136 111 52 88 -119 -58 -187 7
7410 7 -199 -115 -62 235 -161 -48 -112 153 -103 -195 101 -103 -22 120 59 185 -53 -10 128 -1 125 99 -56
7433 -56 -50 209 248 58 -162 67 3 90 55 53 80 -21 -111 -104 8 22 -93 -356 -200 -235 240 50 107 -89 40
7458 40 337 -156 -114 -55 -419 -92 -348 -151 49 104 172 14 171 73 178 30 -94 191 219 -121 79 289
7480 289 -69 -91 -78 73 -106 42 54 -43 -34 -186 38 -67 -268 -7 -44 -19 170 226 -32 -11 150 54 239 78
7504 78 -221 -71 -103 169 156 28 -293 -54 -58 -126 -127 -2 -175 225 63 -52 100 125 106 302 148 -205 -184 -128
7528 -128 256 32 -102 -70 -192 83 -110 -132 -127 -32 -142 94 -53 24 30 76 -110 -219 -144 -32 56 127 71 45 89
7553 89 78 -70 27 -174 52 -163 -185 247 -19 126 -14 -94 20 188 -1 -33 -49 -123 -150 133 -21 36 -313
7576c13M48j52J26ro7M3j14K62j47j92k9K56P0Q3l38K10p0j83J58m22L50N5ON3
7600H4j58K5o0N2p2R5K94k10P4k31J83j09J36m0j25L8L9k43J88j2J16k59J36Q
7624e1M9J38k15p3K50j07P2j13J43k39K19RL8j51J60j86j14K61L04p8l18l3J42
7647A07n78P53m88p4l48P04l16L94n4n30J65R5K73k08J92k50J07M38l99K59l7
7668B05o6Q1j26nOn7k03J19J11q2m3j52J34M4P4J16j21J24k05J19j35j12L36Q
7692A70j90j64P3J60j05P4Mj79q7L98l32k5J04J45j8j19J60J77r9k30K94k94P9
7715dNj43M15k51J8j04J86k72M5j05K98m1j86J26L55l64j52k2J42L75nk83k23
7738a90K41k2j26J54j07P6l9j68J60N5K4r4K30n9l47K02q4J6N61o08J96J24k15
$$ plain form
7576 -313 135 -17 109 100 33 76 -38 224 77 -115 -144 112 182 265 -73 137 67 -116 42 -380 -30 25 31 84
7600 84 -74 -49 -109 -57 -129 -34 260 50 124 -107 76 -33 103 63 -62 -24 15 -228 -40 -52 64 -195 -59 -51
7624 -51 -2 136 -79 -152 98 -9 63 -50 93 -146 73 82 120 -31 129 -57 -171 90 394 316 -2 -35 107
7647 107 -471 282 -206 -280 -628 76 -240 154 100 -430 -265 -170 103 -105 87 -163 -56 382 -17 242 205
7668 205 139 220 94 89 95 38 -165 -46 65 -17 -60 -212 -78 -34 40 156 35 159 -46 73 -62 -174 162 170
7692 170 -20 -184 -111 49 -56 18 22 -157 -244 154 -178 -203 -99 46 28 -91 69 246 147 -83 211 -83 -4
7715 -4 1 -142 273 22 40 -64 122 -150 -105 -210 88 47 -139 -13 342 -22 -174 -196 -54 321 316 33 -190
7738 -190 51 29 -97 57 -50 26 -13 -181 -21 34 58 -36 194 135 -212 -10 -94 -78 483 -125 71 195 -20
7761b0j15qK21m8rn4j9n9K75j02J45m12M31l24J11N9k95L41Lr3J1k59J82j2nQ4
7787B9n4J6J31p8p1l0N6p9q2K91j55o7q1J18k8M6J41j20o9P1J74o7j71K12k56
7812a23J38P2J6k25K21o7j94L38p8J6LO7l03K78j19j9l0J29k85K00j41l0K83k7
7836A20k24M01j72k53K45j91K04j44J27p8r8j26Q4Q2k59L04m8l5K00K2q8Q3j76
7859b0j20L66k09M0l13K82j06J30j21J4J64j10j11p4K97n8l8M4J09k78j80J57
7881a35L3J68q1J38k57J54R2j98P6K4m1Jk77K45K81q1j68L32j06j79o3P5J08k74
7905a33l8J94j88R6n4K96K7k15m0j24J71r0J87m5j14O8n6J15j59K45j89J76j4
7928A16J35l56J50p9J79L7j40j16j32J44J34k50K40J39m04L5M34k76J38j3j28
$$ plain form
7761 -20 -135 -143 78 30 21 -33 -52 -111 164 62 207 -205 226 -98 13 72 -223 118 121 28 39 -220 -38 -50 -55 29
7787 29 -25 -9 122 44 -27 -57 -1 -80 -162 129 -26 -93 -174 -56 -84 -38 103 -17 -86 -15 159 92 -79 133 -123
7812 -123 15 87 103 -122 99 32 -162 176 98 114 117 184 -119 159 40 21 -9 120 -165 35 -106 -136 147 120
7836 120 -104 297 125 -128 117 -74 130 -14 113 35 -63 -189 -105 -23 -282 22 -26 -61 139 161 73 156 -20
7859 -20 -140 226 17 57 -256 26 -80 50 -71 -57 107 -3 -114 -188 109 51 13 57 166 -112 -292 -135
7881 -135 -102 66 -15 123 -134 20 112 -86 -10 14 -27 -26 -303 -58 223 142 -26 306 200 21 -42 33 141 -133
7905 -133 -171 23 -165 -69 -123 173 200 -15 -55 -179 -8 -98 89 44 -70 -2 -58 57 -102 143 -46 130 116
7928 116 251 -105 45 -34 145 182 42 -74 -206 -62 72 -178 62 201 -203 -168 266 -10 128 115 -13
7949a3j17K08k28J98p4q5q9J65J49l54L04N2j40k8O1j6Qk16J85J92j16j34J88
7972A00J32l65N5L7M7N9PN7r2J43j9m30N30k64j12K47k81M5J81r4L6r0J53k54
7996a72J70k90K21K24q6Q2k2r9j36Q7Qj65K33p1QN3j8o4R6k0j24M6L7J44o7k27
8022a52J32J4J90q9N5n58M73j84M1J1O4m9J48j62r3R1o0J11JO1kj99J63R4k24
8047a23n3P2J26k85K5J63K21k35K52j78K94n0l21q0K54j26l7O8j56P8P5J19q3
8070B0n3J69k49L55j94J6k91K17J41j18p1K51k47J51l82L30j68J96NJ30k95J85
8092I8K62m61K56j28M9k5M7k77J48K41l70J64j37R8j68K40o0j82K81k01J68m2
8114AN8o8l0J15j4jl3m4J39q4j25j6P3O4J04j54J83j3k56J60P0l98L13J5N1j96
$$ plain form
7949 -13 -130 78 -150 48 -26 -111 -200 -35 114 -240 64 116 -24 -52 9 -7 1 -215 -30 162 46 -88 100
7972 100 232 -133 -78 -41 6 65 72 129 37 180 161 -269 261 -3 -115 132 -149 -104 77 -17 19 -71 82 -172
7996 -172 -2 -292 -71 153 67 149 127 28 -108 -21 -13 -178 55 -16 -8 45 27 -37 59 39 -85 -39 -2 142 75 -152
8022 -152 -20 -6 184 95 150 -408 65 -119 -78 -67 -3 -52 96 -66 -159 -68 -128 -17 -16 45 43 -156 7 101 -123
8047 -123 -176 -104 22 -263 -238 -75 146 -89 163 -15 279 229 -92 -172 82 -44 -81 -13 -169 -91 -16 103 20
8070 20 -33 136 -113 242 48 64 -227 -10 131 13 -58 193 -54 97 -285 45 -123 73 78 208 -87 98
8092 98 360 -101 155 27 76 51 98 -179 -31 210 -160 4 -133 -35 -203 37 -23 -205 76 -125 43 1
8114 1 59 -9 -39 76 62 61 28 -16 123 39 -86 -102 -29 35 139 -15 168 155 -101 59 129 -269 44 59 110 -86
8140h6P1j67L40o1J08o2j1l03L76p7nj98J90r2o8L2j76L46J06m77L54J41l83K18
8164A16j41J41k41%Q4J0j44J53J91l00L74o1j42k53K55O1k76J08J21l14J10p6
8186b24J65K29j3j54P4
$$ plain form
8140 -86 -15 -182 158 97 205 143 132 -171 205 128 123 -75 115 23 -45 -13 -189 157 263 -214 140 281 -102 116
8164 116 -25 116 -125 -125 -41 -31 -175 -22 169 -131 243 182 40 -213 42 103 -173 -65 56 -258 -148 -224
8186 -224 -59 170 157 3 77
8191G7
$$ Imaginary data points
##PAGE= N=2
##DATA TABLE= (X++(I..I)), XYDATA
0@%%%%%%%%%%%%%%%%qJ6j6J6j6K3l1L2l7M5m8N6p0P8q8J04j20J36j52J69j91K15
38A13k40K69l00L33l70M10m54N02n54O12o74P42q17R01r94J096j211J338j481
57g79J647j840K063k328K650l049L562m246N215o707R323j5331N9469K0591l0268
72C9972J602l8054j4707n740O627q160R412K1637P898j825J9407l916j0369j2243
86A1541j1729j5577k3353j2431k081j0457J890J2533J0448J3335J2727J6215J1559
99A4620m090N756j411j2763p562o166o610l341J37J0556R192Q430K1238J1870
113C9856R554J0891L337K770p471p194l663j1423r567M19l036J912M689Q990R600
128D9664Q50J0749M859p693j803m003j4142j1767q467q781r516m700M136l357
$$ plain form
0 0 0 0 0 0 0 0 0 0 0 0 0 0 0 0 0 0 -8 8 -8 8 -8 15 -16 16 -21 24 -24 32 -38 40 -48 56 -64 72 -80 89 -102 113
38 113 -127 142 -158 175 -195 215 -239 263 -291 321 -353 389 -428 473 -521 575 -636 702 -779
57 -779 868 -972 1091 -1237 1413 -1636 1926 -2320 2895 -3812 5511 -9820 49649 70240 39972
72 39972 41574 3520 -11187 -16927 -10300 -18460 -9048 12589 20487 18662 38069 34153 23784 11541
86 11541 -188 -15765 -39118 -51549 -53630 -64087 -62197 -49664 -39216 -25881 -13154 3061 14620
99 14620 10530 16286 14875 2112 -5450 -11616 -18226 -21567 -21430 -10874 -1682 6748 27986 39856
113 39856 49410 60301 63638 66408 58937 51743 48080 36657 27090 27509 24473 26385 31074 40064 49664
128 49664 50514 61263 66122 58429 56626 52623 38481 26714 18247 9466 -50 -4750 -614 -3971
142c971J768R820Q32J483K655k174n378o820p409p641j0578l669m324l618N000
157c4024K547N469P872N189N978M486J475J51k635k410k631n925J143p58O15O516
173f942M428O993P436O617O327L237J256J655l952k764l223m852j297l954J049
188A2014J621J26M476M116O29K008R71k830l714n176l657q704n711k442o506k605
204a5384J332o58j22L037J194J82j194L86l314n719p46n595m907p09j388j390
220c4995K352L098K723L463M364L674j28L589p5k256J365k127j130M83J008J832
236a2760K200M016M970K658M201M021N1K198n95j055j706k346j495j217j394K14
252A961R31j14K320Q9J552j6j290j94l954k992k509m487l770j725l030j413n50
$$ plain form
142 -3971 -2203 7617 8449 9932 12587 10413 5035 -1785 -9194 -16835 -27413 -31082 -35406 -39024 -34024
157 -34024 -31477 -26008 -18136 -12947 -6969 -2483 -1008 -857 -3492 -5902 -8533 -14458 -13315 -14073 -13458 -6942
173 -6942 -2514 4479 11915 18532 24859 28096 29352 31007 27055 24291 21068 16216 14919 10965 12014
188 12014 13635 13761 18237 22353 22982 24990 25961 23131 19417 14241 10584 1880 -3831 -6273 -12779 -15384
204 -15384 -14052 -14710 -14832 -11795 -10601 -10419 -11613 -11227 -14541 -20260 -21006 -26601 -31508 -32217 -33605 -34995
220 -34995 -32643 -29545 -26822 -23359 -18995 -15321 -15449 -11860 -11935 -14191 -12826 -14953 -16083 -15600 -14592 -12760
236 -12760 -10560 -6544 -1574 1084 5285 9306 9357 11555 10960 9905 8199 5853 4358 3141 1747 1961
252 1961 2892 2778 5098 5187 6739 6723 5433 5239 1285 -1707 -4216 -8703 -12473 -14198 -17228 -18641 -19191
269a9191N27K28o60K742j230j388R51k109l078k54j975k115j89M82J078j70M041
286b2310K559J048M274K131P81J891J709k90K50P40O10l8J771L089M6L786L269
303E316J315K876J969O02L55M17p67j081j257kj951n50L71p59O33J9J26J26o74
322G084j327r08k619k267k088k735j554k882n28j470r26M29j03p82O33P67j437
339a2713k3p58p84j320J34k32o81J575J483N27J896L189O39K468K545J004R77
356g4J718J763o39J750J562M19Q91K961R91J187L128J035J139J490J094m75K3
373A9963j12o25j345N8n34j620J44p45p22M23r43q12r76r82k316j393j898j648
391C917k435j548j205k148J23j409m75j3l95r16J97n41p23m8p57L5m77M90K00
$$ plain form
269 -19191 -18664 -18436 -19096 -16354 -17584 -18972 -18021 -20130 -23208 -23462 -25437 -27552 -27741 -27259 -26181 -26351 -22310
286 -22310 -19751 -18703 -14429 -12298 -11517 -9626 -7917 -8207 -7957 -7217 -6607 -6645 -4874 -1785 -1739 2047 5316
303 5316 6631 9507 11476 12078 12433 12850 12083 11002 9745 9743 7792 7242 7613 6854 7487 7506 7632 7758 7084
322 7084 5757 4849 2230 -37 -2125 -4860 -6414 -9296 -9824 -11294 -12220 -11791 -11894 -12676 -12043 -11276 -12713
339 -12713 -12736 -13494 -14278 -15598 -15464 -15696 -16377 -14802 -13319 -12792 -10896 -7707 -7068 -4600 -2055 -1051 -74
356 -74 1644 3407 2768 4518 6080 6499 7390 10351 11342 12529 15657 16692 17831 19321 20415 19940 19963
373 19963 19851 19226 17881 17939 17405 15785 15929 15184 14462 14885 13942 13130 12154 11172 8856 7463 5565 3917
391 3917 1482 -66 -1271 -3419 -3296 -4705 -5180 -5193 -5588 -6504 -6307 -6848 -7571 -7619 -8376 -8341 -8818 -8328 -8128
410h128J79J949P01R08K433J538O19K444R73J260Q31J474J045N6K152Q07K69K203
428A3713J169J36K077J029K01P99j17N53j368N47l77j959K16p33j583k5m99j619
446A2160l50j157q29j452j403k59k685j402j152k424p38r06k038j08r10q47L05
463f195j292O07j065k02O11j266M6M40o60N56R28n49J790N79Q46J508P37J489
481a092M04J439J339l64J490J433o73J420J105M0J552P7J347J78M33J300j013
498A0415L73N98j684q8J94k001L25r09j100p66j148L12j818r52M22k655r74K05
516a251k404m59p25k161J9j509j70o92p53M59j064l71J180j204K18P25j186J230
534a0118q7O9J193n81J880K13P58J275K15P43J785k34R99J321m51J412j11N57
$$ plain form
410 -8128 -7949 -6000 -5299 -4391 -1958 -420 199 2643 3616 4876 5707 7181 8226 8282 10434 11241 11510 13713
428 13713 14882 15018 17095 18124 18325 19124 19007 19560 18192 18739 18362 16403 16619 15886 14303 14278 13779 12160
446 12160 11810 10653 9824 8372 6969 6710 4025 2623 1471 -953 -1691 -2597 -4635 -4743 -5653 -6500 -6195
463 -6195 -7487 -6880 -7945 -8147 -7536 -8802 -8756 -8316 -8976 -8420 -7492 -8041 -6251 -5672 -4826 -3318 -2581 -1092
481 -1092 -688 751 2090 1726 3216 4649 3976 5396 6501 6541 8093 8170 9517 9695 10128 11428 10415
498 10415 10788 11386 9702 9614 9808 7807 8132 7223 6123 5357 4209 4521 2703 1751 2173 -482 -1456 -1251
516 -1251 -3655 -4114 -4839 -7000 -6981 -8490 -8660 -9352 -10105 -9646 -10710 -11081 -9901 -11105 -10887 -10162 -11348 -10118
534 -10118 -10205 -10136 -8943 -9524 -7644 -7431 -6673 -5398 -5183 -4440 -2655 -2889 -1890 -569 -1020 392 281 838
552H38J022l29J151k84K84J353n30k13Q17r22J84jj176L21j245J69p04j257N59
571C7q99j055M54j502o34K79j644o9q98l03n58j468L99o00r87R41o89p57J293
590h660q88K63O06p50R78m83J067J34j64J075N55j76J855o2P14J533l95J656j5
609a157P83Q34j08R90P70k18R90J94l71J537o43J06M82m44O90j036L0j2q34M75
629C058o69j383N03q12j057M21j791J75m33o18j01j268O0j74j165J69k80j144
647f509J215j220KM85m09O99n80M91R52m84Q80N45n13J417N18j70J609k45Q73
666d44R05K53R86J35Q28J192k74P58Q09o53J685l37P2J142o84L75j40K44L49r55
686F246M13%j333R54p38r31L47j089l46k02q41j77p70n71m1j201k72K85j701O15
$$ plain form
552 838 1860 1531 2682 2398 2682 4035 3505 3292 4109 3187 3371 3370 2194 2515 1270 1439 735 -522 37
571 37 -862 -1917 -1463 -2965 -3599 -3320 -4964 -5033 -5931 -6234 -6792 -8260 -7861 -8461 -9448 -8507 -9196 -9953 -8660
590 -8660 -9548 -9285 -8679 -9429 -8451 -8934 -7867 -7733 -7897 -6822 -6267 -6443 -4588 -4650 -3936 -2403 -2798 -1142 -1157
609 -1157 -374 460 352 1342 2112 1894 2884 3078 2707 4244 3601 3707 4189 3745 4435 3399 3429 3417 2583 3058
629 3058 2389 1006 1509 697 -360 61 -1730 -1555 -1988 -2606 -2707 -3975 -3915 -4089 -5254 -5085 -5365 -6509
647 -6509 -5294 -6514 -6512 -6027 -6436 -5737 -6317 -5826 -4874 -5358 -4478 -3933 -4446 -3029 -2511 -2681 -1072 -1317 -444
666 -444 461 714 1700 1835 2663 3855 3581 4339 5148 4495 6180 5843 5915 7057 6373 6748 6608 6852 7201 6246
686 6246 6659 6659 5326 6280 5542 4611 4958 3869 3523 3321 2480 2303 1533 962 921 -280 -552 -267 -1968 -1353
706a353q74o57L23o20j54l99J27K91n18KJ008q34R69L04n93J107K50K42O99K92
726c88P08L81M05Q61L93j2J685p22J296O24j40R80j92P53K84j98J86K84k07R09
746G890r34K09M60j192O19o42n13j22o67n3o83p92k3r58o53K69j514j92m7j218
766g56K03r23j38m15k81m04k93l90M43o38k50O95q41O67J16j68J77L10L78K85
786b223K28O57L6L74R86l27Q28Q82k95N70N12M36J65L54M67J41p5Q41k86j33P22
807D860q98K41L59l14k01J6l65l49j35m64k44p41K28o52n44k36q10j94k92n06
827a241m00o6l69o6p56J82n23n49M10o67o1L51m06R1K57L60j74L06R9J94m9R43
849b134l0M23L59j70M43M28O31l19M57L93M89k00O18M7r7N92l16M3RL22m08N0
$$ plain form
706 -1353 -2227 -2884 -2561 -3181 -3335 -3734 -3607 -3316 -3834 -3832 -2824 -3658 -2689 -2385 -2978 -1871 -1621 -1379 -680 -388
726 -388 320 701 1106 1967 2360 2348 4033 3311 4607 5231 5091 6071 5879 6632 6916 6718 6904 7188 6981 7890
746 7890 6956 7165 7625 6433 7052 6410 5897 5775 5108 5055 4372 3580 3557 2599 1946 2215 701 509 462 -756
766 -756 -553 -1476 -1614 -2029 -2310 -2714 -3007 -3397 -2954 -3592 -3842 -3147 -3988 -3321 -3205 -3373 -3196 -2886 -2508 -2223
786 -2223 -1995 -1338 -1302 -928 58 -269 559 1441 1146 1716 2228 2664 2829 3183 3650 3791 3716 4557 4271 4138 4860
807 4860 3962 4203 4562 4248 4047 4063 3698 3349 3214 2750 2506 1765 1993 1341 797 561 -249 -443 -735 -1241
827 -1241 -1641 -1707 -2076 -2142 -2898 -2716 -3239 -3788 -3378 -4045 -4106 -3755 -4161 -4070 -3813 -3453 -3627 -3321 -3222 -3028 -3077 -2134
849 -2134 -2164 -1741 -1382 -1552 -1109 -681 -50 -369 88 481 970 770 1388 1435 1338 1930 1614 1657 1666 1988 1580 1630
871A630K85l09k01j16k7n54K94m09p90N2j20m49k85k49l68k64j6n41l5j51p6k93
893b992J81j04l57J23L46k18j01K69j83l4L57L07j64N92K10O1K8J48M56MO18j63
915f16O68J22J58J0L63K01l88P54j0j78K71K35l81%M27m40k23L60n15j08J8l74
937C54R5j88k72n4n58j1m91k57K00l06j62j01k79l53J9K64m15j28M27j29k10L89
959b166k20J91K33J52L0J68J65K14K52K10K48R5Q75k24K17K81J89K82M01j15J82
980A660K14L05J37m8L04j06j43K92n24L1J59Rl61l8m96J35k52j22k18p77N28n02
1002A87M9j77o83j28J49n11J20j60m41J58l56q4j28m37N41j50KJ02J11l75N71
1023a640J95J29J25J27K11j32O37MJ37P02k83L97N5N9K85L21K2M99j30L66K14
$$ plain form
871 1630 1915 1606 1405 1289 1262 708 1002 593 -197 -145 -265 -714 -999 -1248 -1616 -1880 -1896 -2437 -2472 -2623 -2699 -2992
893 -2992 -2811 -2915 -3272 -3149 -2803 -3021 -3122 -2853 -3036 -3070 -2713 -2406 -2570 -1978 -1768 -1707 -1679 -1531 -1075 -1071 -453 -616
915 -616 52 174 332 342 705 906 518 1272 1262 1084 1355 1590 1209 1209 1636 1196 973 1333 818 710 728 354
937 354 449 261 -11 -65 -623 -634 -1125 -1382 -1182 -1488 -1650 -1751 -2030 -2383 -2364 -2100 -2515 -2643 -2216 -2345 -2555 -2166
959 -2166 -2386 -2195 -1962 -1810 -1780 -1612 -1447 -1233 -981 -771 -523 -428 447 223 440 721 910 1192 1593 1478 1660
980 1660 1874 2179 2316 2268 2572 2466 2323 2615 2091 2122 2281 2290 1929 1891 1395 1530 1278 1156 938 161 689 187
1002 187 236 59 -624 -752 -603 -1114 -994 -1154 -1595 -1437 -1793 -1877 -2005 -2442 -1901 -2051 -2049 -1947 -1836 -2211 -1640
1023 -1640 -1445 -1316 -1191 -1064 -853 -985 -348 -344 -207 495 212 609 664 723 1008 1329 1351 1850 1720 2086 2300
1044B300j83M49r2k49L95k39o8L71n58J57K01l74J53q00L39j77k92J7o38l87L00
1065F25k95k77j70l96K09p72M4K45q80K90M5p03L46o7k42p4ML51J32l67N26n31
1087a957K80O01l99M59J31L4M21J19n1O88o92J026o7J23L99l87Q55l05K8K77J45
1108A728j69N64l43K46J76n42M02n22M78L6q90J12J86m52J47k87k46K2n66K96
1128C76l85l95M42m58P1k30p42L31L4n55L95o15K82J41j85L94l84N0K15k86J32
1149a372M47k12L63P8o2M83l39M17L17j41M52j4p7J44q6O63K44q03O48M5k25L46
1171A316k05M19r6j43J26m91K09K99n26q5Q0j70M9m74l7J41n29M97o72n7J68m11
1193e92P2p1m11L09k53L3j85n0L23l53k43P07l28j93O58m15K78K31l4P47m96K85
$$ plain form
1044 2300 2117 2566 2474 2225 2620 2381 2313 2684 2126 2283 2484 2110 2263 1463 1802 1625 1333 1350 712 325 625
1065 625 330 53 -117 -513 -304 -1076 -1032 -787 -1667 -1377 -1332 -2035 -1689 -1756 -1998 -2072 -2068 -1717 -1585 -1952 -1426 -1957
1087 -1957 -1677 -1076 -1475 -1016 -885 -851 -430 -311 -362 326 -366 660 593 716 1115 728 1583 1278 1306 1583 1728
1108 1728 1559 2123 1780 2026 2202 1660 2062 1540 2018 2054 1164 1276 1462 1010 1157 870 624 646 80 376
1128 376 -9 -404 38 -420 -349 -579 -1321 -990 -956 -1511 -1116 -1731 -1449 -1308 -1493 -1099 -1483 -1433 -1218 -1504 -1372
1149 -1372 -925 -1137 -774 -696 -758 -275 -614 -197 120 -21 431 417 340 484 398 1061 1305 502 1150 1195 970 1316
1171 1316 1111 1530 1434 1291 1417 926 1135 1434 908 823 903 733 782 308 271 412 -117 380 -292 -349 -181 -592
1193 -592 -520 -591 -1002 -693 -946 -913 -1098 -1148 -825 -1178 -1421 -714 -1042 -1235 -577 -992 -714 -483 -517 230 -266 19
1215A9L87k84N62r4J27M61o72K91O07k61L47r5l72O21n02L63j75k28K91o0k81
1236A052L35m02nL14j151N81j56k97J32q09M29l14j90J13m40j37l4l21J33k3l57
1257a547K43k66J6K10m45N95J25m74M76k89N17K62l22M73l09M26M69l31P02k15
1277C16Q6R4M15k10N58p9q2N25l85O29k62q0K02o7j36L70n58M17j49j47k1m67
1299I69k97K39k77q0m89R3j10n17l1N4n17J09k68j37m5l14R6l16j64J01j35J34
1321a902j19j28k0L38k78L73j89L20j1K8L16J35L68Q9k02M87p8K33N98K44o5K29
1343G66J77J53nL33J29r3J24j03K68j51N7l10K08j85P6k91k0L4l03k27L03o54
1365B86l1r9l45L2j31m52O1k04o7l68k74N2j17j6k92j02K05j63l34M03k50M10
$$ plain form
1215 19 406 122 684 590 717 1178 506 797 1404 1143 1490 1395 1023 1644 1142 1505 1330 1102 1393 1333 1052
1236 1052 1387 985 980 1294 143 724 568 271 403 -406 23 -291 -481 -368 -808 -945 -979 -1300 -1167 -1190 -1547
1257 -1547 -1304 -1570 -1554 -1344 -1789 -1194 -1069 -1543 -1067 -1356 -839 -577 -899 -426 -735 -309 160 -171 531 316
1277 316 402 496 911 701 1259 1180 1098 1623 1238 1867 1605 1525 1727 1660 1524 1894 1336 1753 1604 1457 1436 969
1299 969 672 911 634 554 65 158 48 -469 -500 -446 -963 -854 -1122 -1259 -1304 -1618 -1522 -1838 -2002 -1901 -2036 -1902
1321 -1902 -2021 -2149 -2169 -1831 -2109 -1736 -1925 -1605 -1616 -1588 -1272 -1137 -769 -680 -882 -395 -473 -240 358 602 537 766
1343 766 943 1096 1091 1424 1553 1460 1584 1481 1749 1598 1655 1345 1553 1368 1444 1153 1133 1167 864 637 940 286
1365 286 255 156 -189 -157 -288 -740 -679 -883 -950 -1318 -1592 -1540 -1657 -1673 -1965 -2067 -1862 -2025 -2359 -1956 -2206 -1796
1387a796l16J00J74j67M24J80o6K61J28j27M73N0k8M46k5L19L1M61o9L1N56J51
1409A191L1J06R5n6m2K11J51m98J56K06j41k16q2n4l01K93k70j34j32j44k00P
1431A77K43k80k42k63j71k85n6N5k52n4j02j42L1pm4kK7j25Q8L8%J03L96l74L61
1456h80J63k79K68K68K07J07L92O4L8j27N17j28R1K73r0J12J79J75k1k64L10J1
1478A386J14l10L7j20L35l13K80l05k17j24J11l03k09K81j6n36L1n4j68k37K43
1499i4k32l3k3l92K43K9j24j37j7J54K1m15K59J02k08N45Q1O3K76k91j20N03Q6
1522B76J23J11P9J88j07N2M3K10J02L66k45J06q8j23L87j14l3O8j86k52K94j93
1544A064km7k53nj19J70j88k86j04J5k15j18N9n8p0l69j50Q5j56j14l1j90K62
$$ plain form
1387 -1796 -2112 -2012 -1838 -2005 -1581 -1401 -1467 -1206 -1078 -1205 -732 -682 -710 -264 -289 30 61 522 453 484 1040 1191
1409 1191 1222 1328 1423 1367 1325 1536 1687 1189 1345 1551 1410 1194 1112 1058 757 1050 780 646 514 370 170 177
1431 177 420 140 -102 -365 -536 -821 -877 -822 -1074 -1128 -1230 -1372 -1341 -1348 -1392 -1394 -1367 -1492 -1404 -1366 -1366 -1263 -867 -1241 -880
1456 -880 -717 -996 -728 -460 -253 -146 246 310 348 221 738 610 701 974 884 996 1175 1350 1329 1065 1375 1386
1478 1386 1500 1190 1227 1107 1442 1129 1409 1104 887 763 874 571 362 643 627 91 122 68 -100 -337 -94
1499 -94 -326 -359 -382 -774 -531 -502 -626 -763 -780 -626 -605 -1020 -761 -659 -867 -322 -241 -178 98 -193 -313 190 276
1522 276 399 510 589 777 670 722 765 975 1077 1443 1198 1304 1216 1093 1480 1366 1333 1401 1215 963 1257 1064
1544 1064 1062 1015 762 757 638 808 620 334 230 245 30 -88 -29 -87 -157 -526 -676 -591 -747 -861 -892 -1082 -820
1567h20j44o3J16J59L4l22L61j4L3J67j81J21N30k23L31J8j46L98K92q5K80j00
1589G42K95J36k90K38J25J59RM8k06j48J05J85l9m7j74m36L77m35k8J42k37o7
1611D54j77j71o7k68j14j33l05K46j15j97Q0m85J99J07o82L08k57M4J48k21J42
1632a464M8k25K83J29Q7K21L3J02J02l72O00J28q4M60K3J82J35j08K63q8K60K91
1654A006n0L5J41O1J65l29J24J28k13M48n24J23o5j4Jn79K59k21j34mk44l42J81
1677d7k12k01k5k87l4j63l67J96k81j21J86j44l06L61m00J96k8j05P5P3K32n3
1699a455MK7K30rL53J97k77L70J0M82j15J54L94j39L89k77K50J88Q3J08K83l52
1721H98L19o0l00O22m33L7J81l48K11l61j5J17k34j24N0j87j41j57j31j25j24
$$ plain form
1567 -820 -964 -1027 -911 -752 -718 -1040 -679 -693 -660 -493 -674 -553 -23 -246 85 103 -43 355 647 562 842 742
1589 742 1037 1173 883 1121 1246 1405 1414 1462 1256 1108 1213 1398 1359 1312 1138 702 1079 644 616 758 521 454
1611 454 277 106 39 -229 -343 -476 -781 -535 -650 -847 -767 -1252 -1053 -946 -1628 -1320 -1577 -1533 -1385 -1606 -1464
1632 -1464 -1416 -1641 -1358 -1229 -1142 -921 -888 -786 -684 -1056 -456 -328 -412 48 71 253 388 280 543 455 715 1006
1654 1006 956 991 1132 1193 1358 1029 1153 1281 1068 1516 992 1115 1050 1036 1037 458 717 496 362 358 114 -228 -47
1677 -47 -259 -460 -485 -772 -806 -969 -1336 -1140 -1421 -1542 -1356 -1500 -1806 -1445 -1845 -1649 -1677 -1782 -1707 -1634 -1402 -1455
1699 -1455 -1451 -1424 -1194 -1203 -850 -653 -930 -560 -550 -68 -183 -29 365 226 615 338 588 776 859 967 1250 898
1721 898 1217 1157 857 1479 1046 1083 1264 916 1127 766 751 868 634 510 560 373 232 75 -56 -181 -305
1742c05j08L6n3k35l3k65K12n26k44N12l88J44k15K72j47j63J74J23r0K98k4P7
1764i48K79m38M69J54J56K27l86L64L42j83P9L3M42J13k29L17p1K15K10l80J60
1785I25L83k85N6L55n56L32M7l84L13k83P4r8l98K15j73l03J08m1j56j27r2Q6
1807bl58l0J72l60J45k17Jj74J47k03K08P2k06J31q1PO9K56j96Q5J5K60n9J08
1831b10L85j42p3R0K67j10M9L40K33n1k9n3L09j76K5L13j42n1j26k83M17k4k01
1854G57oJ2Nj03M5k62j29k27P2k38J94ok99K91n64N02k52l86J29j0k34K45j56
1877f20r0N8p3K44m98K88K33q8P8L11j49K59m40K94M6L1J88J93p9J80M5M0n3r9
1901B99L83p4J68K5k23M69l05O5l0j02L9r5K17j62jl15K78k27l20M21m66M7p6
$$ plain form
1742 -305 -413 -377 -430 -665 -698 -963 -751 -1277 -1521 -1009 -1397 -1253 -1468 -1196 -1343 -1506 -1332 -1209 -1299 -1001 -1025 -948
1764 -948 -669 -1107 -638 -484 -328 -101 -487 -123 219 36 115 148 590 703 474 791 720 935 1145 765 925
1785 925 1308 1023 1079 1434 878 1210 1257 873 1186 903 977 879 481 696 523 220 328 287 131 4 -88 -2
1807 -2 -360 -390 -218 -578 -433 -650 -649 -823 -676 -879 -671 -599 -805 -674 -755 -748 -679 -423 -619 -534 -519 -259 -318 -210
1831 -210 175 33 -40 50 317 207 256 596 829 778 749 696 1005 829 854 1167 1025 974 848 565 982 958 757
1854 757 751 763 768 665 710 448 319 92 164 -74 120 114 -185 106 -458 44 -208 -594 -465 -475 -709 -464 -620
1877 -620 -710 -652 -725 -481 -979 -691 -458 -546 -468 -157 -306 -47 -487 -193 -147 -116 72 265 186 366 411 451 398 299
1901 299 682 608 776 801 578 1047 742 807 777 675 714 619 836 674 673 358 636 409 89 510 44 91 15
1924A5k54J90j90K55l37qL3k48j54J51j30K05l98r7L44l37K28Q6k8j04K57k80
1946h01J23L0K42M6j0K49j36J47O6k89L94J55j59J68L23l73M99j83J19k2k9K10
1968G69j44K33o6N3R4k10k19J67oj15Q2l37J23k8j14J8k59J61k60L9k56r4j65
1991e34J06j50K70l07j4n7k69q3J58j49j12M22k97o7J93m9m0j03L7J97J15K81
2013d52j61K17p5L81j42O6K14j76J24L48n2o1O5L76m9J7M2J17J21J94r7m2j63
2036H12L00k72J14N2l16j20R6j18j35k6OQ7m09r5Q0j63ql16K06l41k9L05m47K6
2060g11P0j09k19p0P7J8j23n7L62k79M08m00M30k54JK69k2M3m7m5K84J63N3K14
2084E6J61J37Rk6J56r7J47j46K12J69R9k37J96j03J7K53j2j39j19j09K97m33K10
$$ plain form
1924 15 -239 -49 -239 16 -321 -329 -296 -544 -698 -547 -677 -472 -870 -967 -623 -960 -732 -646 -674 -778 -521 -801
1946 -801 -678 -648 -406 -360 -370 -121 -257 -110 -44 -333 61 216 57 225 548 175 674 491 610 588 559 769
1968 769 625 858 792 845 939 729 510 677 671 556 638 301 424 396 282 300 41 202 -58 -19 -275 -369 -534
1991 -534 -428 -578 -308 -615 -629 -686 -955 -1038 -880 -1029 -1141 -719 -1016 -1083 -890 -939 -979 -1082 -1045 -848 -733 -452
2013 -452 -613 -396 -471 -90 -232 -166 48 -128 -4 344 292 231 296 672 623 640 682 799 920 1114 1017 975 812
2036 812 1112 840 954 1006 690 570 666 548 413 387 393 480 71 -24 56 -107 -115 -431 -225 -566 -595 -290 -737 -711
2060 -711 -641 -750 -969 -1039 -962 -944 -1067 -1124 -762 -1041 -633 -1033 -603 -857 -856 -587 -609 -566 -613 -658 -374 -211 -158 56
2084 56 217 354 363 337 493 396 543 397 609 778 877 640 836 733 750 1003 991 852 733 624 921 488 698
2107F98M05o18L67n23j00M6J38l72l8j4Ko54L96r0l8k39J11q6O5J0k01K37l12
2130h10J60k25K43j68j82L55J07j09J50K6k07K13j2K50K48k67J95J9J47N9p8L92
2152E06o5k84L40j88k1K86j9j0j25J98j11j86K66J60j53J33j48p3j26L6J15m21
2174A10n1K05j93J4J95l20j31m4n2k8j27K8J16m33Q1j11n6M12j81j30L22l68J47
2197e95m8Q9J18o0j40N51k37j39K23j46J51j48L19L5N8M1l5l5M98l05QK34p1N0
2221D16k07J02O9p2M9Q6l54J42P3j11K11p8k20j74L8J05j30J97j94m1J66l34j77
2244d38L09j90j47K44r6j10J78k34L01l62P7r9k5J19PK9JL0j11M51m05L81Nk8
2268a13J07q1L2R2J29J5r7p5K14k00J72K25j74J10Q6j10J03k15K34r5P6J95m93
$$ plain form
2107 698 1103 485 852 329 229 275 413 41 3 -11 -9 -663 -267 -357 -395 -634 -523 -609 -544 -534 -735 -498 -810
2130 -810 -650 -875 -632 -800 -982 -627 -520 -629 -479 -453 -660 -447 -459 -209 39 -228 -33 -14 133 192 114 506
2152 506 441 157 497 309 288 574 555 545 420 618 507 321 587 747 594 727 579 506 380 416 531 110
2174 110 59 264 71 85 280 -40 -171 -215 -267 -295 -422 -394 -278 -711 -630 -741 -797 -385 -566 -696 -374 -742 -595
2197 -595 -643 -554 -436 -496 -636 -85 -322 -461 -238 -384 -233 -381 -62 -27 31 72 37 2 500 195 203 437 366 416
2221 416 209 311 380 308 357 443 89 231 304 193 404 326 106 -68 -30 75 -55 142 -52 -93 73 -261 -438
2244 -438 -129 -319 -466 -222 -318 -428 -250 -484 -183 -545 -468 -567 -592 -473 -466 -437 -436 -406 -517 -66 -471 -90 -85 -113
2268 -113 -6 -87 -55 37 166 181 84 9 223 23 195 420 246 356 442 332 435 220 454 359 435 630 137
2291A37J52P1k55K0L31k81K26j85l47O72r06M38m61K0J25J78k76J31k74N6Q0k35
2313e83K42k37MK50r4J22j41J30r7J15j26L04j10J64o8J11J63j56n8K39j8j5K
2336A43J70J7l1M8J60j86K14n2j6l3M6J77k31O3r8J83O7p3k26K79k74K18k67p7
2360B21K73l69P9P4j47j39j7j05k42O7M5j9q9o8J02M3j90J14K6J19j79j15J73
2383c43j90K00j36j82L39pn7J90j34L14L5j80K91k76N43j40j63L54P1k5J36j50
2405D90L5M2PN0Mj56L03j84K10J19l66R3K8l8j33l04K25O1k83Q9J69k70p4p8l21
2430b82M68l65j41j80K13k36J43J36l93j44K42n2k16L24l43K98j74J99k10K90
2450d23k21J3O6K70L1j0O1k0NK08p8M1J75J8k29L05K91l57K56l3K7J09m6K87l55
$$ plain form
2291 137 289 360 105 125 456 175 401 216 -131 541 -365 73 -388 -368 -243 -65 -341 -210 -484 -428 -348 -583
2313 -583 -341 -578 -574 -324 -418 -296 -437 -307 -404 -289 -415 -111 -221 -57 -125 -14 149 -7 -65 174 156 141 143
2336 143 313 330 299 347 507 321 535 483 467 434 480 657 426 489 391 574 641 568 342 621 347 565 298 221
2360 221 494 125 204 278 131 -8 -25 -130 -372 -305 -260 -279 -368 -436 -334 -291 -481 -367 -341 -222 -401 -516 -343
2383 -343 -533 -333 -469 -651 -312 -319 -376 -186 -320 -6 29 -151 140 -136 407 267 104 458 529 504 640 490
2405 490 525 567 574 624 628 472 775 591 801 920 554 647 675 637 504 200 425 486 203 292 461 191 117 39 -282
2430 -282 186 -179 -320 -500 -287 -523 -380 -244 -637 -781 -539 -591 -807 -483 -826 -528 -702 -503 -713 -423
2450 -423 -644 -631 -565 -295 -264 -274 -213 -233 -228 -20 -98 -57 118 136 -93 212 503 146 402 369 396 505 459 746 391
2475C91j58K40q1k9n4L10j99J39l34Q5R2j87j06j08L6J46m06J72j68r5K27J3j17
2498a91j62j68j53m6O0J97k57p1J37J36p9j91J18J4K28k99J31r7K33m8k8J96j25
2521d65K52k59O9J34J17P7j06K52j16R7J45%J50o6j14K43k15K81o3Kl1k42L37
2544D79j65J6j39J20l04J72j11K15k61j03J7p5q6J14j35P6j72n3p4oK14k8j85
2567d74l0mJ91r5n8J60r6J44j65K24l25L34j02r1J22m5J13qJ32K28l4O3o2K9m5
2592A06K71k35k38K81K40j07o0J30J42j51k94J55k4J39j6J9j81L8J59j48j33J37
2614B30l39K61J2n9j62J80k47R5l52K82j73j3Q4J85m61J81m2p7Q8J38m3L0Kp6
2638b76J34M6J32l26J34J06P0m2O1p7J99J83k39p2L72k22L43j31R3M6k69J55j73
$$ plain form
2475 391 233 473 392 363 309 619 420 559 225 310 402 215 109 1 37 183 -223 -51 -219 -314 -87 -74 -191
2498 -191 -353 -521 -674 -720 -660 -463 -720 -791 -654 -518 -597 -788 -670 -656 -428 -727 -596 -693 -460 -508 -536 -340 -465
2521 -465 -213 -472 -403 -269 -152 -75 -181 71 -45 52 197 197 347 281 167 410 195 476 413 415 384 142 479
2544 479 314 330 191 311 7 179 68 283 22 -81 -64 -139 -225 -111 -246 -170 -342 -395 -469 -475 -261 -289 -474
2567 -474 -504 -508 -317 -412 -470 -310 -406 -262 -427 -203 -528 -194 -296 -387 -265 -310 -197 -205 -73 155 121 184 122 151 106
2592 106 377 142 -96 185 425 318 258 388 530 379 85 240 216 355 339 358 177 215 374 226 93 230
2614 230 -109 152 164 105 -57 123 -124 -29 -381 -99 -272 -285 -201 -16 -477 -296 -338 -415 -327 -189 -232 -202 -200 -276
2638 -276 -142 -96 36 -290 -156 -50 20 -22 39 -38 161 344 105 33 405 183 526 395 488 534 265 420 247
2661B47P7m0J78J00J53l08Q1j51j70OM5J17n38M40j84R6K96k92M4j04l38L25k27
2684a47l4m2J57k84J13J64k21LL2J51j51J16J23o9k97R8M6N2J89q3K19n35N45
2707A45K22p0l7j06M2m7J05L1J02R4o3J03j14P4K54j83l7K18K1j88kk83J49j3
2731D17j26J36q8J20k05J77m94L00r9n1j61J65j04k15K30q7j07k07N9K61k46r2
2753d17L7k2j40N2P4j31Q1K35k50L56o78N76k23k3M85k47J20l5r6K85K33m30J79
2776B1R7L04pm05L33L8m8J60j00J25j87J11J62k74J27j21K28j66O8q4L0l03K94
2799D03l80J90k21j73J28K33l60N6l41J37O3j56J10J55k01Nl92Q5m7Q6K86l1j59
2822e24j74q8p7M67n22P08k23m4K09q7R8J39j62J49K41k61J72l25J64L91j01J99
$$ plain form
2661 247 324 284 462 562 715 407 488 337 167 173 218 335 -203 237 53 149 445 153 197 93 -245 80 -147
2684 -147 -181 -223 -66 -350 -237 -73 -294 -291 -259 -108 -259 -143 -20 -89 -386 -288 -242 -190 -1 -84 135 -400 145
2707 145 367 297 260 154 196 149 254 285 387 481 418 521 407 481 735 552 515 733 754 566 564 281 430 417
2731 417 291 427 339 459 254 431 -63 237 138 87 -74 91 -13 -228 2 -85 -192 -399 -340 -79 -325 -417
2753 -417 -380 -402 -542 -490 -416 -547 -466 -231 -481 -125 -803 -227 -450 -473 12 -235 -115 -150 -246 39 272 -158 21
2776 21 118 422 415 10 343 381 333 493 393 518 331 442 604 330 457 336 564 398 466 382 412 109 403
2799 403 23 213 -8 -181 -53 180 -180 -124 -465 -328 -265 -421 -311 -156 -357 -352 -744 -659 -706 -620 -334 -365 -524
2822 -524 -698 -786 -863 -396 -918 -210 -433 -477 -268 -355 -257 -118 -280 -131 110 -151 21 -304 -140 251 150 349
2844C49j5k92J99k79J40L02lk45K36j49J52M1o8j00k37K65j92M4o7Mj5k3j46j44
2868b43r4K05o8j45NQP1k21L90l33K3K4L7k51j38L44KJ65j61j21J94l18J57P9
2892c89p6J41J76q8O9mJ37m6l9J37M3j10J30l4R6J46L1l5M4o4L61l75n9J09n7
2917B44J83J11j15j73Q9l35L00n2r4q5L35m62l0M6Pk22J06J65l66L06j95J85p3
2940a25K9l1o2k36K76j12j15J70m0k6j15K7L71k28l7L47r6K53n42J92L84k15K59
2963C28l51R2R6J35Mm02L48N4k00J08Q6p3M2J23j5m41N24l88J30P2j92K05o1j38
2987H6o1J42q0N7k25J86n2o5nJ21k99RM5J02j20l4J36J14k0k79j28L33k68K58
3011d7k5J33l66L47m6k88K19K6k56M16K3L4j81L22l20K47R6l87K69J02R9k8q4
$$ plain form
2844 349 334 42 241 -38 102 404 401 156 392 243 395 436 368 268 31 296 104 148 81 85 70 47 -99 -243
2868 -243 -337 -132 -200 -345 -340 -332 -261 -482 -92 -425 -402 -378 -341 -592 -730 -386 -384 -219 -380 -501 -307 -625 -468 -389
2892 -389 -465 -324 -148 -236 -167 -171 -34 -80 -119 18 61 -49 81 47 143 289 320 285 329 265 626 251 192 301 244
2917 244 427 538 423 250 339 4 304 252 158 73 408 -54 -84 -38 -31 -253 -147 18 -348 -42 -237 -52 -125
2940 -125 -96 -127 -189 -425 -149 -261 -376 -206 -246 -272 -387 -360 11 -217 -254 93 -3 250 -292 -100 284 69 328
2963 328 -23 69 165 300 304 -98 250 304 104 212 298 225 267 390 375 -66 458 70 200 272 80 285 224 86
2987 86 25 167 87 144 -81 105 53 -12 -17 104 -195 -186 -141 -39 -159 -193 -57 57 37 -242 -370 -37 -305 -47
3011 -47 -72 61 -305 42 -4 -292 -73 -47 -303 113 136 170 -11 311 -9 238 334 -53 216 318 417 389 305
3034C05k5o7j51K98j43j1Q9Q3l01K02j37J4K10j94m38J27J81J13j69j01k8N5K23
3057A35r0k48M0j13J63J92l68J24l05M77l49J47k9K18l7O4j49K99k24pj4R3n7
3080c8j28L96l24J89q9K42M9k94j03K54J65j08P6J16k0Q1l69K11l4jl3J24j21
3103B41Q4l94M55j70m3J97k44jk55K08L7Rj54j82J33j69J38l37J61jO1l2j45J5
3127c88P8j68N4L30k30J75J9j88J95k9l71L94O3M1j09k09K66j00K72J06L8j76
3149F3K98j97k64N36k54k0J77k97L81k78M4Q9K59j14n1j48r5N1l4J11j71rK71
3172C48l49L92o84L41L4k3j80r9K64k34J82p2r2j39K35k93p5L14p9Mo8j4r9L62
3196b4k48k4M8p6pL38j91K0J53j45l5R5J94Q1l07L21j50n4K00j53kKK62l02J23
$$ plain form
3034 305 280 213 62 360 217 206 295 378 77 279 142 156 366 172 -266 -139 42 155 -14 -115 -143 -88 135
3057 135 45 -203 -163 -276 -113 79 -289 -165 -470 7 -342 -195 -224 -6 -43 21 -128 171 -53 -60 -74 19 -38
3080 -38 -166 230 -94 95 6 248 297 3 -100 154 319 211 287 403 383 464 95 306 272 271 238 362 241
3103 241 325 -69 386 216 173 370 126 125 -130 78 115 124 -30 -212 -79 -248 -110 -447 -286 -287 -226 -258 -403 -388
3127 -388 -310 -478 -424 -94 -324 -149 -130 -318 -123 -152 -523 -129 -66 -25 -134 -343 -77 -177 95 201 239 63
3149 63 361 164 -100 436 182 162 339 42 423 145 189 278 537 423 372 224 129 180 146 257 86 77 348
3172 348 -1 391 -293 48 82 59 -121 -220 44 -190 -8 -80 -172 -311 -76 -369 -444 -130 -209 -205 -273 -287 -386 -24
3196 -24 -272 -296 -248 -324 -331 7 -184 -164 -11 -156 -191 -96 98 179 -128 193 43 -11 189 36 34 36 298 -4 119
3221A19K5P4j73L74l68K64p6k44J53j21K76k0k22j26L6K30k86l6J74R9j02l26
3243b76J29J42j86j11j16J52K18m29K76LR4J22j34q6J11j48J81p7k4J2J50O9l19
3266b47MP3J58l7P0j79q0L15M0J09J02l62K58J3J07m32P7M0Q6k5k06J27n1K62
3290B22l96N40k39j40j31J22J5k01L34l63J96m4J39rK05k46r7J83j95K65j97Q0
3312D3m07J40J33J19k27N4K10l43K35j09O2j18K51R2p5j3l67L34J05k72Q7m3K09
3335A00j41J95P0j45J0o5nj0J39l0J81k25k00p5K95o0n0J47L8j63j32K55j63J09
3359G5j19r9K28J4j25k55n3L23l26J81n2K78k83pK85k10J13J1j24n2J99k1P8j4
3383D5J47l5r3j04j63P7K23J9j3J28r2k96M92l8j52p8q2M5j37Q9N14j16j49q4
$$ plain form
3221 119 144 218 45 419 51 315 239 -5 148 27 303 283 61 -65 -29 201 -85 -121 53 152 50 -276
3243 -276 -147 -5 -191 -302 -418 -266 -48 -477 -201 -198 -104 18 -116 -202 -91 -239 -58 -135 -159 -147 3 72 -247
3266 -247 -243 -170 -12 -49 21 -158 -238 77 117 226 328 -34 224 237 344 -88 -11 29 115 90 -116 11 -40 222
3290 222 -174 366 127 -13 -144 -22 -7 -208 126 -237 -41 -85 54 45 250 4 -93 90 -105 160 -37 43
3312 43 -364 -224 -91 28 -199 -145 65 -278 -43 -152 -90 -208 43 135 60 47 -320 14 119 -153 -66 -109 100
3335 100 -41 154 224 79 89 24 19 9 148 118 299 74 -126 -201 94 34 -16 131 169 6 -126 129 -34 75
3359 75 -44 -143 85 99 -26 -281 -334 -11 -337 -156 -208 70 -213 -220 65 -145 -32 -21 -145 -197 2 -19 59 45
3383 45 192 157 64 -40 -203 -126 97 116 103 231 139 -157 335 297 145 67 -15 30 -107 -18 496 380 231 147
3407A47lJ23j81j19l7K06p2K12l60Q0l7j35K41M1k13K20k63J73k61K1K3n6L12
3430F2j80R6r2qK29k67k3J68P2j42KN5P2j47L3n3K95j08J2k80J67J48J73r9j11
3455G4J83j87P8J31l43o6L88k65M22j16l4l36L02l23J19Q4m9lJ8J14K9j05J94
3478C09j80Q1k88J64L2j19j16J74j61j16J59j36K16k5j80J61o8R4J7j85J90l13
3500b90K10J38j94Q7P0k71L10J43j50q8q1J08K31k76O5n7n1J31O5J62n9L3j8j44
3524G4O8O4J79j55r3k2J6n8Q0n0j06J99k17J45J42l70K47nOj66K13q1j11J6P6
3549I1p7P8l01L2L20l76L52m42K28m2j11N2o8K41m4K4J87o1j72j68J49j10Q5J65
3573C2l05J90L38j66n9L5j59K65M2l92J70R8j12L35l64Q9N3K6j07N8K57k96J40
$$ plain form
3407 147 144 267 86 -33 -70 136 64 276 -84 -4 -41 -176 65 106 -107 113 -150 23 -238 -217 -194 -250 62
3430 62 -118 -22 -114 -122 107 -160 -183 -15 57 -85 -83 -28 44 -103 -70 -123 172 64 76 -204 -37 111 284 185 74
3455 74 257 70 148 279 -64 -130 258 -7 415 299 265 -71 231 -92 27 111 62 59 77 191 220 115 309
3478 309 129 210 -78 86 118 -1 -117 57 -104 -220 -61 -197 19 -6 -186 -25 -93 1 18 -167 23 -290
3500 -290 -80 58 -136 -49 21 -250 60 203 53 -35 -116 -8 223 -53 12 -45 -96 35 100 262 203 236 218 74
3524 74 142 206 385 230 137 115 131 73 153 103 -3 196 -21 124 266 -104 143 138 144 -22 191 110 -1 15 91
3549 91 14 92 -209 -177 143 -233 119 -323 -95 -137 -248 -196 -264 -23 -67 -43 144 83 -89 -257 -108 -218 -133 32
3573 32 -273 -83 255 89 30 65 -94 171 213 -179 -9 89 -23 312 -52 37 90 116 9 67 324 28 168
3596A68j85k0J86j03J45j32r6j36L10j80O5k80J96K3l09K48q9QJ83j50K3l9j59
3619c23J11m3K58l85K78j51K90m30L38L4p3M6pj00M8%K83k31Mk01L34p8J27l2
3643I7l26K34P2K99l66k26J54K72k1k34L7k30J80Lm2m6J7k82K1K36Q0Oj83R0R6
3668f2n2l2k09L7J70j67R5K62k36m4J81l6k36K77J92l23K06m8J3n9J97j54N5J67
$$ plain form
3596 168 -17 -37 149 46 191 59 -37 -173 137 -43 22 -258 -62 -39 -348 -100 -189 -181 2 -148 -125 -164 -323
3619 -323 -212 -255 3 -382 -104 -255 35 -395 -57 -23 -96 -50 -57 -157 -109 -109 174 -57 -53 -254 80 2 129 97
3643 97 -229 5 77 376 10 -216 -62 210 189 -45 -8 -238 -58 -55 -97 -143 -126 -408 -387 -151 -71 -65 -248 -158 -62
3668 -62 -114 -146 -355 -318 -148 -315 -220 42 -194 -238 -57 -93 -329 -52 140 -183 23 -25 -12 -71 126 -28 27 194
$$ [...]
8191b48
##END NTUPLES=NMR FID
##END=
