##TITLE=1H_Pr BnNCS
 CDCl3
 8 sc, 
 17.03.2022
##JCAMPDX= 6.0         $$ Bruker NMR JCAMP-DX V2.0
##DATA TYPE= NMR FID
##DATA CLASS= NTUPLES
##ORIGIN= UXNMR, Bruker Analytische Messtechnik GmbH
##OWNER= root
$$ XWIN-NMR		Version 3.5
$$ Fri Mar 18 13:04:00 2022 Russian Standard Time (UT+4h)  she@DPX200
##.OBSERVE FREQUENCY= 200.131346
##.OBSERVE NUCLEUS= ^1H
##.DELAY= (6, 6)
##.ACQUISITION MODE= SIMULTANEOUS
##.ACQUISITION SCHEME= undefined
##.AVERAGES= 8
##.DIGITISER RES= 18
##SPECTROMETER/DATA SYSTEM= spect
##.PULSE SEQUENCE= zg30
##.SOLVENT NAME= CDCl3
##.SHIFT REFERENCE= (INTERNAL, CDCl3, 0, 15.7039)
##AUDIT TRAIL= $$ (NUMBER, WHEN, WHO, WHERE, WHAT)
$$ ##TITLE= Audit trail, XWIN-NMR		Version 3.5
$$ ##JCAMPDX= 5.01
$$ ##ORIGIN= Bruker BioSpin GmbH
$$ ##OWNER= she
$$ F:/spectra/data/she/nmr/H-F/1/audita.txt
$$ ##AUDIT TRAIL=  $$ (NUMBER, WHEN, WHO, WHERE, WHAT)
(   1,<2022-03-18 13:02:27.25 +0400>,<she>,<DPX200>,
      <created by zg, POWCHK disabled, PULCHK disabled
       configuration hash MD5:
       00 E9 B6 7A A2 85 ED C7 34 08 36 98 17 FE 4E 26
       data hash MD5: 16K
       05 16 B6 2C F1 4E D5 F9 0B 6E 33 D1 48 94 15 AF>)
$$ ##END=
$$ 
$$ hash MD5
$$ E2 07 B5 B4 44 3A E2 7D 0F 7D E6 26 57 90 E7 78
##$RELAX= 
##$RELAX= 
##$RELAX= 
##$RELAX= 
##$RELAX= 
##$RELAX= 
$$ Bruker specific parameters
$$ --------------------------
##$DU= <F:/spectra>
##$EXPNO= 1
##$NAME= <H-F>
##$PROCNO= 1
##$TYPE= <nmr>
##$USER= <she>
##$AMP= (0..31)
100 100 100 100 100 100 100 100 100 100 100 100 100 100 100 100 100 100 
100 100 100 100 100 100 100 100 100 100 100 100 100 100 
##$AQSEQ= 0
##$AQ_mod= 1
##$AUNM= <au_zg>
##$AUTOPOS= <>
##$BF1= 200.13
##$BF2= 200.13
##$BF3= 200.13
##$BF4= 200.13
##$BF5= 200.13
##$BF6= 200.13
##$BF7= 200.13
##$BF8= 200.13
##$BYTORDA= 1
##$CFDGTYP= 0
##$CFRGTYP= 5
##$CHEMSTR= <none>
##$CNST= (0..31)
1 1 145 1 1 1 1 1 1 1 1 1 1 1 1 1 1 1 1 1 1 1 1 1 1 1 1 1 1 1 1 1 
##$CPDPRG= <>
##$CPDPRG1= <>
##$CPDPRG2= <>
##$CPDPRG3= <>
##$CPDPRG4= <mlev>
##$CPDPRG5= <mlev>
##$CPDPRG6= <mlev>
##$CPDPRG7= <mlev>
##$CPDPRG8= <mlev>
##$CPDPRGB= <>
##$CPDPRGT= <>
##$D= (0..31)
0 1.2 0 0 0 0 0 0 0 0.06 0 0.03 0 0 0 0 0.0002 0 0 0 0 0 0 0 0 0 0 0 0 
0 0 0 
##$DATE= 1647594146
##$DBL= (0..7)
120 120 120 120 120 120 120 120 
##$DBP= (0..7)
150 150 150 150 150 150 150 150 
##$DBP07= 0
##$DBPNAM0= <>
##$DBPNAM1= <>
##$DBPNAM2= <>
##$DBPNAM3= <>
##$DBPNAM4= <>
##$DBPNAM5= <>
##$DBPNAM6= <>
##$DBPNAM7= <>
##$DBPOAL= (0..7)
0.5 0.5 0.5 0.5 0.5 0.5 0.5 0.5 
##$DBPOFFS= (0..7)
0 0 0 0 0 0 0 0 
##$DE= 6
##$DECBNUC= <off>
##$DECIM= 32
##$DECNUC= <off>
##$DECSTAT= 4
##$DIGMOD= 1
##$DIGTYP= 9
##$DL= (0..7)
0 120 120 120 120 120 120 120 
##$DP= (0..7)
150 150 150 150 150 150 150 150 
##$DP07= 0
##$DPNAME0= <>
##$DPNAME1= <>
##$DPNAME2= <>
##$DPNAME3= <>
##$DPNAME4= <>
##$DPNAME5= <>
##$DPNAME6= <>
##$DPNAME7= <>
##$DPOAL= (0..7)
0.5 0.5 0.5 0.5 0.5 0.5 0.5 0.5 
##$DPOFFS= (0..7)
0 0 0 0 0 0 0 0 
##$DQDMODE= 0
##$DR= 18
##$DS= 0
##$DSLIST= <SSSSSSSSSSSSSSS>
$$ [...]
##$SUBNAM2= <"">
##$SUBNAM3= <"">
##$SUBNAM4= <"">
##$SUBNAM5= <"">
##$SUBNAM6= <"">
##$SUBNAM7= <"">
##$SUBNAM8= <"">
##$SUBNAM9= <"">
##$SW= 18.0517287032376
##$SWIBOX= (0..15)
0 0 2 0 0 0 0 0 0 0 0 0 0 0 0 0 
##$SW_h= 3612.71676300578
##$TD= 16384
##$TD0= 1
##$TE= 0
##$TE2= 300
##$TE3= 300
##$TEG= 300
##$TL= (0..7)
0 120 120 120 120 120 120 120 
##$TP= (0..7)
150 150 150 150 150 150 150 150 
##$TP07= 0
##$TPNAME0= <>
##$TPNAME1= <>
##$TPNAME2= <>
##$TPNAME3= <>
##$TPNAME4= <>
##$TPNAME5= <>
##$TPNAME6= <>
##$TPNAME7= <>
##$TPOAL= (0..7)
0.5 0.5 0.5 0.5 0.5 0.5 0.5 0.5 
##$TPOFFS= (0..7)
0 0 0 0 0 0 0 0 
##$TUNHIN= 0
##$TUNHOUT= 0
##$TUNXOUT= 0
##$USERA1= <user>
##$USERA2= <user>
##$USERA3= <user>
##$USERA4= <user>
##$USERA5= <user>
##$V9= 5
##$VALIST= <valist>
##$VCLIST= <CCCCCCCCCCCCCCC>
##$VD= 0
##$VDLIST= <DDDDDDDDDDDDDDD>
##$VPLIST= <PPPPPPPPPPPPPPP>
##$VTLIST= <TTTTTTTTTTTTTTT>
##$WBST= 1024
##$WBSW= 4
##$XGAIN= (0..3)
0 0 0 0 
##$XL= 0
##$YL= 0
##$YMAX_a= 887103
##$YMIN_a= -772578
##$ZGOPTNS= <>
##$ZL1= 120
##$ZL2= 120
##$ZL3= 120
##$ZL4= 120
##$ABSF1= 10
##$ABSF2= 0
##$ABSG= 5
##$ABSL= 3
##$ALPHA= 0
##$AQORDER= 0
##$ASSFAC= 0
##$ASSFACI= 0
##$ASSFACX= 0
##$ASSWID= 0
##$AUNMP= <proc_1d>
##$AZFE= 0.1
##$AZFW= 0.1
##$BCFW= 1
##$BC_mod= 2
##$BYTORDP= 1
##$COROFFS= 0
##$CY= 11.3945322036743
##$DATMOD= 1
##$DC= 2
##$DFILT= <>
##$DTYPP= 0
##$F1P= 2.36226072786647
##$F2P= -0.459571619588291
##$FCOR= 0.5
##$FTSIZE= 0
##$FT_mod= 4
##$GAMMA= 1
##$GB= 0.15
##$INTBC= 1
##$INTSCL= 1
##$ISEN= 128
##$LB= 0.24
##$LEV0= 0
##$LPBIN= 0
##$MAXI= 10000
##$MC2= 0
##$MEAN= 0
##$ME_mod= 0
##$MI= 1.114404
##$NCOEF= 0
##$NC_proc= 0
##$NLEV= 6
##$NOISF1= 3.799351
##$NOISF2= 2.8
##$NSP= 1
##$NTH_PI= 0
##$NZP= 0
##$OFFSET= 15.70392
##$PC= 1
##$PHC0= -17311.02
##$PHC1= 14.40078
##$PH_mod= 1
##$PKNL= yes
##$PPARMOD= 0
##$PSCAL= 0
##$PSIGN= 0
##$REVERSE= no
##$SF= 200.130013532006
##$SI= 16384
##$SIGF1= 3
##$SIGF2= 2
##$SINO= 400
##$SIOLD= 16384
##$SREGLST= <1H.CDCl3>
##$SSB= 0
##$STSI= 0
##$STSR= 0
##$SW_p= 3612.71676300578
##$SYMM= 0
##$S_DEV= 0
##$TDeff= 0
##$TDoff= 0
##$TI= <>
##$TILT= no
##$TM1= 0
##$TM2= 0
##$TOPLEV= 0
##$USERP1= <user>
##$USERP2= <user>
##$USERP3= <user>
##$USERP4= <user>
##$USERP5= <user>
##$WDW= 1
##$XDIM= 8192
##$YMAX_p= 0
##$YMIN_p= 0
$$ End of Bruker specific parameters
$$ ---------------------------------
##NTUPLES= NMR FID
##VAR_NAME=  TIME,          FID/REAL,        FID/IMAG
##SYMBOL=    X,             R,               I
##VAR_TYPE=  INDEPENDENT,   DEPENDENT,       DEPENDENT
##VAR_FORM=  AFFN,          ASDF,            ASDF
##VAR_DIM=   8192,          8192,            8192
##UNITS=     SECONDS,       ARBITRARY UNITS, ARBITRARY UNITS
##FACTOR=    0.0002768,     1,               1
##FIRST=     0,             0,               0
##LAST=      2.2672688,     0,               0
##MIN=       0,             -772578,         0
##MAX=       2.2672688,     887103,          0
$$ Real data points
##PAGE= N=1
##DATA TABLE= (X++(R..R)), XYDATA
$$ [...]
2219I967m86o504J188O915o68p081o90N877K56o677j724M901J774o175m057M109
2235I25L356n493m914M168M282n437n157L137M701l453n480K565N313j280n558
2250h325N64N891N0n515R0O579J653n696p37O356K123m358j656N732L756l229
2266C278k526M097M643k784m695L458N712k681n089K200M871k737o077O85L796
2281F151j453n665j404L794m63o251k797L855J216n555k941M331K080m814k695
2296a2611M175L123k606k224L894N011j134l046L175N988k73k882K614N981N51
2311I736m280J598M612K91m102p13L667O56m285l089K643J081n429l901K306J548
2327B339m870l870J832J642m016l569J202K700j373l399J133M088J6l608J325
$$ plain form
2219 9967 9481 2977 4165 11080 10412 3331 2641 8518 8774 2097 373 5274 7048 873 -3184 925
2235 925 4281 -1212 -6126 -1958 2324 -3113 -8270 -5133 -432 -3885 -9365 -6800 -1487 -2767 -8325
2250 -8325 -7761 -1870 -1820 -7335 -7245 -666 987 -4709 -5446 910 3033 -1325 -2981 2751 6507 3278
2266 3278 752 4849 9492 6708 2013 5471 11183 8502 3413 5613 10484 7747 1670 2355 6151
2281 6151 4698 -967 -2371 1423 960 -5291 -8088 -4233 -3017 -8572 -11513 -7182 -5102 -9916 -12611
2296 -12611 -8436 -5313 -7919 -10143 -6249 -1238 -2372 -5418 -2243 3745 3472 590 3204 9185 9736
2311 9736 5456 7054 11666 11957 7855 7142 10809 11465 7180 4091 6734 7815 2386 -1515 791 2339
2327 2339 -2531 -6401 -4569 -2927 -6943 -10512 -9310 -6610 -7983 -11382 -10249 -6161 -6145 -9753 -8428
2342h428N024J041k805J569N117J088k515O16M308J820j999m27L194K524k777
2357G350k426K279K410l164l108K429K029l178m018J255J571k520l529K47K109
2372b64j182l798o90K843k52l886l01L387M93l122k93L158J258k590m43L334K142
2389b06j606j161K586K704j647k052K695L175j368k336K664K759j181k751J322
2404C597K674p00k587J38K692k34l569r77K822j03l670q49K859rl799j631K172
2421a174L14k893j583J469J815k538k583J707K644j959k819K387K901q06k769
2436e887J931L134k59j788J330L730R81k030K70L767J046k334n28M081J096k986
2452E554r69L091Q91l310j987J604J126k581l400P17J917k897m255M94K336k319
$$ plain form
2342 -8428 -3404 -2363 -5168 -3599 1518 2606 91 707 5015 6835 4836 4409 7603 10127 7350
2357 7350 4924 7203 9613 6449 3341 5770 7799 4621 603 1858 3429 909 -2620 -2373 -264
2372 -264 -1446 -5244 -5934 -3091 -3343 -7229 -7530 -4143 -3650 -6772 -7065 -3907 -2649 -5239 -5682 -2348 -206
2389 -206 -1812 -2973 -387 2317 670 -1382 1313 4488 3120 784 3448 6207 5026 2275 3597
2404 3597 6271 5571 2984 3122 5814 5580 2011 1034 3856 3753 83 -766 2093 2084 -1715 -3346 -1174
2421 -1174 -860 -3753 -5336 -3867 -2052 -4590 -7173 -5466 -2822 -4781 -7600 -5213 -2312 -3118 -5887
2436 -5887 -3956 -822 -1081 -2869 -1539 2191 3172 1142 1412 5179 6225 3891 3363 7444 8540 5554
2452 5554 4585 7676 8567 5257 3270 4874 6000 3419 19 736 2653 -244 -4499 -4005 -1669 -3988
2468c988l835P42K322j256l464K29L037K63k476M90L576J849k244k09M035K679
2484A750j968j22M328K719j720j307L121K212j668j939J815K936j795l671N21
2499E212K217j744m590o0K131j308m480j010K265q16l842j526K430Q73l151j673
2515i072L143J802k560j864L576K963j938j116K987L143j207j440K207L282k74
2530C632k338J720L619k56l470L91L214K88l933l57L017q3l488j350K330N78l054
2547D60k486K327J380k318l137J731K168k083l034J638K884j554l249R83K859
2562a431n46k799M34K980M66k698k67L153J358l273n05L650J404k508p95K869
2578A492K021j513j824K239K620j076k150J639K950j337l206J202K637q41l274
$$ plain form
2468 -3988 -7823 -7081 -4759 -6015 -9479 -9250 -6213 -5950 -8426 -7936 -4360 -2511 -4755 -4964 -929 1750
2484 1750 -218 -340 3988 6707 4987 3680 6801 9013 7345 5406 7221 10157 8362 4691 5212
2499 5212 7429 5685 1095 1035 3166 1858 -2622 -3632 -1367 -2183 -6025 -7551 -5121 -4248 -7399 -9072
2515 -9072 -5929 -4127 -6687 -8551 -4975 -2012 -3950 -5066 -2079 1064 -143 -1583 624 3906 3632
2530 3632 1294 3014 6633 6377 2907 3298 6512 6800 2867 2510 5527 5444 1956 606 2936 3514 460
2547 460 -2026 301 1681 -637 -3774 -2043 125 -1958 -4992 -3354 -470 -2024 -5273 -4290 -1431
2562 -1431 -1977 -4776 -4342 -1362 -896 -3594 -3861 -708 650 -2623 -3128 522 1926 -582 -1377 1492
2578 1492 3513 2000 176 2415 5035 3959 1809 3448 6398 5061 1855 3057 5694 4853 1579
2593A579K19K458q95l444o46J871l20k962j914K139N71l408k036K038J562k500
2609e688j949K433J861j472j606J852K521L7j839J300L993K16j775J130L676M94
2625E184k350O81L007J046k363n82K159O68k530j748J838O12k926k108J096P76
2641B460k954k841P73J108j961k621R68J375j229k269L15J944N02k025N26K646
2657c283R85j617J00L066J594j166K32K777J701j462q73K253J842r52j709J793
2673E281J620j517k202P40J396j708k292K34J151j260k354n95J313o36k215j053
2689d097J578J25j982q96K034K26j732l73K116R36r50m63J346J572m61j012J432
2706f01J947j68j286J177K196n61j635R77J837m31j367J75J684o10j166n94J414
$$ plain form
2593 1579 1798 4256 3361 -83 -729 1142 822 -2140 -4054 -1915 -1344 -4752 -6788 -4750 -3188 -5688
2609 -5688 -7637 -5204 -3343 -4815 -6421 -4569 -2048 -2011 -3850 -2550 1443 1659 -116 1014 4690 5184
2625 5184 2834 3515 6522 7568 5205 4623 6782 7450 4920 3172 5010 5622 2696 588 1684 2460
2641 2460 -494 -3335 -2562 -1454 -3415 -6036 -5068 -3693 -4922 -7191 -6876 -4932 -4430 -6455 -5929 -3283
2657 -3283 -2298 -3915 -3815 -749 845 -321 -89 2688 4389 2927 2054 4307 6149 5197 3488 5281
2673 5281 6901 5384 3182 3922 5318 3610 1318 1552 2703 1443 -911 -1506 -193 -829 -3044 -4097
2689 -4097 -2519 -2394 -4376 -5272 -3238 -3012 -4744 -5117 -3001 -2065 -3015 -3478 -2132 -560 -1021 -2033 -601
2706 -601 1346 1178 -108 1069 3265 2704 1069 2046 3883 3452 2085 2260 3944 3334 2168 1574 2988
2723B988nj607j042J639K13j672j525J402N29k184p82J154N85j219j116L63P82
2740a497n39j413K00J636m14j748M66J699j76j693J063J609L04j248J71J957N64
2757I41o60j78J956J246p92o66J758J132j126q23J311P08j168q49M84Q21j444
2774B651j571k20J001r93k444N7O69p63k364j41J077n83j852k0J168L84j122k83
2792e349J515R56l79k09J981J577m02l82K067J931p14j45J488J565n48q74P63
2809D841J263o44j480K9J080o83k528k94Q90j003k232r08Q28m88j916j203J088
2826c360L40j839p62J038J050p31j116J596J856o52r61J602J947k59m96J262J633
2843B148J65r82O68K002J72j827L6J950pj758n78J509j21j734p28Q81K05j329
$$ plain form
2723 2988 2983 1376 334 1973 2186 514 -1011 391 920 -1264 -2046 -892 -307 -1526 -2642 -2279 -1497
2740 -1497 -2036 -3449 -3249 -1613 -2027 -3775 -3309 -1610 -1786 -3479 -2416 -807 -503 -1751 -1580 377 941
2757 941 281 103 2059 3305 2513 1847 3605 4737 3611 2788 4099 4807 3639 2790 3274 4095 2651
2774 2651 1080 860 1861 868 -1576 -1519 -850 -1613 -3977 -4118 -3041 -3624 -5476 -5496 -4328 -3944 -5066 -5349
2792 -5349 -3834 -2878 -3257 -3466 -1485 92 -310 -692 1375 3306 2592 2447 3935 5500 4952 4078 4841
2809 4841 6104 5460 3980 4009 5089 4406 1878 1584 2474 1471 -761 -1669 -841 -1329 -3245 -4448 -3360
2826 -3360 -3020 -4859 -5621 -4583 -3533 -4264 -5380 -3784 -1928 -2580 -3541 -1939 8 -251 -747 515 2148
2843 2148 2313 1331 1999 4001 4173 2346 2382 4332 4325 2567 1989 3498 3377 1643 915 1796 2001 672
2861F72j376M12J033j201j821P30J215j158j587Q65J248p00j643P69J218j44j310
2878b778J55J525L53j484j23J908N18j363m49J901R19j139m79J424R94r58n59
2895C65J368J278r75r76P69J339J76k172P99J593p68j620O2J280n41j504n65O40
2913E48J28j670q63P60N13j915r48J113L74j220j362J085J381j135p46J225J100
2930a632k90p22R14J763K56j062J027K009L62j053R3J925N82j171j04J661M7r85
2948C620r57O58O22j433j514M75O75j438j625N5M80j270j708L67Q22r43j371J56
2966d329J355l31j360K65J425Q10q61PJ762J077p73M2J887Q33k57k67J530J083
2984C898n22q56Q51J159o23j252L40J075p93j386l34R34j116j504p45R32m54j523
$$ plain form
2861 672 -704 -292 741 -460 -2281 -1551 -336 -1494 -3081 -2216 -968 -1668 -3311 -2542 -1324 -1468 -2778
2878 -2778 -2623 -1098 -745 -2229 -2352 -444 74 -1289 -1738 163 1082 -57 -536 888 1882 924 365
2895 365 1733 3011 2036 1060 1829 3168 3344 1172 1971 3564 2796 1176 1238 2518 1977 473 -92 548
2913 548 676 -994 -1857 -1097 -584 -2499 -3447 -2334 -1960 -3180 -4542 -3457 -2076 -3211 -3957 -2732 -1632
2930 -1632 -1922 -2644 -1730 33 289 -773 254 2263 2625 1572 1665 3590 4172 3001 2897 4558 4605 3620
2948 3620 2663 3321 3943 2510 996 1471 2146 708 -917 -862 -382 -1652 -3360 -2993 -2171 -3114 -4485 -4329
2966 -4329 -2974 -3305 -4665 -4400 -2975 -2165 -3026 -3019 -1257 -180 -953 -911 976 1809 1552 1285 2815 3898
2984 3898 3376 2520 3371 4530 3907 2655 2995 4070 3277 1891 1557 2491 1375 -129 -874 58 -396 -1919
3002a919p39N70J51j103r78R99R07j121m22Q79J110r21r3J168P36J43k26M27J611
3021A179k32q66O93J357l47n61K16J071qj138J83Q43j58p86k48L91M63j204o19
3040B29L14N58r34r57N84O91j021p85N53M19p62m30K96O35m72p54L97L73K85q76
3060a657k04J101J14r60R8O88L30m61l48J042N54po22Q77R28o6o63Q19J006n62
3080B007o44Q69P69n23n69K76O15o35p73m05L91l80j302k09M32m25j160o18N46
3099a738k60j164l69R46j28q20j55Q80L13J82k89Q86Q62J06k02J199J246J99m04
3118A290R34R40j2l50L97M83K33q83k81N12j14j028q41L73l39j079p18K52k97
3137e28j010p97K49j89o35m59K69L99j77n83M82J091k38l45O42J047K93n01R00
$$ plain form
3002 -1919 -2658 -2088 -1937 -3040 -4018 -3019 -2112 -3233 -3655 -2776 -1666 -2587 -2680 -1512 -776 -633 -859 -432 1179
3021 1179 947 81 774 2131 1784 1223 1439 2510 2502 1364 1547 2390 2232 1446 1198 1589 2052 848 229
3040 229 543 1101 167 -790 -206 485 -536 -1321 -768 -349 -1111 -1541 -1245 -610 -1082 -1836 -1439 -1066 -781 -1657
3060 -1657 -1861 -760 -646 -1606 -1508 -820 -490 -951 -1299 -257 297 290 -332 545 1473 1407 744 1563 2569 2007
3080 2007 1363 2232 3001 2478 1909 2185 2800 2165 1392 987 1378 998 -304 -513 -81 -506 -1666 -2284 -1738
3099 -1738 -1998 -3162 -3531 -2585 -2713 -3533 -3688 -2808 -2495 -2313 -2602 -1716 -854 -748 -950 249 1495 1694 1290
3118 1290 2224 3164 3152 2802 3199 3682 3915 3032 2751 3263 3149 2121 1280 1653 1314 235 -483 -231 -528
3137 -528 -1538 -2335 -2086 -2275 -2910 -3369 -3100 -2701 -2878 -3461 -2979 -1888 -2126 -2471 -1829 -782 -489 -990 -90
3156i0O69P22k64M4R22L94m81k9Q18J18r60k84Q11Op03n40L03K4p10p10K3M99
3178E82o07j150o4O08J28j274J75Q32n28o87L50N87l9q03J71P90J70n06k48R48
3198e65L51n17j86Q48P55q34m5O61M99m12k15O77M48j32n01K75O21j10o62j07
3218H49J022n65p49P9N53qq78l91P83k42r30m40K98L42q07l34M1L67n62o73M86
3239a759N74p55k28K85Q36m08k37L72J034L16p21N34Q51K51l90K36J253J77n06
3258A715P0L23P03q03k54L45N39p24n59k3L69n84j266J70K85q17r17K2K47q12
3278a971m52j37N37j57q57N3N65M95k33l71R67J099n17r9J029N55k8k8P80J059
3298B289j05m37M82J101l00o15k31N09j97r27N2K17o53q19l45K76m93o70o38J25
$$ plain form
3156 -90 579 1301 1037 1081 2003 2397 1916 1887 2705 2823 1863 1579 2390 2396 1693 1153 1456 1480 770 60 83 582
3178 582 -25 -1175 -1239 -631 -503 -1777 -1602 -770 -1298 -1985 -1635 -1048 -1087 -1890 -1719 -929 -759 -1265 -1513 -565
3198 -565 -214 -731 -917 -69 686 -148 -193 468 967 555 340 1017 1465 1333 832 1107 1728 1618 956 849
3218 849 1871 1306 557 636 1189 1181 303 -88 695 453 -477 -917 -619 -277 -1084 -1418 -1377 -1010 -1572 -2245 -1759
3239 -1759 -1185 -1940 -2168 -1883 -1047 -1455 -1692 -1320 -286 30 -691 -157 694 945 555 791 2044 2221 1715
3258 1715 1785 2108 2811 2008 1754 2099 2638 1914 1355 1332 1701 1117 -149 21 306 -511 -1428 -1406 -1159 -1971
3278 -1971 -2423 -2560 -2023 -2180 -3037 -2984 -2419 -1924 -2157 -2528 -1561 -462 -979 -1078 -49 506 478 450 1230 2289
3298 2289 2184 1747 2229 3330 3030 2415 2184 2693 2496 1569 1621 1838 1185 366 21 297 -196 -866 -1504 -1379
3318a379l1o13m80L45L28p17j58O48O43m56j80Q37L41K19j42M53Q54J33k16K62
3338F91Q63L8l52J9N57J13o42j69P32m53m97k73N14n2l85q37L49K36m49o98N73
3359a22K51n86l28K28K39q3m31l3N12m78k35K4N26j91l48j90P01J23m64k04O50
3380d39L7l82O9M84N17n39l5O59L71J37m24L73O58k45n26O22N72l94k64J30M35
3401A816m33m22R2%k04n45k48n9o0q53l34J53j51n76n07K30M21m84k66K58N45
3422a627j41Q2K75N99J62j72M81R41K56k97O81M62R3m7J55O4M93j79l66J22J10
3443B147p80r5m2n7o70o59o2Q7p09m42L9k83m2o11K54L62l50l44K66L38j02J96
3465a559L20N73j17J15L96N82L31m0l5M17M81L0k19L68L36m73j74L55L10o61l31
$$ plain form
3318 -1379 -1410 -2023 -2503 -2158 -1830 -2547 -2705 -2057 -1414 -1870 -2050 -1213 -872 -653 -795 -342 512 645 429 691
3338 691 1554 1592 1240 1259 1816 1929 1287 1118 1850 1397 900 627 1141 1089 704 -133 216 452 3 -695 -122
3359 -122 129 -457 -785 -557 -318 -401 -832 -865 -353 -831 -1066 -1042 -516 -707 -1055 -1245 -544 -421 -885 -1089 -439
3380 -439 -402 -784 -715 -231 286 -253 -288 371 742 879 455 828 1486 1241 715 1337 1909 1515 1251 1381 1816
3401 1816 1383 961 1053 1053 849 304 56 -3 -63 -916 -1250 -1097 -1248 -1824 -2331 -2101 -1680 -2164 -2430 -2172 -1627
3422 -1627 -1768 -1686 -1411 -812 -650 -822 -341 600 856 559 1240 1702 1795 1748 1903 1967 2460 2281 1915 2037 2147
3443 2147 1367 1272 1230 1173 503 -156 -218 -131 -840 -1282 -1243 -1526 -1568 -2179 -1925 -1563 -1913 -2257 -1991 -1653 -1755 -1559
3465 -1559 -1239 -666 -783 -668 -272 310 641 601 566 983 1464 1494 1275 1643 1979 1506 1332 1687 1997 1336 1005
3486A005Q3M0l21n86J2O2l02n64q9J46m1n59N2J79M6o02J98K62j17j06j00O17
3508f85nm2rM17L02p2j61L68K11L12m60K24P60m99q6K79K31q7l48p7L61Ql11r9
3532E32L98Lo60l15O41qo82l0L04j93k19m9L26l29M2n96J95L87m32n84M57J41
3554f71l77O5J36L09k4l10M03K75q3k81J82N49L46n39J37N63O67o10J11M60L97
3575A705k75m78M56J01j9n60J18j23Q7q16N9J97l92m24k62K34o20o71J39J91%
3596a353m16j10M56N9k9l08O16L63j09J32M53N13j92J96N83L96K19k27L12N30
3616B084j92l51J36L15j11o54o9R9k09p11j56J8k06p76k35R3N5m43m55M94p7j05
3638a456l73N36J61l55K06N00K56J56l5M26K55Q6Lr9N88Q7j28N3J46K68n20j35
$$ plain form
3486 1005 1088 1128 807 221 233 295 -7 -571 -660 -514 -555 -1114 -1062 -883 -837 -1439 -1241 -979 -1096 -1202 -1302 -685
3508 -685 -690 -732 -741 -324 -22 -94 -255 113 324 636 176 400 1160 661 575 854 1085 998 650 573 934 942 631 532
3532 532 930 933 273 -42 599 591 -91 -121 183 -10 -229 -278 48 -281 -239 -835 -640 -253 -685 -1269 -812 -671
3554 -671 -1048 -983 -847 -538 -562 -872 -469 -194 -277 -558 -376 173 519 -20 117 680 1347 737 848 1308 1705
3575 1705 1430 952 1408 1509 1490 930 1048 925 1012 196 255 452 60 -364 -626 -392 -1012 -1683 -1544 -1353 -1353
3596 -1353 -1769 -1879 -1423 -1364 -1393 -1701 -1085 -722 -831 -699 -246 267 75 271 854 1250 1469 1242 1554 2084
3616 2084 1892 1541 1677 1992 1881 1227 1158 1257 1048 337 181 199 -7 -783 -1018 -925 -870 -1313 -1768 -1274 -1351 -1456
3638 -1456 -1829 -1293 -1132 -1487 -1281 -781 -525 -369 -404 22 277 363 366 267 855 942 814 867 1013 1281 761 626
3660F26L09J29k63m86K80J8j60l84J07o3j00n95L87K55m38k85J59N35l84j69J62
3681c60J73p4m16j09L88L46m70r2N3N30m40k01N03m8k89J19J45L00M3k49L31K20
3703D03K11l27j4M44L94m78j93M69O6m79J65M66r9l36r2p1M3m35k01J68J97o41
3725c40m18L30k2l82l00J07J39k26j67n0K51Q0r6J09O72J36l35K72K67M1K15K99
3747E82K9L37J79j89K96K37O2o1K3k03j8l72j54L01m36k83l61L1n9m65j1n5k48
3770h38j99j56Q9M4k26l3K36K12n20N21K12K85k54K31J90M90j78K57J33L97k4
3791H69Q7J41L25j28k56J3K10j31k85P4J24n10j7j60r2j68k55l27L2L7j96l38
3813i51j8K76k21lJ98N1j85N1K56p0L46j31O2L68J59n3j35M94N7l38K17K14rK7
$$ plain form
3660 626 935 1064 801 315 595 613 453 69 176 113 13 -582 -195 60 -378 -663 -504 31 -353 -522 -360
3681 -360 -187 -261 -677 -786 -398 -52 -522 -614 -561 -31 -471 -672 -169 -217 -506 -387 -242 58 101 -148 183 403
3703 403 614 287 273 717 1111 633 440 909 975 496 661 1127 1028 692 600 529 572 137 -64 104 301 -340
3725 -340 -758 -428 -450 -832 -1132 -1025 -886 -1112 -1279 -1329 -1078 -998 -1094 -985 -313 -177 -512 -240 27 68 283 582
3747 582 611 948 1127 938 1234 1471 1533 1472 1495 1292 1274 902 748 1049 613 330 -31 0 -59 -524 -535 -590 -838
3770 -838 -1037 -1193 -1104 -1060 -1286 -1319 -1083 -871 -1391 -870 -658 -373 -627 -396 -206 284 106 363 496 893 869
3791 869 956 1097 1422 1294 1038 1051 1261 1130 845 919 1043 533 516 356 264 96 -159 -486 -454 -417 -613 -951
3813 -951 -969 -693 -914 -917 -719 -668 -853 -802 -546 -616 -270 -401 -339 29 188 135 0 494 551 213 430 644 635 662
3837F62k6o0r0j75k8M64n5m17l42L67K97n31j36M5l1k92J6L48j49K27l57j70N3
3860c80M5j49J76K10k15k49K92j41J73j56N4m7j09P5Q7r4L95j1k03K25Q1J0m3
3883B6M69J9l6Q5JK45k27K10J8J46r3j47n3M7j8m41p0n4m0l78m7m1j52k91j69
3908i91j7j72R4j13m6J74RJ32J68M15l47L11r2M80K17j87L54K30J14K7J06K19
3930A085o2J38k67L19J17n08j09J73j03n24O8l11K15o51j18R5l4k06l65N6J51
3951h41l33J63O9K17k86K45j88N17RJ7O4M01O0q3J72L74p2j50L28q8M23m18j31
3974D69K04Ok98j82M27l4l71O0l9K9k65j08k30M21k80q8l00M66M3n38R8J61K16
3997a33k45j93O2L63k05P5Q8j14j31N7L16j05r4J4MK09oJ60l36O65j13j86K13
$$ plain form
3837 662 636 576 486 311 283 747 692 275 -67 300 597 66 -70 -25 -56 -348 -332 16 -133 94 -263 -433 -380
3860 -380 -335 -484 -308 -98 -313 -562 -270 -411 -238 -394 -340 -387 -496 -421 -334 -428 -33 -44 -247 -22 59 69 26
3883 26 495 514 478 563 564 809 582 792 810 956 863 716 663 710 692 251 181 127 87 -291 -338 -379 -531 -822 -991
3908 -991 -1008 -1180 -1086 -1199 -1245 -1071 -1062 -930 -762 -347 -694 -383 -475 5 222 35 389 619 733 760 866 1085
3930 1085 1023 1161 894 1213 1330 822 713 886 783 259 327 16 231 -420 -538 -443 -477 -683 -1048 -992 -841
3951 -841 -1174 -1011 -942 -725 -1011 -766 -954 -437 -428 -411 -347 54 114 31 203 577 505 355 683 595 1018 600 469
3974 469 673 679 381 199 626 592 221 281 242 271 6 -102 -332 89 -191 -279 -579 -113 -70 -608 -510 -349 -133
3997 -133 -378 -571 -509 -146 -351 -276 -188 -302 -433 -376 -60 -165 -259 -245 -241 -32 -38 122 -214 451 338 152 365
4020C65p0O1j65J58J31K4m6j7J05J4n05K27R6J88k25j40k48O4n9n08J64J7k12
4043e81K17j50Nk47J25P3p2j7N4j32K02K62j74K22K24P8k24L90R0L3N4j92L47
4066E87n8K43m5j15J37O6j06k76O9j29p2M0l2k2n75j12J37k14J50l49j6j06J18
4089f80j79J01J3K41l80L34Q1J54j67N5M82r9L8J58J69J94j55M69k02R1P5q9K91
4112I95k58k18l1K23k41m04K49o7k22p0k7j96r5Q5j73j43k19L21J2j10J19m5L5
4135d80r5J98n9K12j08J38M66k47qK75J51j70K27j39J72m8j75J19q3J47l70o8
4157E5K42L6l21K8nK3K6k30L05j17m43L58O2j29j37J61N5r9j32M7J2R0lp8j4j66
4183c74K24m3k58K35l9L5p9J15ol7J41J4O2RP0O7J95j64J3R6p3K22o5K17n4o1
$$ plain form
4020 365 295 356 191 349 480 504 458 441 546 560 55 282 378 566 341 201 -47 17 -42 -550 -386 -369 -581
4043 -581 -364 -514 -509 -756 -631 -558 -630 -647 -593 -725 -523 -261 -435 -213 11 89 -135 255 345 378 432 240 587
4066 587 529 772 727 612 749 815 709 433 502 373 301 341 309 287 -288 -400 -263 -477 -327 -676 -692 -798 -680
4089 -680 -859 -758 -745 -504 -884 -550 -469 -315 -482 -427 55 -44 -6 152 321 515 360 829 627 718 793 704 995
4112 995 737 519 488 711 470 66 315 248 26 -44 -71 -267 -362 -277 -450 -593 -812 -491 -479 -589 -470 -515 -480
4135 -480 -575 -377 -436 -224 -332 -194 272 25 17 292 443 273 500 361 533 485 310 429 346 493 123 55
4157 55 297 333 12 40 35 58 84 -146 159 42 -401 -43 19 -110 -247 -86 -31 -130 -262 -215 -203 -113 -116 -194 -208 -374
4183 -374 -150 -193 -451 -216 -255 -220 -299 -184 -190 -227 -86 -72 -10 -1 69 136 331 167 180 276 203 425 360 577 523 462
4209D62K0N3j22J49l29q0P5j80k23K5j19j26J6j38k66K71j39Q6k37J97p9J94J63
4232c27p7Pl5L50rK85M0L04k37m5K08J07O9K7QK9p0j02j44J04l04K72r8l27j35
4257a00K15j36l11J76j61p3op2L8j73N2J31O7Mj07L46m49J77K98P4O7j20J83j3
4281A07L92k52K86k19J09K56k21n4l3j02l9K41Q5m27nJ7J62k07m66K37k4J4j57
4304c00K5K47k21p1q7j8Q6J88q4j09J67J58l82J96K13k09l0N3J71j45j43M05J44
4327B54j13k45K66m8Q6k02O4K64%j53j41K19l82K07J9K9K19j96L8p6P4j49j50
4350a16j32M26j6m19n7L80k92q0K3N6j63O5o4J32j09K4J47k09J54J88k61J65K91
4373A33j94j87L50K29k10r0J3J93n2J92K46k25N8k49K7J17J04k28jq3m1r4k4K43
$$ plain form
4209 462 482 535 413 562 233 153 228 48 -175 -150 -269 -395 -379 -517 -783 -512 -651 -565 -802 -605 -684 -490 -327
4232 -327 -404 -397 -432 -82 -91 194 234 538 301 256 464 571 640 667 675 704 634 532 388 492 188 460 362 35 -100
4257 -100 115 -21 -332 -156 -317 -390 -396 -468 -430 -603 -551 -420 -353 -349 -456 -110 -559 -382 -84 -10 57 -63 120 107
4281 107 499 247 533 314 423 679 458 404 371 269 230 471 556 129 124 141 303 96 -370 -133 -157 -143 -300
4304 -300 -275 -28 -249 -320 -407 -425 -339 -151 -235 -344 -177 -19 -401 -205 8 -201 -231 -178 -7 -152 -295 110 254
4327 254 141 -104 162 114 200 -2 62 326 326 173 32 251 -131 76 95 124 343 147 185 109 183 34 -116
4350 -116 -248 178 162 -257 -314 66 -226 -306 -283 -227 -390 -325 -389 -257 -366 -342 -195 -404 -250 -62 -323 -158 133
4373 133 -61 -248 102 331 121 31 44 237 185 377 623 398 456 207 234 351 455 227 226 143 102 8 -16 227
4397B27j65r9l62k34J80N7k00L9K09j95j1J10M6l7k2L75p5j07N53l37J65J49%
4420B66J05K27l56J27Q7K9o6J23J3j18r4J62k50j06O4l03K4o4p7L2l10J92o5j33
4444d91l5M9j12J52P4Q7j8l1J11n5N9J04j34L10n0J93R6l27K49Q9k1N1k54K09
4468C05P5r3k4j26j35l0K96k91mm4j01K49j55l03J80Q0K8J63j82J69nRO1k86J95
4493C1K56k34K4l11l15N14J40k90j37K79k04J16j94J23p2N6J56j29K84j48p0M07
4515B82j98n6K71k66J88Q3M3Q4j05k03J61j54K36q5p9n6j50Ml27K35j0l8N2j30
4539b18l93K37J56j70J50M4k92K20J35L3L4l1J01k7J53J89J71j86K5o8m1j40L99
4562D81j87K06l18O1P0k77J2J21L4l40L17o6k07j53K42l5k31N2o0j98K38j32O
$$ plain form
4397 227 62 -37 -399 -633 -453 -396 -596 -557 -348 -543 -554 -444 -398 -435 -457 -82 -157 -264 289 -48 117 266 266
4420 266 371 598 242 369 456 485 419 542 555 437 343 505 255 149 213 -90 -66 -130 -207 -175 -485 -293 -358 -491
4444 -491 -526 -477 -589 -437 -363 -276 -294 -325 -214 -269 -210 -106 -240 70 20 213 309 -18 231 320 299 350 96 305
4468 305 380 287 263 137 2 -28 268 -23 -27 -71 -172 77 -78 -381 -201 -121 -93 70 -112 57 52 61 122 -164 31
4493 31 287 53 77 -234 -549 -35 105 -185 -322 -43 -247 -131 -325 -202 -274 -218 -62 -191 93 -55 -125 282
4515 282 84 28 299 33 221 304 347 431 326 123 284 130 366 281 202 146 -4 0 -327 -92 -102 -140 -88 -218
4539 -218 -611 -374 -218 -388 -238 -194 -486 -266 -131 -98 -64 -95 6 -21 132 321 492 306 331 263 222 82 481
4562 481 294 500 182 243 313 36 48 169 203 -137 180 114 -93 -246 -4 -39 -270 -218 -278 -476 -238 -370 -364
4585c64J01k0R1m9J25j83J90j6j36K38K57k47j3L88k00P4k7NJ52j27K3J18J1l44
4609D7J50j02J2j19K9k40J03L30j24k73n0J50p6j56O8J78k00J28J87l66K99j03
4631a28l8L60k40K25l26N3j34J23Q3K89l59R3L95o9k87K41Kj05k33L3n7L97L3
4654C51k81k0j50L2J62q5l6Q9Q1pk10n1K4j06K12J73m55K64J12j15P9k10L16l49
4678a80n2L19l19J14Q5k32r4L50L5k69M17j87K62m05O4L42j21M7k82K00K3j01
4700A6m1K31j18O8R9J76l83K41j80k02Q3j19j81J01L89j80l93j1L2J64l14p4L67
4723b29Q4k7m7K67j76J51r6J59l3R8p0M2K34q8J32j96J00j40m1l6K94n8J25k87
4747A62O3k65L81k67L2Nj13j09J23Rl4j33k23J03J1L27l14j15L72j60R2p8K92
$$ plain form
4585 -364 -263 -283 -192 -241 -116 -299 -109 -125 -261 -23 234 -13 -26 362 162 236 209 214 366 239 262 380 391 47
4609 47 197 95 107 -12 17 -223 -120 210 86 -187 -237 -87 -163 -319 -251 -73 -273 -145 42 -324 -25 -128
4631 -128 -166 194 -46 179 -147 -94 -228 -105 -22 267 -92 1 396 327 40 281 283 178 -55 -22 -79 318 351
4654 351 70 50 -100 -68 94 9 -27 62 143 136 -74 -125 -101 -207 5 178 -277 -13 99 -16 63 -147 169 -180
4678 -180 -232 87 -232 -118 -33 -265 -359 -9 26 -243 174 -13 249 -156 -92 250 129 176 -106 94 117 16
4700 16 -25 206 88 156 255 431 48 289 109 -93 -10 -129 -310 -209 180 0 -393 -404 -372 -208 -522 -596 -229
4723 -229 -145 -172 -219 48 -128 23 -73 86 53 151 81 123 357 269 401 205 305 165 124 88 382 324 449 162
4747 162 225 -40 341 74 106 111 -2 -111 12 21 -13 -146 -369 -266 -255 72 -242 -357 15 -145 -53 -131 161
4770A61l96Q7L29j25O4j21J39K4Ll62M65Rj88J57k12m8Q1l5j11K69M3m13K48k18
4794a50K26l01K24Q9j3j29j70J33M19l70J2K59l71L44o6k51j7J0p8m1J79J29j32
4817f5o0K52j38L9J5j55K70k55K6N3K1R5P5pP4J31k59J54j56J40j72k2N1J6J45
4842B68j54l7K9j15J71k39j1K02l66K22j0k06oP9K47j18j6p1p8K08j61k2J60q9
4866a13P9J6k0lJ4p6L84q4M8k05J83j88K20q3L1r4j29Rj3J67q0j88K60J03k35
4891CP4k62L12k14j13J20j57J83q1m02L85k95L72o8j6Q5o2K9j41L62k36R3K26
4914A97j51J29j66J92N9k91L1P8%o0rJ16j63K76l56K83k42K89k68R0R2p3k45K61
4938F9p0k7k75P0J91k47L81j16j00J48j80K9K23p1k7J00J38om4j55p3J0M3J26
$$ plain form
4770 161 -235 -148 181 56 120 -1 138 162 165 -197 268 277 89 246 34 -14 67 32 -79 190 233 -180 68 -150
4794 -150 76 -225 -1 88 75 -54 -224 -91 328 -42 -30 229 -142 202 136 -115 -132 -122 -200 -241 -62 67 -65
4817 -65 -125 127 -11 28 43 -112 158 -97 -71 -18 3 98 173 166 240 371 112 266 110 250 78 56 107 123 268
4842 268 114 77 106 -9 162 -77 -88 114 -252 -30 -40 -246 -252 -173 74 -44 -60 -131 -209 -1 -162 -184 -24 -113
4866 -113 -34 -18 -38 -41 -27 -103 281 197 245 40 223 35 255 172 203 109 -20 -11 -24 143 63 -125 135 238 3
4891 3 77 -185 127 -87 -200 -80 -237 -54 -135 -537 -152 -447 -75 -143 -159 -74 -136 -107 -248 114 -122 -29 197
4914 197 46 175 9 201 260 -31 0 78 78 18 9 125 -38 238 -118 165 -77 212 -56 34 126 53 -192 69
4938 69 -1 -28 -303 -233 -42 -289 92 -24 -124 24 -156 -127 96 25 -2 98 236 230 186 31 -42 -32 11 137
4962A37j2j9Lj58L08k30j13J12r4P1j94J83M5q4Q9J72j18k26J51n6J75j63l3R9
4986D5n3nJ71L2k74j27J84J68k76NK64q5j67O0l6Q0j60K30Q6j66J77k42J38j12
5010f3J74j0M9j4l16L92O2k35J85J50k25O1l10L60l87P5l4N8PQ8p8l76K28j02
5034b61J93O3j63k56K36K24j31K7Jj3k3N4O5J55j58J57l13L73kj46J83P2k46M1
5058A32K01k97Q7L2P7k82P6N4k39K68j35j20%LO3j48K19j80K0m1O2J34j17j9P1
5083g9n0J19j22j19K94n2k1J12P7J11j34k57K55k8oj84J74k4l97N35j97P8j08
5106b3j16j2K68q5N2o8L31l69J06K0k02J6j01N5K62l21M2q3m0L34k46K26k14r1
5130b59J23K41k11J50M9k12j1K29J3p8LM5j50J53r8n1J12J36j86O0K70n29K58
$$ plain form
4962 137 125 106 109 -49 259 29 -84 28 -66 5 -189 -6 39 -45 44 216 98 -128 23 -33 142 -21 -54 45
4986 45 -8 -13 158 190 -84 -211 -27 141 -135 -130 134 49 -118 -58 -94 -14 -174 56 142 -24 153 -89 49 -63
5010 -63 111 101 150 136 -180 212 274 39 224 374 149 210 -100 260 -127 -52 -86 -28 -21 67 -11 -387 -159 -261
5034 -261 -68 -5 -168 -424 -188 36 -95 -68 -67 -80 -103 -49 16 171 13 170 -143 230 228 82 265 337 91 132
5058 132 333 36 123 155 232 -50 26 80 -159 109 -26 -146 -146 -143 -80 -228 -9 -189 -169 -210 -148 -14 -131 -150 -79
5083 -79 -129 -10 -132 -251 43 -9 -30 82 159 270 136 -121 134 106 100 -84 90 66 -331 204 7 85 -23
5106 -23 -139 -151 117 32 84 16 347 -22 84 104 -98 -82 -183 -128 134 -187 -145 -228 -268 66 -180 46 -168 -259
5130 -259 -136 105 -106 44 93 -119 -130 99 112 34 37 82 -68 85 -13 -64 48 184 -2 58 328 -201 57
5153E7J15j37j83K43j13J38o8OR5l45J91J11j24M8l42N5K18j25j8p5L40k2l99
5176c34K74j59K39p4J87m45L63r9J01l18L14JR9j14j20J81Qm2l8j48J07m1J66
5199A08k0k20K14q0m3K38JR9n06L43o6j56Q1L2j17P1j20L47l84R3l6P6P9M1k03
5224a28K52k42Q9P5l0p1R7m5O1K03j51j1M6r3ro7J52k08q6K42Q6m0j19K3R2k95
5250a77J75l5j30j07J21M1m3K7M1N9o9J64l04J96J80j15M4O7j57P5j59K46p3j55
5274h8L7q3L62k10J98j74L3o4N1j55R5K4l9j80J7K30j56J23pJ32l4r0J67L4k83
5299f0Nk09K97q9j00k6LJ63M5k9m0R7o2r8O1K32k56k49L69k97K00J27k17k25L51
5324gn3J87p5J10l64L53j44j28L47k67K22k76J98pl4K22j00k86L23l45J14K18
$$ plain form
5153 57 172 35 -148 95 -18 120 52 58 153 -192 -1 110 -14 34 -308 -253 -35 -160 -178 -253 87 65 -334
5176 -334 -60 -219 20 -54 133 -312 51 -48 53 -265 49 50 149 35 -85 96 104 62 24 -124 -17 -58 108
5199 108 88 -132 82 2 -41 197 198 297 -209 134 68 -88 -7 25 -92 -21 -141 206 -178 -85 -121 -45 34 75 -128
5224 -128 124 -118 -29 46 16 -55 42 -3 58 261 110 99 145 52 43 -24 128 -80 -166 76 162 122 3 26 118 -177
5250 -177 -2 -37 -167 -274 -153 -112 -155 -128 -87 -28 -97 67 -237 -41 139 24 68 135 -22 53 -106 140 67 -88
5274 -88 -51 -134 228 18 216 42 75 11 62 -93 2 26 -13 -193 -176 54 -102 21 14 146 112 22 189 223 -60
5299 -60 -55 -264 33 -56 -156 -182 -179 -16 29 0 -40 57 -5 -103 -42 190 -66 -315 54 -243 -43 84 -133 -358 -7
5324 -7 -60 127 52 162 -202 151 7 -121 226 -41 181 -95 103 96 62 284 184 -102 221 -124 -10 208
5346B08k73r8KR2k67L74p8j11J13j85J46j85K07O9l9n1K2K10j40m3p2P6J55k7
5370A05j29Q8j54l2N0R4j29M2K85l34K30m2k69L11Q3k91LJ49k84M0%J63j14K2
5394a13J22l8k21K09J13l8k20K07L9J5J62l77L38k16j22M02l22l1J83pJ55k16
5416B4K44k22q0J24lM8j00o3N8O8o9Lj11k8J51L9q4k90K97j73K97m4l0q9j37J93
5442B3J8q3Q2n4KJ68j39j57K09K2j52R1J19k57J93l0k37J54J57j88j42J40J82
5465A21n9J33j20j02K16k56j2j35M54j99J3J87j80M4l25M07M7k46N5J37j01J53
5487B32l01J4M0J48k54J85K20k48l07K09L03j05q6l44K37N2K43k46J53o3L8m6
5509G4j41K10k62K47L5J48j69l35L09o7k79K79J38q6j41K05k79L17l27P7j68k9
$$ plain form
5346 208 -65 -163 -161 -69 -336 38 -40 -151 -38 -223 -77 -262 -55 14 -25 -76 -54 156 16 -27 -99 -23 132 105
5370 105 -24 64 -90 -122 -72 22 -107 -65 220 -114 116 74 -195 116 199 -92 -89 60 -224 -184 -184 -21 -135 -113
5394 -113 9 -29 -250 -41 72 34 -186 21 60 75 237 -140 198 -18 -140 262 -60 -91 92 85 240 24
5416 24 268 46 -34 90 87 135 35 -28 30 98 29 32 -79 -107 44 83 -1 -291 6 -167 130 86 56 -33 -170 23
5442 23 41 -42 40 -14 -12 156 17 -140 69 91 -61 30 149 -108 85 55 -182 -28 129 -59 -201 -61 121
5465 121 62 195 75 -27 189 -67 -79 -214 240 41 54 241 61 105 -220 187 234 -12 43 180 79 232
5487 232 -69 -55 -15 133 -121 64 284 36 -271 -62 241 136 50 -294 -57 -5 238 -8 145 82 120 74
5509 74 -67 143 -119 128 163 311 142 -193 116 49 -230 49 187 101 -40 165 -114 203 -124 -47 -215 -244
5531b44j5j4K65Oj54K53j74M0r1m1J11J16Q2r6j28J50NJ8P9j70K51l99K85j57
5555b2P7J21m6n8l12K30R0N7l17J26K75k32J22j05R4j56J54j66P4k30R8O8p9J27
5579a0j39N0q1j04Q3M49j29k06K2N0L2rq0O2M1j15l4J17R5R4l24N5mJ93K8l03
5605a67K53q3J98J69l33j02P5m8L9OK9J23j41K7J56q7n7l0J37j75LK58k48M3O4
5630A09l32L34l19K38M2j95L16n3k41J90mj93K19q2K08k22k15M44l05QQ5r8K28
5653A62k85J75o1j4J00J82k29j94Q7QK85k14r8K30j25k3L3J71k69k9K08Ro2L6
5677H3j38n1J16j55K14k09K37k42J28J08J5j0M7k58l2J19J5J59L2K3j13k9j10
5700e1r7M0J06o8K2J13O9o0m8K59m10l3O6j08L47l27Q8K60l98K98p2j30K35o1
$$ plain form
5531 -244 -259 -273 -8 -2 -156 97 -77 -37 -128 -169 -58 58 140 44 -84 66 71 89 168 -2 249 -150 135 -22
5555 -22 55 176 130 72 -240 -10 80 137 -180 -54 221 -11 111 6 100 -56 98 -68 6 -224 -126 -58 -137 -10
5579 -10 -149 -99 -180 -284 -201 248 119 -87 -65 -15 17 8 -72 -10 31 -84 -118 -1 94 188 -136 -81 -85 108 136 -167
5605 -167 86 3 201 370 37 -65 10 -38 1 7 36 159 18 45 201 114 57 27 164 -11 -8 250 2 45 109
5630 109 -223 111 -208 30 72 -123 193 140 -101 89 85 -108 111 29 237 15 -200 244 -61 -53 32 -66 162
5653 162 -123 52 -9 -23 77 259 30 -164 -77 -69 216 2 -96 134 9 -14 19 190 -79 -108 100 109 47 83
5677 83 -55 -106 10 -145 69 -140 97 -145 -17 91 106 96 143 -115 -147 -28 -13 146 178 201 88 59 -51
5700 -51 -148 -108 -2 -70 -48 65 134 74 26 285 -125 -158 -92 -200 147 -180 -92 168 -230 68 -4 -134 101 40
5724D0j49K1N4k40L26r6J05J9R5j90J20k9n9J48l58L2K40J74l84l7k1J36J59M
5748A10j00j49L81l66j0N8L9J03L2J32k82J69j30q8P5k31K41j16J43k48L46n2
5770E7k73J69J86K37o05N29l65j81R5L17k07p3M6J10J28m9l3k86J07Mj0Q2R1j35
5794e9K10k15R7L84n68R6J22j32M2L1o5k2J44N9N4k59K56j54l5%nO2n7J54K17
5819C57k17j93M8P6k25J63k23K34J22j35p4O4j2J90l56K16k39L45l05N1L1%J59
5842G7k44J23M9q4k71L21J07j72J04j25J52k77J95J62n6j54j07M05l02J35j71
5863a33K15n1OJ10L4m23L21j40J27M1m0l2R1p7j75K17K1k7j89j1J51J52k00k95
5887c07M97k39j17j16L17j05q2R9K47l03j16L71j28j13Qr7K02M5J81k58j1Q8j90
$$ plain form
5724 40 -109 -88 -34 -274 52 -44 61 80 175 -15 105 76 17 165 -193 -161 79 253 -131 -168 -189 -53 106 110
5748 110 10 -139 242 -124 -134 -76 -37 66 98 230 -52 117 -13 -101 -26 -257 -16 -132 11 -237 109 57
5770 57 -216 -47 139 376 -229 300 -65 -246 -151 166 -41 -114 -68 42 170 121 88 -198 -91 -87 -97 -15 76 -59
5794 -59 151 -64 33 417 -151 -55 67 -65 -23 8 -57 -79 65 124 178 -81 175 21 -14 -14 -19 43 -14 140 357
5819 357 140 -53 -5 71 -154 9 -214 20 142 7 -67 -3 -15 175 -181 35 -204 141 -164 -113 -82 -82 77
5842 77 -167 -44 5 -79 -350 -29 78 -94 10 -115 37 -240 -45 117 61 -93 -200 205 -97 38 -133
5863 -133 82 31 37 147 181 -242 79 -61 66 107 67 35 126 49 -126 91 112 85 -104 -115 36 188 -12 -307
5887 -307 190 -49 -166 -282 35 -70 -152 -53 194 -109 -225 146 18 -95 -87 -184 18 63 244 -14 -25 63 -127
5910a27K1K9j1K1j59K40j28J03J01Mj4m4j13M06k45j86o2n7K22L11m41K48j14
5933EM6k27K56J5J5l29K17J1j2m0j4J04j70P8m8J6j8P3J31J2j53l2l72N18l24
5958b42L59j33K00o2j5m2l7j68m9L06m1J5Q6m5Kp5r8N8%j43J26Q5k77J27N8K7
5984B2k63LK05mn7J79l05J91J13j82J02j81J71K9n5r3J71r2j07j21L18j00j46
6007b02Q5n6N4j05L95l2j29q1K21r2j78r3M54m38L4L30l22L34J06p3j84p6l3O3
6031a8R7J52k48j16R5R3m7Kk28M92k81k2M54n44L37k2m24K89P1l8p3J44k23L28
6055B70j9k24n1J30J83l00l8J11Lq8K19m01mK19J05M2j25n0j12p3J11j19J78J27
6079I4k9j28k4j0K21N4J2k20q6O0L7j71R8kJ0R0J54j81K5L6J12k12N8L2j64J49
$$ plain form
5910 -127 -106 -77 -88 -67 -226 14 -114 -11 90 94 80 36 -77 329 84 -102 -164 -221 1 312 -129 119 5
5933 5 51 -176 80 95 110 -219 -2 9 -3 -43 -57 47 -123 -45 -93 -77 -95 -22 109 121 -32 -64 -436 82 -242
5958 -242 117 -16 184 122 107 65 28 -140 -189 117 76 91 177 132 134 59 -39 19 19 -124 2 87 -190 -63 -5 22
5984 22 -241 -238 -33 -37 -94 85 -220 -29 84 -98 4 -177 -6 23 -32 -125 46 -46 -153 -274 44 -56 -202
6007 -202 -117 -173 -119 -224 171 139 10 -71 150 58 -120 -213 241 -197 -163 167 -155 179 285 212 28 -48 -81 -18
6031 -18 79 231 -17 -133 -38 55 8 10 -218 274 -7 -29 425 -119 218 196 -228 61 132 94 21 165 -58 270
6055 270 251 27 -24 106 289 -11 -49 62 65 -23 196 -205 -209 10 115 157 32 -18 -130 -203 -92 -211 -33 94
6079 94 65 -63 -87 -97 124 178 190 -30 -116 -56 -19 -190 -92 -94 -84 6 160 -21 4 40 152 -60 -2 30 -134 15
6105A5M9k49O8J71o2l8R9MJ09o2J5n5j7K7k01K70j50K83k59J6j10l6J45p2n7m0
6131a37J25k08L43k90r3K88k20J29M27m00rnM2K0P6l44O1L20J53k41rJ11oj2n
6156A16j90j17J24o8N3Q4j66J63k23J69j42K95j39R5O1j07Q2j30J83k06K03K1
6178A61K1k08o7K12o9j02k9L1K37k73o5O9L3J19r6O5J33k36K1R1O9j88RJ73m8
6203F3k31RL05n3j35N1p3J45j23j77L15n7k66L19j09O5qJ06l14M7J84j03n2J47
6227E5j15O8k38J28K46j15j35K57j09j60J38p3j76J89j53K32K6n2p5J47r5j88
6249a98K71o7o6J0J04k5k27L12k51j50L99O1j49J5j04PJ61j22j12K66j19j18K8
6272g4l3R3P4k6P3j35J66O7m12K50n5J00m55L29pn1L2K31j09m7p9l0K60p0j65
$$ plain form
6105 15 64 -185 -117 54 -8 -46 53 57 166 104 119 64 47 74 -127 143 -7 276 17 33 -77 -113 32 -40 -97 -137
6131 -137 -12 -220 123 -167 -260 28 -192 -63 364 -36 -45 -50 -8 12 88 -256 -195 125 278 37 28 139 133 121 116
6156 116 -74 -191 -67 -135 -82 2 -164 -1 -224 -55 -197 98 -41 54 115 8 90 -40 143 -63 140 161
6178 161 182 -26 -93 119 50 -52 -81 -50 187 -86 -151 -82 -49 70 -26 39 172 -64 -43 48 117 -71 -62 111 63
6203 63 -168 -159 146 93 -42 9 -64 81 -42 -219 96 39 -227 92 -17 48 40 146 -168 -121 63 -40 -92 55
6227 55 -60 8 -230 -102 144 29 -106 151 42 -118 20 -53 -229 -40 -193 39 65 13 -62 85 -10 -198
6249 -198 73 6 -60 -50 54 29 -198 114 -137 -287 112 173 24 39 -65 -58 103 -19 -131 135 16 -102 -74
6272 -74 -107 -14 60 34 107 -28 138 205 -207 43 -12 88 -367 -38 -45 -96 -64 167 58 11 -68 -98 162 92 -73
6297g3K27j74O0o0J32r9l18K13N9j06N2K7J56k19J00R3q0p2J42L1j69J01j57j83
6321c17N10k10J3K9O3j76K62o0q4K1K57k19j13l56K61j73J78N5n2J42k07N3n1
6344a74J98j46o2K29J22k7J42k55j1K2J9K2j26k05J16R7pM0J6MJ53k47K61l89
6368b08K14j14k79M35J16l59L66M0k4r8p5N3j87J24K47m21m7K58m08M67ko4J95
6391B29m75L79k21J79k36N3J17j26J60r1j32j03K21J62j04k16J56R6J01Lj28K
6413B6j59J5J86j46P9P5j63K63l46K72J27n0l06N0N2j77q1N02k65L90k08j32j99
6436a95J86J33J2P0m55J30K7J39n9pN2j00N6K53k41K28r3O6m0J20k36q4j58K58
6460F2jJ59j83PK53m41J37N5j76K37k07K68Qj46L9l1n3p1j16J50r7M4Q2Q2l1j27
$$ plain form
6297 -73 154 -20 40 -20 112 13 -305 -92 -33 -139 -87 -60 96 -123 -23 70 -10 -82 60 91 -78 23 -134 -317
6321 -317 193 -17 -4 25 88 -88 174 114 30 51 308 89 -24 -380 -119 -292 -114 -59 -111 31 -176 -123 -174
6344 -174 24 -122 -184 45 167 140 282 27 16 38 57 79 -47 -252 -136 -39 -46 -6 10 14 167 -80 181 -208
6368 -208 6 -108 -387 48 164 -195 171 211 187 89 14 67 -120 4 251 -170 -217 41 -367 100 98 34 229
6391 229 -246 133 -88 91 -145 -92 25 -101 59 -32 -164 -267 -46 116 12 -204 -48 48 149 152 24 26
6413 26 -133 -118 68 -78 1 76 -87 176 -170 102 229 179 -127 -77 -25 -202 -283 219 -46 344 136 4 -195
6436 -195 -9 124 136 206 -249 -119 -92 47 -12 -19 33 -67 -11 242 1 229 136 202 162 282 46 -38 -196 62
6460 62 61 220 37 44 297 -144 -7 48 -128 109 -98 170 178 32 71 40 -13 -84 -200 -50 -147 -103 -21 61 30 -97
6486i7Q8J07k64K48p6r3J38j65L4n6J99Q2j88K13j21j34J52l55L93J4l31K44O4
6509I6j11j52K59j23O0qL7j1l3O1l03L15j09j42N8J45j03k77K99P2J46j87K66
6532B55l71K5LK33m9p5k20K54J7J26k40o5M70l73j25L5j6J98L7q6j78J99j22R1
6556B3K3j49J59j23J99k47M8N6J6k65K41j20K20k27L65O7m22K86m8k32J40oj78
6579a74R9k09L78l4k14L29j16o6p5J9p9K22r8o0j28L40j16M2k09J53k09NL26l4
6603I2k02K1K07q4k48L05O8J16l40J93j38J57m4q7r8K2K40k67N4j22o2K69J17
6626A69j41K4P0j51LJ4RK33l48M38k15J6L6k80j21K93k0j22R7m0O7k8p3J05J1
6651D6J03j79J22r9L5m6q2j86R7K8J05j16K10L29k09k37K23k77j60N89j33o1J39
$$ plain form
6486 -97 -9 98 -166 82 6 -87 51 -114 -80 -136 63 145 -43 170 49 -85 67 -288 105 119 -212 32 96
6509 96 -15 -167 92 -31 29 21 58 47 14 75 -228 87 -22 -164 -106 39 -64 -341 -42 30 176 -11 255
6532 255 -116 -91 -88 145 96 21 -199 55 72 198 -42 -107 363 -10 -135 -100 -116 82 119 33 -145 54 -68 23
6556 23 46 -103 56 -67 132 -115 -67 -11 5 -260 -19 -139 81 -146 219 286 -136 150 102 -130 10 4 -174
6579 -174 -75 -284 94 60 -154 175 59 -7 -82 -63 -142 80 -18 -78 -206 134 18 60 -149 4 -205 -200 126 92
6603 92 -110 -89 118 34 -214 91 159 275 -65 128 -10 147 103 16 -82 -60 180 -87 -33 -155 -217 52 169
6626 169 28 52 122 -29 -26 -12 -3 230 -118 320 105 121 157 -123 -244 49 29 -93 4 -36 31 3 -70 35 46
6651 46 149 -30 92 -7 28 -18 -100 -286 -189 -161 -56 -172 38 367 158 -79 144 -133 -293 296 163 102 241
6674B41m63R1P2L37q0j60j91K06n3J97L4l58J23N5J40j32N2k85O5Q8P4k92J28
6697a11P7j31K91Ll01L00j44N5rK8J2j05j51J06K9J26j70P5j80N23k99P5q1j42
6721a24J80o9p7M5P9J82L2l93N7K86j91R7j53mJ04j66M19j82j55j71M64j69j41
6744e0j0J6q4O0o6K25M2k92J83j07K4P6M8j83J20Oj9N4K4Jj43O8j03q9J79j0J04
6771G4N9k01N3K0l9j9K00k76Q9J50o8l8M3j74L60m38K8N6R6L78m94PQ7N7j46J33
6797cK80j49k37Q6R1J34l95q3L29l6N7k29K64j69J24J02n18M01nj52k6J18j27
6820a43K15l5k34K24j15K90k86j00L00k79L92n59M32k66M4Q7k37J58J43k47J45
6841g1N7m0J0K78l79J10m0rq6L22j72J5K7P3j76j19J85K55k88J43k28K73k12k2
$$ plain form
6674 241 -222 -131 -59 278 198 38 -153 53 0 197 231 -127 -4 51 191 59 111 -174 -109 -21 53 -239 -111
6697 -111 -34 -165 126 129 -172 128 -16 39 30 58 70 -35 -186 -80 -51 75 -95 -20 -200 323 24 99 18 -124
6721 -124 56 -13 -90 -45 34 216 248 -145 -88 198 7 104 -49 -53 51 -115 304 122 -33 -204 260 91 -50
6744 -50 -60 -44 -128 -68 -134 91 133 -159 24 -83 -59 17 65 -118 2 8 -11 43 67 68 -75 -7 -110 -199 -20 -30 74
6771 74 133 -68 -15 5 -34 -53 147 -129 -40 110 42 4 47 -127 233 -205 -177 -121 -25 353 -141 -134 -47 10 -136 -3
6797 -3 277 128 -109 -23 68 202 -193 -276 53 17 74 -155 109 -60 64 166 -352 49 44 -108 -134 -16 -143
6820 -143 72 37 -197 27 -88 202 -84 -184 116 -163 229 -330 102 -164 -120 -33 -270 -112 31 -216 -71
6841 -71 -14 -54 -44 234 -145 -35 -75 -84 -170 152 -20 -5 22 95 -81 -200 -15 240 -48 95 -133 140 -72 -94
6865i4J70j42k7K9K25j98J98j40J04J32J26n74k3J67J80j58J18n2k49N0J52K6
6887B0J12j80p1O6R8p2N9J4j12J20j80j48L89k97O0J69k55K05l9M1n0P8J1j04
6911f6Q3p3J38j27K60j96k64M83m18K04k26L94l80K68k48J60r4J88J64m75J95
6932c0L61k93j43J44j39J14j15K3p0N6%M00k93n6J13j42J43j06J11o9N1J61k35
6955a4j39K5K23M4J9j08M9k22K90l34P2J05J00p5m7r2P8R3n0j39O5j0L6J33Lk46
6981a41K86j74l5qL56j70K5r4J68l43J92j42K27K7l72O79n69j53L33%r1KJ9P4
7005I6l5k35qj19J93K61m26K80j57J60J8M6O9r9K7j36K7J24k85j9K17k00J61J93
7029A53k07l7K6J00o9KJ85k52m0J88J2j15%j15M2J89j60J51j44q3K53k48K34j12
$$ plain form
6865 -94 76 -66 -93 -64 161 -37 161 21 125 257 383 -191 -214 -47 133 -25 93 41 -208 -158 -6 20
6887 20 132 -48 -119 -53 45 -27 32 46 -66 54 -126 -274 115 -182 -122 47 -208 -3 -42 -1 -51 27 38 -66
6911 -66 17 -56 82 -45 215 19 -245 238 -180 24 -202 192 -188 80 -168 -8 -102 86 250 -225 -30
6932 -30 331 38 -105 39 -100 14 -101 -78 -148 -92 -92 308 15 -41 72 -70 73 -33 78 9 60 221 -14
6955 -14 -153 -128 95 139 158 50 99 -123 167 -167 -95 10 110 35 -12 -104 -26 67 17 -122 -57 -67 -31 102 105 -141
6981 -141 145 -29 -64 -72 284 114 139 45 213 -130 62 -80 147 174 -198 481 -88 -241 92 92 1 3 22 96
7005 96 61 -174 -182 -301 -108 153 -273 7 -150 10 28 74 143 44 71 -65 -38 86 -199 -218 -1 -201 -40 153
7029 153 -54 -91 -65 35 -34 -32 153 -99 -139 49 61 -54 -54 -169 -127 62 -98 53 -91 -174 79 -169 65 -47
7053d7j10K21m19L96J47o4j89J37Mj68J8L14l29j89N81j40j55p2J9j09L84k11
7075A9J85k5l24J90J12O6m27L44k28k14J39K98O0l04K31r8k4O7k06J07J04r9J44
7098A17m20K16L11m32J86o6Q9l6m7R2N6l1R7m84K88R3J7K7j04K6J33j26J81j76
7122GM9k6K37k52k50M77j41k50N4R3R0j89Q8R6j73J58m5R7k14J68r0J34J91l16
7146gk2J03K2j03qJL5r9J69j64Q9l3j51M8J29R5j66P9j33J17j47J38kL57m73q1
7172b07M72j21n8j57K21p8R0k62p5J4K85N0l48J81pR2N7L3P9k96j6Q4Q1K3o7j45
7198g5j61K21NN2j55j36K86m7J35m07L56k69K73J52l86J70n2K81j55Q8j45j80
7220a49K04j15J84N5j99l7R0J57l6k02q7k7K62J00j7p3l10K15J32k71P8R8P0k58
$$ plain form
7053 -47 -157 64 -355 41 188 124 -65 72 76 -92 -74 240 -89 -278 303 163 8 -64 -45 -154 230 19
7075 19 204 179 -145 45 157 223 -204 140 -88 -302 -163 135 195 -109 122 24 0 67 -139 -32 72 -27 117
7098 117 -303 -87 224 -208 -22 -88 1 -35 -82 10 66 35 132 -352 -64 29 46 73 -31 -5 128 2 183 7
7122 7 56 30 267 15 -235 242 101 -149 -95 -2 88 -101 -13 83 -90 68 23 120 -94 74 -16 118 309 -7
7146 -7 -29 74 96 -7 -15 -14 21 -78 91 -73 16 -17 -168 -120 9 104 -62 17 -116 1 -146 -8 -10 347 -126 -207
7172 -207 265 144 86 -71 150 72 162 -100 -175 -161 124 174 -174 7 0 92 149 182 261 -35 -51 33 114 137 70 -75
7198 -75 -236 -15 -10 42 -113 -249 37 -10 125 -282 74 -195 78 230 -156 14 -38 243 88 176 31 -149
7220 -149 55 -60 124 179 -20 -57 33 190 154 -48 -135 -162 100 200 183 110 -200 15 147 -124 -46 52 122 -136
7244a36J02j14J0l3L62k04k36K99j1L2O6k95j11K84j89J84P5k7l8Q3p7q1N7k72
7268b70N77k71q6j03J63OR9k92J45j20K38q6o1P0J15k08j30K81r0J38j04Q4q6
7291IJ21k2j61j51K90q5R0k3k2j07MJ92j41J87l83O9J71o6K62k26r2R6K9l53L52
7316D0j04J06j83J1L28j44j29J15J38k8P8l6k02N6j46J65k57K97O9j18j24J31
7338F3N5k1N5j80lJ22J67j20j64R3J48j79j85L44j07R9m39J47J35J56k69L81j35
7361A63j91J13j56K97k39P9j17J02Kj2j0m2J18k08O4p6J20N4j45J58K6j4J10j46
7385E0M4R3m39O35n49P1K57k24p0QJ28j76L31n0L0k18lJ63M4k65M4J92k09M1l5
7410a07N2L2m0o2L5K92l64J36j31k02K45J89j72J54J87q7j83j22j13J24R0jJ41
$$ plain form
7244 -136 -34 -148 -138 -171 191 -13 -249 50 39 71 137 -158 -269 15 -174 10 85 58 20 103 26 -55 2 -270
7268 -270 307 36 -50 -153 10 16 115 -177 -32 -152 86 0 -61 9 124 -84 -214 67 -23 115 11 95 9
7291 9 130 108 -53 -204 86 1 91 68 46 -61 -57 135 -6 181 -202 -133 38 -28 234 8 -84 12 41 -312 40
7316 40 -64 42 -141 -130 198 54 -75 40 178 150 228 192 -10 46 -100 65 -192 105 174 56 -68 63
7338 63 118 97 152 -28 -31 91 258 138 -26 67 215 36 -149 195 88 187 -252 -105 30 186 -83 298 163
7361 163 -28 85 -71 226 -13 66 -51 51 53 41 31 -11 107 -101 -37 -113 7 61 -84 74 100 86 196 50
7385 50 94 187 -252 383 -166 -95 162 -62 -132 -124 4 -172 159 109 139 -79 -82 81 125 -140 -96 96 -113 -72 -107
7410 -107 -55 -23 -63 -125 -90 202 -162 -26 -157 -359 -114 75 -97 57 244 157 -26 -148 -261 -137 -47 -48 93
7433I3n8K04k84%M46m78K36l6k47L3K61k02N2J06l28L23r5j13J57j52L70l09K5
7456DK2k36M30k03J31j83k03P4K16J2r0J4J09l62K90K18k74L75k58n0j89J1K27
7479H5p1j18M1J20r4Mo1k3J34Q3k9J5m8l5l5J36O8j54j12L60l38L11k38q2N4J83
7505A56j95N2J09J35m65L01j29O9k19L33p9j12K07k62J51j81L2k7K49l14J94J78
7527A83j85j00k9J52R0j82k00M68j38MJ58j96J5j95O5R5n4J03j04N5j40M04Rj97
7551H1j72J45k48K87n1K5M1k76K40j10j36K87j25o0q6L65l39N5L20j62j03P9k23
7574a66L38m24M0K68j12P4j06J51m2mk8n5p8p5L19j31j6j2k7k8K23r9o5k3R4j32
7600a16J42L1L1k67l2L04j99J62k29J51j1o8N1Q9j20K06l48M7K98k92K34J9L8
$$ plain form
7433 93 35 239 -45 -45 401 -77 159 123 -124 -91 170 -32 20 126 -202 121 26 -87 70 -82 288 -21 4
7456 4 26 -210 220 17 148 -35 -238 -164 52 64 -26 -12 97 -265 25 243 -31 344 86 36 -153 -142 85
7479 85 14 -104 -63 57 -37 -33 -94 -117 17 100 71 86 38 3 -32 104 172 18 -94 266 -72 239 1 -81 -27 156
7505 156 -39 13 122 257 -208 93 -36 33 -186 147 68 -44 163 -99 52 -129 -97 -124 125 -189 5 183
7527 183 -2 -102 -131 21 111 -71 -271 197 59 63 221 25 40 -155 -90 5 -49 54 -50 5 -135 269 278 81
7551 81 -91 54 -194 93 42 67 108 -168 72 -38 -174 113 -12 -72 -158 207 -132 -77 243 81 -22 57 -166
7574 -166 172 -252 -212 56 -56 18 -88 63 21 17 -11 -66 -144 -219 100 -31 -47 -59 -86 -114 109 10 -55 -78 16 -116
7600 -116 26 57 88 -179 -211 93 -106 56 -173 -22 -33 -101 -50 39 -81 125 -223 -176 122 -170 64 83 121
7623A21r9p8Q9J73r8k5j41N2l9j40J53K5o5l9J99n6N0l0Q4j49L8J37M4mK5j69
7649E8k20K15p6p4O0J5Q0q9j17J7J11k9P1j64j12M2K63R6l58M17k92J8J10J38
7673A80k51l6K10q7o5O6K53m03J34P1Q3m91K60Rj11K73j35P9r0K74l20L3L50k34
7697E2R7o1j38r5J83J28l85J44J39m3J63l55J98r6j9R2j9O7j11j14L22j90J14
7720G3j30K83J16l63K91j71j23J98l77K80k17K20k50J00K35n7k40J69L9r4j57
7741a75J50KR7J30j77n3k9K0j17K60k06K96l20N8L4n0N5K08j70K54m75K28j33
7764a13K47r1N3N4k89Q4n7J04J19Rj40R7k71K54K44n11K62k32J5J19J46K2pk19
7788a01J01Ll2j9J0J09P6j39J32O3J1j60K65l18o4J07j51J10P4k23P2K02l0k80
$$ plain form
7623 121 22 -56 33 206 108 83 -58 -6 -45 -185 -32 -7 -72 -111 88 32 82 52 136 -13 25 162 206 202 227 58
7649 58 -162 53 -23 -97 -37 -22 58 -31 -148 -131 -20 -49 22 -142 -254 -212 51 147 -211 206 -86 -68 42 180
7673 180 -71 -107 103 16 -49 17 270 -133 1 72 155 -336 -76 -67 -178 95 -40 39 -51 223 -97 -64 286 52
7697 52 149 88 -50 -145 38 166 -219 -75 64 21 184 -171 27 -69 -88 4 -15 52 -59 -173 149 -41 73
7720 73 -57 226 342 -21 270 99 -24 174 -203 77 -140 80 -170 -70 165 108 -132 37 76 -18 -175
7741 -175 -25 -23 74 204 27 -26 -55 -35 -152 108 -98 198 -122 -64 -30 -80 -25 183 13 267 -208 20 -113
7764 -113 134 43 96 150 -139 -55 -112 -8 111 120 -20 77 -194 60 304 -207 55 -177 -162 -43 103 125 118 -101
7788 -101 0 3 -29 -48 -38 71 147 8 140 203 214 54 319 1 -63 44 -107 3 77 -146 -74 128 98 -182
7812a82M4O3J71m9N9q8n2K10q6q7j54M58k40l3P1k6Q2k94K92P6k39QR1j28L20
7837B87k25j77J79j69m3L37j86j2J18Nj69k9j15M86P1l90k57J03N23l85K9Nj34
7860a48K25l0j31J71m8Q8N7l23j7R6M18m21k2J13n9J64j23k2j45k4QJ86l5P0O2
7885A10J14j90k55K13n4P7P3J2j17M9m2j19j2J15L8k5p7p4J30q4K56N9j83o6J65
7910A13o2M7j81Lj33K03L6J2m9r9J87r3K3R1l53J14L39o7q3Kj6l05M45j58k74
7935b58K62J05k67J99l4k14p6K61P5j35P2K63k26q9m3J42J19j51p7oK74l83L22
7958A35j16K3q6J50J99l88J72j72J21j67K33m41M17J06j53L4p5o0MJ32P0k51K55
7981A42q7p5K72Pk76N6q0K5j67J63k0k11O31o8l31j76J44O2Q9j07j24J65l5Nj70
$$ plain form
7812 -182 -138 -75 96 47 106 18 -34 176 90 3 -151 307 67 34 105 79 161 -133 159 235 -4 4 95 -33 287
7837 287 62 -115 64 -105 -148 189 3 -9 109 114 -55 -84 -199 287 358 -32 -289 -186 337 -48 -19 -14 -148
7860 -148 77 47 -84 87 39 127 184 -139 -156 -60 358 -63 -85 28 -31 133 10 -12 -157 -181 -173 13 -22 48 110
7885 110 224 34 -221 -8 -62 15 88 100 -17 32 -10 -129 -141 -26 12 -13 -90 -164 -34 -118 138 197 14 -52 113
7910 113 51 98 -83 -80 -213 -10 26 38 -11 -110 77 -16 7 98 -255 -141 198 131 48 50 34 -271 174 16 -258
7935 -258 4 109 -158 41 7 -207 -283 -22 53 -82 -10 253 27 -62 -105 37 156 5 -72 -78 196 -187 135
7958 135 19 42 -44 106 305 -83 89 -83 38 -129 104 -337 80 186 33 67 -8 -68 -64 68 138 -113 142
7981 142 55 -20 252 259 -17 39 -41 -16 -183 -20 -40 -251 380 312 -19 -195 -51 11 100 -7 -131 34 -1 4 -166
8006a66J8L1J48R6j70R1p6J35l4k6Km3q7K56k77J74L2k7j59J1j41J39J69K32m96
8031a68J1L14k16K9j93K58m1q3o0K64n0j33K4j27K41o6J51P1j78p9J23Q4k83J00
8055gJ14l09K22L4j98K21J09j85j43J84k58K54j3j97L61J0k53Q1o7O7j05J78L4
8078A34k18K81m47J13l5k9L14O5k93j8K95l7O6n6k63L63k96j4J63j55K03j91K55
8101B00r7L6k07j65J98L08j85m8l7J98m1K8j32j34K26N9k74L10l9j56m3K00j26
8124G9j26J08k15R7P8M2j73j61K99K16j92q1M5j39K05jl9J78j27l3O7l23J68j27
8148a55K32m1j46J94m19L34j59J61k61K26k8J10Q7j70M8L9J42j45Q6k85L19Rj92
8171a4j29k6K82nj4j60j09K67O4j82J46j57Q8K8k69r9L14k87J16K69
$$ plain form
8006 -166 -148 -117 31 127 -43 48 -28 107 73 47 49 6 -81 175 -102 72 104 77 -82 -71 -212 -73 96 328 -168
8031 -168 -157 157 -59 -30 -223 35 -6 -89 -149 115 65 -68 -44 -171 70 4 155 226 48 -31 92 176 -107 -7
8055 -7 107 -202 20 54 -144 77 186 1 -142 42 -216 38 25 -172 189 199 -54 27 -40 27 -78 100 134
8078 134 -84 197 -250 -137 -172 -201 113 178 -115 -133 162 125 191 135 -128 235 -61 -75 88 -67 136 -55 200
8101 200 103 139 -68 -233 -35 273 88 40 3 201 160 188 56 -78 148 207 -67 243 204 48 5 205 79
8124 79 -47 61 -154 -57 21 63 -110 -271 28 244 52 -29 16 -123 82 81 42 220 93 60 127 -196 -28 -155
8148 -155 77 36 -110 84 -335 -1 -160 1 -260 -34 -62 48 135 -35 13 52 194 49 135 -150 169 178 -14
8171 -14 -143 -169 113 108 94 -66 -175 92 156 -26 120 -37 51 79 -190 -289 25 -262 -146 123
8191A23
$$ Imaginary data points
##PAGE= N=2
##DATA TABLE= (X++(I..I)), XYDATA
0@%%%%%%%%%%Qj6J6j6K4l2L2m0N3o2P3r0J06j25J48j73K03k34K67l07L53l99M53
33B42n15N81o53P33q22R19j022J138j266J404j554J719j900K095k309K545k804
50a469L087l404L754m143M578n068N628o271P017p900Q963j0268J1913j4067J7024
65I374k1341K8262m1143P3065k99759n00889N54231M38091j60279j34908M68109
76D12813L11864l91723n07092K00783M85887k4740l21473J99622M33341k20877
86E78405o64862p8268M39077M1354l87311J1744M05322l3807n88509k93451L05523
97b64783K09244k83522j69967L48295K28413m21045m19213K51079L90410j46521
107b77610k25460L05338L71573k11250m02652J08967M18211N2892k43632J05021
$$ plain form
0 0 0 0 0 0 0 0 0 0 0 0 8 -8 8 -8 16 -16 16 -24 29 -33 40 -50 56 -69 79 -94 109 -125 142 -165 188 -211 242
33 242 -273 308 -345 388 -434 485 -537 601 -665 739 -815 904 -996 1099 -1210 1335 -1469
50 -1469 1618 -1786 1968 -2175 2403 -2665 2963 -3308 3709 -4191 4772 -5496 6417 -7650 9374
65 9374 -11967 16295 -24848 48217 -251542 -752431 -198200 239891 79612 -55296 412813
76 412813 724677 332954 -174138 26645 512532 487792 166319 365941 799282 578405
86 578405 -86457 -164725 274352 315706 -71605 -59861 345461 311654 -276855 -570306 -264783
97 -264783 -55539 -339061 -509028 -160733 67680 -353365 -772578 -521499 -131089 -277610
107 -277610 -503070 -197732 173841 -37409 -440061 -331094 87117 140009 -103623 1398
117A398M22612J3013m42107r9687M06520J56535k91148m9505L68726J03523l89874
128B00006k43213K47727K24433k02354k10960K04294K07077k90375l91763J12033
138a43095L10120j07963k85925J07627K58393j70562l88986K451L05132M2947
148f9861k28551p81K69271K3904l33960j37007K90228J94234j84243p8344K82510
159B7400J42485k69737j93467K19226K46010p6475j14874J79717K11338j50639
169B20984k85261P2574K91740O26j98306P9182K36481j01763l33417m4199K30321
180A68962M2511j88946k5897J92773P801k96766j80318J61606J29854j63687j11198
191b63305J88904J16334k37571k20941J25698J75251q6028j06780J51154J83621
$$ plain form
117 1398 424010 437023 -5084 -104771 301749 458284 167136 117631 486357 589880 200006
128 200006 -43207 204520 428953 226599 15639 219933 427010 136635 -255128 -143095
138 -143095 167025 59062 -226863 -119236 139157 -31405 -420391 -417940 -112808 -69861
148 -69861 -298412 -299193 -29922 -6018 -339978 -476985 -186757 7477 -176766 -255110 27400
159 27400 169885 -99852 -293319 -74093 171917 95442 -19432 160285 371623 220984
169 220984 -64277 8297 300037 300663 102357 181539 418020 316257 -17160 -61359 168962
180 168962 211473 22527 -3370 189403 197204 -99562 -279880 -118274 11580 -152107 -263305
191 -263305 -74401 41933 -195638 -416579 -290881 -115630 -201658 -308438 -157284 26337
201B6337r9979k11616M8860K29035L3674j23439Q8688K46087j0030k31785j4910
212a9078K17668N8474j32252J7067J98175M1519k03422j25512J23024R4762j35250
223A35175j03530J45462J05528j96283k09356P4325J12309j25431j43634R6572
233a08863J29991j18183k06684J3162J48076k1266j44869M1879J97717J329j96025
244b63736j6854J98866N5934j31462J7915K10534P1010j45580n7650J54161J06377
255A99515r5862o7024J51659J35617j19516j48699R7446J36768j01057j42031
265D6816Q8791J31117j04819j83048K1015J24433m7080j64365m056J38320k4121
276B3003k03182n0777J57205L2670j66925l9275J65705M5363j67857p1617J49673
$$ plain form
201 26337 -73642 -285258 -236398 -7363 26311 -97128 -8440 237647 227617 -4168 -19078
212 -19078 198590 257064 124812 141879 340054 381573 178151 52639 175663 270425 135175
223 135175 31645 177107 282635 86352 -123004 -48679 63630 -61801 -205435 -108863
233 -108863 21128 -97055 -303739 -290577 -142501 -163767 -308636 -266757 -69040 -67711 -263736
244 -263736 -280590 -81724 -25790 -157252 -139337 71197 142207 -3373 -61023 93138 199515
255 199515 103653 36629 188288 323905 204389 55690 153136 289904 188847 46816
265 46816 135607 266724 161905 -21143 -128 124305 77225 -87140 -91196 47124 23003
276 23003 -180179 -230956 -73751 -41081 -208006 -247281 -81576 -36213 -204070 -275687 -126014
287a26014J00561j03023p4292J36153J31000r8834j28930J10625J75391n3896
297F8741j25747J02096J72249o8296j66937N1617J72988p251j36499J8216J55548
308B36725k557j87427o0432J51246N4225j58335o5512J51658N1285j89984j22677
319a41785J13159Q2959j25008j04699J04660J08746j13083j65521N1172J42888
329d6512n3985j44852O9792J80291l9787j77052K0839J71405Q896j30473K6910
340a14528J87364N0474j42564m9585J53809Q6517j22824n9877J72488J21499j32014
351A50759j17894J15512J05638j21243j24923R7767J31023q3950j60175K6667
361A9181J18986o7023j84463M900J55169k0808j85288k3562J44180o694j75703
$$ plain form
287 -126014 -25453 -128476 -202768 -66615 64385 -34449 -163379 -52754 122637 68741
297 68741 -57006 45090 217339 149043 -17894 33723 206711 199460 62961 81177 236725
308 236725 234168 46741 -13691 137555 191780 33445 -32067 119591 170876 -19108 -141785
319 -141785 -28626 54333 -70675 -175374 -70714 38032 -75051 -240572 -189400 -46512
329 -46512 -100497 -245349 -175557 4734 -35053 -212105 -191266 -19861 -10965 -141438 -114528
340 -114528 72836 123310 -19254 -68839 84970 171487 48663 -11214 161274 282773 150759
351 150759 32865 148377 254015 132772 7849 105616 236639 152689 -7486 19181
361 19181 138167 71144 -113319 -108419 46750 25942 -159346 -182908 -38728 -45422 -221125
372b21125l6757J49372N1178j30890n5999J35764Q8764j14511q9082J32805J40067
383D9586p7522r3899J26732J51702p2782j20412Q6895J50565l8047j18765N3431
394I7484J52649j5473j54788j5418J36692M710j64676l5907J48154K5885j71566
405G746p6373J12131L2580j53115r0177J06033Q0737j14285j19422P5617J04192
416c4336r2890j32988Q0772J51418m9840j28153O2534J49238k8942j25600M0405
427a08382J61772K4371j12414p28J46601M3055j29429m1790J46753P4648j19485
438H4972o3165J26846P4384j23592r7075R0056Q6631r0917j11052O0720J04514
449A42322p3252j47081K3979J17680m9467j52366J6704J35102k1600j46965p205
$$ plain form
372 -221125 -257882 -108510 -57332 -188222 -244221 -108457 -19693 -134204 -223286 -90481 49586
383 49586 -27936 -121835 4897 156599 83817 -36595 50300 200865 162818 44053 97484
394 97484 250133 234660 79872 64454 201146 205856 41180 5273 153427 179312 7746
405 7746 -68627 43504 76084 -77031 -167208 -61175 19562 -94723 -214145 -138528 -34336
416 -34336 -127226 -260214 -179442 -28024 -77864 -206017 -143483 5755 -23187 -148787 -108382
427 -108382 53390 77761 -34653 -35381 111220 154275 24846 -16944 129809 204457 84972
438 84972 21807 148653 223037 99445 2370 92426 179057 88140 -22912 37808 142322
449 142322 69070 -78011 -54032 63648 14181 -138185 -121481 13621 -7979 -154944 -162149
460a62149J25439Q849j28432k8727J28679N6821j10462n8379J20351Q2840j05517
471g0687p8842J19381J12416p8370q4044R5756J10967o4571j01845O4238J27997
482A52396k2602j07774K8948J26139j4642j38928r316J27583R951j28391k1418
493A946J15366J4594j34513o2470Q7727M3909j01147p3232Q2075P0858r9579j13177
505a67643O0631R1371p1537j00342O6737J07954n2868j09871L5007J11542q443
516c7462r0149K6995J31483K3505j04051j2613J23267M2879r4070j4505J30007
527A25286N8136r7101n4017Q7152N6338q0349o5203P4382P9480o8870j04724L1765
539D2275P5952o2198j13782K8870R1744m6921j20502P60P7606k6532j05051p805
$$ plain form
460 -162149 -36710 -27861 -156293 -185020 -56341 480 -109982 -168361 -48010 34830 -70687
471 -70687 -149529 -30148 82268 3898 -80146 15610 126577 62006 -39839 24399 152396
482 152396 129794 22020 50968 177107 162465 23537 14221 141804 151755 23364 1946
493 1946 117312 131906 -2607 -65077 22650 66559 -34588 -107820 -25745 45113 -54466 -167643
505 -167643 -107012 -15641 -87178 -187520 -120783 -12829 -65697 -175568 -140561 -29019 -37462
516 -37462 -127611 -100616 30867 54372 -49679 -62292 60975 103854 9784 -4721 125286
527 125286 183422 86321 32304 119456 175794 95445 30242 104624 184104 115234 10510 42275
539 42275 118227 56029 -57753 -28883 62861 15940 -104562 -103802 -26196 -52728 -157779 -165584
551a65584R2247J7360r2314l0686R0705M1201q2915l2027J08838P1856o6416m0494
563h8229Q8599P1325n3155m8210P5177Q9165l2299o7817M3038Q8281k8051q9605
575D8219K4101R3067k1677j00976K219Q0272j7590j02899j9823O7961j286r5357
587d3769m1733O3044K5004q6281n5605O7379M6755p6993n9801O7343O1557n5235
599h8335n2236O0474O9738l5658o0438M0742Q5817o573o2154K8621R1180l988
611F7190p9622J1704R3726J1873o8877L641Q0210R714p9573k9209O2532K9549
623A12858o4404l9972N9792M0537p5208p2220M4025M8373o0947o0714N1184N6722
635D0026n5652p9333J8922N5823k7197o5865K1098P8226q873q6096o145P8071
$$ plain form
551 -165584 -73337 -55977 -148291 -178977 -88272 -47071 -129986 -162013 -53175 18681 -47735 -88229
563 -88229 370 71695 18540 -29670 45507 134672 102373 34556 77594 165875 137824 48219
575 48219 72320 165387 143710 42734 44953 125225 107635 4736 -15087 52874 51588 -43769
587 -43769 -85502 -22458 2546 -83735 -139340 -71961 -25206 -102199 -162000 -94657 -33100 -88335
599 -88335 -140571 -80097 -10359 -46017 -106455 -65713 20104 13531 -48623 -20002 71178 67190
611 67190 -12432 -728 92998 104871 35994 39635 119845 129559 49986 20777 83309 112858
623 112858 48454 8482 68274 108811 33603 -38617 5408 53781 -7166 -67880 -16696 40026
635 40026 -15626 -94959 -76037 -20214 -47411 -113276 -92178 -13952 -22825 -108921 -115066 -36995
647c6995N330p1929Q750R6238K3649o8725j7002P0638L0849n4012j9006P9520
659D7305O2727m7754n0618N2274N5524n3907n7871N9429P5003l9956p1898K5637
671E5895N3973m1565p9697J2029O8918j3267q6570j5461O3507r425r8153k4722
683a14538P8856J7294q4368k8083P1697K4599p5414l8131P0914N9619m6174m5871
695a09600O4041P5637m2146o4593N7898R3173k5906o5976M7269R1061j7385p5727
707B7746J8653Q3688k147q2607q749Q2442J5509r1310l7832P2556K1629r6683
719B895n3460O7525L6511q3165o3588N3700M8037o6410p6940L9424P2281l6458
731e9648p9598L4090R1109k2547r0131K1296J00503K473p5674J5647J00895J8746
$$ plain form
647 -36995 -31665 -103594 -94844 1394 25043 -43682 -60684 9954 40803 -13209 -32215 47305
659 47305 110032 62278 11660 63934 119458 65551 7680 67109 142112 102156 30258 55895
671 55895 109868 68303 -11394 635 69553 56286 -30284 -45745 17762 8337 -89816 -114538
683 -114538 -35682 -18388 -102756 -130839 -59142 -34543 -109957 -148088 -77174 -17555 -63729 -109600
695 -109600 -45559 30078 -12068 -76661 -18763 74410 48504 -17472 29797 120858 103473 27746
707 27746 46399 130087 127940 45333 36584 119026 134535 43225 5393 77949 99578 2895
719 2895 -50565 16960 53471 -29694 -93282 -39582 8455 -57955 -134895 -95471 -23190 -59648
731 -59648 -139246 -105156 -14047 -36594 -126725 -105429 -4926 -2453 -78127 -62480 38415 57161
743E7161p9477j7400R0379M5697o7638l3010Q8855N8390p6876o5346O6214O3385
755A30334o4972o9583N6823P2564n3040r1421J8079O8969l2094r3658R016Q8934
767C9951q378j03999j8464Q1786N098r4271j9168R0581L2893q0231m0922O9693
779d5431M7652o2755n0772P0966P9165m5580o8631N2854Q1499l9700p4886M5877
791i742R4068j4454p5405J7360Q2286m954q3455n222Q8810K2321q3428k9706P8122
804G6601K6585q9002m6761P1519M2637p3375n8049N3109M8713o1901p4013L5754
816d8183O6540l8392q0395K3749P7741k5172q6760J1912Q3687l332p5141L667
828i0079Q2149J6504o7772j5133P7407M0687n7351l0172P4256N6607n2990m5368
$$ plain form
743 57161 -22316 -39716 50663 96360 28722 -4288 84567 142957 66081 735 66949 130334
755 130334 65362 -4221 52602 125166 72126 -19295 -1216 67753 35659 -57999 -48983 39951
767 39951 31573 -72426 -90890 -9104 -4006 -98277 -117445 -26864 6029 -74202 -115124 -45431
779 -45431 2221 -60534 -111306 -40340 38825 -6755 -75386 -22532 58967 19267 -55619 -9742
791 -9742 84326 69872 -5533 11827 94113 89159 5704 482 89292 111613 28185 -1521 76601
804 76601 103186 14184 -32577 38942 81579 8204 -49845 3264 51977 -9924 -83937 -48183
816 -48183 18357 -20035 -100430 -76681 1060 -24112 -110872 -98960 -15273 -18605 -93746 -90079
828 -90079 -7930 8574 -59198 -74331 3076 43763 -13588 -43760 30496 87103 34113 -11255
840a1255O2267N9481m7414n4890M6922O2906l3628o4414K0962O0641k3659p8081
852a62J96O4814q847q2163j4074O2985k060q2320k5211N9148J5027o5693l1264
865a09624N4110L2824n4045m3900M8581N4987l4714m3991M9912O5590k8068n1885
877f0223L7727O8186j0924m5081K6321O6969j81n4804m67N9735J0895n6755j1570
890B9828O0051J5590o4052l0981M3652J5317n7199l5082L8269K6254m7190m9376
902e4919K0736L2150l6085n1089K4247N0497k2408n3770J6003M9966j3474m6670
914h4816J5944N7849N485m0276J835N0567J3420m1378q254N6774K9726l7996j7379
927A501M8090K5235m2748k5906M0831L1938l1043l0585K6100L0152k9723m5778
$$ plain form
840 -11255 51012 110493 63079 8189 55111 118017 84389 19975 40937 101578 77919 -162
852 -162 34 64848 56001 -26162 -40236 22749 20689 -61631 -86842 -27694 -12667 -78360 -109624
865 -109624 -55514 -22690 -76735 -120635 -72054 -17067 -51781 -95772 -45860 19730 -8338 -60223
877 -60223 -22496 45690 34766 -10315 16006 82975 82794 27990 27523 87258 98153 41398 29828
890 29828 89879 105469 41417 10436 54088 69405 12206 -22876 15393 41647 -5543 -54919
902 -54919 -34183 -2033 -38118 -89207 -64960 -14463 -36871 -90641 -74638 -24672 -38146 -84816
914 -84816 -68872 -11023 -5538 -45814 -43979 6588 20008 -21370 -29624 27150 56876 18880 1501
927 1501 49591 74826 32078 6172 47003 78941 47898 17313 43413 73565 43842 -1936
939a936J3642L8504j9109m7994R684L9902j8425n3085R45L8916p391m3676j502
952e1525L8941L307m4164j5857L6629J6650l7322j6867M3712K7746l5806k3517
964e8073L9226K9967k7915k1496L7480L9419j7349k8614K2797L9635j2880l7218
976D979J6721M8602n782m3073P739M2706r430m8661j997M0256J366m3254j3572
989c400L2647N658m7813k8868L0918J9032m1819l1226L2184K4762m0100l6852
1001h4877K7556L2950k3686k9948K6150M1272j2558l6663J3967M8147R39l5801
1013c2552J4187N6530P130m1509J405M9022R533l8126l784M5533J9198l7793k3468
1026B5306L1770K1079m0203l5474K9880L0769l8169m4555J9550K7643l5985m7169
$$ plain form
939 -1936 11706 50210 31101 -16893 -7209 32693 14268 -38817 -37872 1044 -6347 -50023 -51525
952 -51525 -12584 -9277 -53441 -69298 -32669 -16019 -53341 -70208 -26496 1250 -34556 -58073
964 -58073 -18847 11120 -16795 -38291 -811 38608 21259 -7355 15442 55077 42197 4979
976 4979 21700 70302 64520 21447 29186 71892 62462 13801 11804 52060 53426 10172 -3400
989 -3400 29247 34905 -12908 -41776 -10858 8174 -33645 -64871 -32687 -7925 -48025 -84877
1001 -84877 -57321 -24371 -48057 -78005 -51855 -10583 -23141 -59804 -45837 2310 3249 -32552
1013 -32552 -18365 38165 45295 3786 5191 54213 63746 25620 21836 67369 86567 48774 25306
1026 25306 57076 78155 37952 2478 32358 63127 24958 -19597 -47 27596 -8389 -55558
1038e5558J5001L6333j8189m5653N007L9242p605m8993p93N0490J0272m2059k677
1051f5182N1499J5418m0976r705M8865K8253k8795j4607M2212L4262k7447l1403
1063B394L0905M1472k1589l7858K5487M2588k2955m8580J0069L7776j5942m7127
1075c360J409L8616m640n0869j5305L7170N467m9717j8414M3161J7608m5927k4380
1088f9181L7737K3089l7168k6461L6256L7062k3183l2750K6190M2288j7196l9047
1100d2364K2578N2231o470m1157J3347M8549m026m3948K247M6574Q592l9559j0353
1113F241M0246J5010m3547k5032L7410K4952l9196l0094L3071K6696l7527l8553
1125c0323K2240L1072k4687l8817J4793L6807j6197m6879L318M2328n298m5605
$$ plain form
1038 -55558 -40557 -4224 -22413 -68066 -63059 -23817 -31422 -80415 -81208 -30718 -20446 -62505 -65182
1051 -65182 -13683 1735 -39241 -48946 -81 28172 -623 -15230 26982 61244 33797 2394
1063 2394 33299 74771 53182 15324 40811 83399 60444 11864 21933 59709 43767 -3360
1075 -3360 -1951 36665 32025 -18844 -34149 3021 8488 -41229 -59643 -16482 1126 -44801 -69181
1088 -69181 -31444 -8355 -45523 -71984 -35728 1334 -21849 -54599 -28409 13879 -3317 -42364
1100 -42364 -19786 32445 25975 -15182 -1835 46714 42688 -1260 987 47561 56153 16594 6241
1113 6241 46487 61497 17950 -7082 30328 55280 16084 -14010 19061 45757 8230 -30323
1125 -30323 -8083 22989 -1698 -40515 -25722 11085 -5112 -51991 -48673 -6345 -11643 -57248
1137e7248K183M7065M157m3890o789M3479J3409l6134j0692M3081K6865l0242
1149d756k2624L6053L3828k6665k8417L4056M1514k1408l4669K2609L7183j8311
1161D8393l8825J1223L8409p149m2896l761L5604k587m8909j4232L6676O263m5317
1174b7108j8190L2745R807m0909k4152K8557K3096k6770k6310K6113L2659k0169
1186c0631l2561K2389M1574j0055k9267K1302M4670m432l2210J0263M0843M100
1198D5985l0434J423M0107J0917l5663j4258L2642J3461l7278j9919L1315J6400
1210E4698l6370k9225J9696J6509k9594l1693J4695K6254j9127l6344P574L0053
1222a2874j3165l7401Q027L8250j485l2095L738L5233M076k8634k037L6549J7535
$$ plain form
1137 -57248 -55065 -8000 -3843 -47733 -54522 -11043 2366 -33768 -44460 -1379 25486 -4756
1149 -4756 -27380 8673 42501 15836 -12581 21475 62989 41581 6912 29521 66704 48393
1161 48393 9568 20791 59200 52051 9155 5394 40998 38411 -10498 -24730 11946 18209 -27108
1174 -27108 -45298 -12553 -2746 -43655 -67807 -39250 -16154 -42924 -69234 -43121 -10462 -30631
1186 -30631 -63192 -40803 771 -9284 -38551 -17249 27421 22989 -9221 1042 41885 45985
1198 45985 15551 16974 57081 67998 32335 18077 50719 64180 26902 6983 38298 54698
1210 54698 18328 -10897 8799 25308 -4286 -35979 -21284 4970 -14157 -50501 -42927 -12874
1222 -12874 -26039 -63440 -55413 -17163 -18648 -50743 -47005 -11772 -7696 -36330 -38367 -1818 15717
1235A5717k2639r585L2370K1046k5441j7937K9975K6442k0629k0398K3179K3934
1247E6034k0260k7480J2518K4540j1974k9370N621K6712q832l7088l394K7947
1259A4974l233l4069l602K8264Q00l2577j0608K3254Q423k4885j3205K4436J8431
1272c597k1544k0241K0725K2921j7677k0160K2058K8255j0977k0299J4685K6095
1284B0244n970k1457R003K9930K326k3374N03K7305K880k7360m833K7403O698
1297D3298k5231r287K1326O260k5748j6172J5209J1840j9618k0550J1941J5638
1309H906j9965k6561R240J9462j4180k3007J0736K1876r654k2177M898K3255P12
1322a6459j8556L869K8076P439j9891k007K7318J0186j8914k055K8272J3641j7749
$$ plain form
1235 15717 -6922 -16507 15863 36909 11468 -6469 23506 49948 29319 8921 32100 56034
1247 56034 35774 8294 20812 45352 33378 4008 9629 36341 27509 -9579 -12973 14974
1259 14974 11741 -22328 -25930 2334 3134 -29443 -40051 -16797 -8374 -33259 -46464 -22028 -3597
1272 -3597 -25141 -45382 -24657 -1736 -19413 -39573 -17515 10740 -237 -20536 -5851 20244
1284 20244 14274 -7183 1820 31750 34076 10702 11205 38510 41390 14030 9197 36600 43298
1297 43298 18067 8780 30106 36366 10618 -5554 9655 21495 1877 -18673 -6732 8906
1309 8906 -11059 -37620 -28380 -8918 -23098 -46105 -35369 -13493 -23147 -45324 -40426 -17171 -16459
1322 -16459 -35015 -31146 -3070 4369 -15522 -17529 9789 19975 1061 -994 27278 40919 23170
1335B3170q027J9525J2090j6034j3678J5873J6672j4707k1671Q014J5118j6640
1347A9705k6513O019J7948j3062k5453J723J4920r738k5262k253J9594J335k0992
1360d2029m005K2115O763k2486o220K5486J3990j6334m724K5173J5279j4074r944
1373a1010K0458K0269q847j3182J6674K3028j0296k1725Q979K2530j0149k3596
1385A3133O405K1335q272k7787k727J7160l797k6136p330J9815M042k6394j3276
1398c3829J9461Q217k4634j3265K1806J5379j9208j5161J8488J7535j3648j6908
1410c5767J5565K5410n779j9409J0971K7010m107k4090O929K9393O32k3336K449
1423E871K5650K501k4519p259K3386R593k2857j2768K1872J3561k4757k0365J8704
$$ plain form
1335 23170 15143 34668 46758 30724 17046 32919 49591 34884 13213 21227 36345 19705
1347 19705 -6808 -789 17159 4097 -21356 -19633 -4713 -14451 -39713 -41966 -22372 -21037 -42029
1360 -42029 -46034 -23919 -17156 -39642 -45862 -20376 -6386 -22720 -27444 -2271 13008 -1066 -11010
1373 -11010 9448 29717 20870 7688 24362 47390 37094 15369 24348 46878 36729 13133
1385 13133 19538 40873 32601 4814 2087 19247 15450 -10686 -18016 1799 5841 -20553 -33829
1398 -33829 -14368 -6151 -30785 -44050 -22244 -6865 -26073 -41234 -22746 -5211 -18859 -35767
1410 -35767 -20202 5208 -571 -19980 -9009 18001 13894 -10196 -3267 26126 26758 3422 5871
1423 5871 31521 34022 9503 2244 25630 35223 12366 -402 21470 35031 10274 -10091 8613
1436H613J7014k1012k1167J5947J9338j7111k5901P564K1190r587k6149M102K6261
1449h98k579k9338j986K7474K031k7027k922K9202R499k3277q070K4436J4500
1462A1045j9122j2899K3274K3566j4267j9001J8797K4755j3737k2470J4686K7398
1474D2025q198k4309O639K3811n886k8795k507K3960J201k9077r488K2635L559
1487A5570l1460j5257K1737R995k5567j6024J9751J4582k0792k0200J5251K2560
1499i854j1026k0950J4743K8675o221k3948J0405L0214k24k1263P038L0236N168
1512C2993k2062k938K5438R237k1946j0235K3639J3899k3637j8694J7329J3057
1524C6080k2816k1424J4047J5990j7043k4567N954J7388j1932k6251K297K3511
$$ plain form
1436 8613 25627 4615 -16552 -605 18733 1622 -24279 -16715 4475 -5112 -31261 -27159 -898
1449 -898 -3477 -32815 -34801 -7327 -5296 -32323 -35245 -6043 3456 -19821 -27891 -3455 11045
1462 11045 -8077 -20976 2298 25864 11597 -7404 11393 36148 22411 -59 14627 42025
1474 42025 33827 9518 16157 39968 34082 5287 2780 26740 27941 -1136 -10624 12011 15570
1487 15570 -15890 -31147 -9410 585 -24982 -41006 -21255 -6673 -27465 -47665 -32414 -9854
1499 -9854 -20880 -41830 -27087 1588 -4633 -28581 -18176 12038 11814 -9449 -2411 27825 32993
1512 32993 10931 7993 33431 42668 20722 10487 34126 48025 24388 5694 23023 36080
1524 36080 13264 -8160 5887 21877 4834 -19733 -13779 3609 -8323 -34574 -32277 -8766
1536h766l243k5868P7K4886P83k4602j851K6415R008j8593m554K3662J3509j6089
1550e226j0802K0980K0029j2708j4385J8028K0929j3165j9710J1925K0662r149
1562B7408j9932O141J9129n369k3576k858J8237l09k3613o056J9500L471k4131
1575a1958j0727J6834O458j9673j0417J5766J1436j4456j4240J1736J4786r985
1587a4440j5677J1021K0834n520j7277Q253J9888l402j6787N792K0454K139j4933
1600C45M9J7868M317j5880n348J7803R192j5664q362J5552P974j6550j1421J1832
1614A1707J0180j2126j3222P911J0772j0518j7098L440J2738n847j7391K425J4407
1627b622m391j7701k47J4520n32j3689q07J4902M560j1966m675J3702R099r677
$$ plain form
1536 -8766 -12009 -37877 -37800 -12914 -12131 -36733 -38584 -12169 -3161 -21754 -26308 -2646 10863 -5226
1550 -5226 -16028 4952 24981 12273 -2112 15916 36845 23680 3970 15895 36557 27408
1562 27408 7476 13617 32746 27377 3801 943 19180 18871 -4742 -10798 8702 12173 -11958
1575 -11958 -22685 -5851 607 -19066 -29483 -13717 -2281 -16737 -30977 -19241 -4455 -14440
1587 -14440 -30117 -19096 1738 -3782 -21059 -12806 7082 3680 -13107 -7315 13139 15278 345
1600 345 394 18262 22579 6699 1351 19154 28346 12682 4320 19872 27846 11296 -125 11707
1614 11707 21887 9761 -3461 4450 15222 4704 -12394 -8954 3784 -2063 -19454 -17029 -2622
1627 -2622 -7013 -24714 -24961 -10441 -10973 -24662 -25469 -10567 -6007 -17973 -22648 -8946 153 -9524
1641i524n257J5751J2040q916p300J2962J1539p701p768J0248J2898m952j0653
1654A3367M383J1231m813j4089O91J2718l535j6231k378J0274m355j6960m119
1667a3816R973l30j3851n694Q754L048j2612p817R991Q904r318o746J1826J1460
1681f228p627p345J1061J2520l032n844R199J3842j393q814M214J3865M83j1021
1695A3880J609J4183l87j4191k653J0466p80j3807n196Q868K006j3248r386O124
1709b512M200j2092j0790P706Q789r855j1271P279R376q020r995P917J2025k726
1723i969q987M672J3264N1j0636K584J5291L790j0657L84J4987L436j2304k536
1737C370J2766M998j0566n219J0031O616j0164j0481P160R137q522j1659O626
$$ plain form
1641 -9524 -14781 970 13010 4094 -3206 9756 21295 13594 5826 16074 28972 24020 13367
1654 13367 17750 28981 24168 10079 10770 23488 19953 3722 1344 11618 7263 -9697 -13816
1667 -13816 -3843 -4173 -18024 -23718 -14964 -11916 -24528 -32345 -22354 -13450 -22768 -29514 -17688 -6228
1681 -6228 -13855 -21200 -10139 2381 -651 -6495 2704 16546 15153 6339 10553 24418 24901 13880
1695 13880 15489 29672 29285 15094 12441 22907 22127 8320 3124 11992 13998 750 -8636 -2512
1709 -2512 1688 -10404 -21194 -13488 -4699 -14554 -25825 -18546 -9170 -17190 -27185 -19268 -7243 -9969
1723 -9969 -18956 -14284 -1020 -969 -11605 -9021 6270 10060 -597 -213 14774 18210 5906 3370
1737 3370 16136 21134 10568 5349 15380 21996 11832 1351 8511 17648 9126 -2533 4093
1750D093J0236q802j3624L387J0149n382j2739J931J0996j648j3738k359J1257
1763f243J660j3323k932J3788N016j2538m576J2404O433j0554n495J2257J0044
1776E941p015p355Q666J2079n766j0355P778J5087l188j1871N411J3504l013j3552
1790F351J622J2855k17j2830l000J1012J592j5481p749J0082M262j4060q750R525
1804d786N329j3121j0676P508Q406q497j0282O878J1715m562j1932M264J4486
1817e270n93j1581M467J7032K373j1481J733J5335L848r750j050J4055O882r922
1831A6078o742J0402P849j1343j0176R025R203j1032j2966N536P656r708j4068
1844a0286K467J0100m904j4092o14J1045k394j4505k339J3614K748j2376k216
$$ plain form
1750 4093 14329 5527 -8097 -4710 5439 57 -12682 -10751 245 -1403 -15141 -17500 -6243
1763 -6243 -4583 -17906 -20838 -7050 -2034 -14572 -19148 -6744 -311 -10865 -16360 -4103 5941
1776 5941 -1074 -8429 237 12316 6550 -3805 3973 19060 15872 4001 9412 22916 19903 6351
1790 6351 7973 20828 20611 7781 4781 15793 17385 1904 -5845 4237 8499 -5561 -14311 -4786
1804 -4786 543 -12578 -23254 -15746 -7340 -15837 -26119 -19241 -7526 -12088 -24020 -19756 -5270
1817 -5270 -5863 -17444 -12977 4055 6428 -5053 -3320 12015 15863 6113 5063 19118 26000 16078
1831 16078 9336 19738 27587 16244 6068 15093 24296 13264 298 5834 13490 3782 -10286
1844 -10286 -7819 2281 -2623 -16715 -17329 -6284 -8678 -23183 -25522 -11908 -9160 -21536 -23752
1857b3752J3347N203j0349l523J2667R134o611m710J0584J1822n819q821Q340
1870G512J2557m376j0298O449J1983m404j2371J758J0330k257j2204j469R589
1883A2799N28j3243n644R289K108j2980o722J0101N043j1675q044Q041O115q313
1897a2597p784P260R825m435q891N054J1322k663j0045M177J3172k71r631K078
1911c429J1632R44r216p87J0511M064q058l884R262N526q828o895Q135P017p968
1926H026p539O567O404p053r166L352P203m460r237J119Q326k242j1242j225Q913
1941b254l84j0544j314R582J062r227k774P961L499p098l275Q046O964m958n719
1956a0433P446Q383m043n694P211R403k390o289M678Q238j649o851J527P814M94
$$ plain form
1857 -23752 -10405 -5202 -15551 -19074 -6407 2727 -3884 -8594 1990 13812 7993 -828 7512
1870 7512 20069 15693 5395 11844 23827 19423 7052 8810 19140 16883 4679 3210 12799
1883 12799 13327 84 -5560 3729 5837 -7143 -13865 -3764 1279 -10396 -18440 -10399 -4284 -12597
1897 -12597 -20381 -13121 -3296 -7731 -16622 -11568 -246 -2909 -12954 -8777 4395 4124 -5507 -3429
1911 -3429 8203 9147 -69 -856 9655 13719 5661 1777 11039 16565 7737 842 8977 15994 8026
1926 8026 487 7054 13458 6405 -2761 591 7794 3334 -5903 -4784 3542 1300 -9942 -11167 -2254
1941 -2254 -2638 -13182 -14496 -4914 -3852 -13079 -15853 -7892 -4393 -11491 -14766 -6720 244 -4714 -10433
1956 -10433 -2987 5396 1353 -4341 2870 12273 9883 3594 8272 16510 14861 8010 9537 17351 17845
1971A7845q162k205O703L4r843m116O724P50r370m879M919O37q368o096L672L715
1987h040n058o291L685O164l881o471M114Q314j566m779M784Q937M01m278K755
2002a210Q399K450m072P43Q336K993n865j916O703K412o508l443N603K107p345
2017I387n096K657J418o326n767J321L261m635p374J089M674m050p345J867N960
2032h959j346n394J966N950K96m480Q84O968L327l477k16O963L921m882j339O716
2048F898M118m109k341N719L568m679l786L210M144l448n342J982M635l246p276
2063D7J001M610k635o663P69N056k104o530j135M440j38n857j594N499K097n201
2079h338l205N563L046n417k974O377M275l999k814M720M770k482l700L819O229
$$ plain form
1971 17845 9683 7478 14181 14215 4372 256 6980 7730 -1640 -6519 -1600 -963 -9331 -15427 -11755 -8040
1987 -8040 -13098 -19389 -15704 -9540 -13421 -19892 -15778 -7464 -9030 -13809 -9025 -88 313 -3965 -1210
2002 -1210 7189 9639 5567 6310 14646 17639 11774 9858 16561 18973 12465 9022 14625 16732 9387
2017 9387 4291 6948 8366 2040 -3727 -2406 855 -3780 -11154 -10065 -5391 -9441 -16786 -14919 -8959
2032 -8959 -10305 -15699 -13733 -7783 -7487 -11967 -11083 -4115 -788 -4265 -4481 2482 6403 1521 182 6898
2048 6898 11016 6907 4566 10285 13853 9174 5388 8598 12742 9294 3952 5934 10569 7323 47
2063 47 1048 5658 3023 -3640 -2871 2185 81 -6449 -7584 -3144 -3282 -9139 -10733 -5234 -3137 -8338
2079 -8338 -11543 -5980 -2934 -8351 -11325 -4948 -673 -4672 -7486 -2766 2004 -478 -4178 -359 5870
2094E870p47m770K659O744p93o083J717P169k03n972M69N697j36o507k114M669
2110G669J201o088l911M253K146o928n798L793L215o146n074L783M027m774n667
2125a4299K505M932k036n165K273P509L45n796J431Q028J429n328J301Q526K909
2140H564m757n39O879L322m514k726N739M911m810n440L971M182n727p035K973
2155D993M461m940p238P10M146l687p830q23M995n23p332j595O497R81p218j768
2171a6171P350K873m915j226P021M944l637k812O215O431k058l864N319P216k393
2186A0293n748L237P103k149o474J659O174j736o998j687M804k77p567l237N312
2201B709J432p433m970M925K467p169m268M720M261m832m669L823M999k329m977
$$ plain form
2094 5870 5123 353 3012 9756 8963 2880 4597 11766 11563 5591 6060 11757 11621 5114 3000 7669
2110 7669 8870 2782 -1129 3124 5270 -1658 -7456 -3663 -448 -6594 -11668 -7885 -3858 -8632 -14299
2125 -14299 -11794 -6862 -8898 -14063 -11790 -4281 -3936 -9732 -8301 -273 1156 -4172 -2871 5655 8564
2140 8564 3807 3268 10147 13469 8955 6229 11968 16879 12069 6629 10600 14782 9055 2020 4993
2155 4993 9454 4514 -2724 -2014 2132 -1555 -9385 -10208 -5213 -5736 -13068 -14663 -8166 -7185 -14403 -16171
2171 -16171 -8821 -5948 -10863 -12089 -5068 -124 -3761 -6573 -358 6073 4015 151 5470 12686 10293
2186 10293 4545 7782 14885 12736 6262 7921 14095 12359 5361 3674 8478 8201 634 -2603 2709
2201 2709 4141 -3292 -8262 -3337 -870 -8039 -12307 -7587 -3326 -8158 -12827 -9004 -4005 -6334 -11311
2216a1311K754P423l66n532K055P761J8o184J289P418J065n148l52O121J851n153
2232C709k367N139L507m655m040M373M459n115n696L606M805m273n162K339M479
2247E108k506o527M43M911j210o139q11N906M78o524j972N548J474n952k043N250
2263d566K935m447k925L956M270k569l653L950N987j853m069L651O008j664l770
2278A241K404O023l17m075L26N061N37n116k134M793J395n874l001L705J328n926
2294C70m289K963J816n128m244K242K279l188m924J441M079j704m198J700N584
2309e201l48m034J925N937Q66k754J366N736K235k721l87M922L064l141j515M139
2325A0089K986l798l056K824J824m001l680J618J866k969m850Q6J946k235n138
$$ plain form
2216 -11311 -8557 -1134 -1500 -7032 -4977 2784 2802 -3382 -2093 5325 6390 1242 890 7011 8862 3709
2232 3709 1342 6481 9988 5333 1293 5666 10125 5010 -686 2920 7725 3452 -1710 629 5108
2247 5108 2602 -3925 -3482 1429 219 -5920 -6731 -825 -347 -6871 -8843 -3295 -1821 -7773 -9816 -4566
2263 -4566 -1631 -6078 -9003 -5047 -777 -3346 -6999 -3049 2938 1085 -2984 667 6675 5011 1241
2278 1241 3645 9668 9351 5276 5602 10663 11200 6084 3950 8743 10138 4264 1263 4968 6296 370
2294 370 -3919 -956 860 -4268 -8512 -6270 -3991 -7179 -12103 -10662 -6583 -8287 -12485 -10785 -5201
2309 -5201 -5549 -9583 -7658 -1721 -855 -3609 -2243 3493 5728 3007 2620 7542 10606 7465 5950 10089
2325 10089 13075 9277 6221 9045 10869 6868 3188 4806 6672 3703 -1147 -1061 885 -1350 -6488
2340f488o93L541j285m606l78L725l63l868k16M247J580k701j62L903K496j745
2356c013r37L871L552j774j593L677L455k066k385K775L074j819k376J056L001
2371H498j208l559k70K431o19m008q65L039n14m527j188K479l03l628j301K707
2387b836J017k639k296K106J987k222k328K100L146j686k024K138K789j359k190
2402d297K201L372m99k338J252L296N04k848K70L933J075k846n10L816J99l243
2418C337p81K801J054l009j343J969J348l038k438R61J939k573l230J065K240
2433C02k569l466O39K102j527k877N72K621k01k835p7L193P66k566J47M130J858
2450B12k472m49M299J958j740p28L653K514j523j321K282K431j388l133J752K895
$$ plain form
2340 -6488 -7181 -3640 -4925 -9531 -9909 -6184 -6547 -10415 -10631 -6384 -4804 -7505 -7667 -3764 -1268 -3013
2356 -3013 -3950 -79 3473 1699 106 3783 7238 5172 2787 5562 8636 6817 4441 5497 8498
2371 8498 7290 3731 3461 5892 5273 1265 400 3439 2925 -1602 -2790 -311 -614 -4242 -5543 -2836
2387 -2836 -1819 -4458 -6754 -4648 -2661 -4883 -7211 -5111 -1965 -3651 -5675 -3537 -748 -2107 -4297
2402 -4297 -2096 1276 777 -1561 -309 2987 3491 643 913 4846 5921 3075 2565 6381 6580 3337
2418 3337 2556 5357 6411 3402 2059 4028 5376 2338 -100 861 2800 227 -3003 -1938 302
2433 302 -2267 -5733 -5094 -2992 -4519 -7396 -6824 -4203 -4404 -7239 -7316 -4123 -3357 -5923 -5776 -1646 212
2450 212 -2260 -2709 1590 3548 1808 1080 4733 7247 5724 4403 6685 9116 7728 4595 6347 9242
2466I242j997l755N66K278k573m035j2J449j229l868j031J841k84m012j497K441
2482f476J002l501r61L170J933k460j122L573K502p16j293L061M080o44j777K168
2498B539M199m8k453J106M202o32l399K40L192j061l415r18K391l5l903k312J560
2515A253Q25l896l110K043J599l159l108K149J851k254k787K256L110j228k048
2530f504J175L736r7k358N76M427O99k875L09M306P27k602l50L306J153k375j539
2547A714K674J916k462k768J951K537k478l152J706K649j894l426O70K242r98
2562H81k801l89K745R1l264r75K657N77l458j079K993Q53l070j221K341J689k182
2579c612j584K511K199j464k014J817L347r30k491J942L444l16k156J257L292
$$ plain form
2466 9242 7245 3490 4056 6334 3761 -274 -286 1163 -66 -3934 -4965 -3124 -3408 -7420 -8917 -6476
2482 -6476 -5474 -8975 -9936 -6766 -4833 -7293 -8415 -4842 -2340 -3056 -4349 -1288 2792 2148 371 2539
2498 2539 6738 6690 4237 5343 9545 8913 5514 5754 8946 7885 4470 3552 5943 5908 2005 -307 1253
2515 1253 2078 -1818 -4928 -2885 -1286 -4445 -7553 -5404 -3553 -5807 -8594 -6338 -3228 -4456 -6504
2530 -6504 -5329 -1593 -1690 -4048 -3472 955 1654 -1221 -912 3394 4121 1519 1169 4475 5628 3253 1714
2547 1714 4388 6304 3842 1074 3025 5562 3084 -68 1638 4287 2393 -1033 -363 1879 881
2562 881 -1920 -2309 436 527 -2737 -3712 -1055 -478 -3936 -5015 -2022 -1169 -4239 -5460 -3119 -1430 -3612
2579 -3612 -5196 -2685 -486 -1950 -3964 -2147 1200 270 -2221 -279 3165 2849 693 1950 5242
2594E242o5k365K71K913M84k729o74K466P02k980k143J918J174l069k591J586
2610A40J010k804k961Q59J647j868l005Q24K168p79k599K60L089P1k187M89L599
2627b047J076k161O33L478J268j282J43K588K404j327j341K035K348j630k167
2642D018J791J781j931k459L39J378j767k837k76J172j019k910j006J741o70k937
2658e592o90J756M78k446l29J956P98j012p23K238J591n44o73K045K644p85j058
2675c46J895K431l62j506J196K056j86j676L25J705o12j719n54J683J9k701j268
2692C80J466K41k906j139J690J40k286j230J284K53j150j269P06J791r59j436
2708d424R24J872l30j988J286K488o52j279R50J883J78j074L60J537J215j585
$$ plain form
2594 5242 5177 2812 3083 5996 6480 3751 3077 5543 6245 3265 1122 3040 4214 1145 -1446 140
2610 140 1150 -1654 -4615 -3756 -2109 -3977 -6982 -6158 -3990 -4769 -7368 -7108 -4019 -3948 -6135 -5646 -2047
2627 -2047 -971 -3132 -2499 979 2247 965 1108 3696 6100 4773 3432 5467 7815 6185 4018
2642 4018 5809 7590 5659 3200 3539 4917 3150 313 37 1209 190 -2720 -3726 -1985 -2655 -5592
2658 -5592 -6282 -4526 -4048 -6494 -6823 -4867 -4069 -5081 -5804 -3566 -1975 -2519 -3192 -1147 1497 712 -346
2675 -346 1549 3980 3618 2112 3308 5364 5178 3502 3827 5532 4920 3201 2647 4330 4349 1648 380
2692 380 1846 2087 -819 -1958 -268 -128 -2414 -3644 -2360 -2107 -3257 -4526 -3820 -2029 -2988 -4424
2708 -4424 -3500 -1628 -1958 -3946 -2660 -172 -824 -2103 -1153 730 908 -166 194 1731 2946 1361
2724A361m17J632Q73j363q31J771J000j859p89J452N15j004j215N97O50q12j475
2741H6J94J126q39j843L2J175n00k183L37J011n63j386o02J356k17j115l04J269
2759b966R47j352m11J878J250j133l03J795J535n50l02J381J697m23n00J204J199
2776D946k14j003J35J691n80k292QJ273n76k116m78O94q03k178q79M81k62j618
2794c771j212P36O58j662o81J068Q56p14p60J611J359j40n53J370K129L92n50
2811A36J316K143K12p59J62K163j51j184J9J560J90j969m87O85j32k278j052O35
2829A209l1j886j383M22P47j788j681P11J097j245j247Q38R48q7r88O34J743N86
2847a401j097L68K208O56j253M19J927P70j252m84J672R94j124p41J435O41j235
$$ plain form
2724 1361 944 2576 3449 2086 1255 3026 4026 2167 1378 2830 3345 2341 1126 1723 2373 1561 86
2741 86 280 1406 567 -1276 -1244 -69 -569 -2752 -2415 -1404 -1967 -3353 -3955 -2599 -2816 -3931 -4235 -2966
2759 -2966 -2019 -3371 -3782 -1904 -654 -1787 -2090 -295 1240 690 388 1769 3466 3043 2543 3747 4946
2776 4946 4732 3729 3864 5555 4975 2683 2691 3964 3388 1272 794 1488 685 -1493 -2372 -1891 -2153 -3771
2794 -3771 -4983 -4247 -3589 -5251 -5932 -4864 -4008 -4722 -5482 -3871 -2512 -2652 -3205 -1835 294 686 136
2811 136 1452 3595 3807 3048 3210 5373 5222 4038 4057 5617 5807 3838 3351 4036 3904 1626 574 1209
2829 1209 1178 -708 -2091 -1669 -922 -2710 -4391 -3680 -2583 -3828 -5075 -4237 -3289 -3376 -4364 -3730 -1987 -1401
2847 -1401 -2498 -2130 78 734 -519 -100 1827 2597 1345 861 2533 3527 2403 1662 3097 3738 2503
2864B503r86M04J366j144j639P68J049j063j621K00J416o80j841J66J216l94j615
2881a895k41J252L07j665n73J092Q67j526p92J466P14j156p01J415Q05o82r62
2898b275Q81J613l2j316R02J915p8j196P51J594mj265N28J432K10j032n63J230
2916C295K80j126j135O60P70j693j471P62N24j635j195N10M28j173j403L8R25
2933b639k76j647K05J358M56j254n0J977L83r98M65J843R58o59J9J390J472n47
2951B456l37J173J468r07q90J080Q44r20j333J96Q53r22j614j48L80n79j808n21
2969a529N10n4j922p38R89j6j470o06J164O62r21j98J347Q35m03m91J105J924
2987A88j93l07Q53J898J7j237R51J650o12p00M99Q60Q1j312l09N91P1j157r39
$$ plain form
2864 2503 1517 1921 3287 2143 504 1272 2321 1258 -363 -163 1253 573 -1268 -1102 114 -280 -1895
2881 -1895 -2136 -884 -577 -2242 -2815 -1723 -856 -2382 -3174 -1708 -994 -2150 -2851 -1436 -631 -1313 -2275
2898 -2275 -1394 219 187 -1129 -227 1688 1610 414 1165 2759 2755 1490 2018 3450 3660 2628 2065 3295
2916 3295 3575 2449 1314 1974 2744 1051 -420 342 866 -769 -1964 -1454 -1026 -2199 -3602 -3564 -2639
2933 -2639 -2915 -4562 -4357 -2999 -2543 -3797 -3847 -1870 -1487 -2485 -2020 -177 781 122 141 1531 3003 2456
2951 2456 2119 3292 4760 3853 2963 4043 4887 3967 2634 2830 3683 2761 1147 999 1379 800 -1008 -1529
2969 -1529 -1019 -1073 -2995 -3733 -2744 -2760 -4230 -4836 -3672 -3010 -3931 -4129 -2782 -1947 -2350 -2841 -1736 188
2987 188 -5 -312 541 2439 2456 1219 2170 3820 3208 2508 3007 3867 3948 2636 2327 2918 2989 1832 893
3006H93Q75l43j429r65L78L59j449o55K10N42o77q65L67R97l59r08M61J105k12
3025a675o24M93J211J21m99N24J108K10r83P8J295O35r14l64J045P84j060o20
3043G65P52P25j023n85J072J65o20j063N28N60n14n25L4M95l42p52l50P78j24
3062b4j200L5P68l83r44k82N09J47n16m39M74M47n46o08P54Q71k85l37P94J201
3082D36k32l56Q06Q98n1j48N17O18M32o98K74P79J28r44j77M99j78j089n91J64
3102A087k21j020n91k15O6p12j218O8M38o80p72M48O87o94m79Q11R91l03Q3O90
3122a536J145K88M3N31Q76O95l60K24J173N13o08j18P34K25r65j94K25j13q84
3141A894j038J9J5m77j243k35O48o65j350N7O00q92k17k04Q47j00k49j20Q77N17
$$ plain form
3006 893 1768 1425 -4 -969 -591 -232 -1681 -2336 -2126 -1584 -2261 -3126 -2759 -1762 -2121 -3029 -2568 -1463 -1675
3025 -1675 -2299 -1806 -595 -474 -973 -449 659 869 -114 -36 1259 1894 980 616 1661 2445 1385 765
3043 765 1517 2242 1219 634 1706 1871 1251 188 716 1276 762 237 271 766 424 -328 -678 100 -24
3062 -24 -1224 -1189 -421 -804 -1748 -2030 -1521 -1374 -1890 -2329 -1855 -1408 -1954 -2562 -1808 -937 -1222 -1559 -765 436
3082 436 204 -152 654 1552 1501 1353 1870 2488 2920 2222 2496 3275 3403 2459 2282 2781 2603 1514 923 1087
3102 1087 866 -154 -745 -960 -894 -1606 -2824 -2756 -2318 -2998 -3770 -3322 -2635 -3329 -3808 -2997 -2006 -2309 -2226 -1536
3122 -1536 -391 -103 -60 471 1347 2042 1682 1906 3079 3592 2984 2866 3600 3825 2860 2666 2891 2778 1894
3141 1894 856 875 890 413 -830 -1065 -417 -1082 -2432 -2375 -1775 -2667 -2884 -3088 -2241 -2341 -2590 -2710 -1833 -1316
3161a316l83l58J392P86n75J12R68R05n43j49O08Q16n71l38O55K24l87o45M03
3180A604N82n80q85J90N75l98r64r5O91l28q86k81K36M33q29n42R59l18o85l80
3200a901Q69M03p60l99O92N52r77k65P53O36l08l51L29R56r7m55K31Q70J84p80
3220A82L63P82L00r48L03P17P7m13l33P71R0m81p25N63L67p39j028O50L25q59
3240c6r24J51P00r69n36j39N11m11q16L6M01L99p37J82O40O06o02k26J256L59
3260a55k42L2J055O64j39k23P43M98Q9p23N21Q37l41q32L30O12o45n54k62J48
3280A413p18p12m10L6j6j172n24L29J47r73o16P71P1m77k00N44N07R4j89P01O75
3301g19N58n19N95J113J33n73P20J221j06l71j94R92L24j081r1M18o2o85p92J55
$$ plain form
3161 -1316 -1699 -2057 -665 121 -454 -342 626 1531 988 839 1447 2263 1692 1354 2009 2233 1846 1201 1604
3180 1604 2186 1606 721 911 1486 1088 124 29 720 392 -494 -775 -539 -106 -935 -1477 -518 -836 -1521 -1901
3200 -1901 -1032 -629 -1389 -1788 -1096 -544 -1521 -1786 -1033 -397 -705 -1056 -727 229 132 -323 -92 778 962 182
3220 182 545 1327 1627 679 982 1699 1776 1363 1030 1801 1891 1410 685 1248 1615 876 -152 498 823 -36
3240 -36 -960 -809 -109 -1078 -1614 -1753 -1242 -1653 -2469 -2433 -2032 -1633 -2370 -2188 -1548 -942 -1544 -1770 -514 -155
3260 -155 -397 -365 690 1354 1215 992 1735 2233 2322 1599 2120 2957 2616 1784 2114 2726 2081 1527 1265 1413
3280 1413 695 -17 -427 -391 -407 -1579 -2103 -1774 -1627 -2600 -3216 -2445 -2374 -2851 -3051 -2507 -2000 -1906 -2095 -1394 -719
3301 -719 -161 -680 -85 1028 1161 588 1308 2529 2423 2052 1858 2850 3174 2093 2002 2420 2358 1673 881 1036
3321A036L00j060r06K97J06p09n70J08K59n06o74MO04%m00L34O05K37o89M73R68
3342a83K32j004M18J028N03p21R6M74M40m95k1M22M12o50j63l3N84k38p71M32
3362G62K89m00l50J09K08j02o66J16J89L46n62l62N01j58o54o8M79p3m19m41P36
3383e20q7o16p6j06O00k62m11L88N69l47l21M79O23j77j87O55N38K90k10J24O88
3404A634n3L04m02M54L03n67l74M34L13j005l62L12m4p21l65p3m40n01k95j45
3424a593R7k51q07K79L46M1n96K03P37R4j3r9P44M91J7L02N84M16J10j5N00M57
3446B044K6l34N96J87m92l85L50k19k19l93k96k21j15n87l38Q1l00q85m4L97k79
3467a426m24L5L41k92k53P2L27N46k3l04N52M64k8J81M42P53r1o26P25K49k37
$$ plain form
3321 1036 1336 276 -630 -333 -227 -936 -1506 -1398 -1139 -1645 -2319 -2315 -1711 -1711 -2111 -1777 -1172 -935 -1624 -1151 -183
3342 -183 49 -955 -537 491 994 273 369 843 1283 788 767 1189 1601 951 788 755 1339 1101 330 762
3362 762 1051 651 301 410 618 516 -150 -34 155 501 -61 -423 78 -80 -734 -802 -323 -396 -815 -1256 -520
3383 -520 -607 -1223 -1299 -1405 -805 -1067 -1478 -1090 -521 -868 -1189 -710 -87 -264 -451 204 742 1032 822 946 1634
3404 1634 1581 1885 1483 1937 2240 1673 1299 1733 2046 1041 679 991 947 226 -139 -212 -652 -1153 -1448 -1593
3424 -1593 -1496 -1747 -2554 -2275 -1929 -1888 -2484 -2281 -1544 -1450 -1463 -1562 -818 -327 -310 -8 576 992 1102 1087 1587 2044
3446 2044 2070 1736 2332 2519 2027 1642 1992 1773 1554 1161 865 644 529 -58 -396 -315 -615 -1500 -1544 -1147 -1426
3467 -1426 -1850 -1815 -1474 -1766 -2019 -1947 -1620 -1074 -1097 -1401 -849 -385 -413 -232 210 963 872 246 971 1220 983
3488I83L64k79O60j36j44l95N09m53m75J40K43J06j022j86O28l39p27p5K08L6
3508c54m85j32J55j1J8m83L70K21j56l83N97L18q0k70K51L78j31j52j3Q81J9m47
3530A11j14M22L43k55k72N42l3l08J92J76L09j01n56J64L96k20k47k39M12m04
3550C18k11k6L81l44l42J21k0l81l11J94R4l78j87j93J71P0k42j08L28K80j74
3571i60j7L06M82k20mL98L76K32k21K89N35J60j79L66J19J26m71j2K99Q4n62J31
3593A257J8l92n13n28J53M2p84n43J39J80n24n54N07J09n99J70K38J36J4r8M17
3614a155O69k6M8L69M07M57k61K62Q91j20j62R2L72K11n77o1J78J74n43n12K44
3635I57qq19k97j14K81p38j68L1q3j40l44j11M94j73j23Q4K64L26j67n4N99M10
$$ plain form
3488 983 1347 1068 1728 1592 1448 1053 1562 1109 634 774 1017 1123 101 -85 543 204 -523 -598 -390 -354
3508 -354 -839 -971 -816 -827 -809 -1292 -922 -701 -857 -1240 -643 -325 -405 -675 -424 -46 -177 -329 -342 539 558 111
3530 111 -3 419 762 507 235 777 744 436 628 804 1113 1012 456 620 1016 796 549 310 722 318
3550 318 107 81 462 118 -224 -103 -123 -504 -815 -621 -527 -905 -1092 -1285 -1114 -1044 -1286 -1394 -1066 -786 -960
3571 -960 -977 -671 -189 -409 -413 -15 361 593 372 661 1196 1356 1177 1543 1662 1788 1317 1305 1604 1688 1126 1257
3593 1257 1275 883 370 -158 -5 37 -747 -1290 -1151 -971 -1495 -2049 -1542 -1433 -2032 -1862 -1624 -1488 -1474 -1572 -1155
3614 -1155 -486 -512 -464 -95 312 769 508 770 1661 1541 1379 1471 1843 2054 1477 1416 1594 1768 1225 713 957
3635 957 949 130 -167 -281 0 -738 -906 -875 -958 -1098 -1442 -1553 -1059 -1232 -1355 -1271 -1007 -681 -848 -902 -303 107
3657A07l31K8O24J36k20k68M02M07k98j57K70N7J64l26r1L00j54n91L59L77m45
3678C50j95j04p3O8M0l57L80L13o44K3L14q5k39l16L42J10m93m5J3K93l12k59
3700h76K16L36l50k48J35K76L72n71M82K83o0k32K03N13r7j1L10L12m2pm31L25
3722H38M74n3m10J95J65j76l94j46L50o16l13k76J30k43l35O2j30M0n13l6J68
3743a219J62m00p2O05K32m04J72K46M59j03J87K66M85j74J1M90K40p0j15K51P8
3764A327p3r8OJ75m43j3j60j09j51l43l51K5J6k83n48M61k80l60L4J33Q8m56R4
3787a309j34L53K86L6j21M21M9J07L24M41j17j63L85L93r1M2o2L06J9o2k71O4
3809H96J96l96Ljk59k81K0J2j25n30j23L14m51L26l42r6K48k9j17J9J54J31k20
$$ plain form
3657 107 -224 -196 428 564 344 76 478 885 587 430 700 757 921 595 504 804 650 59 418 795 350
3678 350 155 51 -22 46 86 -271 109 422 -222 -199 115 30 -209 -525 -183 -73 -566 -611 -598 -305 -617 -876
3700 -876 -660 -324 -674 -922 -787 -511 -139 -710 -228 55 -5 -237 -34 479 382 371 681 993 951 944 513 838
3722 838 1312 1259 849 1044 1209 1033 639 493 843 227 -86 -362 -232 -475 -810 -748 -878 -838 -1351 -1387 -1219
3743 -1219 -1057 -1457 -1529 -924 -692 -1096 -924 -678 -219 -322 -135 131 616 442 453 943 1183 1113 998 1249 1327
3764 1327 1254 1156 1162 1337 894 881 721 612 461 118 -233 -208 -192 -475 -1023 -562 -842 -1202 -1168 -1035 -947 -1403 -1309
3787 -1309 -1443 -1090 -804 -768 -889 -468 -419 -312 12 453 336 173 558 951 860 902 840 1146 1165 1103 832 896
3809 896 1092 696 699 698 439 158 178 190 65 -465 -588 -274 -725 -399 -741 -837 -589 -618 -735 -716 -562 -431 -651
3832f51%K44J96l37N66j66K74P5j95L09L49o88K05lK90n6m3K07j57J59l31J60
3854D07J45l84L5n3J44qk28K05M6J79l89j4l2K82m16rk0k2k9j70K43j88m36J15
3878e97J97j2k09k74M06J40l47J44j65O11k69k5K44K13K45k36j9K63N98k43J33
3899G98K67M5l75M45J32l88k41j59J19m8j65j87j41O4k96j28k64Ok43k56jM7l84
3922a353l4K37J48J63k53M35J02k1J71J68K02O11k89N4N03K31k0LJ03j33J94j41
3944A081lj65nl88q1J3r8l11k2M3k52n37J78m6r2j52l12K70P1r6J6M65j96J11
3968e08P6J14r2J93q3N09K0M4k90L44J49k5J24j62J32J74m91Q4J01L05p92L60
3990B86J54k06k9j40j2k23K57l18K70J51k52l82M58j62K2m16N28J27n48M2LL22
$$ plain form
3832 -651 -651 -407 -211 -548 18 -148 126 201 6 315 664 -24 181 178 468 412 369 576 419 578 247 407
3854 407 552 168 203 150 294 286 58 263 309 488 99 85 53 335 -81 -90 -110 -132 -161 -331 -88 -276 -712 -597
3878 -597 -400 -412 -621 -895 -489 -349 -696 -552 -717 -106 -375 -400 -156 57 302 66 47 310 908 665 798
3899 798 1065 1110 735 1180 1312 924 683 524 643 595 430 243 102 166 -130 -258 -522 -516 -759 -1015 -1016 -969 -1353
3922 -1353 -1387 -1150 -1002 -839 -1092 -657 -555 -576 -405 -237 -35 576 287 341 844 1075 1055 1058 1161 1028 1222 1081
3944 1081 1078 913 908 520 439 452 354 43 21 64 -188 -725 -547 -593 -685 -837 -1149 -879 -808 -904 -888 -423 -619 -508
3968 -508 -432 -318 -410 -217 -300 209 229 273 -17 327 476 451 575 413 545 719 228 312 413 718 -74 286
3990 286 440 234 205 65 53 -170 87 -231 39 190 -62 -444 14 -148 -126 -542 -14 113 -435 -393 -390 -68
4012f8k37K17q0k6l9l38K47K78k39J81m03L25j7R7J4J75J92J67j82J37l3P1j67
4035B72K18K7rj88j49O31l33q7j17J02rj46l26J72k14j54j78K25j17l15J1l4M24
4058b94l77o1J04K18k33R8j04N27k17o4L32L61j45%K80Q9L%K82p1L1r3K49J6k70
4083F61k63q0J91l1k06p1j58J07l9m89j39J35r3m22K11J16K16n87K65j56j01K94
4105f39J73q6K87k42J88M87k1O0j41L76q3J22R9j28J99R3K0j32L65l47k69J05
4127D86L06n68k93J08K5o9n59M35l61J2M1jk66M1n1j58O14l87K42Q8O1o2k38K64
4151b90L93k8J46m42K56M54k39rL8J69K2l41r7L7K65k60N9J09K0k02K4o8J62k30
4175e2n1Q1J82k92k1M14R6n76K86k30L28k19N8n9k31J26k18K4o7l2J78op2J54
$$ plain form
4012 -68 -305 -88 -168 -194 -233 -571 -324 -46 -285 -104 -507 -182 -199 -102 -88 87 279 446 264 401 368 439 272
4035 272 490 517 508 320 171 802 469 382 265 367 358 212 -114 58 -156 -310 -488 -263 -380 -695 -684 -718 -294
4058 -294 -671 -732 -628 -410 -643 -545 -649 -122 -339 -403 -71 290 145 145 425 514 517 517 799 728 759 666 915 931 661
4083 661 398 318 509 478 272 201 43 150 111 -378 -517 -382 -475 -897 -686 -570 -354 -941 -676 -832 -933 -639
4105 -639 -466 -552 -265 -507 -319 168 147 207 66 442 359 481 580 452 651 744 764 632 997 650 381 486
4127 486 792 224 -69 39 64 -5 -564 -129 -490 -478 -437 -438 -704 -663 -714 -872 -258 -645 -403 -315 -254 -316 -554 -290
4151 -290 103 75 221 -221 35 489 250 241 279 448 470 129 32 69 334 74 133 242 262 60 84 16 178 -52
4175 -52 -103 -22 160 -132 -153 261 357 -219 67 -163 165 -54 4 -55 -286 -160 -378 -354 -421 -453 -275 -281 -353 -199
4199a99k02J13J07k14L37k16J41J08J91j83J54N28n10K80L29k29O3m5K02P8m49
4220C84R5J3j2l0k08O2l50j87K56r9j51j22q9j78pn6j06J16J02o3l1K89j8k51
4244f41N81k26K13Q5J21q0K33L31k41P9L32j25j45J95k78M1K94l86o9JJ41n20
4266f4j51L91j93k00M9j36J0M1j17r1O2l56O4K20R2J17p8J16Qk6o2K29l9N99m54
4291C1L88n02J05K28J39k2j22J08r3k1L7J07k0o7L3m01J93k13L57n0j08k5r3L9
4315B8k87M4K38k47J5K68p4j57q9q8K34L8j22J01l86L91p3n9J39R2k94M17j36
4338gj12l0J78nL12k37K41k25N8K01j5j3k69O6m26K69J96r6J0l7P0M0l57L32j41
4363Cj97N3J80r3p9j71k28M13k9p1q9K49k08r1P0n1J24R4l90N43J30m05J59m6
$$ plain form
4199 -199 -401 -288 -181 -395 -58 -274 -133 -25 166 -17 137 665 155 435 764 535 598 553 755 833 384
4220 384 479 492 480 450 242 304 -46 -233 23 -76 -227 -349 -438 -616 -623 -679 -785 -669 -567 -630 -661 -372 -390 -641
4244 -641 -60 -286 -73 12 133 53 286 617 376 455 787 662 517 712 434 475 769 383 314 315 456 -64
4266 -64 -215 176 -17 -217 -168 -304 -294 -253 -370 -461 -399 -755 -691 -471 -379 -262 -340 -224 -216 -242 -304 -75 -114 485 31
4291 31 419 -83 22 250 389 367 245 353 260 239 276 383 363 296 329 -72 121 -92 265 215 107 82 -11 28
4315 28 -259 -215 23 -224 -209 59 -15 -172 -261 -349 -115 -77 -199 -98 -484 -93 -166 -225 -86 6 -288 129 -7
4338 -7 -119 -149 29 24 336 99 340 115 173 374 359 346 77 143 -283 -14 182 86 96 59 129 169 -188 144 3
4363 3 -194 -141 39 -54 -133 -304 -532 -119 -148 -219 -308 -59 -267 -358 -288 -339 -215 -121 -511 32 162 -243 -84 -130
$$ [...]
8191a05
##END NTUPLES=NMR FID
##END=
