##TITLE=1H_Pr BnMe
 D2O
 8 sc, 
 6.3.2024
##JCAMPDX= 6.0         $$ Bruker NMR JCAMP-DX V2.0
##DATA TYPE= NMR FID
##DATA CLASS= NTUPLES
##ORIGIN= UXNMR, Bruker Analytische Messtechnik GmbH
##OWNER= root
$$ XWIN-NMR		Version 3.5
$$ Wed Mar  6 18:15:38 2024 Russian Standard Time (UT+4h)  she@DPX200
##.OBSERVE FREQUENCY= 200.1313
##.OBSERVE NUCLEUS= ^1H
##.DELAY= (6, 6)
##.ACQUISITION MODE= SIMULTANEOUS
##.ACQUISITION SCHEME= undefined
##.AVERAGES= 8
##.DIGITISER RES= 18
##SPECTROMETER/DATA SYSTEM= spect
##.PULSE SEQUENCE= zg30
##.SOLVENT NAME= D2O
##.SHIFT REFERENCE= (INTERNAL, D2O, 0, 15.7039)
##AUDIT TRAIL= $$ (NUMBER, WHEN, WHO, WHERE, WHAT)
$$ ##TITLE= Audit trail, XWIN-NMR		Version 3.5
$$ ##JCAMPDX= 5.01
$$ ##ORIGIN= Bruker BioSpin GmbH
$$ ##OWNER= she
$$ F:/spectra/data/she/nmr/H-F/1/audita.txt
$$ ##AUDIT TRAIL=  $$ (NUMBER, WHEN, WHO, WHERE, WHAT)
(   1,<2024-03-06 18:14:22.71 +0400>,<she>,<DPX200>,
      <created by zg, POWCHK disabled, PULCHK disabled
       configuration hash MD5:
       00 E9 B6 7A A2 85 ED C7 34 08 36 98 17 FE 4E 26
       data hash MD5: 16K
       6D DA 01 BF AC 9D 57 65 BA E4 CA BE 7A 38 4D CF>)
$$ ##END=
$$ 
$$ hash MD5
$$ 68 2E 53 3D 4A 52 D3 A1 07 60 97 3B C0 39 DD BB
##$RELAX= 
##$RELAX= 
##$RELAX= 
##$RELAX= 
##$RELAX= 
##$RELAX= 
$$ Bruker specific parameters
$$ --------------------------
##$DU= <F:/spectra>
##$EXPNO= 1
##$NAME= <H-F>
##$PROCNO= 1
##$TYPE= <nmr>
##$USER= <she>
##$AMP= (0..31)
100 100 100 100 100 100 100 100 100 100 100 100 100 100 100 100 100 100 
100 100 100 100 100 100 100 100 100 100 100 100 100 100 
##$AQSEQ= 0
##$AQ_mod= 1
##$AUNM= <au_zg>
##$AUTOPOS= <>
##$BF1= 200.13
##$BF2= 200.13
##$BF3= 200.13
##$BF4= 200.13
##$BF5= 200.13
##$BF6= 200.13
##$BF7= 200.13
##$BF8= 200.13
##$BYTORDA= 1
##$CFDGTYP= 0
##$CFRGTYP= 5
##$CHEMSTR= <none>
##$CNST= (0..31)
1 1 145 1 1 1 1 1 1 1 1 1 1 1 1 1 1 1 1 1 1 1 1 1 1 1 1 1 1 1 1 1 
##$CPDPRG= <>
##$CPDPRG1= <>
##$CPDPRG2= <>
##$CPDPRG3= <>
##$CPDPRG4= <mlev>
##$CPDPRG5= <mlev>
##$CPDPRG6= <mlev>
##$CPDPRG7= <mlev>
##$CPDPRG8= <mlev>
##$CPDPRGB= <>
##$CPDPRGT= <>
##$D= (0..31)
0 1.2 0 0 0 0 0 0 0 0.06 0 0.03 0 0 0 0 0.0002 0 0 0 0 0 0 0 0 0 0 0 0 
0 0 0 
##$DATE= 1709734462
##$DBL= (0..7)
120 120 120 120 120 120 120 120 
##$DBP= (0..7)
150 150 150 150 150 150 150 150 
##$DBP07= 0
##$DBPNAM0= <>
##$DBPNAM1= <>
##$DBPNAM2= <>
##$DBPNAM3= <>
##$DBPNAM4= <>
##$DBPNAM5= <>
##$DBPNAM6= <>
##$DBPNAM7= <>
##$DBPOAL= (0..7)
0.5 0.5 0.5 0.5 0.5 0.5 0.5 0.5 
##$DBPOFFS= (0..7)
0 0 0 0 0 0 0 0 
##$DE= 6
##$DECBNUC= <off>
##$DECIM= 32
##$DECNUC= <off>
##$DECSTAT= 4
##$DIGMOD= 1
##$DIGTYP= 9
##$DL= (0..7)
0 120 120 120 120 120 120 120 
##$DP= (0..7)
150 150 150 150 150 150 150 150 
##$DP07= 0
##$DPNAME0= <>
##$DPNAME1= <>
##$DPNAME2= <>
##$DPNAME3= <>
##$DPNAME4= <>
##$DPNAME5= <>
##$DPNAME6= <>
##$DPNAME7= <>
##$DPOAL= (0..7)
0.5 0.5 0.5 0.5 0.5 0.5 0.5 0.5 
##$DPOFFS= (0..7)
0 0 0 0 0 0 0 0 
##$DQDMODE= 0
##$DR= 18
##$DS= 0
##$DSLIST= <SSSSSSSSSSSSSSS>
##$DSPFIRM= 0
$$ [...]
##$SUBNAM2= <"">
##$SUBNAM3= <"">
##$SUBNAM4= <"">
##$SUBNAM5= <"">
##$SUBNAM6= <"">
##$SUBNAM7= <"">
##$SUBNAM8= <"">
##$SUBNAM9= <"">
##$SW= 18.0517328524113
##$SWIBOX= (0..15)
0 0 2 0 0 0 0 0 0 0 0 0 0 0 0 0 
##$SW_h= 3612.71676300578
##$TD= 16384
##$TD0= 1
##$TE= 0
##$TE2= 300
##$TE3= 300
##$TEG= 300
##$TL= (0..7)
0 120 120 120 120 120 120 120 
##$TP= (0..7)
150 150 150 150 150 150 150 150 
##$TP07= 0
##$TPNAME0= <>
##$TPNAME1= <>
##$TPNAME2= <>
##$TPNAME3= <>
##$TPNAME4= <>
##$TPNAME5= <>
##$TPNAME6= <>
##$TPNAME7= <>
##$TPOAL= (0..7)
0.5 0.5 0.5 0.5 0.5 0.5 0.5 0.5 
##$TPOFFS= (0..7)
0 0 0 0 0 0 0 0 
##$TUNHIN= 0
##$TUNHOUT= 0
##$TUNXOUT= 0
##$USERA1= <user>
##$USERA2= <user>
##$USERA3= <user>
##$USERA4= <user>
##$USERA5= <user>
##$V9= 5
##$VALIST= <valist>
##$VCLIST= <CCCCCCCCCCCCCCC>
##$VD= 0
##$VDLIST= <DDDDDDDDDDDDDDD>
##$VPLIST= <PPPPPPPPPPPPPPP>
##$VTLIST= <TTTTTTTTTTTTTTT>
##$WBST= 1024
##$WBSW= 4
##$XGAIN= (0..3)
0 0 0 0 
##$XL= 0
##$YL= 0
##$YMAX_a= 377071
##$YMIN_a= -216935
##$ZGOPTNS= <>
##$ZL1= 120
##$ZL2= 120
##$ZL3= 120
##$ZL4= 120
##$ABSF1= 10
##$ABSF2= 0
##$ABSG= 5
##$ABSL= 3
##$ALPHA= 0
##$AQORDER= 0
##$ASSFAC= 0
##$ASSFACI= 0
##$ASSFACX= 0
##$ASSWID= 0
##$AUNMP= <proc_1d>
##$AZFE= 0.1
##$AZFW= 0.1
##$BCFW= 1
##$BC_mod= 2
##$BYTORDP= 1
##$COROFFS= 0
##$CY= 11.3945322036743
##$DATMOD= 1
##$DC= 2
##$DFILT= <>
##$DTYPP= 0
##$F1P= 15.7292609196834
##$F2P= 12.9074282941183
##$FCOR= 0.5
##$FTSIZE= 0
##$FT_mod= 4
##$GAMMA= 1
##$GB= 0.15
##$INTBC= 1
##$INTSCL= 1
##$ISEN= 128
##$LB= 0.24
##$LEV0= 0
##$LPBIN= 0
##$MAXI= 10000
##$MC2= 0
##$MEAN= 0
##$ME_mod= 0
##$MI= 1.114404
##$NCOEF= 0
##$NC_proc= 0
##$NLEV= 6
##$NOISF1= 3.799351
##$NOISF2= 2.8
##$NSP= 1
##$NTH_PI= 0
##$NZP= 0
##$OFFSET= 15.70392
##$PC= 1
##$PHC0= -25103.57
##$PHC1= 7.987312
##$PH_mod= 1
##$PKNL= yes
##$PPARMOD= 0
##$PSCAL= 0
##$PSIGN= 0
##$REVERSE= no
##$SF= 200.130013532006
##$SI= 16384
##$SIGF1= 3
##$SIGF2= 2
##$SINO= 400
##$SIOLD= 16384
##$SREGLST= <1H.CDCl3>
##$SSB= 0
##$STSI= 0
##$STSR= 0
##$SW_p= 3612.71676300578
##$SYMM= 0
##$S_DEV= 0
##$TDeff= 0
##$TDoff= 0
##$TI= <>
##$TILT= no
##$TM1= 0
##$TM2= 0
##$TOPLEV= 0
##$USERP1= <user>
##$USERP2= <user>
##$USERP3= <user>
##$USERP4= <user>
##$USERP5= <user>
##$WDW= 1
##$XDIM= 8192
##$YMAX_p= 0
##$YMIN_p= 0
$$ End of Bruker specific parameters
$$ ---------------------------------
##NTUPLES= NMR FID
##VAR_NAME=  TIME,          FID/REAL,        FID/IMAG
##SYMBOL=    X,             R,               I
##VAR_TYPE=  INDEPENDENT,   DEPENDENT,       DEPENDENT
##VAR_FORM=  AFFN,          ASDF,            ASDF
##VAR_DIM=   8192,          8192,            8192
##UNITS=     SECONDS,       ARBITRARY UNITS, ARBITRARY UNITS
##FACTOR=    0.0002768,     1,               1
##FIRST=     0,             0,               0
##LAST=      2.2672688,     0,               0
##MIN=       0,             -216935,         0
##MAX=       2.2672688,     377071,          0
$$ Real data points
##PAGE= N=1
##DATA TABLE= (X++(R..R)), XYDATA
0@%%%%%%%%%%%%%%%%%qJ6j6J6j6K1k9L2l6M4n2O0o8P9q9J00j15J30j47J67j87
38i8K09k34K62k94L25l59L98m39M85n36N92o52P17p90Q70r60J060j171J297j439
58g57J599j788K014k282K610l022L559m291N349p030J0139k4528J56540R3877
72B31989j64275j78006n0907O6547J7909o0053l0638J20541J94237J03517o0135
83A90726j11096m0747K7123k0571j05382r1872L4762J18832O9235l9723p1310
94d0023j8896K0812j9415o8102j9875J08475J66703P3027p1330j00142L029Q4370
106A18633J1922j38762j73440l1735J27894J36186J5045p2748l5682M3639K9144
117C0096p4819j16638l106J60787J95677O5609q7254j18163m6795n109m5550p9804
$$ plain form
0 0 0 0 0 0 0 0 0 0 0 0 0 0 0 0 0 0 0 -8 8 -8 8 -8 13 -16 16 -20 24 -28 32 -36 43 -46 54 -61 69 -78 89 -98
38 -98 111 -123 139 -155 170 -189 209 -230 255 -281 311 -341 376 -414 456 -504 556 -615 682 -757
58 -757 842 -946 1068 -1214 1396 -1626 1933 -2358 2991 -4039 6100 -18428 138112 231989
72 231989 67714 -110292 -161199 -94652 -76743 -136796 -167434 -46893 147344 250861 190726
83 190726 79630 38883 66006 45435 -59947 -151819 -117057 1775 71010 31287 -40023
94 -40023 -58919 -38107 -57522 -125624 -145499 -37024 129679 202706 131376 31234 34263 118633
106 118633 130555 -8207 -181647 -213382 -85488 50698 65743 -7005 -42687 952 30096
117 30096 -44723 -161361 -164467 -3680 191997 257606 170352 52189 5394 285 -45265 -125069
129a25069k5093P1332J00430L5619l9019l8939J1938J6986m4656p5613K134J22563
141A2613J48412M2183q1549r6237k0472J7354l7898r4124m8571O5637J18283M4415
153G0046o7254p8710K0718R4678M0223p3120r6057P113J16456J08317M834o7158
165H0086m6602n348k6804q4296q2682P951J03841J04157J7566m6673k4507K2594
177A9283Q229n0460n9501J7117J00490R3128N277n9557m3201m290k3076q3599
189h0160r1124J473J16709J30834K7718p3034o6618R878M2541l896n0032j5805
201e1516O6532R1143J9063o7109p1715p584K9193j2744p4099o0019L1109R7844
213i902O8219p944l5124j67K4588q378n4964m0725L3109Q1920M7221k6338n1872
$$ plain form
129 -125069 -150162 -78830 21600 57219 18200 -20739 -8801 8185 -36471 -112084 -109950 12613
141 12613 161025 203208 121659 25422 4950 22304 -15594 -109718 -158289 -92652 25631 70046
153 70046 2792 -75918 -55200 39478 79701 6581 -89476 -82363 34093 142410 147244 80086
165 80086 33484 28136 1332 -82964 -165646 -157695 -53854 50303 67869 21196 -3311 19283
177 19283 27512 -22948 -82449 -65332 35158 128286 133563 74006 30805 26515 3439 -80160
189 -80160 -171284 -169811 -53102 77732 105450 32416 -34202 -24324 18217 14321 -35711 -51516
201 -51516 15016 106159 125222 58113 -13602 -21186 8007 -4737 -78836 -138855 -107746 -9902
213 -9902 58317 50373 15249 15082 39670 31292 -23672 -64397 -31288 50632 97853 71515 19643
226A9643j4903J3807k2055q0520o9706K4423J06608R0916R490l7967j4663J7525
238D2598o678o1968o2522J9103J01416R0319m279q0142o7489p851J0049k9173
250e6617n0112J443P6012Q6120K2197l9223l5075R437K1606j8617n0211j7727
262e0767M7849O6377J3639m6993m7020k040J4065k4449n6488k1659N1542Q1158
274B5214L7839k0281k4423J6869L0590j9114p4483n7397K5764Q4600N6759j8131
286F3806n2507k3582N594j6984n6640m2239L2759R5725Q0750P763m3311l0882
298B0252K403l644l9739m2362J2396O7570N6831q810n3748l6943O43L01l1137
311e5987l4105J7859P4778P0103N947m4444k8920J6742K0147k7135n7156k0602
$$ plain form
226 19643 4740 18547 -3508 -84028 -153734 -129311 -22703 68213 77703 39736 25073 42598
238 42598 35920 -26048 -88570 -69467 31949 122268 117989 37847 -29642 -37493 -27444 -56617
250 -56617 -106729 -105286 -29274 56846 79043 39820 4745 14182 35788 17171 -33040 -50767
262 -50767 -2918 63459 77098 30105 -16915 -18955 -4890 -29339 -85827 -107486 -55944 25214
274 25214 63053 42772 18349 35218 65808 46694 -27789 -85186 -59422 25178 81937 63806
286 63806 11299 -12283 -6689 -23673 -80313 -122552 -89793 5932 86682 94445 51134 20252
298 20252 22655 19011 -20728 -63090 -50694 16876 73707 64897 11149 -25794 -25151 -24850 -55987
311 -55987 -90092 -72233 2545 72648 78595 34151 5231 21973 42120 14985 -42171 -62773
323f2773M4520N9726R536m1541l4116R156K1089j7893n2815k6810M2545P9913
335C0537M7470j0947k8360l719O106k7032n9772l6793K9336O8796M1712j4765
347D2569l6891j4999K866j7140m4661k4918M1046Q6465N9638r275m5410k4411
359A4879M039q888m2581l8375J5867O3440M8909j1352m9019k8982J0824J3350
371g889j9380l0738R118N8176N6264M903l4400k2514Q806N938l1370m9716j5407
384f8209L8196N1259J2769k6097j9652J2210J4524k3541m9134j6465M7169P2807
396D5836L5471j7684l0524q428q93k8864n3600k9224L2522O8696M1700j3982l6531
409D495j4927M584j0457l2245j4547L7803O8593M0891j4960m0426k1718j57j1574
$$ plain form
323 -62773 -18253 41473 51009 9468 -24648 -15492 5597 -12296 -65111 -91921 -49376 30537
335 30537 78007 67060 38700 34981 41087 14055 -45717 -82510 -53174 15622 57334 42569
347 42569 5678 -9321 -6455 -23595 -68256 -93174 -52128 34337 93975 84700 39290 14879
359 14879 18918 10030 -32551 -70926 -55059 8381 57290 45938 -3081 -32063 -21239 -7889
371 -7889 -27269 -58007 -48889 9287 65551 70454 36054 13540 22346 28284 -3086 -52802 -68209
384 -68209 -30013 21246 34015 7918 -11734 476 15000 -8541 -57675 -74140 -26971 45836
396 45836 81307 63623 33099 24671 23778 -5086 -58686 -87910 -55388 13308 55008 41026 4495
409 4495 -10432 -5848 -16305 -48550 -63097 -25294 43299 84190 69230 28804 7086 6929 -4645
422d645l6853k8959J9434N7336L9038j4083l8829j3109J9364J1694k3360l1987
434d4959O786N0873M7636J861l2479k2399N514L726l0091m7832j4889L8666N4183
447A6596K0817j5290j5395M656L511k4304l8440p609M3016N9046K4733j9258k8719
460B3360j0119n529l0652m7350j5593M2734O6607L1965j8797l2142q021Q803q275
473c009l0987j5636L2461N9875L2596k0597m3678k1333M861l825k9380k5068J5628
486d8092M7781L5349l936k3760p464J3333L369k5440k8871O313M2046L6761j577
499D5812k6671j4291O407m297l6335m1657j648M6003N3640J8406j6016j5354M264
512A8263J897k6136l8746p523M1081N5286K0698k2643l1812j3287o659k3026l1024
$$ plain form
422 -4645 -41498 -70457 -51023 6313 45351 31268 -7561 -20670 -1306 10388 -12972 -44959
434 -44959 -38173 12700 60336 62197 29718 7319 12833 16559 -13532 -61364 -76253 -37587 16596
447 16596 37413 22123 6728 11384 14895 -9409 -47849 -55458 -12442 46604 71337 52079 23360
460 23360 13241 7712 -22940 -70290 -85883 -43149 23458 55423 36626 4484 -3537 5266 -3009
473 -3009 -33996 -49632 -17171 42704 75300 54703 11025 -10308 -5447 -9272 -38652 -63720 -48092
486 -48092 -311 35038 31102 7342 -122 13211 16580 -8860 -37731 -31418 10628 47389 45812
499 45812 19141 4850 11257 6960 -29375 -71032 -72680 -26677 26963 45369 29353 13999 18263
512 18263 20160 -5976 -44722 -52245 -11164 44122 64820 42177 10365 -2922 -9581 -32607 -63631
525f3631m456L8949N5468K7074j4823k6517o835N069j0491k7335j1916K7295M6050
538C3901K0067k2028l3540j0618P510m967k7339k2088J5452M6800L6493k134k2021
551A5488o519J1912K41k7849l2041P55L6744L5791L302j9980j3650n21q363k9956
565c4646l0738M923M6306M9808J4945j5441j3434O81n869k9692l4658j077M1947
578f945M7637J1108k6149k9023q332L01j5075k6330l640L8022N2215K2526j6786
591C9529k6058p892M059p968k3819j3355J8228L4629J6635j3409k2205o736N291
604c071o590k4772j5706J9397M1782K7409k910j4168j400P062j0188l5231l1340
617d9726O552M0115L4718J306k1355j3388K810m012k6974k7777P652M5629M7568
$$ plain form
525 -63631 -68087 -29138 26330 53404 38581 12064 5229 10298 -193 -27528 -39444 -12149 33901
538 33901 53968 31940 -1600 -12218 -4708 -9675 -37014 -59102 -43650 3150 39643 37509 15488
551 15488 8969 20881 21122 -6727 -38768 -38013 -1269 34522 37824 17844 4194 3673 -4690 -34646
565 -34646 -65384 -60461 -14155 35653 50598 35157 21723 22404 16535 -13157 -47815 -48892 -6945
578 -6945 40692 51800 25651 -3372 -11704 -11403 -26478 -52808 -56448 -18426 33789 56315 39529
591 39529 13471 5579 9638 1670 -22149 -35504 -17276 17353 33988 20579 -1626 -8362 -3071
604 -3071 -9661 -34433 -50139 -30742 11040 38449 35539 21371 19971 27033 16845 -18386 -49726
617 -49726 -43174 -3059 31659 32965 11610 -1778 1032 -2980 -29954 -57731 -50079 -4450 43118
630D3118J4971j6908k1204q320p161k1903k5434k33L2434L8158J0874j9179k2515
643c302o608j339j3490j7051N221L4288L8224J2208j6618j9552k051L579j4135
656f26k8861j3759K0005L5478J5685j4474j9235N57J0630o224k5921j7506J6072
669b8179M0665L0979j08j7424r221J74j1556l0253k5557O483L5644L2744N220
682B9611j4179j0659l161r844k1642j5258J3474M0287L6889O424j8723j7929p236
695H054j0329k3319k1130N979L4253L2894L410k0141j5743J168L868j0522j8479
708c0037n75K9295L6493J1140j7936k0276l453K755j1865k5858j4273J6037L2265
721C712J8542n276j2242j851M195o946k1279j3840J4725L4376K4296n13j2856
$$ plain form
630 43118 58089 41181 19977 11657 4496 -17407 -42841 -43074 -10640 27518 38392 19213 -3302
643 -3302 -9910 -11249 -24739 -41790 -36569 -2281 35943 48151 31533 11981 9930 13509 -626
656 -626 -29487 -43246 -23241 12237 27922 13448 -5787 -5230 5400 -824 -26745 -44251 -28179
669 -28179 12486 43465 43357 25933 16712 16886 5330 -24923 -50480 -43997 -8353 24391 29611
682 29611 15432 4773 1612 -8232 -29874 -45132 -31658 8629 45518 51942 33219 15290 8054
695 8054 -2275 -25594 -46724 -40745 -6492 26402 29812 9671 -6072 -4904 -1036 -11558 -30037
708 -30037 -30612 -1317 35176 46316 28380 8104 4651 7406 -4459 -30317 -44590 -28553 3712
721 3712 22254 16978 4736 2885 7080 134 -21145 -34985 -20260 14116 38412 37899 25043
734B5043q517o751j8090k8827j6522J5563L7181K7720J082j3929q243p1p460k1646
748b3467j5452J5259L9716L0417k038k3469j8265l832m214j8052j9913K974L0213
761a0123L2423Q385j5363j5952j104M083p486j4530n04K0705K4338P411j0597
774B1686j2308l933l899j6098k2015o248J9383K9190J5441l295o241K820J360
787A5843j5850k6248r918K0893L5117J9746p263j8641r945k407j1850k4556j5992
800e1071J4253L7763L1046K804j6373j2903k762n077j3642r885R716K6626K2534
813C3029O18j6808j5854p114p490j4022r828R598K6627K2065J392j0990m193N400
827A2430p46j6343j9386o90K2625K5562N276j4275j3135j73O16j4498k3341p804
$$ plain form
734 25043 16526 9775 -8315 -37142 -53664 -38101 -920 26800 27882 13953 5710 5639 -1821 -23467
748 -23467 -38919 -23660 16056 46473 44435 20966 2701 -1131 -5345 -23397 -43310 -40336 -10123
761 -10123 22300 30685 15322 -630 -1734 2349 -5137 -19667 -20171 534 24872 32283 21686
774 21686 9378 5445 1546 -14552 -36567 -42815 -23432 5758 21199 17904 11663 14483 15843
787 15843 -7 -26255 -36173 -15280 19837 39583 32320 13679 3734 1327 -10523 -35079 -51071
800 -51071 -36818 945 31991 34795 18422 5519 2757 -2320 -15962 -25847 -16131 10495 33029
813 33029 33647 16839 985 -6129 -13619 -27641 -37469 -27871 -1244 20821 22213 11223 7030 12430
827 12430 11684 -4659 -24045 -24735 -2110 23452 28728 14453 1318 1145 1761 -12737 -36078 -43882
841d3882K0909L3872J9539k800j0815m836k350j1300j8941r576J3619K8037J8759
854C0235k614j3924j1194q714j4323j6965l046K0930L1949J9223k803j2233o760
867I761j903q449j7150j0457J2072K7564J7808o484j8683j0217J180j905j3282
880b0145j2901N895K5065K4481O175r296q690n22j672j2865j7343l030J6978K0990
894A3120P055p169p910k548n162j5108j6628k29K1954K8846J5081l182r032m472
908A4616n443j6113k0753n399J9113K8031J3433p543j4818q352l621q836j3259
921b8944l024J7671K8867J8417k864j3700q661k754p604j4515q353R685K0866
934E087J3423l446j1685o283N54l023j1845r992O855K2828K0904L854q666o304
$$ plain form
841 -43882 -22973 10899 30438 27638 16823 11987 9637 -1663 -20604 -30180 -16561 11476 30235
854 30235 27621 13697 2503 -6211 -20534 -37499 -40545 -19615 12334 31557 28754 16521 9761
867 9761 7858 -591 -17741 -28198 -16126 11438 29246 22762 4079 -6138 -4958 -6863 -20145
880 -20145 -33046 -27151 -2086 22395 28570 19274 10584 10062 8390 -4475 -21818 -24848 -7870 13120
894 13120 20175 13006 5096 2548 -2614 -17722 -34350 -34579 -12625 16221 31302 28120 19088 14616
908 14616 9173 -6940 -27693 -33092 -13979 14052 27485 19942 5124 -3228 -6849 -15685 -28944
921 -28944 -31968 -14297 14570 32987 30123 16423 7762 5008 -2596 -17111 -25464 -15779 5087
934 5087 18510 15064 3379 -2904 -2350 -5373 -17218 -27210 -20355 2473 23377 27231 18565 12261
948A2261m10n147j6492j7469j429J7521K1440Q720n344q067l818m821j2553j3521
962b9129J571K1591K6390J2157m845r914o902q428j5830j6199j343J8395K4144
975A1658J0893p171j2538n573j086p039j2042j847J7510K5750J3545n835j3739
988A2486p891k271o331j3171r001O639J8518J4669K34q394m775M49l557j1115
1002a3511p856P088J9165J6214L419n528n143l841r750j7999j4671L023K0191
1015i199K0835O378o156n832r60m744j3691j2604L820K1857K4077R274q115j3382
1029A1558q738o544j1401j2704j357J6088K2059J1087m745j0014n192k527o027
1042h457p467O23J3166J7984R072m563j0117n990l387q845j3635o689R519J9041
$$ plain form
948 12261 11851 6704 -9788 -27257 -28686 -11165 10275 18995 13651 5584 1766 -3055 -15608 -29129
962 -29129 -27558 -5967 20423 32580 27735 17821 10919 2491 -13339 -29538 -30881 -12486 11658
975 11658 22551 15380 2842 -2731 -3817 -10856 -22898 -24745 -7235 18515 32060 26225 12486
988 12486 4595 2324 -4007 -17178 -26179 -19540 -1022 13647 13881 5487 712 1161 -2396 -13511
1002 -13511 -21367 -14279 4886 21100 24519 18991 13848 10007 257 -17742 -32413 -29390 -9199
1015 -9199 11636 18014 11858 6026 5066 322 -13369 -25973 -22153 -296 23781 33055 24940 11558
1029 11558 2820 -3724 -15125 -27829 -29186 -13098 8961 20048 15303 5289 97 -2430 -8457
1042 -8457 -15924 -15301 -2135 15849 24921 20358 10241 4251 864 -7981 -21616 -28305 -18786 255
1056B55J2624n19n360q43J254n726j3114r311O408J9607J7011K096q750p922m176
1071C534q077j5412j2572L932K0348K1162Q063m222o918n008o058j0139q373L979
1085a5761J7815J8850N696q271j1384p702p268j0840r261L141J7030J8652P499
1098A8196m019o586k826j592o743r859j840J2251J6897O805o145r363m152k010
1112i86p967j2945o125R626J9049J4447K471m905l369r19n650j2817r515N306
1126a4299J7201J4989K957o906q483p166r337j1991o338P731J9033J8050O629
1139B2070m256o492m551o587j1543p960N724J6862J4706J748q853r322m523m589
1153g566r377q408L208J6790J9047P483n809q072j709K3o547j0780l985Q434J4107
$$ plain form
1056 255 12879 12360 7000 6157 7411 1685 -11429 -20740 -14332 5275 22286 24382 15632 7710 3534
1071 3534 -4543 -19955 -32527 -28595 -8247 12915 20978 16756 9838 4830 -1228 -11367 -19740 -15761
1085 -15761 2054 20904 26600 18329 6945 -757 -8025 -18865 -28126 -24985 -7955 10697 18196
1098 18196 14177 7591 4765 3173 -3570 -13429 -15269 -3018 13879 20684 14539 5176 1024 -986
1112 -986 -8953 -21898 -28023 -18397 652 15099 17570 12665 9296 8377 2727 -10090 -19605 -14299
1126 -14299 2902 17891 20848 13942 5459 -1707 -11044 -23035 -29373 -21642 -2609 15441 22070
1139 22070 17814 11322 6771 184 -11359 -19319 -13595 3267 17973 19721 10868 1546 -2977 -7566
1153 -7566 -16943 -25351 -22143 -5353 13694 21177 15368 7296 5587 5610 -937 -11717 -15702 -7268 6839
1168F839Q382k436p309n212l871p336r515l007R440J7286J3389L078k931k982
1182A3815n107j1292j3242m975Q624J6208J1427k84o999n750m057p907j1819n960
1196b7318R367K1347J8088L334p777q073m600n563q881p145K580J3381J3972L431
1210A6143p405r099m914l051n093m572L151J2703J4056O174j688l499l147n614
1224D145j0179j0202j719J0073J3588N780l407m847j396j954q170j1328k962J1994
1238a0584J9110J2754P18n980o035n271q428j1875o823O692J6345J3110J708o730
1252H711p579n643o454o853j080R963J6325J2122J891n628o797n363o926r897
1266a3208o392N087J3792J0846P04n940m626j103k231p024o199L237J3233J4026
$$ plain form
1168 6839 15221 12785 5476 264 -3607 -10943 -20458 -23465 -14025 3261 16650 19728 16797 13815
1182 13815 8708 -2584 -15826 -20801 -12177 4031 15458 15174 8175 2425 -1632 -9539 -21358 -27318
1196 -27318 -17951 3396 21484 24818 17041 8968 4368 -1195 -10076 -17221 -14641 -1260 12712 16143
1210 16143 8738 -361 -5275 -8326 -13419 -17991 -14840 -2137 11919 18093 16405 12906 9759 4145
1224 4145 -6034 -16236 -17955 -7882 5706 11486 8079 3232 1836 -118 -8288 -19616 -22578 -10584
1238 -10584 8526 21280 21998 16018 9983 4712 -3716 -15591 -22414 -15722 623 13733 15441 8711
1252 8711 1132 -4511 -10965 -17818 -18898 -8935 7390 19512 21403 15775 8978 3615 -3311 -13208
1266 -13208 -19600 -14513 -721 10125 10829 4889 263 -840 -3071 -10095 -16294 -13057 176 14202
1280A4202N797l845o493l729l849q899j0492k718Q721J3249Q343N00l524l652
1294C611m730q133p668M03J1268J5677J0064k90o155n883o346j0627j1344k852
1308b3005R844J5806J0411J1o365n314l157m694o550j919Q006J4930J1631M86
1322B0121p686p471m801n982p863m493L898J0776J0139L175k696k944j633l705
1336a165o937n219L180J1708J1753L482l721m330l214o116j0518r679m38J0730
1350a0484J4629Q425n70m323l363l737o883p504m35J0282J4780Q645j201o810
1364A1451p708p867q583o876m6R205J3593Q841J03m357l751l250n347o371j155
1379a2118Q244J2435P452j452o187n331l946n482p925m983M391J2435J1245L099
$$ plain form
1280 14202 19999 16154 9661 5932 2083 -6816 -17308 -20026 -11305 1944 10287 10787 7263 3611
1294 3611 -1119 -9252 -16920 -16517 -5249 10428 20492 20202 14047 8164 1818 -8809 -20153 -23005
1308 -23005 -13161 2645 13056 13067 6702 1388 -1769 -6463 -13013 -14932 -6926 8004 19635 20121
1322 20121 12435 4964 163 -5819 -13682 -18175 -14277 -3501 6638 9813 7117 4173 2540 -1165
1336 -1165 -8102 -13321 -10141 1567 13320 16802 13081 8751 5537 -579 -11097 -20776 -21214 -10484
1350 -10484 4145 12570 12000 7677 4314 577 -6306 -13810 -14245 -3963 10817 19462 18261 11451
1364 11451 3743 -4124 -12707 -19583 -19629 -10424 3169 12010 12113 7756 4005 755 -4592 -10963 -12118
1379 -12118 -3874 8561 16013 14561 8374 3043 -903 -6385 -14310 -19293 -14902 -2467 8778 11877
1393A1877l217l224j213k982o679n982J416R435J0529M889j896n207n725p012
1407d991q947o840K009J1622J3387P318p2l244l793n559q193o353J761J0319J1932
1422A0356N488k852o711n619n063p176p097%R981J3966Q584k05m853m315l070
1437A414m592n403j573N437R627O882l79n236m835l426m888o638l236M774J0625
1452a447R825M255o45k411l415o062q155n238K866J0017R999L238l347m878m355
1467B47n984p939n128L507J1615J2567O336q46m284m460n428p461o120R96R682
1482b700J1629N091l458o828n565m272m943l816J499Q449J0972O999Q7l818l828
1497E498l462n127o056k123M937Q761O050L27l008l124l899n993o325j892O149
$$ plain form
1393 11877 8660 5436 4223 1241 -5438 -11420 -10004 -569 9960 14849 12953 7746 2021 -4991
1407 -4991 -13938 -20778 -18769 -7147 6240 13558 13486 10242 6449 890 -7303 -13656 -11895 -1576 10356
1422 10356 15844 12992 6281 662 -4401 -11577 -18674 -18674 -8693 5273 13857 13652 8799 4484 1414
1437 1414 -3178 -8581 -10154 -4717 4910 11792 11413 6177 1342 -2084 -6972 -13610 -16846 -12072 -1447
1452 -1447 8378 12633 11988 9577 6162 100 -8055 -13293 -10427 -410 9589 12827 9480 4602 247
1467 247 -5737 -13676 -18804 -15297 -3682 8885 15221 14375 10091 5631 203 -7258 -13378 -12382 -2700
1482 -2700 8929 14020 10562 3734 -1831 -6103 -11046 -14862 -13363 -4914 6058 13057 13144 9326 5498
1497 5498 2036 -3091 -9147 -11270 -6333 2428 8478 8805 5797 2673 -1226 -7219 -13544 -15436 -9287
1512i287J1141R224K596k276k879k951n840q646n767K918J0161R829L356k732
1526H847m887m727n323o205l708L638J1116J2190N829k179n895n738n542n825
1540h409l606K098P455P945L674j475l677l849m301n373l961K122Q911J0456N059
1555A3069j347l563k620l206o232o939k207N379R290O560J69l588l146k320l945
1570d646n772k981M620J0555R682L685j932m727o008p156o662k707L832Q771Q341
1585F895L046j781l858m565n691n873j783N675J0712Q878K422k781m214m026n159
1600b103o691m909J639Q508R533L987k746m750l168k172l314l221P90O468Q500
1615F351N382M18l218m338m824n689n506j486M884Q243O151J733j301k416l799
$$ plain form
1512 -9287 1854 11078 13674 11398 8519 5568 -272 -8918 -14685 -11767 -1606 8223 11579 8847
1526 8847 3960 -767 -6090 -12295 -16003 -12365 -1249 10941 16770 14591 8696 2958 -2584 -8409
1540 -8409 -12015 -9917 -2462 5483 9157 7682 4005 156 -4145 -9518 -13479 -11357 -2446 8010 13069
1555 13069 11722 8159 5539 2333 -3899 -10838 -13045 -7666 1624 8184 8353 4765 1619 -701 -4646
1570 -4646 -10418 -13399 -8779 1776 11458 15143 13211 8484 2476 -4680 -11342 -14049 -10217 -1446 6895
1585 6895 9941 8160 4302 -263 -5954 -11827 -13610 -7935 2777 11655 14077 11296 7082 3056 -2103
1600 -2103 -8794 -13703 -12064 -3556 5977 9964 7218 2468 -700 -2872 -6186 -9407 -8617 -2149 6351
1615 6351 11733 12151 8933 4595 -229 -5918 -11424 -12910 -8026 217 6368 8101 6800 4384 585
1630E85n986n685n44O515R800P271J418l058m482m618o184p231l321M555J0089
1645h76Q762K583k780m289l825l904m178j572M001Q359Q042L061k819n259m845
1660D61m951n404k924K695P248P145L187p61k042k002l275m720l749J164O629
1675a299Q145M371j127l538l335m088o172n746q18N702Q851O670J981j828l104
1690D665m018n079m585o64N176Q754O647R92l274m506n370o434n398p39N384Q883
1706D34P361K214k121l345l387m038m303j795L630P917O727J243l155m158l957
1721g33m363m296k403K038O634P436M192l6k077k671l623m809l670R02N974O832
1737E327L469n27k530l591m801n723m642L58O620R214O190J140k265l173l843
$$ plain form
1630 585 -5401 -11086 -11630 -5115 4685 11956 13374 10316 5834 1216 -4968 -12199 -15520 -10965 -876
1645 -876 7886 10469 7689 3400 -425 -4329 -8507 -10079 -6078 2281 10323 13384 10565 5306 461
1660 461 -4490 -9894 -12818 -10123 -2875 4270 7457 6696 4654 2652 -623 -5343 -9092 -7928 -1299
1675 -1299 6846 11217 10090 6552 3217 -871 -7043 -12789 -13607 -7905 946 7616 9597 7769 4665
1690 4665 647 -4432 -9017 -9681 -4505 4249 10896 11888 8614 4108 -1262 -7696 -13094 -13833 -8449 434
1706 434 7795 10009 7888 4543 1156 -2882 -7185 -8980 -5350 2567 9294 10537 7382 3224 -733
1721 -733 -5096 -9392 -11795 -9757 -3123 4313 8505 8469 6392 3721 98 -4711 -8381 -7479 -1505 5327
1737 5327 8796 8269 5739 2148 -2653 -8376 -13018 -12660 -6040 3174 9364 10504 8239 5066 1223
1752A223n076m894q13N318Q027N474O28l328n001m933m623l577j23N288Q339O462
1768H391J875j780l196l488m398m409j344L532O269M801J228k037l180l028l614
1783d378m509k569K752P432P422L645m66k404k853l787n150l802M46M911O578
1798C268M361M4k978l844m336m942l283J736O773Q046N315J051k281l755m940
1813B35n668m250L38N068P113M709j17l352l475l190l893l374L85N357P648N821
1829I355J356k310l529l726m313l895j673K368N554N268J764j427k315k614l861
1844c998l812j227L063O386O328L253l53k364l581m978n549l808R18N989O981
1859C248L663l83k310l089m012m140k212J821O071P473M707P4l215m596m902m900
$$ plain form
1752 1223 -3853 -8747 -9560 -4242 3785 9259 9887 6559 1558 -3375 -7998 -11575 -11698 -6410 1929 8391
1768 8391 10266 8486 5290 1802 -2596 -7005 -8349 -4817 1452 6253 7481 5444 2264 -764 -4378
1783 -4378 -8887 -11456 -8704 -1272 6150 9795 9329 6925 4072 285 -4865 -8667 -8221 -3310 3268
1798 3268 7629 7673 4695 851 -3485 -8427 -11710 -9974 -3201 4845 10160 11211 8930 5175 235
1813 235 -5433 -9683 -9345 -4277 2836 7545 7428 4076 601 -2589 -6482 -9856 -9471 -4114 3534 9355
1829 9355 10711 8401 4872 1146 -3167 -7062 -8735 -6367 -813 4455 6219 4792 2477 -137 -3998
1844 -3998 -7810 -9037 -5974 412 6740 9993 9640 7276 3695 -1283 -6832 -10640 -9722 -3733 3248
1859 3248 6911 6528 4218 1129 -2883 -7023 -9235 -7414 -1343 6130 10837 10911 7696 3100 -1802 -6702
1875f702l363M18M957O593L995M73j801k796l448l433k374P36M624O494M508M59
1891I340k460l252l389m187m474j883K878O115N269K281m94k230k727l150l228
1906e591j666K274N796N969K870q53l118m247n101n159k564K383N948O179L705
1921F825M55k009l085l745m042k371K000O050O438L085j161l484l823m219m331
1936g417k860R45M884O321M536Q86j946k821k756k989k508J49L759N204L651M97
1952G535j927l048l827m350l641m28L227N712N425K536m45j776k523l857m199
1967e586j679K619N593N170J955j284l156m022m552l973j558K425O052O555L684
1982H243k36k362k974l859l872j838J847M813N049K546q62k995l640l806l366
$$ plain form
1875 -6702 -10065 -9647 -4690 1903 5898 6371 4570 1774 -1674 -5107 -7481 -6745 -2121 4373 8881 9340
1891 9340 6880 3628 239 -3948 -8422 -10305 -7427 -1312 3957 6238 5744 3514 787 -2363 -5591
1906 -5591 -7257 -4983 813 6782 9652 8799 5681 1434 -3667 -8826 -11390 -9007 -3059 3120 6825
1921 6825 7280 5271 2186 -1559 -5601 -7972 -5972 78 6516 9601 8440 4956 1133 -3086 -7417
1936 -7417 -10277 -9332 -4448 1873 6409 7295 5349 2528 -228 -3217 -5725 -5576 -1817 3387 7038 7535
1952 7535 5608 2560 -1267 -5617 -9258 -9686 -6459 -747 4678 7214 6769 4993 2470 -1387 -5586
1967 -5586 -7265 -4646 947 6117 8072 6788 3632 -390 -4942 -8915 -10473 -8048 -1996 4559 8243
1982 8243 8007 5645 2671 -1188 -5060 -6898 -5051 -238 4811 7357 6495 3500 -140 -3946 -7312
1997g312k013J329M931O172L982M40j521k234l097l638k692r1K959M665L480P46
2013F106j578k944l448l742l074l10L856O077M995K077l49j945l348m432l987
2028f046j447K458N200M790J778j495k989l344l575l328j239K965O069O065L015
2043H877l46k759l820l822l101j581J257L865M458K443m26k185l034l408l150
2058f732j358K194M836N073K962O25j311k232l296m108l483m20L409N271L408
2073D838J21j710k094k475l168k738k10L418N817N222K320j245l463m103l945
2088c415l132q81K326M412M222J903m75k219l600l990k621L39L684N322M383J741
2104G999q60k246k859l810m121k161J647M819M627J880p61j996k131k181k250
$$ plain form
1997 -7312 -9325 -7996 -3065 3107 7089 7529 6008 3774 677 -2961 -5653 -5744 -2785 1880 5360 6106
2013 6106 4528 1584 -1864 -5606 -8680 -8990 -5134 943 5938 8015 7666 5721 2373 -2059 -6046
2028 -6046 -7493 -5035 165 4955 6733 5238 2249 -1095 -4670 -7998 -9237 -6272 -203 5862 8877
2043 8877 8531 5772 1952 -1870 -4971 -6552 -5295 -1430 3028 5471 5045 2860 -174 -3582 -6732
2058 -6732 -8090 -5896 -1060 4013 6975 7600 6289 4057 761 -3347 -6830 -7250 -3841 1430 4838
2073 4838 4959 3249 1155 -1320 -4488 -7226 -7436 -4018 1799 7021 9341 8096 4633 530 -3415
2088 -3415 -6547 -7428 -5102 -690 3532 5435 4960 2741 -859 -4849 -7470 -7131 -3447 1875 6258 7999
2104 7999 7139 4893 2034 -1776 -5897 -8058 -6411 -1592 3035 4915 4154 2158 27 -2154 -4404
2119d404j520Q80L790N252L715N08k360l297l757l539k350J79K794M061L530J732
2135E214l15k360l644l583k051R48M031N142L533O94j265k429l518m547l858o69
2151h677L269N370M374J428j316k578k425k268k133o24K364M808M448J857j254
2166F643l007l675l546k733q14J547L352L915K766O25j210k355l021k947j112
2181e572J888L981L936J993q2j406k510l715m109k667N03L770N231L656Q41j356
2197D382k101k495l018k184L06L276M783L571R55j967l466m038l461k045J87K901
2213d414M477M003J623n65j956k788l126k082J87K617L908L042J012r47k273l135
2229d17l371k814r67K034M353M242K024K5j179j905k734k812j446J019L418M062
$$ plain form
2119 -4404 -5924 -5044 -1254 3998 7713 8221 5861 2564 -1193 -4732 -7082 -6903 -4109 -48 3482 5214
2135 5214 4899 2539 -1105 -4688 -6739 -5791 -1760 3382 6915 7609 6344 3915 397 -4150 -8008 -8677
2151 -8677 -5408 -38 4336 5764 4448 1870 -555 -2823 -4956 -5580 -3216 1592 6040 7897 6643
2166 6643 3636 -39 -3585 -6318 -7132 -5585 -2233 1682 4448 5073 3863 1508 -1513 -4460 -5572
2181 -5572 -3684 297 4233 6226 6144 4738 2228 -1487 -5596 -8263 -7760 -3990 1241 4897 5738 4382
2197 4382 2281 -214 -3232 -5416 -5110 -1834 2949 6520 7475 5508 2042 -1996 -5457 -7502 -7315 -4414
2213 -4414 63 4066 5689 5124 3168 380 -2746 -4828 -4641 -2024 1884 4926 5938 4991 2718 -417
2229 -417 -3788 -6602 -7569 -5535 -1182 3060 5084 5109 3930 2025 -709 -3521 -4967 -3948 -530 3532
2245C532K375q1k130l123l382l062j877R40L938M794L379J067j052k505l309k968
2261c464j605O80K959L912K693N69j663k869l370l301j958P24L566M471L219J253
2277E816n44j960k618k788k271m11K178L669L090P84j199k139k427k674k437q22
2293f753K014L968M143K635K00j751k717k886k576j285R52L100L446K231J15j708
2309C128k828l395k984q95J835L711M173K831Q02j194k369l149l265k003P47L192
2325a663L944K322p7j745k310k575k434j477O29K820M159L607J207j221k283k646
2341B57k695j857l27J661K907K791J409k73j748k902l020j915J27K270L783L540
2357D008J758q9j331k344l439l154j252J346L467L625J839l77j548k505k606k103
$$ plain form
2245 3532 5907 5826 3696 573 -2809 -5871 -7748 -6808 -2870 1924 5303 6370 5318 2813 -496 -3464
2261 -3464 -5069 -4389 -1430 2482 5175 5744 4081 1212 -2158 -5459 -7417 -6693 -3127 1344 4563 5816
2277 5816 5272 3312 694 -2094 -4365 -4776 -2598 1071 4161 4945 3746 1607 -820 -3494 -5931 -6753
2293 -6753 -4739 -771 3372 6007 6207 4456 1739 -1147 -3723 -5008 -4056 -956 2490 4721 4836 3128
2309 3128 300 -3095 -6079 -6974 -5139 -1428 2745 5576 6378 5184 2815 -334 -3599 -5602 -4855 -1663
2325 -1663 2281 4603 4526 2781 471 -2104 -4538 -6015 -5386 -2566 1593 5200 6407 5186 2903 257
2341 257 -2438 -4295 -4622 -2961 -54 2737 4146 3873 2125 -777 -3797 -5712 -5585 -3315 468 4008
2357 4008 5766 5677 4346 2002 -1437 -4591 -5843 -4497 -1030 2595 4434 4057 2509 4 -2602 -4705
2373d705j005J196L687M372K669J88j797k830l236k520j160P16K453L124K279
2388C431O73r95k234k733k236j108R02L074L701K326O25p30j802k636l088k260
2404e090l74J948L418K999J108n70j761k083k164j816m61J968L590L392J806j37
2420E773j995l125l268k356p23J412L102L307J874J34j376k378k655k191n11J877
2436c099L500L239J807o4j719k499k777k558j394O75K795L413K347L72j154j898
2452I86k106k020r93P59K316L024K520Q93j033k266k773k772j894MK158L137K744
2469B684J258k40j222k182k657j931M6J909L393L106J249p41k130k564k895k275
2485e192o02J598L249L361J925jj404k309k565j741k51J386K721K966J613k02
$$ plain form
2373 -4705 -5710 -4514 -827 3545 6214 6402 4605 1775 -1461 -3981 -5141 -4425 -1972 1152 3431
2388 3431 4104 3109 875 -1858 -4094 -5202 -4300 -1226 2475 4801 5426 4696 2894 258 -2830 -5090
2404 -5090 -5464 -3516 -98 2901 4009 3439 1678 -405 -2569 -4385 -4846 -2878 712 4104 5910 5773
2420 5773 3778 653 -2615 -4971 -5694 -4282 -1180 2127 4001 4135 2759 381 -2274 -4465 -4976 -3099
2436 -3099 401 3640 5447 5383 3664 1165 -1612 -4170 -5564 -4889 -2094 1319 3666 4038 2884 986
2452 986 -1120 -3140 -4133 -3374 -1058 1966 4486 5379 4346 2080 -693 -3465 -5359 -5355 -3197 -60 2684
2469 2684 3942 3702 2480 298 -2359 -4290 -4244 -2335 1058 4164 5413 4672 2542 -22 -2917 -5192
2485 -5192 -5794 -4196 -947 2414 4339 4338 2934 625 -1940 -3681 -3932 -2546 175 3141 4754 4552
2501D552j589k379k836k393r10J176K806L059J998N40p19j671k111k138j113L65
2517c363K188L107K214L10j068j938k696k485j465K05J965L212K955J462k39j709
2533B655k529k331j639QJ842L056K409R11m82j778k701k816j886l9J949L225L043
2550B897J576k01j446k056k093j874p47J250K726K658J266j05j521k426k342j784
2566d222n67R78K466K985K199O64q22j688k359k326j301O82K083K592J828N67
2582C759p61j917k413k302j367L91K317L385K714R91o41j669k226k464j651k6
2598c880J756K603K418J123o25j878k479k240j338Q0J888K936K635J374j22j206
2614C045k196k503j819m05J161K395K397J292k06j280j841k037j800o94J115K596
$$ plain form
2501 4552 2963 584 -2252 -4645 -5555 -4379 -1573 1486 3484 4024 3305 1634 -477 -2615 -3728 -3363
2517 -3363 -1175 1932 4146 4456 3388 1450 -1246 -3731 -5196 -4991 -3026 186 3141 4603 4364 2655
2533 2655 126 -2205 -3844 -3836 -1994 1062 3471 4382 3900 2122 -579 -3395 -5281 -5320 -3371 -146 2897
2550 2897 4473 4272 2826 770 -1323 -3197 -3944 -2694 32 2690 3956 3851 2330 -96 -2438 -4222
2566 -4222 -4789 -3811 -1345 1640 3839 4503 3681 1993 -366 -2692 -3993 -3311 -1228 1364 3192 3759
2582 3759 2998 1081 -1332 -3634 -5001 -4610 -2293 1092 3806 4797 4156 2487 261 -2203 -3854 -3880
2598 -3880 -2124 479 2897 4020 3395 1517 -962 -3202 -4540 -4460 -2572 364 2999 4373 4251 3045
2614 3045 849 -1654 -3473 -3878 -2717 -322 2075 3367 3161 1881 40 -1997 -3797 -4491 -3376 -780
2630g80K958J909M57r65j935k427k101r97M22J846K575K045O16p97j811k327k150
2647c462j106P57K392K918K197R61n78j819k490k343j499Q7J748K771K301P06
2663C541p03j539j979k049j250K17J764K591K475J327k11j552k274k203j619m23
2679c887J016K221K385J236K03j007j839k206j670l40J216K338K611J682K86j036
2695C209j924k189k196j218N19K153K711J997M95q73j759k198j813p86P39K037
2711a096K733K132O37p90j854k411k258j221L11J806K407J976Q90l29j434k040
2727e41j850j126K60J590K591K227Q90m97j368j970k147j661l54J081K141K297
2743A563J561J46j023j925j964j395m10J028K234K465J502K16j045j994k455k049
$$ plain form
2630 -780 2178 4087 4544 3579 1644 -783 -2884 -3881 -3459 -1613 962 3007 3623 2826 1015 -1312 -3462
2647 -3462 -4568 -3811 -1419 1499 3696 4657 4079 2260 -230 -2573 -4072 -3985 -2237 534 2835 3541
2663 3541 2838 1299 -680 -2729 -3979 -3762 -1998 593 3068 4395 4184 2632 358 -1845 -3464 -3887
2679 -3887 -2871 -650 1735 2971 3174 2167 328 -1878 -3548 -3888 -2672 -334 2277 3959 4245 3209
2695 3209 1285 -904 -3100 -4318 -3799 -1646 1065 3062 3557 2684 925 -1273 -3086 -3872 -3133 -1096
2711 -1096 1637 3769 4406 3616 1762 -649 -2907 -4128 -3817 -2011 396 2372 3262 2933 1499 -541
2727 -541 -2391 -3517 -3257 -1667 924 3151 4041 3544 2176 206 -1941 -3602 -3956 -2875 -734 1563
2743 1563 3124 3270 2247 322 -1642 -3037 -3447 -2419 -185 2280 3782 3998 2953 959 -1496 -3545
2759c545p47Q53K081K508J821M22p62j654j904j772q87O58K129K615J709M32r10
2776C047j824k401j827r46L83J641K289K048Q98m31j325j813j771j123J91J603
2792a361K231J793Q61k40j337k060k174j515k27J280K317K368J306q9j033j529
2808E91j833j599l90J011K084K200J523J12j282k145k159j595n13Q14K056K403
2824A278J737M92o73j663k116j800m95R39J814J998J543K76r06j568j899j779
2840b822j049L18J806K482J934P49n50j293j765j683q88M2J199K023J939R16m80
2857B878j382j989j863j222OJ299K100K052J328K12q49j915k127j482k28J050
2873b132K138K077J020k57j005j711j880j595m37R48K158K350J517L45r37j740
$$ plain form
2759 -3545 -4292 -3439 -1358 1150 2971 3393 2631 977 -927 -2699 -3586 -2928 -799 1816 3525 3957 3047
2776 3047 1223 -1178 -3005 -3951 -3568 -1927 362 2410 3308 2877 1552 -261 -2032 -3155 -2964 -1361
2792 -1361 870 2663 3524 3284 1947 -113 -2287 -3802 -4029 -2749 -432 1936 3242 3153 2120 591
2808 591 -1242 -2841 -3231 -2220 -136 2064 3587 3699 2417 272 -1887 -3482 -3995 -3181 -1125 1278
2824 1278 3015 3507 2834 1171 -945 -2745 -3240 -2301 -487 1511 3054 3330 2424 856 -1043 -2822
2840 -2822 -3871 -3553 -1747 735 2669 3418 2868 1575 -190 -1873 -2761 -2719 -1520 503 2442 3358 2878
2857 2878 1496 -493 -2356 -3578 -3572 -2273 -173 1879 3207 3419 2570 655 -1472 -2954 -3182 -2132
2873 -2132 6 2083 3103 2846 1841 130 -1750 -3345 -3782 -2834 -676 1674 3191 3536 2599 859
2889H59j840j330o11M19J633K131J391L64p56j658j996j550n06P22J650K006J580
2906B508P36k57j295j771j716j166O8J396K015J639O52l25j193j734j784j097
2922c324O2J288K150K113J204k02j302j736j705j273l01R70J847J753J134J63
2938B841r98j866j844j274j47J046K005K085J235J38q83j529j754j526o60Q31
2954b300J516J862J268L17o89j415j574j406o17M74J505K037J719O27n19j332
2970A473j766j790r94L68J282J741J539Q47l41j150j701j593r81K06J363K002
2986E05J854Q32k22j051j745j922j170r0R96J798J823J145j69j119j546j556j003
3003b640j11R30J743J780J096J83p73j520j920j296m22O86J406J879J287K01o78
$$ plain form
2889 859 -981 -2311 -2922 -2503 -870 1261 2652 3016 2260 602 -1394 -2944 -3450 -2728 -1078 928 2508
2906 2508 3244 2987 1692 -79 -1795 -2961 -2893 -1497 518 2157 2809 2484 1291 -443 -2227 -3324
2922 -3324 -3262 -1974 176 2289 3493 3291 1989 253 -1452 -2725 -3026 -2056 -209 1544 2678 2841
2938 2841 1843 -23 -1867 -3141 -3288 -2242 -237 1848 3083 3221 2338 809 -945 -2471 -3131 -2300
2954 -2300 -784 1078 2346 2663 1974 559 -1015 -2421 -3038 -2564 -1059 978 2697 3324 2805 1473
2970 1473 -293 -2083 -3077 -2709 -1427 314 1853 2700 2359 1209 -492 -2085 -3066 -2860 -1497 505
2986 505 2359 3191 2969 1918 173 -1749 -2919 -3009 -2013 -215 1608 2753 2584 1465 -81 -1637 -2640
3003 -2640 -2751 -1821 -78 1702 2798 2981 2208 688 -1232 -2528 -2950 -2264 -858 1021 2308 2509 1831
3020A831j124j566j365o38N73J600J822J419M75m53j374j745j498q08N5J165J877
3037B46J667P84k71j121j688j587q12L47J305J718J537Q26k20j153j705j686j128
3054b941j5J118J819J608P91o3p89j373j412j105k69R57J689J688J056K3j019
3071A763j547j510j120m93P10J412J643J237N03n02j374j559j253m07N84J258
3087f55J631J348L85n15j252j607j540q73L94J412J806J475O15l56j135j399j355
3104a621q01J48J106J701J561O35l98j182j524j471r46R7J028J592J573R49P1
3121B518r10j409j405r20j04P80J536J455P65m4o93j286j565j228l27P22J462
3138f53J728J254K12n75j169j412j233n24M72J278J639J116L19n19j322j608j282
$$ plain form
3020 1831 707 -859 -2224 -2862 -2289 -689 1133 2552 3027 2574 1200 -545 -2043 -2851 -2796 -1631 246
3037 246 1913 2697 2426 1305 -383 -1970 -2782 -2435 -1130 588 2125 2951 2731 1578 -127 -1813 -2941
3054 -2941 -2956 -1838 -19 1589 2380 2317 1528 155 -1257 -2362 -2631 -1674 15 1703 2759 2782 1763
3071 1763 216 -1294 -2414 -2907 -2197 -785 858 2095 2598 2096 722 -837 -2090 -2497 -1913 -655
3087 -655 976 2324 2709 2194 942 -665 -2205 -3078 -2684 -1272 534 2009 2624 2268 1133 -266 -1621
3104 -1621 -2422 -2274 -1168 533 2094 2729 2331 1149 -375 -1846 -2792 -2695 -1667 -75 1498 2447 2518
3121 2518 1608 199 -1206 -2126 -2230 -1450 86 1541 2306 2262 1569 283 -1282 -2510 -2837 -2115 -653
3138 -653 1075 2329 2541 1966 797 -615 -1848 -2372 -1900 -622 1017 2133 2452 1933 611 -997 -2279
3155b279n12M43J250J773J346O45l81j048j461j347q16K48J127J550J252N29l17
3172B002j070j497j259p41J42R86J612J507P71Mr18j282j365r24j43Q04J254J273
3190A156Q93J13p90j301j405j007k87P91J548J623R21K37n43j121j438j174n78
3207b362L85J284J452J157L63o78j165j362j097m41M50J227J613J204N76k89j178
3224A139j525j297n93K87R61J283J182N30j96q84j198j280q15J79J080J547J333
3241A733O75p7q41j273j307r50k41O33J343J397Q51l4p22j143j264q74p0O70J278
3260b16J418J050L32o53j318j471j236l11N50J251J396Q81L31n11r09j292j150
3277a858m45N81J240J434J169K93n17j081j162j229o11L2R74J389J232N50j92
$$ plain form
3155 -2279 -2791 -2348 -1098 675 2021 2666 2285 1237 -224 -1571 -2387 -2139 -1012 538 1790 2319 2002
3172 2002 932 -565 -1824 -2565 -2423 -1437 175 1682 2453 2457 1539 257 -1108 -2032 -2175 -1371 -117 1156
3190 1156 2049 2162 1372 71 -1334 -2341 -2628 -1837 -289 1334 2255 2492 1949 828 -610 -1784 -2362
3207 -2362 -1977 -693 759 1916 2279 1601 436 -926 -2023 -2464 -2014 -787 826 2030 2606 2317 1139
3224 1139 -386 -1683 -2276 -1989 -1028 255 1437 1967 1771 887 -311 -1591 -2406 -2227 -1147 400 1733
3241 1733 2408 2331 1490 217 -1090 -2040 -2281 -1648 -305 1092 1943 1909 1187 44 -1220 -2094 -2164 -1494 -216
3260 -216 1202 2252 2584 1931 613 -858 -2094 -2405 -1855 -604 792 1673 2004 1493 584 -708 -1858
3277 -1858 -2303 -1722 -482 952 2121 2414 1897 816 -346 -1575 -2186 -2154 -1180 209 1441 1991 1799
3294A799r49j199j146m74K02Q67J196J244O65p7q16j198j463q89o4Q13J296J203
3312A010P37J46n37j089j254q83j61O59J334J428Q38Pp27j186j226j039l40M84
3330a799J122J328J040L62m65j089j192r64k66M54J041J273R78L12k93j043j360
3347e61j226m64L49R31J229J098N36k34p68r96j044o88P6Q47J326J188M68j95
3365A872p72j237j245p02%O63J167J247Q50M1o11j071j150q21p3P01J167J181
3383A207P37N3n81j180j305q59k36M82J174J246R60J60m47q80j118r09l46M59
3401a383J030J214Q39K89l99j030j268r67m41K83Q77J269J067M70j52p03j157
3418a62r94o08J60Q97J040J032N54j55q91j121j006p55q3P92J246J161P26M8n86
$$ plain form
3294 1799 850 -349 -1495 -1969 -1767 -900 296 1540 2205 2128 1312 114 -1349 -2238 -2302 -1489 -193 1010
3312 1010 1747 1893 1356 267 -987 -1870 -2031 -1372 -38 1390 2228 2235 1508 322 -904 -1943 -2283 -1799
3330 -1799 -677 651 1691 2053 1588 499 -693 -1657 -1923 -1469 -428 845 1823 2135 1842 799 -561
3347 -561 -1787 -2251 -1902 -971 258 1356 1892 1658 890 -106 -1150 -1838 -1762 -915 411 1599 2067 1872
3365 1872 1100 -137 -1382 -2084 -2084 -1421 -254 993 1843 1884 1273 202 -948 -1769 -1842 -1141 26 1207
3383 1207 1944 1997 1416 236 -1069 -1928 -2164 -1682 -508 738 1698 1858 1411 531 -587 -1496 -1842 -1383
3401 -1383 -353 861 1700 1989 1590 560 -708 -1675 -2116 -1833 -956 313 1380 1850 1698 995 -162
3418 -162 -1156 -1764 -1604 -707 333 1365 1919 1764 873 -248 -1254 -2009 -2092 -1300 -54 1107 1833 1881 1295
3437A295j133j033p18p4O16J011J087P80m4o70j063j101q08k64O63J119J155P99
3455A617K77m07r03j074q71l19L75R78J044P98J79m07r04j004r86l56K67R56J117
3474C77J042M34j90p22j114r15n28K13O35J092R68L53j66p41j018j089o18J44
3492a843P91J113J110O48k5o35r63j022p24m8M91J075J042N88p9n37j000j032
3510a050p09k5N52R53J158P68J88m78q44j015q29k91L74Q38J040O83J55k90q11
3529C67j044p93k97K28Q92J249R18L56l26p24r43q86n80R6O89J028P96N19j14
3548A431q59r66q55m06P6P47J073R94M94M0o53j019j021o21J7N32R22Q87N53J0
3568A376n36q74q91n69j22M94J011J107O29J16m80p97j021p28k57L04O91R22Q07
$$ plain form
3437 1295 162 -871 -1589 -1663 -1047 -36 1051 1831 1787 1117 54 -1047 -1855 -2119 -1456 -337 818 1617
3455 1617 1894 1487 584 -490 -1361 -1680 -1305 -327 717 1515 1694 1287 383 -621 -1607 -1963 -1696 -740 377
3474 377 1419 1853 1663 941 -173 -1088 -1616 -1403 -768 324 1292 1645 1479 738 -280 -1369 -1987 -1843
3492 -1843 -1052 61 1171 1819 1794 1159 196 -826 -1550 -1598 -1107 -32 1010 1598 1519 982 -18 -1050
3510 -1050 -1759 -1784 -1232 -279 879 1647 1835 1357 513 -502 -1331 -1622 -1248 -410 630 1313 1468 1178 367
3529 367 -677 -1470 -1767 -1539 -647 602 1520 1876 1550 826 -117 -1003 -1583 -1487 -798 230 1026 1545 1431
3548 1431 572 -394 -1249 -1655 -1579 -832 241 1235 1729 1769 1116 97 -924 -1545 -1528 -996 -74 813 1366 1376
3568 1376 840 -34 -925 -1494 -1616 -1122 -111 996 1625 1741 1261 464 -557 -1285 -1542 -1238 -547 375 1182
3587A182L17m71p36q97p76k44L94R14R09Q24L26j76p91j038r45m21J42O85J013
3606B11Q05L61j77o40q07p58m96J18P28R62R21N08j57o84q99r21n20l3M60P99
3626b19R76N47p2l35q15r18n33m1O51P98Q51N73Q3l72q39r30p75k54K86R37R63
3647E62N79J61k47o98q13o87k34L26O87R44Q11K63l60p97r93o63m71K62O22Q82
3667A36Q32L40n7o15q46q27k75J54O07R13P86L18j69n47q27q97n80J4N97Q91Q36
3688G84N07O2m88p93p65n08RL57Q09Q60N66J1m63q14r13o22j51L97Q15P99O62
3709A121K62k31o62q62o74k87L24P70Q72N13K28l07p08q12p61l46K68O89Q49Q25
3729A071L40j85n96q16o47m10J43N99P30P18L79j04o09q57q05m46J58N02Q05Q14
$$ plain form
3587 1182 1499 1028 292 -605 -1381 -1625 -1231 -317 592 1416 1742 1566 775 -263 -1208 -1629 -1487 -802 211
3606 211 1016 1377 1200 560 -247 -1005 -1501 -1383 -655 307 1228 1736 1579 895 -4 -925 -1445 -1478 -1018 -219
3626 -219 757 1304 1232 897 82 -836 -1369 -1410 -759 39 890 1463 1546 1174 335 -595 -1370 -1624 -1338 -401 562
3647 562 1141 1302 1055 357 -456 -1143 -1377 -1051 -364 580 1391 1654 1294 497 -496 -1159 -1630 -1368 -746 136
3667 136 968 1308 1251 636 -210 -1037 -1312 -1158 -551 362 1148 1466 1297 750 -77 -974 -1554 -1540 -943 -52 784
3688 784 1291 1353 865 72 -693 -1201 -1192 -835 -26 834 1400 1411 948 134 -779 -1401 -1552 -1155 -340 459 1121
3709 1121 1383 1152 490 -372 -1046 -1333 -1009 -239 633 1146 1374 1067 359 -453 -1214 -1560 -1292 -603 246 1071
3729 1071 1411 1226 630 -186 -833 -1243 -1100 -501 229 947 1326 1222 613 -244 -1049 -1495 -1337 -835 -30 784
3749G84M98N4n25n96p92o11K4L60P65P60M70O7m92p50q11m78j47L24P47R42P04
3770A297J29k67o93q28n60l10L01O05O87O71J83k54p12p83o61k14K04O68R40P07
3790A110K41k21m87o99p53l88Q6N45O83P20M07j62n95p30o24l97L6N18P98P29
3810H17M88m5l21p78q52m57L9K90O56P60M59N5m25n70q02m81j31M37P22P66N62
3831A189J73k76p12q03n25k45K09O08P47N94J86l05n49p02o18k09K62O31P36N64
3851I55L56j60o16p24o37l71R3N08P14N69L60q0m22o40o40m23J04M18P72P45L79
3872A260rn11p33o17m96q6L41O63P37L88Q6k81o16p13m28o4L22O38O99N61J48
3893A289m27n62o82o84j92K82O02O86N59J67j70n05p11n13j90J77N44O81N99K85
$$ plain form
3749 784 1282 1336 811 215 -577 -1188 -1164 -804 -39 721 1191 1258 766 16 -795 -1273 -1420 -1096 -349 593 1297
3770 1297 1426 1159 466 -362 -922 -1232 -931 -326 361 1032 1215 961 249 -534 -1195 -1409 -1205 -537 403 1110
3790 1110 1351 1130 643 -56 -809 -1197 -1111 -566 117 837 1244 1082 487 -243 -867 -1264 -1228 -710 88 817
3810 817 1305 1260 939 161 -691 -1148 -1109 -819 -163 597 1056 1111 686 116 -686 -1167 -1298 -861 -139 627 1189
3831 1189 1362 1086 374 -429 -954 -1199 -990 -382 365 959 1145 840 291 -411 -1029 -1238 -976 -345 391 955
3851 955 1311 1151 535 -189 -826 -1197 -1104 -596 118 687 1047 967 545 -95 -735 -1158 -1054 -636 136 881 1260
3872 1260 1251 740 7 -610 -1106 -1192 -851 -188 549 937 1023 742 126 -587 -1015 -1079 -757 -119 580 1141 1289
3893 1289 862 300 -382 -1066 -1258 -976 -374 312 871 1038 868 363 -348 -861 -1051 -874 -330 351 950 1235
3913A235k39n14p27o25k81P5M97O28O16L91om65o72n99l34J8M25P39N95L12Ml74
3935F99o38p03m99l4L70O70O82M79J3k94n88o19m07j18L05N43P04M07J06k78o45
3956A55o48n63r5K57N29O46N76K01k20m85n99n35k28K34N27O02N08J74j71m28
3976D37p00n30k97N4M12O54O70L52p7l60o50n52m01J01L70O15O03L66o8l60o42
3997co94l71L0L01N77O83L88M5k08n75n88m32n6K48N01P05L88L6k75n72o19l92
4019h83j49Q7O43O46M85J45j34n03n58n10j71J57L74N89N17K26j34m64o11m98
4039g46l07N4N22O81M75K88m1l51n69n94l38Q8L13N69O26K42m2k93n78n85l76
4060i62lL44N50O08M49k0k79n74n16m20n5K24N68M86L72J65l30m41o11l92j94
$$ plain form
3913 1235 996 482 -245 -870 -1151 -1076 -579 49 665 1056 1050 585 -87 -686 -1020 -1002 -577 162 757 1069 1073 699
3935 699 61 -642 -1141 -1175 -805 -135 547 1026 1039 745 157 -462 -869 -987 -682 -139 565 972 1078 800 155
3956 155 -493 -1056 -1151 -894 -365 281 857 1058 838 353 -246 -781 -1009 -775 -248 354 862 1036 865 437
3976 437 -263 -793 -1090 -1036 -624 30 700 1052 975 615 -35 -587 -988 -887 -517 98 701 1067 999 639 -3
3997 -3 -697 -1068 -1038 -737 -160 523 911 956 748 173 -415 -847 -903 -655 -154 551 939 975 700 128 -491 -883
4019 -883 -1032 -945 -302 344 829 974 840 337 -221 -731 -902 -745 -371 218 735 961 827 363 -248 -746
4039 -746 -1053 -999 -477 204 679 967 926 575 6 -588 -926 -838 -525 44 670 912 870 577 -1 -586 -962
4060 -962 -965 -621 -71 537 986 966 687 113 -403 -823 -878 -654 -86 400 772 937 607 166 -445 -837 -1031
4081a031K85M79N92M84K42k37m66n58m40k36R6M33N95N09J25j82l76n12m85k66
4101i49P5M41N49N60L03n8l85m98n98l07nL95N09M57L19K5l73m95m99l41J3K20
4123f42N71N71M02L9l10m83m91l91j27K28M49N12M31J06k43m39n70l96r9J90M56
4144b36N66M44J81j60m23n19n62j73O9M57N32M30K47j16m10n66l76k23K7L36O07
4165A32N43K25n0l20n57n30k96R5K19M70N16L93kl56m69m94l66QK99N58M68L20
4187H06N8k67m14n78l63j37K36L94N89L71J23k41m08m00m52j47J65M51N27M38
4207G51J33j79l83n73m41j08O3L97N05L75K70o3l22n78l57l30J30L61N13M70K05
4228H39J0l45n63m23l33m8L42M69N38K34L4k61m32m99k61r9L41L97N21L59j9j94
$$ plain form
4081 -1031 -746 -267 325 809 1051 814 348 -210 -650 -886 -790 -357 238 747 872 690 314 -198 -683 -949
4101 -949 -874 -433 116 676 979 921 536 38 -560 -867 -872 -477 32 489 808 833 460 -35 -534 -875 -862 -642
4123 -642 -71 500 902 941 631 148 -343 -734 -861 -633 -184 328 759 865 622 183 -387 -783 -882 -692 -236
4144 -236 330 774 955 795 372 -147 -709 -882 -813 -356 176 606 853 737 327 -239 -615 -838 -811 -475 132
4165 132 675 900 850 530 -27 -557 -853 -758 -539 -69 447 840 838 482 13 -481 -847 -839 -540 18 486 806
4187 806 864 597 183 -395 -758 -895 -659 -265 324 695 818 577 169 -231 -683 -830 -665 -214 313 751
4207 751 884 705 322 -251 -692 -800 -737 -340 165 540 810 747 425 -153 -510 -840 -710 -349 164 634 839
4228 839 849 504 -59 -482 -815 -863 -521 -52 486 720 754 493 61 -438 -699 -798 -457 -60 461 820 801 607
4250F07n55m15l45j29J84M25M90M01J25j51l87m60m28q3J83L04N10L87J78j52
4270F89m19m62m70j65R7L81N00M31K08j31k83m59m52j99M5L64M59M35J83k1k58
4291D73n67m22k78K4K69M82M18L29Jk41m17m13k97m6J79N20M52K77k8j92m06m66
4313c49l34r1K19L74M16L75J61j81l16m85l58j83J52L88M91K81J62j16l37n53
4333b84l73j45J16L71M47M07J73j03k49m21l95k98J28K38M74L77K88ll81m31m07
4354d71k05n4K48M58M05L00Qk17m02l70l48q4L12L52M38K46K7j80l72m44l03j22
4376g78K02M44M73K19J13j16l40l97l69j30J28K93M85L60Q8j06l62l86l33k03
4396g15O0L64M34L75J74J4l21m38m05j83M8J94M53M08J80k5k87l66l64l09%K48
$$ plain form
4250 607 52 -363 -708 -837 -653 -228 262 663 788 637 250 -210 -638 -721 -538 -234 276 663 841 689
4270 689 270 -192 -662 -827 -730 -349 151 582 790 659 376 -83 -535 -734 -689 -325 134 569 752 731 473
4291 473 -94 -516 -794 -770 -501 -19 399 728 729 488 71 -342 -639 -685 -506 14 466 743 715 523 117 -349
4313 -349 -683 -774 -555 -181 235 610 771 590 274 -211 -569 -752 -600 -212 279 560 722 606 269 -284
4333 -284 -657 -802 -686 -315 132 539 712 609 360 -61 -456 -754 -626 -388 86 463 751 748 367 -64 -471
4354 -471 -676 -730 -482 -24 381 681 689 472 70 -300 -648 -732 -420 -68 370 616 643 463 91 -353 -656 -778
4376 -778 -576 -132 341 560 673 557 217 -180 -549 -679 -551 -258 227 587 675 569 207 -179 -512 -715
4396 -715 -655 -291 143 518 692 706 385 -53 -458 -641 -593 -399 54 462 642 617 330 -36 -400 -709 -709 -461
4418d61M30M61K43j0j89m08m19j88PR7L69L25L33O0k00l51m31k65p0J63L29M02
4440B27L33J52j46l33l71l48j45O2L70M08K48J60j24k82l59l55r8J8K95L83L78
4461D73J85n1k62l55m71q9K1K13L40L53K40Mk37l69m14k39J03J36M58K99K35L6
4483F09q9l92m44k14j08J53M15L12L18mj34l21l52l04j04J87L14L73L27Q5j27
4504E00k83l61l24j72R5L65K87K91K00j02k53l93k76j78N6L37L53L58R2k2k33
4525C37l72l40j65l7K13M03L12K02k3j87l87k83k47j2K46K67M35J80N7j98l23
4546G8l97j87r6J56L42L56K56N3j32k83l68k91l5J17L33L70K13J16r1k88l69k69
4568d16j37%L08L60L28J01p6k42k76l71j46P9K38L10L39J73J4l10k88l34k02N6
$$ plain form
4418 -461 -31 430 673 663 474 66 -353 -541 -534 -437 -68 257 590 650 450 99 -332 -597 -667 -504 -175 227
4440 227 560 712 566 233 -138 -486 -631 -569 -199 209 457 617 493 211 -148 -503 -601 -583 -288 95 473
4461 473 658 607 345 -10 -481 -570 -549 -336 4 357 597 601 364 -5 -419 -658 -555 -419 39 338 573 609
4483 609 520 128 -316 -530 -638 -485 -70 242 560 556 422 101 -251 -555 -659 -472 -158 215 542 627 500
4504 500 217 -144 -468 -640 -545 -180 107 398 598 496 243 -150 -426 -604 -548 -211 142 500 592 570 337
4525 337 -35 -375 -540 -577 -364 39 351 553 530 343 -44 -327 -574 -586 -340 -73 362 542 599 401 78
4546 78 -319 -506 -602 -446 -104 252 508 561 429 146 -222 -513 -548 -431 -98 272 485 601 510 222 -147 -416
4568 -416 -553 -553 -245 115 443 544 468 226 -50 -421 -567 -488 -250 60 399 572 586 276 -12 -346 -548 -492
4590d92J55L48L24J95K6k32k61l50k49kK08K68L88K15J09k25l49l24k64q1J54
4611d39K63L88K85N5j11l11l56k25p4R6K63L53K58J09j29k16l55l41j23Q7L05
4632b18L09L26J32n7k07l21l28j16k3K56L00M38N2m3j90l50l20j75L5J31L52L32
4654C15J66J05k64l26k67j51m0R8K66L32K55J8j25l27l03k54o7J99J84L76K61
4675D51J57k41j98l31k39j17P7L15K93K71J38j29k45l48k48j27O7K02L41L25R2
4696E06J9k30l88k88j19j3K29L07K90J97m4j45l76l23j03LJ21L54L29K52n1j71
4718C56k89k91k67m9K35K39L01J78J38k08k39l28k12o7Q3K89L34K71R9j22k77
4739A74l27k25j50J21K12L36K76R1j11k41k46k98j34K9K91L17K88J42j14r3m09
$$ plain form
4590 -492 -337 11 335 530 556 324 63 -287 -536 -538 -330 -62 326 541 650 425 76 -248 -512 -593 -439
4611 -439 -176 212 497 552 441 130 -226 -451 -525 -429 -166 187 445 554 425 209 -146 -487 -610 -523 -218
4632 -218 91 417 549 492 285 -36 -364 -480 -503 -247 53 491 543 500 310 -40 -360 -535 -500 -369 -17 315
4654 315 481 586 322 -4 -271 -422 -462 -364 -98 234 489 507 382 55 -248 -502 -569 -370 -186 190 451
4675 451 608 367 169 -162 -401 -518 -441 -126 167 438 576 447 202 -146 -394 -521 -454 -252 89 414 506
4696 506 525 295 -93 -381 -500 -513 -284 23 313 510 466 321 -55 -378 -481 -478 -357 -3 326 578 527 356
4718 356 67 -224 -491 -540 -305 -66 235 413 551 343 104 -224 -436 -503 -420 -131 203 474 573 451 174
4739 174 -153 -378 -528 -407 -195 141 417 508 397 156 -90 -388 -522 -493 -202 115 403 545 431 338 -71
4760g1k62j14l0K01L11K49K54m7k12k92l11j79P4J34K73K86K26J0j71k04l71j77
4782d23j11J33L19K67K47K4j45j91k91k47n8J24K91L17J97R8j09k84l55k17j30
4803e44P9K64L11K91O2n5j45l38k67r5KK79K52K92J30p3k18k96k83j12qK22K99
4826D9K67J36K6k49k37k80j92L6J60K95K81J72J2j19l02l23k21n6J93K52K82K10
4848C92Q9o5k66l50j29j25P7K91L01J79J40j47l38j64k62j18M7K72K81K97J03
4869E05n2k11l32j75j88L3K34K94K35J18k3j95k99k70k17J10J87K43L04J85Pj78
4891C15l36j99j66o8J41K46L37J78qj59k54l27j74K9R6K70K88K41Q1j72k74k37
4913a52k31j1J06J46K98J63J28j26j76k94k28j04J16K28K72L15M7p9j54l12k59
$$ plain form
4760 -71 -333 -447 -477 -276 35 284 538 491 279 -13 -324 -503 -429 -295 -22 264 490 500 329 125 -246 -423
4782 -423 -534 -401 -82 185 432 456 311 120 -171 -418 -476 -352 -61 256 453 551 442 158 -197 -414 -544
4803 -544 -465 -201 110 401 463 408 263 -75 -342 -437 -435 -156 96 388 518 445 227 -69 -352 -464 -472 -250 49
4826 49 316 452 478 229 -8 -288 -480 -444 -284 11 292 464 476 357 55 -268 -489 -545 -352 -100 182 392
4848 392 481 416 150 -200 -329 -454 -377 -86 215 394 534 387 49 -115 -377 -495 -448 -176 105 402 505
4869 505 453 242 -90 -265 -453 -420 -186 108 343 461 438 243 -56 -326 -543 -433 -246 -3 301 486 493 315
4891 315 -21 -220 -386 -454 -313 -67 270 448 440 281 27 -300 -474 -445 -349 -79 209 450 531 359 85 -152
4913 -152 -383 -394 -288 -142 156 319 447 321 145 -149 -377 -481 -365 -137 135 450 497 418 264 -48 -307
4934c07j72O4K42J86K86J30m6j43l12k81j29N3J85K54L05J08M0j26k72l30j45
4955d10J0P7K67K79J92Jj22k40k96j66lP6K64L30J25N9p0k07l19k20p6J00K36
4978a13K89J93P5r7j70l05j94j10M1K49K73J79J33k1k33k69k28j25M7J40L10K00
5000B64J30jj44k70k70j26J8J88K75K50J64o4j33k48k83j72k7J75K28K80J80R
5022D23j28k82j99k49L1J01K32K79K20j2r9k03l54k09m2J46K23J98K54O5m2k29
5044A24k02k53m4K8K10K97J68J11o3j30l61j66j71M6J99K41K32J86m5j46k46k70
5066b55j24j2J86K07L11J23n3j49k30k23j99K9N9K66K27K02K6r2j89k93j93K8
5088c48P0K04L14J31%pl04k21k36PR9J36K97J92J27r4j87k81k14o3j3K52K68J67
$$ plain form
4934 -307 -479 -415 -173 13 299 429 383 240 -72 -353 -482 -429 -244 10 315 423 463 337 65 -265 -410
4955 -410 -400 -323 -56 223 415 416 294 54 -242 -408 -411 -335 -71 259 384 443 373 166 -153 -373 -449 -349 -113
4978 -113 176 369 444 347 177 -128 -322 -432 -391 -142 131 310 443 422 189 -80 -308 -433 -386 -246 64 264
5000 264 394 393 249 -21 -291 -417 -399 -211 64 314 478 414 281 33 -250 -422 -449 -274 -46 234 414 423
5022 423 295 13 -186 -435 -404 -303 -71 208 428 416 317 114 -240 -449 -491 -345 -122 76 330 395 353 124
5044 124 -78 -331 -375 -347 -137 160 328 439 376 246 -115 -281 -452 -406 -207 34 266 452 407 261 15 -255
5066 -255 -379 -391 -205 2 313 436 383 234 4 -219 -418 -389 -330 -64 163 365 391 299 110 -183 -376 -348
5088 -348 -278 -74 240 371 371 364 60 -161 -397 -390 -291 -155 142 334 461 367 180 -101 -315 -378 -391 -139 129 296
5112B96R6l3j72k40j99k25P3K19K22K83J31o0j55k55j56j53p0J59K35K45J75n6
5134C60r2k12l42j31k5J70K16K84J72O3j81j39k86j89p3J09K16K88J48N4n8k60
5156I2k65j97o7M7K64K84J74J07o0j98k60k54n4K8J81K80J99P9N2k26l05j69j53
5179d21L8J41K89K78M7K2j25k59k23j39lJ07K43K50J31lj82j95k34j35p0K14J95
5202c4K02K20pp4k19k42j85o7J02K17K10K95l2o1k27k20k00j24Q8K80J92K07R5
5225D16m5j65k88k22o1qJ86K86J22J99n6j62l31j54j56O8J33K66K80J09j8j84
5247B15k20k27j90J3J03L21J86K03j5j68j67k51j41n3J77J69K88J75K0j56j99
5268H3k48j95k4J0J79L13J58J32m3k14l27j05m1J6J92K88J62J10q0k07k34k48
$$ plain form
5112 296 392 359 187 -53 -252 -477 -404 -185 37 320 451 391 236 -19 -175 -328 -398 -239 -4 241 416 360
5134 360 268 56 -286 -417 -442 -272 -56 228 400 463 282 143 -143 -332 -405 -296 -80 208 356 410 352 92
5156 92 -173 -370 -437 -390 -126 158 332 439 379 181 -79 -333 -387 -359 -178 102 301 380 432 206 -99 -268 -421
5179 -421 -383 -242 47 325 372 394 269 10 -213 -352 -355 -248 -5 245 376 373 191 -4 -238 -373 -443 -229 -34
5202 -34 168 388 381 307 88 -154 -339 -406 -304 -87 123 418 386 325 98 -122 -322 -446 -358 -78 114 321 416
5225 416 371 206 -82 -304 -365 -373 -187 99 221 420 364 202 -129 -283 -439 -371 -238 28 308 417 399 215
5247 215 -5 -232 -422 -409 -306 15 201 404 389 221 54 -197 -338 -391 -214 -45 243 418 438 282 83
5268 83 -165 -360 -384 -374 -195 118 276 408 365 151 -176 -281 -322 -306 -114 174 336 446 366 159 -75 -323
5290c23q3L3J82K11K77J12p4j20k68k17j21M9J60K70K26J13J4j35l55k37j02m4
5312d32J82K25K82P7J10j19k69k33j48o9J89J59L11P2P9j06k35k36j90r4J50J74
5334a21K22K39L3m7k05j95k02j05N9J79K52J74J59j06j47k86k30o2N7J78K19K12
5356B77R6J9j65k11k23j91M1J83J94K40J58j6k22j87k14k43N8J36K10K74K17L
5378D34j48k75j54k01j0J26J56K79J05J49j69j92k62j93n6M8K43L22J61JQj94
5400A78k64k52q6J30J59K29K08R3r4j71k15j70j70J8J92K68K15K01l7k21k08k25
5422b22j17K4J13K66J73J79m0j58k49j80j81J0J47K26K56J48K6j03k50k14k37
5443c83L9R7J21L32R0Q0o9k49k43j86m8J51J86K29K33O4j17j31l18j60j18J17
$$ plain form
5290 -323 -406 -373 -191 20 297 409 335 215 -53 -270 -391 -342 -182 88 314 427 441 306 -49 -286 -388 -432
5312 -432 -250 -25 257 334 444 325 56 -177 -325 -394 -205 -46 265 337 416 310 75 -161 -351 -445 -295 -121
5334 -121 101 340 373 326 121 -74 -276 -381 -322 -143 109 283 442 336 189 -97 -327 -389 -332 -154 65 277
5356 277 373 392 227 16 -207 -398 -357 -174 20 260 418 402 180 -7 -221 -464 -406 -270 -60 214 431 434
5378 434 286 11 -143 -344 -354 -228 -72 207 312 461 292 100 -162 -355 -411 -363 -120 202 363 364 372 178
5400 178 -86 -338 -424 -294 -135 94 302 395 301 130 -85 -255 -425 -407 -215 53 268 469 432 211 3 -222
5422 -222 -339 -315 -202 64 237 416 376 218 -31 -211 -392 -382 -235 -9 247 395 421 318 68 -146 -383
5443 -383 -344 -247 -126 206 296 376 307 58 -185 -371 -419 -268 -82 147 380 444 327 196 -122 -282 -400 -283
5465b83J58J92K76K7l3k19j82k51r9Q9J83J92K46J14jj70k39k34j36rR8K88K29
5488B36J16K3j59k51j81j47l0J62K32K35J79l1j41j44l13j71k4J25K11K32J55
5509C14Q5r9k37k22j77k5R5K06K29K00O7q8j88k75j77j22L2K06K25K51J26j45
5531B81j31k47j76r9M3J67K86K01M3k2j25k55k43j23J3J62K42J74J88k7j11k30
5553A1j95j97j8J71K02K99J43j0j65j96k26j47p8J50J99J89K29K7k4k47k25k21
5575c29m6R1K24K00J81N1p1j60k45k23n8K0J99K40K25J14p5j34k26k24j77J17
5597c06J58K13J75J75k6j90k50k05j32K4J03K75K35R8mj44j65k41j22k9J11K40
5619gK35R5Q0j62k24k55j36j0J35J62L12J14O4r8j60k58k13j0M2K17J91K59k3
$$ plain form
5465 -283 -125 67 343 370 337 118 -64 -315 -414 -325 -142 50 296 410 409 239 0 -234 -370 -379 -281 7 236
5488 236 352 375 216 -35 -216 -363 -393 -231 1 236 415 384 243 99 -214 -385 -409 -284 -73 159 314
5509 314 399 300 63 -159 -336 -361 -266 -60 169 369 436 348 160 -115 -292 -414 -382 -176 49 300 426 281
5531 281 150 -97 -273 -372 -329 -162 124 325 368 346 221 -34 -277 -400 -387 -225 17 191 379 352 241 11
5553 11 -184 -381 -399 -228 -26 273 416 406 241 45 -181 -328 -406 -256 -57 132 361 388 364 117 -108 -329
5575 -329 -375 -284 -60 140 321 372 301 141 -104 -327 -385 -365 -166 74 299 413 338 204 -22 -246 -423 -306
5597 -306 -148 65 240 415 389 199 -51 -256 -388 -364 -261 14 249 347 343 199 34 -207 -329 -358 -247 -7
5619 -7 228 323 403 241 17 -238 -374 -384 -249 -87 225 339 403 305 145 -113 -326 -336 -294 -77 114 373 350
5642C50l5j81k57k35j2J5J97K32K39P7l3k09j85k23q4j1K13J77K22J31l3j55k18
5665a8k23j30K5J54K05K43J40mj36j95k63j55J2J24J95K36J27Rr5k08k42j61j9
5688c79J08J81K63J93K0r8k09k03k02m5N6K03K07J79R7k8k81k17j37r4J01J35
5710a50K79K28M6n5j45k34k11j48O0J67K68J67J30k2j82k38j82j79N2J45K43K06
5732B45J29l2o4k05k72j72jJ41J97J73J95M4j35k10k46j39p1J57J96K23K02N9
5754D14j27j70k53k22l5R0K02K32J85N1k6k22k29j78p8N7J59K60J93R8n1j92k25
5777f7j95j60J46R0K10K53P8l3j42k46j80j31P0Q4K50J89J68pj31k16k43j38J4
5800c37O8K34K37J12L5r3k42j61k15l4J47J83K16J97M0j38k13j83j91q2Q4K37
$$ plain form
5642 350 315 134 -123 -358 -370 -355 -158 74 313 390 357 148 -37 -260 -344 -355 -142 35 257 388 355 200 -18
5665 -18 -241 -371 -346 -192 13 256 396 392 256 61 -202 -357 -345 -221 -26 210 337 346 251 43 -199 -360 -379
5688 -379 -271 -90 173 366 386 288 79 -124 -326 -371 -315 -112 95 274 371 343 62 -155 -292 -386 -285 -150
5710 -150 129 357 403 348 203 -31 -242 -390 -330 -163 105 272 402 380 198 -40 -222 -401 -349 -204 39 245
5732 245 374 342 278 73 -199 -371 -372 -231 -34 139 334 378 243 33 -213 -352 -423 -266 -70 153 355 414
5754 414 287 117 -136 -358 -393 -303 -101 131 316 367 341 119 -110 -288 -366 -309 -150 110 303 401 350 158 -67
5777 -67 -262 -422 -276 -186 24 277 355 322 180 -66 -246 -377 -307 -223 27 216 384 377 246 30 -213 -351 -337
5800 -337 -269 -35 202 314 349 256 14 -147 -362 -396 -249 -66 150 347 387 249 36 -147 -338 -420 -336 -99
5822i9K34J95M8j02j52j92k34p6O2K37J34K69R2p8j59k23k15q8PJ35K84J97J05
5845C81j2j17k97j69j52P6J05K00K50J51o4j56j89k02k11k7J72K10K67J08M8j22
5867B50k14k31j12l4R9J94J92J97M4j10j53k27j92q3J42J41K20J65J29j50j29
5888A38j93j94j96J68J74J77K46N5q4j44k73j49j14Q8J57K26J67J47nj76k63j93
5910b41j30K3J66J62K52J05j4o9k68j97j41MR6K43K84Q2K8j11k25k15j34j09J64
5933b45J87K30J36L1n2j83k36j54k5NK11K27J46J06p4j63k36j92p8N9J78J79J47
5956B04J52p1j65k05j88j13N4J69K84J31J45j9j69k06k38r5K6J64K20J05J97M1
5978D23k41k00k46j08j0J49K40K00J45kr1j92k75j38L2M3K18K42J48L3j10k09
$$ plain form
5822 -99 135 330 378 276 124 -68 -302 -378 -316 -79 55 324 416 338 179 -44 -259 -347 -340 -205 79 276 381
5845 381 369 252 -45 -214 -366 -290 -185 15 265 416 352 196 7 -195 -406 -433 -261 -51 216 324 372 250
5867 250 36 -195 -307 -341 -242 -48 144 341 385 275 122 -105 -297 -380 -238 -97 123 288 417 267 138
5888 138 -55 -249 -445 -277 -103 74 320 375 291 147 -126 -275 -389 -301 -144 82 249 396 391 215 -48 -241
5910 -241 -371 -348 -182 -20 232 337 323 254 -14 -211 -352 -348 -252 -9 275 357 385 274 49 -166 -300 -409 -245
5933 -245 -58 172 308 339 287 104 -132 -286 -311 -306 -95 132 278 384 310 147 -89 -281 -359 -300 -122 57 204
5956 204 356 285 120 -85 -273 -386 -332 -163 121 252 397 378 209 3 -235 -330 -304 -140 80 185 382 423
5978 423 182 -18 -264 -372 -382 -233 7 207 352 350 259 67 -208 -346 -314 -271 -53 189 337 370 260 51
6000E1k09j84JK2K14K15K23J04r4k03k29j65r7M1K29J31K44R9n4j68k78j67p4
6023c48k2J75L06J67J22m6j47k79j45j23l5J82K21J68J66l4j50j65k31j38N3J31
6045a72J67K46J28Rj30j59k68j42n7J21K87J49J47j4J3k44k25j96NR8J50K49J66
6068C28P9r1k34j98k08p0N1K28K38J57J37j06j98j77k35j3K4J08K58K12N4rj16
6091B19k82j75j64K9K08K05K29R9L2j70j75k35k22K6J80K06K11J55J9j23k67j73
6113a68j70m7J17K21J99J70M1n7k20j93j91n4J01J73K07J71R8j27j48k48j96j8
6135c39Q7J49K02J58J12l5j66k38j07k01N4J65K23K27R1l5j75k36k32j13J06J31
6157a72K09J94J24K2j62k01k31r4jJ52J57K09J57M8j78j71k39j39p0J36K23K16
$$ plain form
6000 51 -158 -342 -341 -319 -105 110 333 437 343 140 -89 -254 -351 -310 -81 50 294 393 339 171 -107 -274 -348
6023 -348 -370 -195 111 278 400 354 207 -72 -217 -340 -375 -193 28 196 362 328 178 13 -218 -356 -303 -172
6045 -172 -5 241 369 378 248 89 -179 -321 -378 -257 30 179 326 312 325 81 -144 -340 -335 -237 -87 162 328
6068 328 407 316 82 -116 -324 -394 -343 -115 123 280 417 311 113 -64 -299 -312 -288 -180 78 290 344 335 219
6091 219 -63 -238 -402 -373 -165 40 269 368 400 230 55 -180 -402 -376 -196 10 221 376 395 272 5 -168
6113 -168 -338 -385 -268 -47 152 322 363 306 86 -107 -298 -352 -251 -78 129 300 398 271 123 -125 -321 -339
6135 -339 -252 -103 99 257 369 334 168 -70 -177 -378 -324 -159 64 291 382 347 172 -64 -296 -409 -303 -172
6157 -172 37 231 355 377 215 14 -217 -311 -312 -160 -3 206 363 411 233 62 -177 -316 -386 -250 -27 189
6179A89J40O1r7k01k02k17QO4J45K19J53M8Rk00k67j87lL7K12K13J40J15m7j69
6203A63k22j68j38P4J58K40J48J26n4j35k10k35r4NJ60K61J70J16Rj96j32k07
6225a61j05rN4J86K78J08m5p2k42j98j61J2J45J86J54K13M0k1l59j64j52m5R4
6248b64K05J81K31m2m2j72k17j72l3P0J65K37J41R6r3j61j98j72p3K4J44K60J61
6271B76N0j8j34k11k27j45R9J95J70K08J20j0j88k03j83j47n0K16J90K21J0J13
6293C52j39k11k03j22oJ33J98J92J62N3j26k16k24j81k0J2K17K23K41Po3k14j86
6316a21j66r7Q0K24K25K16%l3k14j77j86j25N9J58J87K26J15o6j59k30j14j01
6338b99K6J03K26J88J70l6k11j73k22r8K4J22K09K36R8j8j58j48k32j33j7R6K07
$$ plain form
6179 189 329 390 293 92 -110 -327 -319 -255 -110 109 262 310 319 119 -148 -335 -338 -301 -89 124 264 379 332 163
6203 163 -59 -227 -365 -291 -133 107 255 381 327 192 -18 -253 -347 -342 -182 79 249 365 374 178 46 -161
6225 -161 -266 -275 -221 -35 243 351 306 234 -8 -206 -367 -355 -210 -24 130 343 383 362 3 -161 -313 -358 -264
6248 -264 -59 122 353 311 269 97 -120 -292 -325 -255 -90 147 288 384 291 130 -68 -240 -313 -289 -145 115 276
6271 276 326 308 174 -37 -264 -409 -310 -115 55 263 383 373 185 -18 -201 -348 -398 -182 8 229 239 352
6293 352 213 2 -201 -323 -329 -196 2 194 356 409 283 67 -157 -338 -358 -346 -129 94 335 342 279 65 -121
6316 -121 -287 -384 -304 -80 145 361 361 328 114 -63 -249 -374 -315 -157 30 256 371 305 146 -84 -198 -299
6338 -299 -273 -170 56 244 414 378 167 -6 -228 -326 -302 -180 29 265 363 345 187 39 -193 -326 -343 -247 -40
6361d0K62J61n9j02j31k38j96JN7K18J89J36P0o1k01j81j98q1J14K60J68J68K1
6384C37l9k26j73k32oN0J29K80J99N1n8j46j88j86r9N8J34J90J64J05l4j37k14
6407d1j75j24K5J01K39K04Q8q4K0k55j54j21n2J41J95J82J73n2j24j58k33q8n8
6430c51O3K19K58J39Mr1j36k28j39p7J34J30J92J68N3l9j64k56j93PRJ78K01J35
6454B16J42Mk42j58j50j69Q7J43J90K15K3j0r4k22j67j53QJ99J83J89J36n0j51
6477A69j62k43j26L5J28J60K01J84k5j44j56j88j60n0J57J71K02J47M7o2k17j87
6499a19k17k0R0J98J99J76lj01o9k40j33q4J19P6K28J85P2pj74k30j69j16oJ90
6523a55K19J84M7k8j52k12j41j16%K06J76K02J38l6j55j75j79j63J5J88R5K54
$$ plain form
6361 -40 222 383 324 222 91 -147 -343 -342 -285 -67 122 258 328 267 66 -115 -313 -394 -280 -20 148 316 337
6384 337 298 72 -101 -333 -339 -289 -160 120 319 370 312 166 -22 -208 -307 -249 -115 75 239 344 310 173 -41
6407 -41 -216 -340 -315 -214 25 229 317 233 253 -2 -156 -277 -329 -188 7 189 362 310 186 28 -205 -293 -351
6430 -351 -288 -69 189 328 332 241 105 -123 -262 -339 -205 -75 117 285 338 299 135 -121 -314 -307 -298 -120 81 216
6454 216 358 362 120 -38 -188 -357 -270 -127 63 278 301 291 197 -25 -192 -345 -337 -138 45 234 370 320 169
6477 169 7 -236 -362 -327 -199 -39 162 346 321 177 21 -167 -327 -377 -220 -49 153 300 347 285 68 -119
6499 -119 -336 -356 -266 -68 131 307 304 203 134 -106 -239 -323 -204 -128 100 285 357 350 176 -54 -223 -339 -345 -155
6523 -155 64 248 295 267 115 -97 -238 -354 -354 -148 28 230 368 332 177 2 -177 -340 -325 -137 -42 212
6545B12J08J9j43j63l00j6o0J21K09K64R9l7lk76j69j31l1P5J22J88J72RL3k23
6569G9k41j58l5O0J72K46J87J08j55j41k09j57q8N1J99J83J51J07k0k08j34k47
6591b50o9P6Q9K75R7J17K8j49k34j80q9OQ1J96J89J50j1j57j72k08j08k7J23K54
6615B7J79J03O6r7j98k62j27o0N9K16K21J72rl2j61k34j58J3L0J74K44J68O2r8
6639B98j48k58j50r5N3K11J58J37J28k3j83k08j83q5P5J33J80K01R5l5j12k21
6661c2k07j23L8J31K31J82Q5jq2k28j96q0J2J05J46K39J02N0j69j83j57j73k2
6684c32J22J44K18J94o7mj84k48j50j6J04J70J95J85J5o0j81k00j78p9L2J68K09
6707E7J81J10k0k19j64j44j26Q9Q7K22K09L2L4j55k39j78j16N5O8K55J79J19O
$$ plain form
6545 212 320 339 196 33 -267 -283 -343 -222 -13 251 350 313 310 34 -135 -266 -297 -222 -100 88 260 269 302 79
6569 79 -162 -320 -355 -295 -123 123 310 418 263 122 -87 -244 -332 -281 -82 101 252 359 339 131 -3 -250
6591 -250 -319 -243 -154 121 218 335 363 214 -20 -200 -289 -283 -202 -6 183 333 322 165 -7 -215 -323 -350 -227 27
6615 27 206 309 375 278 80 -182 -309 -369 -310 -94 127 299 290 258 97 -137 -295 -282 -252 -78 166 334 396 298
6639 298 150 -108 -258 -353 -300 -89 69 206 334 311 128 -80 -263 -348 -273 -140 40 241 336 301 189 -32
6661 -32 -239 -362 -324 -193 38 220 305 304 222 -6 -202 -282 -270 -165 -19 220 322 372 203 20 -137 -310 -332
6684 -332 -210 -66 152 346 279 275 91 -157 -307 -323 -219 -49 146 331 346 286 105 -95 -273 -352 -320 -152 57
6707 57 238 348 328 109 -55 -199 -325 -236 -149 73 282 314 348 193 -46 -224 -340 -285 -217 38 217 336 342
6730C42j70j60j62j60L4J22J26J90J68m7p0k33j60j88P0R9J14K81J08M4r5j61
6752I2k27j43m6J07J46K18J03O6p9j84j46j87n3N2J51K16K18jm3j49j81j53j39
6775c62J13J37J84J77M9j3j62j53k22p9pJ36K54J68O4O0j42j50k36j12K4J19J56
6798CJ73J80oj52j81j41j63k7O3K33K16J10Jm3k18j61j96r2J29J64K30J55Rm6
6822B40j75k48o7q9N0J73K17J43J02o3k14j31j42j32O3J29K02K31L1m9j29j82
6844d0j83r7K3J49J67K69P2Pj64k29j77j47L1J50J86J77J21j1j23k35j31j61M0
6867c06J30J18J88J94mr3j37k12j14q8Q9K08J06K01K2l1j44k64j10r1J27J15K28
6890A32J44R6n9k07k21j36j27O1K60J06J82L3l8j11j54k57l5M0J98J42J78L9j
$$ plain form
6730 342 172 12 -150 -310 -276 -154 -28 162 330 283 213 -20 -180 -368 -298 -199 -85 196 304 348 253 92
6752 92 -135 -278 -324 -217 -71 147 250 316 237 53 -93 -280 -333 -281 -130 86 304 303 260 111 -70 -223 -362
6775 -362 -249 -112 72 249 298 285 123 -30 -252 -331 -338 -202 52 220 284 344 202 52 -184 -296 -272 -153 3
6798 3 176 356 350 198 17 -124 -287 -314 -251 -18 198 308 309 266 48 -113 -309 -401 -272 -108 122 277 286 240
6822 240 65 -183 -250 -339 -289 -116 101 244 346 283 69 -62 -204 -336 -273 -144 58 289 320 271 142 -40
6844 -40 -223 -320 -297 -148 19 288 360 367 203 -26 -203 -350 -319 -169 17 194 315 304 181 -54 -185 -346 -306
6867 -306 -176 -58 130 324 320 227 90 -122 -236 -324 -235 -27 79 280 302 271 127 -137 -247 -338 -211 -96 132
6890 132 276 372 313 106 -115 -251 -378 -317 -57 49 231 264 226 115 -39 -296 -331 -291 -93 49 227 266 265
6913B65m8k21k06j23L8J14J85J73J21K5j27k22r0j67J7P4K23J84N9M6j19j55k01
6936a55j40l1Q9K34J28J35R4j34j63j45j73m8O8K11J55J17J51j47j53j91j14j09
6958c21P0J05K31J51N8j01r0j69j76l4mJ57K48J36M4j6j24k42j32r9k4J89J18
6981b5J98J19m3p8j44k25j31M2J12J91J46J75J4r4k61j44j26k4Q0J71J60J75N7
7004C45n9k05k27j00m0O3J83J89J37J5m9j80j58k09qJ00J06J88J89mj1j62k22
7027a19r5j05Q6N9K42J34J39r9p5j84k11o2K4R3K23J60J07J9j06k41j68j24M0
7050b63J05J50K02J05J6j12j90j78j48L2N1J62K31J05N9r9k25j33j31k1P4J30
7072g8K38P3O0p9j82j10k03p5J37P4K49J02J39p3j36k25j38m5P3J04J90J68Lq
$$ plain form
6913 265 217 -4 -210 -333 -295 -181 4 177 298 323 196 -26 -116 -283 -266 -192 31 215 274 320 201 46 -155
6936 -155 -295 -326 -237 -3 125 260 354 220 57 -88 -261 -309 -241 -30 125 242 393 246 93 -98 -212 -321
6958 -321 -251 -146 85 236 294 193 103 -66 -242 -276 -280 -123 125 261 305 289 165 -77 -209 -308 -332 -143 -25
6981 -25 173 292 249 171 27 -198 -329 -287 -175 16 162 337 351 257 -4 -148 -274 -298 -218 -47 113 288 345
7004 345 286 81 -146 -246 -286 -223 -40 149 286 301 252 72 -86 -295 -303 -203 -97 91 280 276 265 103 -119
7027 -119 -214 -319 -233 -174 68 202 341 242 167 -17 -228 -290 -266 -173 50 210 317 336 230 -11 -179 -303 -263
7050 -263 -158 -8 194 299 315 203 13 -165 -313 -281 -230 -68 163 268 327 228 3 -130 -261 -282 -208 -78
7072 -78 160 233 293 214 32 -78 -281 -356 -219 -145 104 206 345 272 136 -89 -227 -272 -199 -95 95 263 266 258
7096B58j11k26j38j00O8J82J40R6J82r9j27j31j41j48J6J36J22K38P1jq0k01j29
7119a23j53m6R0J93K32J11J6r5j41j62j37p7J14J62J13J24J27r1k20j18j85j3
7141b79L3J70J79J65j3j7j97j57j21p5J6J34K47J05J10o2j13j92k03k7L1K06J73
7164A13J15O9n6p7j47k34j08M6J26J88J37J35m4j48p7k46o9K2R8J52J57J32N6
7187C40j11k05j76j59p9J67J56K14J37L6j12k08j18j52mN1J73J98J41opj94j51
7210f9j40l1n2J57K25J38J26j04j36j83j57j5N7O3K60R3O0qj20k53r7j34N4P3
7234a93J85K11j0L8l4j75j99j14L9J20J57J52J01N4j14j83k37p4J3O6J26K29P2
7257B30R1j11o9k15j54l9L9J78J42J99J2o6j66k12j40n5J18J44P6K38Q7p2j80
$$ plain form
7096 258 147 -79 -217 -317 -249 -67 73 169 351 252 125 -6 -147 -295 -279 -143 -21 217 288 287 207 6 -123
7119 -123 -276 -322 -232 -39 193 304 320 225 84 -78 -215 -292 -178 -16 97 221 348 257 37 -81 -266 -279
7141 -279 -246 -76 103 268 255 238 41 -116 -237 -312 -296 -162 85 190 300 238 125 -67 -270 -297 -266 -60 113
7164 113 228 297 241 164 17 -217 -325 -279 -153 35 172 307 263 115 38 -208 -277 -255 -157 -5 152 284 340
7187 340 229 24 -152 -311 -390 -223 -67 147 284 320 208 0 -118 -270 -274 -223 -50 148 289 283 276 82 -69
7210 -69 -209 -240 -292 -135 90 228 354 250 114 -69 -226 -241 -184 -121 139 232 292 284 164 -89 -186 -320 -266 -193
7234 -193 -8 203 193 231 197 22 -177 -291 -252 -132 25 177 278 332 218 35 -202 -276 -263 -197 -71 158 230
7257 230 321 210 141 -74 -228 -267 -228 -50 92 291 303 237 71 -141 -281 -336 -218 -74 2 240 327 255 75
7280G5j84j22n1k2J89J83J54J02o0j21j71j05j42l8J86J45K05Q1k0j41j84j12
7302a53j04k6J18K02J56Q5m4o0j92j70j04M0P2J63J49J75K3j16j76j54j36j5J06
7325a61J07K06Q0P4r7r8k26j57m6J05J10K61J15P0l2k00j54j87m0N1R5J68J85
7348B29N0k7j82j71r8j08N3J34J66J88Qjj45j33j17j15j3J90P3J93Q3K6j68j64
7372d9j34o3LR3J75J72J01Jo0j03k70j06l0J08J41J13J74Jp6j59j50j29q1J10
7396b18J48K00Q8K0L7j55j93j15j45J13J34J18K43j1q8o2j66j50l9L6R4J88J41
7419B18P4m4p5k11j92J2k3O0K19J36J39m4q6k08j75j02l5J94Q6K16R6N9j69j01
7443D4j96j23k5P5J76K34R2l0n8k04o7j46k7P1J41J81J70J6j12j44j40j32q0R5
$$ plain form
7280 75 -109 -231 -282 -304 -115 68 222 324 264 143 -28 -133 -275 -313 -127 18 223 304 284 143 -41 -153
7302 -153 -257 -283 -165 37 193 278 234 174 -18 -188 -292 -252 -180 -17 132 307 330 214 38 -116 -252 -267 -161
7325 -161 -54 152 232 306 209 111 -115 -272 -318 -213 -103 158 273 343 311 111 -43 -230 -270 -219 -124 44 229
7348 229 279 252 70 -101 -199 -307 -254 -120 46 234 242 241 96 -37 -154 -269 -282 -92 -19 174 257 283 115 -49
7372 -49 -183 -246 -243 -150 25 197 298 299 239 136 -134 -240 -270 -162 -21 92 266 267 191 32 -118 -247 -328 -218
7396 -218 -70 130 218 238 275 120 -73 -188 -333 -220 -86 32 275 264 176 114 -52 -202 -241 -205 -111 77 218
7419 218 292 248 173 -38 -230 -218 -241 -181 38 174 313 269 183 -25 -200 -302 -337 -143 -57 159 255 314 145 44
7443 44 -152 -275 -300 -225 -49 185 277 247 189 -15 -82 -228 -255 -184 -43 138 308 324 212 68 -72 -204 -284 -189
7467a89R2J95J49L5l4j53j86j10o1OJ70J74J04J04l6j66k10p4q2oJ60J36J42J22
7491B82m3n5k10j16q1l0J73R6J91J19l4j13j68k02j05M3O2J55J52J52k2q2j07
7514E7j87j06k3L4K13J51J30K5j35o9k06j20j42J81J53J63R0J24j20j01j75j24
7536a87p9P9J70J32J41L3k5j37j63j69q0R8P6J48J76N8Mj17j56j44j20O6M0K12
7560E6J21P7M1j46j27k09o5k5Q4J77J47J18Kj09r4j73j76R5Q7J27J80M1P7j12
7584A94j31k14r0l3N9J58J21J14Q1m6r7j87j45mO1P5J93Q5J03p4j56j55j16q1
7608b85l1J62K05J68O8k2j65j67j28m9KJ49J68P4J40r8j6k06j29j7q3J02J43J90
7632A75O1P3j55j46j52r1n5N9J97J41J58K2j31j53j63o0p7Q7J61J67R0N4l4j50
$$ plain form
7467 -189 -97 98 247 282 248 95 -91 -201 -262 -256 -86 88 192 296 260 94 -116 -190 -272 -278 -118 18 160 282
7491 282 239 184 -26 -142 -223 -253 -80 16 207 326 292 179 11 -191 -296 -253 -191 -36 116 268 246 164 57
7514 57 -130 -236 -259 -225 -12 139 269 294 159 90 -116 -236 -378 -197 -44 119 209 333 213 112 -63 -187
7536 -187 -266 -187 -17 115 256 289 264 127 -36 -205 -285 -187 -111 37 213 271 275 158 2 -142 -262 -196 -156 56
7560 56 177 254 295 149 22 -187 -252 -277 -193 -16 131 249 251 142 48 -125 -301 -206 -119 8 188 229 306 194
7584 194 63 -151 -241 -274 -215 -57 64 178 259 213 116 -71 -216 -220 -159 -84 109 194 297 223 67 -88 -204 -285
7608 -285 -316 -154 51 219 287 265 100 -67 -195 -244 -242 -93 75 149 289 191 175 -31 -160 -177 -260 -158 -15 175
7632 175 236 309 154 8 -144 -235 -290 -231 -34 107 265 287 156 3 -160 -220 -297 -210 -49 118 208 262 228 78
7656G8j82j26n6J05J29J16J35P3q1j05j74r3j03O5J29J62J13J17l4j57j40j76
7678b05p4M7J26J14K10NN6j42j44j74j36P8J33P7K25J00k5j27j15j58j08j0J05
7701a42J98M8J16M7p6j54j67j10K7N9J24J83J29l2mj69j56j17q1M3J78J29J19
7724A92Q9m4j56k01p7l1K5R3K15R8J35j16j87q5k01l3O3P7K01J30K9k7j1j71j96
7749a89r1L3J01K22J75n7N3j23j73q2j24j7J12J63J35M6P5r1k09m7j08n0R2J42
7773a2J17J26j1J3k15j72q6m0N8J33J75J01N5k3j02j78j44j6K6J30J00J71R3p9
7797B20j28j87j11r0M8J54J44J16J07m8j37j03j85q6P0N0K43O9R1o5k1j53j92
7820a94p7L1P8J13J92J08pj16o4j75j15l0Q7K14M9J38N7j12j29j69r5o1J03J62
$$ plain form
7656 78 -104 -230 -286 -181 -52 64 199 272 191 86 -88 -181 -284 -219 -90 72 185 302 268 111 -29 -205
7678 -205 -279 -232 -106 8 218 223 279 137 -7 -181 -317 -239 -106 -29 196 296 271 144 29 -129 -237 -247 -142
7701 -142 56 104 220 267 191 37 -130 -240 -213 -154 -30 153 282 250 246 77 -79 -196 -277 -234 -56 73 192
7724 192 281 237 81 -120 -197 -228 -203 -110 105 203 338 222 35 -50 -251 -284 -221 -144 57 187 216 189 178 7 -189
7749 -189 -280 -247 -146 76 251 194 247 124 -49 -131 -255 -272 -160 3 138 184 259 168 -41 -88 -196 -246 -154 -12
7773 -12 105 231 220 233 18 -154 -240 -280 -222 -89 86 187 242 219 117 -61 -205 -221 -195 -65 35 206 299 220
7797 220 92 -95 -206 -296 -248 -94 50 166 273 225 88 -15 -200 -286 -216 -166 77 146 237 172 151 -2 -194
7820 -194 -271 -240 -162 -49 143 251 244 128 64 -111 -226 -256 -169 45 94 232 289 177 48 -121 -216 -277 -174 -12
7844a2J17J08K7m9j39j34j36kj5J49J56J30M0o2j33j28j15q2K2J25J88J04O3K5
7868B47q5j57j85n3M4J00J79R0J22l1j76q7k18m1rJ22J58J02J29N0j68j50j51
7891a68p7n4J36J41J52R2J6o9j01j73j30oQ4J48J34J34Qm2j31k01j39j2R0R4J67
7916I3J74j0j9j45j98q8o4O6P3J94J50M6r3q0j51j77n5RJ39J68J40Q2l4j06j63
7941d9j19j05K1J22J41J91Q6o1o1j36j76m7o7P4K31Q1J03N8j13j53j81j1p1P7
7965a65J36J99Q1J8j09k3k19j25l8Q2J16J20J90n5n0q4j63j20n3R7J08J47Q1R2
7989B63k7j16j79q4j29R2R6J15J33R8m8n7j62j47p4L3J01J39J50L9L7j34j35j49
8013a45r5L5M4J47J26J34K7j23j28j29j08k8N2J77J32J13J8j23j35j42j21L8l2
$$ plain form
7844 -12 105 213 240 191 52 -82 -218 -220 -235 -86 70 200 240 178 45 -83 -198 -280 -258 -133 55 159 222 247
7868 247 162 5 -180 -233 -189 -89 90 180 302 271 95 8 -210 -251 -260 -138 20 122 251 301 133 -17 -168
7891 -168 -245 -299 -163 -22 130 222 238 169 68 -105 -235 -241 -157 -9 125 259 267 225 94 -107 -246 -258 -168 -74 93
7916 93 267 257 238 93 -105 -193 -257 -191 -118 76 226 272 179 99 -52 -229 -284 -275 -136 32 172 254 220 114 -49
7941 -49 -168 -273 -252 -130 11 202 288 227 166 30 -146 -193 -260 -186 45 126 229 287 174 21 -160 -171 -242 -165
7965 -165 -29 170 251 269 160 137 -82 -207 -245 -163 -47 73 263 208 158 74 -89 -209 -262 -165 -57 90 171 263
7989 263 236 120 -59 -143 -272 -180 -84 31 164 262 214 157 -5 -152 -226 -193 -92 47 197 236 273 139 4 -145
8013 -145 -240 -205 -161 -14 112 246 273 150 22 -107 -215 -243 -191 -14 118 231 249 126 -9 -151 -272 -234 -266
8036b66K31J67J23j1p2j11j28j78l9J11Q8J79J63K4p0j06j82j35r1P8J79J07J11
8059A72N4n6r3j22j44j4k5J07J33J01J35k1r5j43j14j66N3Q0J78J59M1N2j03j90
8083b1o7j60N9JK11J05J79j21rj44j92r7j3J17J20K00M0K6q3j14j43j10l3P9M4
8108a26K24Q6Q7l1j81j02j97n9J03R6J87J32L8o5q5j45j14o5K5P6J88J64L4Jj78
8133I3j29j25j12M4J22J03J37J24n0j4k07q5j57j0J07J25J46J58m6l8j30j36j19
8156a99l2J36K5K05P4O5m2j58j55j23n2Q4J00J65J18O9r2j07j94r9l1R2P0J22
8180D1J34M9l6n6k06j42j05J62L1J51J57
$$ plain form
8036 -266 -35 132 255 244 172 61 -67 -245 -284 -173 -85 94 257 281 211 105 -77 -212 -303 -225 -46 61 172
8059 172 226 170 77 -45 -189 -203 -228 -121 12 113 248 227 132 -11 -125 -291 -238 -158 20 179 220 272 169 -21
8083 -21 -88 -248 -189 -188 23 128 307 186 177 33 -159 -256 -269 -152 -32 168 208 234 151 37 -106 -216 -249 -170 -126
8108 -126 98 184 271 240 59 -43 -240 -299 -196 -100 87 219 257 192 107 -38 -152 -217 -192 -116 72 236 270 271 93
8133 93 -36 -161 -273 -229 -107 -4 133 257 207 193 -14 -99 -256 -266 -159 -34 112 270 224 186 56 -80 -199
8156 -199 -231 -95 -70 135 209 274 232 74 -81 -204 -256 -172 -72 93 211 280 188 81 -113 -212 -243 -151 -81 41
8180 41 175 224 188 132 -74 -216 -321 -159 -128 23 180
8191A80
$$ Imaginary data points
##PAGE= N=2
##DATA TABLE= (X++(I..I)), XYDATA
0@%%%%%%%%%%%Qj6J6j6K4l2M0m8N6p2Q8j04J20j39J63j92K24k57K92l34L82m36
33b33M96n60O29p07P95q89R93j106J229j365J513j675J852k044K253k484K740
50A437l017L323l663M041m463M937n478O093o806P645q642R861j1385J3349j5999
65h767J9791k5705L6314o1262K31156J85544l33011j76725l8026J02026k240n3473
77a24378k4918J23194J26534J0841j34504j01372J5458R9015L7749k8207o043
88f631J02142J15764P650j21077j23289m8082J406l2196n2793R646J15375J18737
100H6652j99j11600p5272N4979J14258J9566j01912q1354P4633J71390Q7968q1410
112A57699j51900q0726Q762n230p8591o6949O9658J87734J41915k8672j44414
$$ plain form
0 0 0 0 0 0 0 0 0 0 0 0 0 8 -8 8 -8 16 -16 24 -24 32 -40 48 -56 64 -75 88 -104 120 -137 155 -179 203 -233
33 -233 263 -297 332 -375 420 -469 524 -582 647 -718 795 -880 972 -1072 1181 -1303 1437
50 1437 -1580 1743 -1920 2121 -2342 2595 -2883 3210 -3596 4049 -4593 5268 -6117 7232 -8767
65 -8767 11024 -14681 21633 -39629 191527 377071 44060 -132665 -170691 -68665 -70905 -124378
77 -124378 -149296 -26102 100432 111273 -23231 -124603 -109145 -10130 27619 -588 -6631
88 -6631 95511 211275 218925 97848 -25441 -73523 -72117 -104313 -157106 -147460 -32085 86652
100 86652 86453 -25147 -100419 -45440 68818 88384 -13528 -94882 -20249 151141 239109 157699
112 157699 5799 -74927 -66165 -71395 -149986 -216935 -147277 40457 182372 153700 9286
123I286j01179J9460O8358J9811j6307K8734Q5431N6319m4681j12450q4538j5312
135h7068M18l8179l4844N5057J40423J07506k3858j14271p2392L2845O5231J632
147C2500m5407M819Q5882P6778l5412j30417r8675J7852P1530O74q5913n5584
159a61373P0857J47229Q6287l7196q5684l1994K3389M313m1191k3741N4794R8626
171A04316L9936o8991j12302n6700R506N604l1324j1705O9783J19859O8726l4027
183A02681p7932l3197J6972J004m4106l0246N3534J13170N9115p0340j39878q1412
195a30635K2713N2656L861k5984K2272Q9428P8520j1832p9147n0143K5611M6588
207D3908q976n9455k8358N2156P7834R259p2166p4692j4843K0418k640k6827Q193
$$ plain form
123 9286 -91893 -72433 -4075 15736 -571 28163 113594 169913 125232 12782 -71756 -87068
135 -87068 -86650 -124829 -159673 -104616 35807 143313 119455 5184 -67208 -34363 30868 32500
147 32500 -12907 -8088 77794 154572 119160 -11257 -109932 -92080 -20550 -19876 -105789 -161373
159 -161373 -90516 56713 143000 105804 20120 -11874 11515 15828 -25363 -49104 5690 104316
171 104316 144252 75261 -37041 -93741 -84235 -78631 -109955 -121660 -51877 67982 136708 102681
183 102681 24749 -8448 8524 9528 -34578 -64824 -11290 101880 160995 90655 -49223 -130635
195 -130635 -107922 -55266 -51405 -77389 -55117 34311 112831 100999 21852 -28291 -2680 43908
207 43908 34932 -24523 -52881 -725 77109 86368 14202 -60490 -75333 -54915 -57555 -84382 -76189
220g6189P6027R1560K6104m9676n5820o001J8947j7856n8004k6584N8312R5091
232G5911L1054o3887q7368l3131J5462L270k7779k269P6021J16193N5289n3789
244A04977j00833n0433K2192L0646j4918l1169J7201O4720L7907m0381q1023m3511
256h4625J8847L2866j643j6716K4950P4220O0128j1990o3838m3614Q205J7192
268A3982k2829m3172l49N6851N3243j0992o0172m0667J3121K6914j4006m1631
280f9707J332P7918R6624K7821n6275p1967k4282R272j1914l9261j1511N3650
292a8300P8639K5587n3469p7064l1010K0442K1241n096L195N1178P5629L0343
304A21315m5269p3046l4545J0083O607k2125j7030L0039O0820K7340m0586o6222
$$ plain form
220 -76189 -162 91398 117502 67826 12006 6005 24952 7096 -50908 -77492 -19180 75911
232 75911 106965 43078 -44290 -77421 -61959 -58689 -86468 -88737 -12716 103477 158766 104977
244 104977 4144 -46289 -24097 6549 -8369 -39538 -22337 42383 80290 39909 -41114 -84625
256 -84625 -65778 -32912 -34555 -51271 -26321 47899 108027 96037 32199 -11415 -3210 13982
268 13982 -8847 -52019 -52368 4483 57726 46734 -13438 -54105 -40984 -14070 -28076 -69707
280 -69707 -68375 9543 106167 133988 77713 5746 -18536 -9264 -21178 -60439 -71950 -18300
292 -18300 60339 85926 32457 -44607 -75617 -55175 -33934 -39030 -35835 15343 90972 121315
304 121315 76046 3000 -31545 -21462 -14855 -36980 -54010 -23971 36849 64189 23603 -42619
316d2619k2637L2373L1701j1375k4943K0357O7922N0361j9061o2640l8416Q949
328a0028J2899k5750m3848k573N7011O4103P466m7973m4050r15J6973o856k2127
341d5668J2323O4535O7676Q352n3742o0180k2518J193j3077k6859K922N6559O8928
354F0444J4443n2206o0951j3311K5584J4708j1606N14M5444O2087J6235n0232
366E1153o8973k8119J5975J3212j7913j9305K2388N4806L0858k5202m7601j5414
378c4135K2929J8007j4609j9976J8481N3980L7566j8203n2699l3625K727L774
390a5783k6586l2547J2610O3992O0114K045m6005l8243j91J3045q345j9632J1633
403b3893N6414N6995J066n7010o0768k0308P191k926j4766R538N1149N5848Q202
$$ plain form
316 -42619 -65256 -32883 -1182 -12557 -37500 -17143 50779 101140 82079 19439 -18977 -10028
328 -10028 2871 -22879 -66727 -69300 -12289 51814 59280 11307 -32743 -33658 -16685 -23541 -45668
341 -45668 -33345 31190 98866 107218 53476 -6704 -29222 -28029 -41106 -67965 -65043 -8484 60444
354 60444 74887 22681 -38270 -51581 -25997 -11289 -22895 -22381 23063 85150 101385 51153
366 51153 -17820 -45939 -29964 -16752 -34665 -53970 -31582 23224 54082 28880 -18721 -34135
378 -34135 -11206 6801 -7808 -27784 -9303 44677 82243 64040 11341 -22284 -19557 -15783
390 -15783 -42369 -74916 -62306 1686 61800 63845 17840 -20403 -20594 -7549 -15894 -35526 -23893
403 -23893 32521 89516 90582 33572 -27196 -47504 -40313 -43239 -58005 -48467 2682 58530 66732
416F6732m3681m6678p944J9607Q286j1837K80L7212M7597N331m9276n6309j4398
429d5078J9570P981k1171j5763K7040N5564L1089k0578m1378j4938J7000J1757
441A1095j8115k3892J2942M9629L6886j4653m7845l3981l936N17j6631j4914K2610
454d0288N9010M8784k397m1358l3807k943O277j2119j7598J5546N4152M4826j1710
467F6375n7778m9747q421J3854O58j2193J0437M8825N1951N903m3303m5330o699
480b5468K1227Q335j5865p722K6201L8032O123l5660m1794j1978J2910M548j5461
493c6572o669K9999N0282K5373j9243l5373j2782R460j727k5990j9035K1962N0285
506B9970L0247j8706m5727k9217R22M581j3014j0918K5329N8154M4997o433m5136
$$ plain form
416 66732 23051 -23627 -31571 -11964 -3678 -15515 -15235 21977 69574 74905 25629 -30680 -45078
429 -45078 -25508 -17527 -38698 -54461 -27421 28143 59232 38654 -2724 -17662 -662 11095
441 11095 -7020 -30912 -17970 31659 68545 53892 6047 -27934 -31870 -31353 -47984 -62898 -40288
454 -40288 18722 67506 65109 23751 -10056 -12999 -6722 -18841 -36439 -20893 33259 78085 66375
467 66375 8597 -41150 -49571 -35717 -35059 -47252 -36815 12010 63961 69864 26561 -18769 -25468
480 -25468 -4241 4094 -11771 -19493 6708 44740 50863 15203 -26591 -38569 -25659 -21111 -36572
493 -36572 -43241 -13242 37040 62413 43170 7797 -4985 4475 2748 -23242 -42277 -20315 29970
506 29970 60217 41511 -4216 -33433 -32511 -27930 -40944 -51862 -26533 31621 76618 70185 25049
519B5049l7259o207M949p911j0724J4906M1314L2362j0994m6122l8706l858J4179
532b9022K530o419J3328M2240L9870p27l8883l5414k578J4275j770j9878p857
545c0305K4841L7724J0019k9874l6786q121J4763M610j4978o980K7371M7682K5773
558F5739j6625l5082j9145j410o485j9875j0809K3097M5959K6475j8172m0271
570f604k2627K433K742j0498l621K9650N3397L3125j6940m6935l3272k788O927
583a5011o912j2254J0902L8864L1858r922m1395l1667P08J6551N613n094Q216
596i543L1725L1104k85l0378k9357o859N286n896j7578k645K7460L4437O685k3920
610A0236k4433k523Q972l772j7325k175L2852M6597J8871k3338l8659k0231L27
$$ plain form
519 25049 -12210 -18417 -13468 -21379 -32103 -17197 24117 56479 45485 -637 -39343 -43201 -29022
532 -29022 -26492 -32911 -19583 22657 62527 61800 22917 -12497 -15075 -800 -2570 -22448 -30305
545 -30305 -5464 32260 42279 12405 -24381 -32502 -17739 -13129 -28107 -35087 -7716 39966 65739
558 65739 49114 14032 -5113 -6523 -13008 -32883 -43692 -20595 25364 51839 33667 -6604
570 -6604 -29231 -26798 -24056 -34554 -38175 -8525 44872 77997 61057 14122 -19150 -21938 -15011
583 -15011 -21923 -34177 -23275 15589 47447 37525 -3870 -35537 -34829 -18278 -12665 -17759 -9543
596 -9543 22182 53286 53001 22623 -6734 -13593 -8307 -14203 -31781 -34426 -6966 27471 34156 10236
610 10236 -14197 -16720 -7748 -11520 -28845 -31020 1832 48429 67300 43962 5303 -14928 -14601
623a4601l907j8887r672K5126M6469K6401j5517l7769k4807N20P860j374J98K2377
637B417L8969K3086j5349l9862l0254n287L592n534n044J6100L3406K1609j0680
650B7169l0645j9353N921J2796k760j0799P749L2141K8947m138l2795k8052k515
663a6334P094q719j9862k011K9112L8261J3293j9717k7254p997O615j255j2220
676b0994n44K6819L7897J4866k1213l5348k1164n635o013r678L303K7967L8540
689B8803J8507j6651l2133j7363K557L902m349J437K2843L3690J3681k2314l7939
702e329k1227K064N403o294p234J2770L3198K5736o804k9091j8707N338J1212
715A035l300j1905K874K5521K5675j142k6184k5303p581J613n496j1261L206K8195
$$ plain form
623 -14601 -18508 -37395 -47067 -21941 24528 50929 35412 -2357 -27164 -26644 -18784 -20158 -19960 2417
637 2417 41386 64472 49123 9261 -20993 -26280 -22688 -28222 -33266 -17166 16240 37849 27169
650 27169 -3476 -22829 -16908 -4112 -6872 -17671 -9922 22219 51166 47028 14233 -13819 -16334
663 -16334 -9240 -17959 -37821 -39832 -10720 27541 40834 21117 -6137 -14134 -7519 -8774 -20994
676 -20994 -21538 5281 43178 58044 36831 1483 -19681 -25316 -31329 -41007 -37704 -9737 28803
689 28803 47310 30659 -1474 -18837 -16280 -12378 -16727 -15290 7553 41243 54924 32610 -5329
702 -5329 -26556 -24492 -19089 -25383 -32617 -19847 13351 39087 32283 3192 -15515 -10177 1035
715 1035 -2265 -14170 -11296 14225 39900 38758 12574 -12729 -20310 -18697 -24193 -35454 -32248 -4053
729d053L4589J1412j6537k1833r144j562p121r928N686K9005L1698N241k5220
742B2233l1722j5528p68k601q193M090L0104L8750J3666k1380l1707j3494O374
755a0176N956n992m848J5002K8589J4193j7001l3349k1408J220Q514p68l418J2002
769a1484K6626J9395l975j8865j3592r21O81q273q883P580K4252J9514m085k2169
783E801j8458l977q57j0368r999J2118L5493L2845M145k2917k4902p833K725m263
797a0447j1436R32K4427L0794P777k3774l3072j6196K646M651j16O615K2324K7393
811C2518J0926j4370k5161j4923o02J297l666Q62J5102K0461N385j6909k2413
824a1493p910N155J209q487l588J6608L0295J9509p458k3456j4951J128J638j0828
$$ plain form
729 -4053 30536 41948 25411 3578 -5566 -7128 -14249 -24177 -18491 10514 42212 47453 22233
742 22233 -9489 -25017 -25785 -28386 -36579 -32489 -2385 36365 50031 28651 -3056 -16550 -10176
755 -10176 -4220 -10212 -15060 -58 28531 42724 25723 -7626 -29034 -27814 -19300 -20068 -23486 -11484
769 -11484 15142 34537 30562 11697 -1895 -2816 -2135 -10408 -19291 -11711 12541 32055 27970 5801
783 5801 -12657 -16634 -17491 -27859 -37858 -25740 9753 42598 46743 23826 -1076 -8909 -6184 -10447
797 -10447 -21883 -20951 3476 34270 42047 18273 -14799 -30995 -28349 -23698 -23814 -17199 5125 32518
811 32518 43444 29074 3913 -11010 -11612 -10315 -13981 -13119 1983 22444 27829 10920 -11493
824 -11493 -19403 -14248 -13039 -21526 -25114 -8506 21789 41298 33840 10384 -4567 -3439 -1801 -12629
838a2629j2992N573K6535K4188j148k2936k1554o208J978j749k788R690K6344
851A2304K6957N432j8766k3969j2880m535n247l928R574K4152K0974j511k1987
864F570k1761o608L575R92k346P123K3816K5913M776k0520k4941q791M380P28
878g094q816m639J2633K2590J0884j1054k0595j1030K625M226l235k342J2254
891c593K4357J6457n292j8865j4917n462n057r912n596J1375K4831J8925k649
904B4602j8895j6517m352L80m018k305J3678K8576K2121l194k3778k2862q929
917a5493n86l077m012O906K0952K0244J236j8449k0135o018M991K867j249N996
931e827J8570J8981J973j6431j9504q690K67k132p358j592J3692K1427J0363r227
$$ plain form
838 -12629 -25621 -20048 6487 30675 29527 6591 -14963 -21171 -19193 -20942 -23730 -14040 12304
851 12304 39261 44693 25927 1958 -10922 -15457 -20704 -24632 -15058 9094 30068 28557 6570
864 6570 -15191 -21799 -18224 -17232 -19578 -12455 11361 37274 42050 21530 -3411 -12202 -7822 -7094
878 -7094 -15910 -20549 -7916 14674 25558 14504 -6091 -17121 -14496 -10270 -13505 -15847 -3593
891 -3593 20764 37221 31929 13064 -1853 -7315 -12372 -22284 -27880 -16505 8326 27251 24602
904 24602 5707 -10810 -15162 -14782 -18800 -21105 -7427 21149 43270 40076 16298 -6564 -15493
917 -15493 -16079 -19156 -23168 -16262 4690 24934 26170 7721 -12414 -18432 -13441 -10574 -11823 -5827
931 -5827 12743 31724 33697 17266 -2238 -10928 -10661 -12793 -20151 -21743 -8051 13376 23739 14512
945A4512j6651p515K511N15o313k095J3352K3246J4243o293j9587j6709p095l985
959a7864o545k440J2588K4469J7703l153j7684j4722m314m56k963O11J3691K3278
973B2199J5525o286k2525k0250o752R05k222l419P618K1167J9010j21j7312j6449
987h912l203N336K038k745K455J3819J6247L135j3749j8290r420p36k144n539
1001b1708J269J4976J9700Q999o495j2116o915j683l837o623N20J5112K1543R973
1015C2715j0313k0197j3936m039l410o691j36J5907K5256J6034m840j8428j5314
1028g392l705K074o56m7R105J7916J2723n551k0027j8083o408O60Q5J186R309
1043h811J6949J4052K22j2128j2013l289J358k141m356L227J4232J4260L64j4046
$$ plain form
945 14512 -2139 -9654 -7143 -6628 -12941 -15036 -1684 21562 35805 29512 9925 -6784 -13879 -17864
959 -17864 -24409 -26849 -14261 10208 27911 24758 7074 -7648 -11962 -12418 -15381 -14770 -1079 22199
973 22199 37724 31438 8913 -11337 -18089 -17184 -19406 -22825 -15207 5960 24970 24849 7537 -8912
987 -8912 -12115 -6779 -4741 -7486 -5031 8788 25035 28170 14421 -3869 -13289 -14025 -16169 -21708
1001 -21708 -20439 -5463 14237 23236 16741 4625 -2290 -3973 -7810 -14433 -13913 1199 22742 32715
1015 32715 22402 2205 -11731 -15770 -19180 -25871 -26007 -10100 15156 31190 26350 7922 -7392
1028 -7392 -11097 -9023 -9679 -9726 -621 17295 30018 24467 4440 -13643 -20051 -19391 -19306 -18120 -8811
1043 -8811 8138 22190 22412 10284 -1729 -5018 -3660 -5801 -10157 -6930 7302 21562 21926 7880
1057G880j4610n515n96l944n665K980J6895K1709R990p990j5327q938j465k717
1071g313o319n52J3024J9581R218r363j8629j4150n311j195n64M411J4715K0718
1085A8271J2359n509j6575j3068l996n98k080O24R692J5488P976p559j6380j2250
1099a3605l071J414m40K05Q780J7744J4341r58j3155j1495k876K32m149o224K015
1114a1242J3562J4349K141j1303j4016o906l88j005l128L663J6215K0151Q598
1127C0691p661j5034j1433n432l905l379L193J2974J5581N822q746j5588j1147
1140a4064l036l3m40N338J5919J8957P724q594j5846j0864k686r51l706j174Q652
1155d804J5167Q869o245j5735j1193J51M243k33j438O693J5209J3142R41j0774
$$ plain form
1057 7880 -6730 -12245 -12841 -16785 -22450 -19470 -2575 19134 29124 21134 5807 -3131 -4596 -7313
1071 -7313 -13632 -14184 -1160 18421 27639 18276 -353 -14503 -19814 -21009 -21573 -17162 -2447 18271
1085 18271 30630 25121 8546 -4522 -8518 -9116 -11196 -10572 -880 14608 22584 15025 -1355 -13605
1099 -13605 -16676 -15262 -15702 -15497 -6717 11027 25368 24410 11255 -240 -3116 -2884 -7033 -13257 -11242
1114 -11242 2320 16669 18810 7507 -6509 -13415 -13803 -14808 -17936 -14273 1942 22093 30691
1127 30691 23030 7996 -3437 -8869 -12774 -16153 -12960 14 15595 21417 12671 -2917 -14064
1140 -14064 -17100 -17133 -17573 -12235 3684 22641 30365 21771 5925 -4939 -7625 -8576 -12282 -13456 -4804
1155 -4804 10363 19232 12987 -2748 -13941 -13790 -9547 -9780 -11218 -4525 10684 23826 24767 13993
1169A3993j2531o742k755l970l512L680J2351J2857K859q538j1016n964k801l660
1183a5749q06Q926J7507J5716K917j0694j4504q908l961m668m687K999J4468J7414
1197A5970N817j0595j6375q780K50K240J282M322J1294J4804P221p103j5825j2170
1211g648l818j28j004L06O688J1587P557l080r154o614k124j346j957J275Q928
1226e32J4608J0152k806j2231j0675m484l199o155m828N263J6031J5215K261r993
1240H627j1755n821p94n76n60N451J4281J5209L474j1063j6210j1229m684j770
1254a7420N8N833J2887J2680K991p726j0933o445q97N05N3M118J1641J2749K939
1269B3033r605j3496q118j952j468l562k33Q816J3937Q643k593r860p809j485
$$ plain form
1169 13993 1462 -5280 -8035 -12005 -15517 -11837 514 13371 16230 7692 -3324 -9288 -12089 -15749
1183 -15749 -16555 -7629 9878 25594 28511 17817 3313 -5595 -9556 -14224 -18911 -15912 -1444 15970
1197 15970 21787 11192 -5183 -13963 -13713 -11473 -10191 -5869 5425 20229 27450 20347 4522 -7648
1211 -7648 -11466 -11594 -12598 -12292 -5604 5983 13540 10460 1306 -5308 -7432 -8778 -10735 -9460 -532
1226 -532 14076 24228 21422 9191 -1484 -5968 -9167 -15322 -20150 -14887 1144 16359 18620 8627
1240 8627 -3128 -8949 -9743 -10319 -10879 -5428 8853 24062 27536 16473 263 -10966 -15650 -17420
1254 -17420 -17362 -11529 1358 14038 17029 9303 -1630 -8075 -8972 -8467 -8414 -4296 7345 20094 23033
1269 23033 13428 -68 -8186 -10138 -11606 -15168 -15401 -6585 7352 15995 13402 3542 -4267 -5752
1283e752R90j849j293O191J2770R580j305j0355j1585p594m669l797J71Q442J4808
1298D753J2151J507q602j0372n302j819k253n35P415J4245J1261q73j2168j4281
1312d873q130j972p71QN266J2265J3051M123p599j1620o175j1P06k49K944Q276
1328E239R113K701o699j0793p679l195k208k138K075R618J3328P842k872q644
1342E688o013k083k419m189o52P476J2669Q736k811j1695j1358n810k327j766
1356a6554Q48Q152J4585J2190J042r074j0711o570k792q71J852O813J0469P757
1370A7136j689j0490j1201o038j669o74R66O565J2405J1047J665p581q983m588
1384c129j033j293k077J453P922J0043L208p044j0789o666j527n03j322J792Q780
$$ plain form
1283 -5752 -4762 -6611 -7904 -1713 11057 20637 19332 8977 -2608 -10202 -14871 -18668 -18497 -10055 4753
1298 4753 16904 18411 9809 -563 -5865 -7684 -9937 -10472 -3057 11188 22449 21576 9408 -4873
1312 -4873 -13003 -14975 -15746 -15738 -10472 1793 14844 18967 11368 -252 -6427 -6438 -5732 -5981 -3037 5239
1328 5239 14352 17053 10354 -439 -8118 -11313 -13521 -15659 -13584 -3966 9362 17204 14332 5688
1342 5688 -325 -2408 -4827 -9016 -9668 -2192 10477 19213 16402 4707 -6651 -12461 -14788 -16554
1356 -16554 -15706 -7554 7031 19221 20263 11189 478 -6092 -8884 -9755 -7903 -1090 9379 17136
1370 17136 15447 4957 -6244 -12282 -13951 -14625 -13659 -7094 5311 16358 18023 10442 1459 -3129
1384 -3129 -4162 -5455 -7532 -6079 1843 11886 15094 8050 -2739 -9405 -10932 -11435 -12757 -10965 -2185
1399b185J2556P992j347p854q253n457l523k655Q53P679J1467O577l412j0042
1413B396r148n071k488j128L247J0184J3653Q653j787r413r524n044j806k002
1427i278m39N407J0784Q176j635r915j0165m754j35Q92J811N772R840R132J943
1442A7436o089q990n553k007j939k145J744P444Q607L049m335p621n847l253k239
1457a1738o77M094J0248J1998N918l896r504q077m471l209k842J413Q146J0883
1471H286N842l310r148q205m022j129j2L168Q894J2223P818k673j0524j0076m914
1486g782j353n54J008N157Q252O190r02p069p601l742k98K83J222M883R145Q124
1502A4963J095n952p787n535l795l465j578L579Q859Q910K564m988p533m697j756
$$ plain form
1399 -2185 10371 18363 17016 9162 909 -4548 -8071 -10726 -9873 -2194 9273 15850 12438 2396
1413 2396 -6752 -11823 -14311 -15439 -12192 -2008 11645 20298 18511 9098 -426 -5470 -7276 -9278
1427 -9278 -9717 -4310 6474 14650 13015 3100 -7065 -11819 -11954 -11062 -9251 -3479 6361 15493 17436
1442 17436 11347 2357 -3196 -5203 -7142 -9287 -7543 -99 8508 11557 7222 -399 -6246 -9499 -11738
1457 -11738 -12415 -8321 1927 13925 19843 15947 6443 -1634 -6105 -9314 -12156 -10743 -2597 8286
1471 8286 14128 10818 1670 -6535 -10557 -11686 -11698 -8530 364 12587 20405 17732 7208 -2868 -7782
1486 -7782 -9135 -9689 -8681 -3524 4728 10918 10016 2947 -4654 -8396 -8694 -8411 -7189 -2306 6839 14963
1502 14963 16058 10106 2319 -3216 -7011 -10476 -12054 -8475 384 9294 11858 6870 -663 -5360 -7116
1517g116j576j353L188R707J1406M893m603r773q507m925k664j246K417P841J0329
1532H018O079l039r098q387l546J10J684M071P536Q440M142l016p598p557m925
1547g086k823j528J249O153R174O133j585o933o058j995m00j233j6M778R123P678
$$ plain form
1517 -7116 -8692 -10045 -6857 2850 14256 19149 14546 4773 -3734 -8659 -11323 -12569 -10152 -2311 8018
1532 8018 14097 11058 1960 -6427 -9973 -9863 -8179 -4108 3428 11868 16010 12994 5396 -2161 -7086
1547 -7086 -9909 -11437 -10188 -4035 5139 11272 9687 2754 -3304 -5299 -5699 -6932 -6948 -2170 6953 14631
$$ [...]
8191A59
##END NTUPLES=NMR FID
##END=
