##TITLE=1H_Pr BnCl
 CCl4
 8 sc, 
 15.3.2024
##JCAMPDX= 6.0         $$ Bruker NMR JCAMP-DX V2.0
##DATA TYPE= NMR FID
##DATA CLASS= NTUPLES
##ORIGIN= UXNMR, Bruker Analytische Messtechnik GmbH
##OWNER= root
$$ XWIN-NMR		Version 3.5
$$ Fri Mar 15 16:24:22 2024 Russian Standard Time (UT+4h)  she@DPX200
##.OBSERVE FREQUENCY= 200.1313
##.OBSERVE NUCLEUS= ^1H
##.DELAY= (6, 6)
##.ACQUISITION MODE= SIMULTANEOUS
##.ACQUISITION SCHEME= undefined
##.AVERAGES= 8
##.DIGITISER RES= 18
##SPECTROMETER/DATA SYSTEM= spect
##.PULSE SEQUENCE= zg30
##.SOLVENT NAME= D2O
##.SHIFT REFERENCE= (INTERNAL, D2O, 0, 15.7039)
##AUDIT TRAIL= $$ (NUMBER, WHEN, WHO, WHERE, WHAT)
$$ ##TITLE= Audit trail, XWIN-NMR		Version 3.5
$$ ##JCAMPDX= 5.01
$$ ##ORIGIN= Bruker BioSpin GmbH
$$ ##OWNER= she
$$ F:/spectra/data/she/nmr/H-F/1/audita.txt
$$ ##AUDIT TRAIL=  $$ (NUMBER, WHEN, WHO, WHERE, WHAT)
(   1,<2024-03-15 16:23:10.21 +0400>,<she>,<DPX200>,
      <created by zg, POWCHK disabled, PULCHK disabled
       configuration hash MD5:
       00 E9 B6 7A A2 85 ED C7 34 08 36 98 17 FE 4E 26
       data hash MD5: 16K
       D2 58 56 9C F3 FC E5 39 32 4C 20 E6 46 40 4F 2F>)
$$ ##END=
$$ 
$$ hash MD5
$$ 14 71 19 D7 F1 C2 9E AF 11 34 FE 83 76 62 73 FA
##$RELAX= 
##$RELAX= 
##$RELAX= 
##$RELAX= 
##$RELAX= 
##$RELAX= 
$$ Bruker specific parameters
$$ --------------------------
##$DU= <F:/spectra>
##$EXPNO= 1
##$NAME= <H-F>
##$PROCNO= 1
##$TYPE= <nmr>
##$USER= <she>
##$AMP= (0..31)
100 100 100 100 100 100 100 100 100 100 100 100 100 100 100 100 100 100 
100 100 100 100 100 100 100 100 100 100 100 100 100 100 
##$AQSEQ= 0
##$AQ_mod= 1
##$AUNM= <au_zg>
##$AUTOPOS= <>
##$BF1= 200.13
##$BF2= 200.13
##$BF3= 200.13
##$BF4= 200.13
##$BF5= 200.13
##$BF6= 200.13
##$BF7= 200.13
##$BF8= 200.13
##$BYTORDA= 1
##$CFDGTYP= 0
##$CFRGTYP= 5
##$CHEMSTR= <none>
##$CNST= (0..31)
1 1 145 1 1 1 1 1 1 1 1 1 1 1 1 1 1 1 1 1 1 1 1 1 1 1 1 1 1 1 1 1 
##$CPDPRG= <>
##$CPDPRG1= <>
##$CPDPRG2= <>
##$CPDPRG3= <>
##$CPDPRG4= <mlev>
##$CPDPRG5= <mlev>
##$CPDPRG6= <mlev>
##$CPDPRG7= <mlev>
##$CPDPRG8= <mlev>
##$CPDPRGB= <>
##$CPDPRGT= <>
##$D= (0..31)
0 1.2 0 0 0 0 0 0 0 0.06 0 0.03 0 0 0 0 0.0002 0 0 0 0 0 0 0 0 0 0 0 0 
0 0 0 
##$DATE= 1710505389
##$DBL= (0..7)
120 120 120 120 120 120 120 120 
##$DBP= (0..7)
150 150 150 150 150 150 150 150 
##$DBP07= 0
##$DBPNAM0= <>
##$DBPNAM1= <>
##$DBPNAM2= <>
##$DBPNAM3= <>
##$DBPNAM4= <>
##$DBPNAM5= <>
##$DBPNAM6= <>
##$DBPNAM7= <>
##$DBPOAL= (0..7)
0.5 0.5 0.5 0.5 0.5 0.5 0.5 0.5 
##$DBPOFFS= (0..7)
0 0 0 0 0 0 0 0 
##$DE= 6
##$DECBNUC= <off>
##$DECIM= 32
##$DECNUC= <off>
##$DECSTAT= 4
##$DIGMOD= 1
##$DIGTYP= 9
##$DL= (0..7)
0 120 120 120 120 120 120 120 
##$DP= (0..7)
150 150 150 150 150 150 150 150 
##$DP07= 0
##$DPNAME0= <>
##$DPNAME1= <>
##$DPNAME2= <>
##$DPNAME3= <>
##$DPNAME4= <>
##$DPNAME5= <>
##$DPNAME6= <>
##$DPNAME7= <>
##$DPOAL= (0..7)
0.5 0.5 0.5 0.5 0.5 0.5 0.5 0.5 
##$DPOFFS= (0..7)
0 0 0 0 0 0 0 0 
##$DQDMODE= 0
##$DR= 18
##$DS= 0
##$DSLIST= <SSSSSSSSSSSSSSS>
##$DSPFIRM= 0
$$ [...]
##$SUBNAM2= <"">
##$SUBNAM3= <"">
##$SUBNAM4= <"">
##$SUBNAM5= <"">
##$SUBNAM6= <"">
##$SUBNAM7= <"">
##$SUBNAM8= <"">
##$SUBNAM9= <"">
##$SW= 18.0517328524113
##$SWIBOX= (0..15)
0 0 2 0 0 0 0 0 0 0 0 0 0 0 0 0 
##$SW_h= 3612.71676300578
##$TD= 16384
##$TD0= 1
##$TE= 0
##$TE2= 300
##$TE3= 300
##$TEG= 300
##$TL= (0..7)
0 120 120 120 120 120 120 120 
##$TP= (0..7)
150 150 150 150 150 150 150 150 
##$TP07= 0
##$TPNAME0= <>
##$TPNAME1= <>
##$TPNAME2= <>
##$TPNAME3= <>
##$TPNAME4= <>
##$TPNAME5= <>
##$TPNAME6= <>
##$TPNAME7= <>
##$TPOAL= (0..7)
0.5 0.5 0.5 0.5 0.5 0.5 0.5 0.5 
##$TPOFFS= (0..7)
0 0 0 0 0 0 0 0 
##$TUNHIN= 0
##$TUNHOUT= 0
##$TUNXOUT= 0
##$USERA1= <user>
##$USERA2= <user>
##$USERA3= <user>
##$USERA4= <user>
##$USERA5= <user>
##$V9= 5
##$VALIST= <valist>
##$VCLIST= <CCCCCCCCCCCCCCC>
##$VD= 0
##$VDLIST= <DDDDDDDDDDDDDDD>
##$VPLIST= <PPPPPPPPPPPPPPP>
##$VTLIST= <TTTTTTTTTTTTTTT>
##$WBST= 1024
##$WBSW= 4
##$XGAIN= (0..3)
0 0 0 0 
##$XL= 0
##$YL= 0
##$YMAX_a= 146606
##$YMIN_a= -135005
##$ZGOPTNS= <>
##$ZL1= 120
##$ZL2= 120
##$ZL3= 120
##$ZL4= 120
##$ABSF1= 10
##$ABSF2= 0
##$ABSG= 5
##$ABSL= 3
##$ALPHA= 0
##$AQORDER= 0
##$ASSFAC= 0
##$ASSFACI= 0
##$ASSFACX= 0
##$ASSWID= 0
##$AUNMP= <proc_1d>
##$AZFE= 0.1
##$AZFW= 0.1
##$BCFW= 1
##$BC_mod= 2
##$BYTORDP= 1
##$COROFFS= 0
##$CY= 11.3945322036743
##$DATMOD= 1
##$DC= 2
##$DFILT= <>
##$DTYPP= 0
##$F1P= 15.7292609196834
##$F2P= 12.9074282941183
##$FCOR= 0.5
##$FTSIZE= 0
##$FT_mod= 4
##$GAMMA= 1
##$GB= 0.15
##$INTBC= 1
##$INTSCL= 1
##$ISEN= 128
##$LB= 0.24
##$LEV0= 0
##$LPBIN= 0
##$MAXI= 10000
##$MC2= 0
##$MEAN= 0
##$ME_mod= 0
##$MI= 1.114404
##$NCOEF= 0
##$NC_proc= 0
##$NLEV= 6
##$NOISF1= 3.799351
##$NOISF2= 2.8
##$NSP= 1
##$NTH_PI= 0
##$NZP= 0
##$OFFSET= 15.70392
##$PC= 1
##$PHC0= -25458.03
##$PHC1= 8.38731
##$PH_mod= 1
##$PKNL= yes
##$PPARMOD= 0
##$PSCAL= 0
##$PSIGN= 0
##$REVERSE= no
##$SF= 200.130013532006
##$SI= 16384
##$SIGF1= 3
##$SIGF2= 2
##$SINO= 400
##$SIOLD= 16384
##$SREGLST= <1H.CDCl3>
##$SSB= 0
##$STSI= 0
##$STSR= 0
##$SW_p= 3612.71676300578
##$SYMM= 0
##$S_DEV= 0
##$TDeff= 0
##$TDoff= 0
##$TI= <>
##$TILT= no
##$TM1= 0
##$TM2= 0
##$TOPLEV= 0
##$USERP1= <user>
##$USERP2= <user>
##$USERP3= <user>
##$USERP4= <user>
##$USERP5= <user>
##$WDW= 1
##$XDIM= 8192
##$YMAX_p= 0
##$YMIN_p= 0
$$ End of Bruker specific parameters
$$ ---------------------------------
##NTUPLES= NMR FID
##VAR_NAME=  TIME,          FID/REAL,        FID/IMAG
##SYMBOL=    X,             R,               I
##VAR_TYPE=  INDEPENDENT,   DEPENDENT,       DEPENDENT
##VAR_FORM=  AFFN,          ASDF,            ASDF
##VAR_DIM=   8192,          8192,            8192
##UNITS=     SECONDS,       ARBITRARY UNITS, ARBITRARY UNITS
##FACTOR=    0.0002768,     1,               1
##FIRST=     0,             0,               0
##LAST=      2.2672688,     0,               0
##MIN=       0,             -135005,         0
##MAX=       2.2672688,     146606,          0
$$ Real data points
##PAGE= N=1
##DATA TABLE= (X++(R..R)), XYDATA
0@%%%%%%%%%%%%%%%%%%%%Oj4J6j6J6j6J7k5L2l3L9m6N2o0O9p8Q7r9J12j24J39
41G4j57J76j96K16k40K67k95L26l60L97m37M82n32N88o50P17p92Q80r81J096j235
62f56J403j610J875k234K753l599N320j6579M6818L7686j5330o060O0251L4290
76A44328k6515q4720l6169J0409p728o0645p3965J0589M3752M1586l0849R414
88f0513N1612Q9490J7681k5611j4283L1699K7223n1189p0423m6537K4288r674
100c6237l8852n5093K3950N9963L6798j0363k754O0855N8060J8440n2182j4226
112D8359J0621J8697n5225o8746l0097K2109J4003l8442k2532K2200P6139K4857
124B1943k863j1691N0079M3510m022n1238l2012J7074j279l6386o9148n729K3070
$$ plain form
0 0 0 0 0 0 0 0 0 0 0 0 0 0 0 0 0 0 0 0 0 0 6 -8 8 -8 8 -8 9 -16 16 -17 22 -24 28 -32 37 -41 46 -53 59 -65 74
41 74 -83 93 -103 113 -127 140 -155 171 -189 208 -229 253 -279 309 -341 376 -416 464 -517 579 -656
62 -656 747 -863 1012 -1222 1531 -2068 3252 -13327 33491 71177 55847 49787 110038 144328
76 144328 117813 33093 -3076 7333 -395 -61040 -135005 -124416 -80664 -39078 -69927 -60513
88 -60513 -8901 80589 98270 72659 58376 90075 117298 66109 -4314 -50851 -26563 -36237
100 -36237 -75089 -130182 -106232 -46269 -9471 -19834 -22588 38267 96327 114767 62585 48359
112 48359 58980 77677 22452 -46294 -76391 -54282 -40279 -78721 -101253 -79053 -2914 21943
124 21943 19080 7389 57468 100978 96956 45718 13706 30780 29501 -6885 -76033 -81762 -58692
137e8692K7684k8093j1087L1661O3126K9014k0778m236K4398M0720k6425m5450
149B1842l8134J8352M75l3371m9265k283M2683K0134q299j7976M2739M7236K5551
162F9684l2517j0452J8185K4339k4527n5254k2338J0363J6782l6809k7461J027
174f8978N1098J9802q352j2350L1665M6086M103k6849k6052K3011Q010j8018n4963
187c1787j2158J5699J6885k3198k6018J6932M0137K8273k0725l766J8354M2771
199F1399p542l0480k5150J5661J3020k6490l8888j5427L1614J0660j0403k6769
211d8795K4356L7398K2245k0590j2734K2278K5933l396m2744j4315P947J9437
223A7020k8420l0182p973L2071J7221j5176j4170J5168M3261O822j5030k1427
$$ plain form
137 -58692 -31008 -59101 -70188 -38527 24599 53613 32835 28599 52997 93717 67292 21842
149 21842 -16292 2060 2535 -30836 -80101 -82384 -39701 -19567 -27866 -45842 -3103 44133 69684
162 69684 37167 26715 44900 69239 44712 -10542 -32880 -22517 -5735 -42544 -70005 -68978
174 -68978 -17880 1922 -6430 -18780 12885 58971 63074 36225 10173 33184 41194 23176 -31787
187 -31787 -43945 -28246 -11361 -34559 -60577 -43645 -3508 24765 4040 274 18628 61399
199 61399 53857 23377 -1773 13888 26908 418 -38470 -53897 -22283 -11623 -22026 -48795
211 -48795 -24439 12959 35204 14614 1880 24158 50091 46695 3951 -10364 -2417 17020
223 17020 -11400 -41582 -49555 -17484 -263 -15439 -29609 -14441 28820 35642 20612 -815
235h15K3225J6931o777l9735j5535J5786J1836j6087l3661P138K5046K4377k0419
248h690r240J3562L7880N079k3634j5516J2859K3144j8513k9592j9827K4845Q811
261A168j2018k8945Q419L1241J6297j3535j7687K1397K4646Q371l2487j0992R363
274E238K0949j7162l0664r721J8992J7855j8617j6380L169L6873Q472j0758j8360
287a0114J8259K3850o11k6628j8076J7463J0749q775l4509o92J7257K0085j7400
300i142j6213R340K9589J3386k0806j0726R327K8325r914k3067j9070J8276J2198
313A1503j2129k6588l870K7006J1448q698k1478J6318K3042J3301k3356j1820
325e321J1163K0136n902k9481r338J0938J9211j7780j8114l829K8637J1165j0592
$$ plain form
235 -815 22410 39341 32564 -7171 -22706 -6920 4916 -11171 -44832 -37694 -12648 11729 -8690
248 -8690 -17930 -4368 33512 38591 14957 -559 12300 35444 16931 -12661 -32488 -7643 1168
261 1168 -10850 -39795 -31376 -135 16162 2627 -15060 6337 30983 39354 6867 -4125 5238
274 5238 26187 9025 -21639 -31360 -12368 5487 -13130 -29510 -26341 10532 19004 8246 -10114
287 -10114 8145 31995 31384 4756 -13320 4143 14892 6117 -28392 -29084 -11827 8258 -9142
300 -9142 -25355 -16015 13574 26960 6154 -4572 4755 33080 23166 99 -18971 -695 11503
313 11503 -626 -27214 -31084 -4078 7370 -1328 -22806 -6488 16554 29855 6499 -5321
325 -5321 5842 25978 20076 -9405 -18743 -7805 11406 -6374 -24488 -28317 320 11485 893
338H93j5930J0873K7645K461j7028j9026J6807J2297l446l1054o999J4613J5543
351G649j2174k1587N973K2137J7612j8499r760O824K8024j789j9608j6143J2172
364H31J6771j1541k2597j1153K2804R539o196k2417R590K2343J3555j5392j4337
377h200J2201J7819K743k7210r319P100J8810j3679j9698o534K0687J4632j1527
390b175j3725M119K8250M753j1462j8724J3887J5093r33k5415j2305J3790J2181
403G334o628k4631K619J7145J8872j4714j1334N502K4748N685j8255j3341O789
416b09J9734r360j9016j4955J8171J0607n542k0561K301K2108J2213q730j6961
429a0200J1340J6367P946k3560j0849N645J7040p565k1683p344J3929J7594j1285
$$ plain form
338 893 -15037 -4164 23481 25942 8914 -10112 6695 18992 15546 -15508 -22507 -7894 7649
351 7649 -4525 -26112 -20139 1998 19610 1111 -8649 -1825 26199 24410 4802 -11341 831
364 831 17602 6061 -16536 -27689 -4885 4654 -1542 -23959 -14369 7974 21529 6137 -8200
377 -8200 4001 21820 24563 -2647 -11966 -4866 13944 265 -19433 -25967 -5280 9352 -2175
390 -2175 -15900 -11781 16469 21222 9760 -8964 4923 20016 19083 -6332 -18637 -4847 7334
403 7334 706 -23925 -21306 -4161 14711 -3 -11337 -5835 18913 24598 6343 -6998 -209
416 -209 19525 10165 -8851 -23806 -5635 4972 -570 -21131 -18830 3278 15491 6761 -10200
429 -10200 1140 17507 25453 1893 -8956 -3311 13729 6164 -15519 -22863 -8934 8660 -2625
442b625j2515q94K6319P863q944j7163Q858J8174L79j9237j6446J2808J0785k182
456E180k4797j584J4318J7858r790j4188M620K0149J1795j6889j1437K672K0533
469A8440n329j7091j5785J2610J3152n432j7503m414K1274J1294l954j8270Q530
482b478J6058J0268j7925j3562N541J4616j074k2617p932Q397J8754r195j2890
495a4039l934K2102J1957q035j4384L321K0314J866j3776j8886J0406J0856K89
508H057k2174o708J2656J5378m142j6910L288J5982J5796j3881j1050O02J9153
521A6047J99j6254j4699O403J5556n134j4570r685J8669J1483j319j7283L795
534f792J6575J0811j1599j6242N669J2287M149k1379r415M974J7750n455j4407
$$ plain form
442 -2625 -15140 -16034 10285 18148 9204 -7959 899 19073 19452 215 -16231 -3423 7362 5180
456 5180 -19617 -21201 -6883 10975 1185 -13003 -8383 11766 23561 6672 -4765 -2093 18440
469 18440 13111 -3980 -19765 -7155 5997 565 -16938 -21352 -78 11216 7262 -11008 -2478
482 -2478 13580 23848 5923 -7639 -2098 12518 11444 -11173 -19105 -10708 8046 -1149 -14039
495 -14039 -17973 4129 16086 8051 -6333 -3012 17302 19168 5392 -13494 -3088 7768 8057
508 8057 -14117 -20825 -8169 7209 3067 -13843 -10555 5427 21223 7342 -3708 -3106 16047
521 16047 16246 -8 -14707 -8304 7252 2118 -12452 -22137 -3468 8015 6696 -10587 -6792
534 -6792 9783 20594 8995 -7247 -1578 10709 14858 -6521 -15936 -10962 6788 1333 -13074
547a3074n100J6341J5651p389j1870j177K0861M057r927j8630O532J2089J228
560I592j7895j1668J1553J2670L92j7892J115J2889J7032r582j1854PJ6138N755
574A8252j5440j3159J387J6784l870j2818j2238J4413J2655l11j4740j259J7200
587F856J0446n947j7554M482J0970P221j8218j1830L430J5119q23j5771n536J0822
601f333J8033n981j0242l956J8844P318p686j6429J604J3705J411j3389j5329
614a8430R485J0901L291j6992k265J1323J6158m433j3240K14J2514J0477j3801
627E202j1986j852J6110j128j1963j2789Q971J4447n49j1732n840J6495J0275
640A3661j707j7019K090J0939Q347j3561j4176K780J1925L574j6147o352O577
$$ plain form
547 -13074 -18174 -1833 13818 6429 -5441 -6618 14243 18300 8373 -10257 -3725 8364 9592
560 9592 -8303 -19971 -8418 4252 4644 -13248 -12133 756 17788 8206 -3648 -3641 12497 18252
574 18252 2812 -10347 -8960 7824 3954 -8864 -21102 -6689 5966 5655 -9085 -10344 6856
587 6856 17302 11355 -6199 -1717 9253 16474 -1744 -13574 -10144 4975 4152 -11619 -17155 -6333
601 -6333 11700 5719 -4523 -8479 10365 17683 9997 -6432 -4828 8877 10288 -3101 -18430
614 -18430 -8945 1956 5247 -11745 -14010 -2687 13471 9038 -4202 -3988 8526 19003 5202
627 5202 -6784 -8636 7474 6346 -5617 -18406 -9435 5012 4463 -7269 -13109 3386 13661
640 13661 11954 -5065 -2975 7964 16311 2750 -11426 -8646 3279 6853 -9294 -15646 -9069
653i069J8023l485r973n092J4879J0860o437j3453k494J4724K184r327j6376O333
667h703J0478M238j4140o360J0134J3683L18j4264m04R534J2969j0913j1512l047
681g989J3751L014j1554j1677L837J5589m92r262r002J3924J0595J81j4874j453
695e412J1397Q197q193j5538K271R521O676j4727p562L798J6011j74j0538n288
709i561J0078J3469n513j0677n374J4050M040o416j5399K777J1143L949j0486
722c920r982Q826J1097L411j4251j953P726J3179o784j1798k739J0898P040j1040
736b90j0092J09J5352L84p955j0332J0061J1290L95j2122m830J1573P555l541
750G557j5541J486Q340Q220j1645r237K584J2824L066j1404n307N827J4359m187
$$ plain form
653 -9069 8954 5469 -4504 -9596 5283 16143 9706 -3747 -6241 8483 10667 1340 -15036 -8703
667 -8703 1775 6013 -8127 -14487 -4353 9330 9648 -4616 -5020 4514 17483 6570 -4942 -7989
681 -7989 5762 8776 -2778 -14455 -10618 4971 4479 -4783 -13785 139 10734 10915 -3959 -5412
695 -5412 5985 14182 5989 -9549 -7278 2243 8919 -5808 -13370 -9572 6439 6265 -4273 -9561
709 -9561 517 13986 8473 -2204 -7578 6472 10512 4096 -11303 -8526 2617 6566 -3920
722 -3920 -13902 -5076 6021 9432 -4819 -6772 954 14133 7349 -4449 -7188 3710 10750 -290
736 -290 -10382 -10273 5079 5463 -2492 -12824 -2763 8527 8922 -3200 -8030 3543 11098 7557
750 7557 -7984 -6498 1842 10062 -1583 -10820 -8236 4588 7654 -3750 -9057 -3230 11129 6942
764F942r031o578J2093O616n049j2838n85J1992L731p164j2162O972R442M731
778I112j2977m500O840J1747k621j2404k168Q218R988r422q974k142J3965K480
792G142p757j0004N516J2322P6r226p937J0760P458n72j4259l77Q285Q405p570
807B262j0976K155R760N869j1548n726K757J3734j939q768o481R055R241m265
821E130j0093l625J2233M004m698j2715M393R126M767j0421p361O287R819J003
835G849j2725k149O146J1325o802r015k696J1382N238p793q848J367J2837K40
849F356p092r489Q797Q027P01j1703l252Q625P559l669j2219J645P465P624j0064
864f89o775J290J2028J046r084n895N562J1240l579q103n808J1306M926l333j1760
$$ plain form
764 6942 -2089 -8667 3426 10042 4993 -7845 -8430 3562 7293 129 -12033 -5061 4381 9112
778 9112 -3865 -8365 -1525 10222 7601 -4803 -6971 1247 11235 1813 -7161 -9303 4662 7142
792 7142 -615 -10619 -5103 7219 7295 -1931 -9868 892 8350 7778 -6481 -6858 1427 9832 2262
807 2262 -8714 -6559 3201 9070 -2478 -8204 -5447 8287 6348 -2420 -8901 154 9395 5130
821 5130 -4963 -8588 3645 7649 2951 -9764 -5371 3755 8522 -1899 -9260 -2973 6846 7849
835 7849 -4876 -7025 -879 10446 3644 -5371 -8067 3315 8553 760 -8088 -6721 6116 6356
849 6356 -736 -10225 -1428 6599 7300 -4403 -7655 970 8529 4860 -7359 -5714 1751 9375 -689
864 -689 -7464 -6174 5854 6900 -2184 -8079 -2517 8723 5144 -2959 -8767 2539 7465 4132 -7628
879g628J105R671M375p222r701N915Q246L600j1898l305M894J0942l769r749k685
894g209Q297P799p432p723j415J2338J601n860r362N797R198J016r064n996Q453
909D38O484q43j2322J46O290Q187p509q109J100R812M146r177n188K749J1979
924H183k522p388o552Q887O501l026j0069j914J0171L987m336j0716M861P628
938C695M983r959n190M539R285o25j0694k640N269R377o427p273k686J1039L763
953F456n213q233K747J0359Q99o539q136P408O041O13j1578k016O165P455m366
968B062r375J345P721O782q517n104J215J1368n12p496o590N654Q212l197q205
983d637m602J0028M251k279j0381K819Q072N158p206p137M317P568K048j0979
$$ plain form
879 -7628 -6523 3148 7523 301 -9400 -3485 4761 8361 -3537 -6842 -1948 8994 5225 -4524 -7209
894 -7209 1088 8887 1455 -6268 -7683 4655 6256 396 -8966 -3169 6029 7045 -2019 -8015 438
909 438 6922 6079 -6243 -6097 193 8380 871 -7238 -6138 3674 7820 -1357 -6545 -3796 8183
924 8183 5661 -1727 -8279 608 7109 4083 -5986 -7900 2271 6258 1922 -8794 -3933 3695
938 3695 8678 -1281 -6471 -1932 7353 6728 -3966 -6606 -1337 8040 1613 -5660 -8346 2693 6456
953 6456 1243 -6990 -4243 6116 7015 476 -7660 -252 5789 6402 -5176 -7192 -1027 6428 2062
968 2062 -7313 -5968 1753 8535 18 -5086 -3871 7497 6985 -511 -7101 -1447 6765 3568 -4637
983 -4637 -9239 789 5040 2761 -7620 -4801 3271 8429 1223 -5914 -1597 5971 8019 -2960
997b960l285L371R425m541p407l016Q588O297m934o653L1J1011J389m838q898
1012f420N458O417Q95r719m709O229O239j379j0294R08O342Q151o845n658P95
1027c590R735K175p785n898K620R315l093o871o238Q568N086j451q997K76Q727
1042B579M833m186q577L986O277L793r938m407K400Q386k051q355k859N926Q097
1057E904m629n442j772J0631K760l865q382L076P374P40p477p074N998N259M55
1072C556j0286l49N654Q017m218o775Q70P873M848p630n260N14R349j743o525
1087b105o680O014O301j518p291k322R020M623j761q920L009N952M634p930n992
1102d966K143O802M77r090k969L561Q963l692n220k587R161M703l611o888O50
$$ plain form
997 -2960 -6245 -2874 6551 2010 -5397 -8413 175 6472 1538 -5115 -5084 5927 7316 2478 -6420
1012 -6420 -962 5455 6350 -3369 -8078 -1849 4390 3011 -7283 -6375 -33 8118 1273 -4385 -3590
1027 -3590 6145 8320 535 -5363 -2743 6572 3479 -3392 -9630 -1062 4024 2573 -6424 -6148 2579
1042 2579 7412 3226 -5351 -1365 4912 8705 -1233 -5640 -3240 5146 3095 -5260 -8119 -2193 5904
1057 5904 1275 -4167 -5939 4692 7452 3587 -4795 -1719 5655 6395 -1082 -8156 -2158 3101 3556
1072 3556 -6730 -7079 -1425 6592 2374 -4401 -3531 4342 9190 1560 -3700 -3186 6163 4420 -2105
1087 -2105 -8785 -2771 3530 2012 -5279 -7601 1419 6042 4281 -4639 -1630 4322 8956 1026 -4966
1102 -4966 -2823 3979 4456 -4634 -7603 -4042 4921 1229 -3991 -6578 2583 7286 3675 -3213 -2563
1117b563Q466P84n549q399M906M916J158r223k495N541P086j675p631R23O274
1132B519O701o689n042n80Q672Q1o621o266L160P536j708n811m518Q411M794m42
1148D197q180J251O519M589n195p507K147N323K473q995l583K132Q621k040n851
1163d099k519O914O651l431n510j493Q860J390m146q542L085N406J348p491m810
1178h387N411N981N65q170M54N043P473m847n683p30P104K494o721n584O81Q169
1194C253j220m993n384O732N580L4o835j087O909M256k865q321J785M484L812
1209F140p946m618J514P520L0o468k240M587Q024l017m852k697Q068K589l490
1224C144p801R08O366J181n492o419N015N208J993p800q59M497P097k680o500
$$ plain form
1117 -2563 5903 6687 1138 -7261 -2355 2561 3719 -5504 -7999 -2458 4628 2953 -4678 -3755 2519
1132 2519 9220 2531 -2511 -3091 5581 5662 -959 -7225 -4065 3471 1763 -4048 -8566 -155 4639 4197
1148 4197 -3983 -2732 3787 8376 3181 -4326 -2179 3144 5617 -3378 -6961 -4829 3792 1752 -4099
1163 -4099 -6618 296 6947 3516 -1994 -3487 5373 6763 2617 -5925 -2840 2566 3914 -3577 -8387
1178 -8387 -2976 3005 3570 -4600 -4146 897 8370 3523 -2160 -2890 4214 6708 -13 -5597 -4916 3253
1194 3253 2033 -2960 -8344 -1612 3968 4002 -2833 -3920 2989 7245 4380 -3941 -2156 2328 6140
1209 6140 -1806 -6424 -4910 2610 2640 -3828 -6068 -1481 6543 3526 -1326 -4023 4045 6634 3144
1224 3144 -4657 -3749 2617 3798 -1694 -8113 -3098 2110 4103 -3697 -4556 -59 7038 4358 -2142
1239b142n97N213M536o409n110q79P985j4m485n426M532O599M8n408l188P022
1255B277L862j138q396O64M365M014n977n896J611O017K341o796k230K858Q386
1270E962k008m697l182O386M120l374o574j329O808J262l781p111L948N179K739
1285D348o518k580M491O036m13p264p11L694N515n442n204j504O868J767m567
1300a484m772K388P643Ll969m417O201M048l48p710j020M527L592l948o918J544
1316d640M886L791o288k638K100P895k83n105k896M369N473l391n576k986O583
1331A294J564k765o957K278N674K770m558m083M499N170J413p337j318K728N665
1346F037m044n786j671N253L392m618m072O28Q008O21l060m845N009M862q5o488
$$ plain form
1239 -2142 -2739 2474 7010 601 -4509 -5388 2597 2583 -1902 -7328 -2796 3803 3851 -1557 -4745 2277
1255 2277 6139 5001 -3395 -2731 1634 5648 -329 -6225 -4614 1403 3744 -3052 -5282 -2424 5962
1270 5962 3954 -743 -3925 2461 6581 3207 -3367 -4696 2112 3374 -407 -7518 -3570 1609 4348
1285 4348 -2170 -4750 -259 5777 5364 -1900 -2611 1083 6598 1156 -4048 -5552 1316 3083 -1484
1300 -1484 -6256 -3868 3775 3778 -191 -4608 1593 5641 5293 -2417 -3437 1090 4682 734 -6184 -4640
1316 -4640 246 4037 -2251 -4889 -2789 5106 4823 -282 -3178 1191 6664 3273 -2303 -5289 1294
1331 1294 2858 93 -6864 -4586 1088 3858 -700 -4783 -284 4886 6299 -1038 -2356 372 6037
1346 6037 1993 -3793 -5464 -211 3181 -1437 -5509 -4881 3127 3748 688 -4157 852 5714 5629 -859
1362h59k955M825K906k118p747R14M136M461n086l400J784O877J767n230k543
1377b268K525O342k716n005l929N403K520k556o149J33O061K554k768n139M092
1392i00M839K540o238k372K593N014k064o603j610L510M523m486l803n63P466
1407A846J713k825m296L183N942n9m775m295M637K710j039p602k88L694M232l632
1423h54m573J787N585L418m985k343J485O681j430m757m004L790L675k629n309
1438d463j835O044K333j684n516L029M918K966m723l326K778M409q4o861j753
1453c768K180N035l805m336j187O021L052l079l608J513O672L90l377m882M123
1468I44L174l55o572k048L667L426k014n751J320M319M305m323k601J104O364
$$ plain form
1362 -859 -3814 1011 3917 1799 -5948 -5034 -898 3563 -1523 -4923 -3139 3738 5505 275 -2268
1377 -2268 257 6599 3883 -1122 -5051 352 2872 316 -5833 -5700 361 2915 147 -4992 -900
1392 -900 3939 6479 241 -2131 462 5476 3412 -3191 -4801 -1291 3232 -1254 -5057 -5620 1846
1407 1846 3559 734 -3562 -379 5563 5504 729 -3566 1071 3781 2742 -4860 -5148 -1454 2778 -854
1423 -854 -5427 -3640 1945 5363 378 -1965 -480 6201 4771 14 -3990 -200 3475 846 -4463
1438 -4463 -6298 -254 2079 395 -5121 -2092 2826 5792 1069 -2257 521 4930 4846 -2015 -3768
1453 -3768 -1588 3447 -358 -4694 -5881 140 3192 113 -3495 -1982 4690 5080 1703 -3179 944
1468 944 4118 3763 -2809 -4857 -1190 2236 222 -5529 -4209 110 4415 92 -2509 -1405 4959
1483D959L72m590l380K238M733k419m579l272N303K377j336n412J380N132K830
1498D336l026m236L056M003J492o295k001J662M786k562n070j481M153L982l269
1513d70l189L9O744J162k538m501L089M119Jn168l460L711K798q75o310L43L372
1530a133M486l363l349J058N362K265m468k687J153N446j689m145l750M074K862
1545B122j510m848n80N242K526j716m872K724L973K386n121k709J913M279r00
1560B909n635j537K705M477l153l331r15N881K066k288l897J701N067L01l588
1575G63m281L521K695k3o046q81L006L871k114m391R14M145L455m059k437O03
1591a259N469m03l877l513K816L690j630m156k114M955K217j030n041J742M083
$$ plain form
1483 4959 5331 741 -2639 -401 4332 1913 -2666 -5938 -635 1742 406 -5006 -3626 1506 4336
1498 4336 1310 -2926 130 4133 5625 -670 -2671 -1009 3777 1215 -3855 -5336 -1183 2799 -470
1513 -470 -3659 -3620 3124 4286 1748 -2753 336 4455 4456 -712 -4172 -461 2337 1462 -4848 -4505 -1133
1530 -1133 3353 -10 -3359 -2301 3061 5326 858 -1829 -676 4770 3081 -1064 -4814 -740 2122
1545 2122 612 -4236 -4816 426 2952 1236 -3636 -912 3061 5447 326 -2383 -470 3809 2909
1560 2909 -2726 -4263 -1558 2919 -234 -3565 -4480 1401 3467 1179 -2718 -1017 4050 4351 763
1575 763 -3518 3 2698 2675 -3371 -4252 -1246 2625 511 -3880 -2966 1179 4634 575 -1862 -1259
1591 -1259 4210 3807 -70 -3583 -767 2923 1293 -2863 -4977 -22 2195 1165 -3876 -2134 1949
1606A949K600l623l479K076L709P05n450j667J644M691k418l745j345M487K963
1621C097k498l349L21N488P08k541m376K794L213M16m995k174L013L191r13n022
1637c627M06L138L960l449k772L10M968J060l693k966J529M598j399l530l020
1652d487M259K405q93m637K28M179K344k247m149K080L323J848m908k005J406
1667a254M369j189m128j505L009L785k523k996q69N167J320k002m060J769L819
1682B712N86l633l284L064K734P1n134k88K568L839k416l423K73L935K250l659
1698A95k489O17M831p20l085l168L269L052r21l937j140M206K001j205m638J653
1714a479K956K378l942k572J357L725L12m467j344J966M280k132k874j502M423
$$ plain form
1606 1949 4549 926 -2553 -477 3232 3937 -1513 -3180 -1536 3155 737 -3008 -4353 134 3097
1621 3097 599 -2750 -2429 3059 3767 1226 -3150 -356 2857 3273 -1722 -3896 -883 2308 1395 -3627
1637 -3627 -3221 -83 3877 428 -2344 -2034 2934 3994 301 -2665 -1136 3462 2063 -1467 -4487
1652 -4487 -228 2177 1284 -3353 -3125 1054 3398 1151 -2998 -918 2405 4253 -655 -2660 -1254
1667 -1254 3115 1926 -2202 -3707 -698 3087 564 -2432 -3301 1866 3186 1184 -2876 -1107 2712
1682 2712 3298 -335 -3619 -555 2179 2250 -2884 -3172 -604 3235 819 -2604 -2331 1604 3854 195
1698 195 -2294 -1677 3154 2434 -651 -3819 -550 2502 1581 -2356 -3496 710 2711 1506 -3132 -1479
1714 -1479 1477 3855 -87 -2659 -1302 2423 2735 -1732 -3076 -1110 3170 1038 -1836 -3338 1085
1729A085J993j874l658M98M232N75k556l771K717K627P50m528j120K516L340j191
1745A635m006J55K988L018l429k456n0M499K39l057k864K015L823p83l061k220
1761c554M074K054o02m435N58L035K184k727l498J393K958J404m323j334J234
1776a579M298j091l007j489L325K860j974l016p05M261O68j942m043J988K887
1791A441Q92l633k032K750K944l2m334R4K338L285k806k762l55L709J163l200
1807e38k417Q58M172n55k314k629L499K536l34l787n42L200J886j657m117J087
1823a652K435J965l760j937R97L941K0l219j176K246L620j777k552j561L884J157
1839B631j691l838P96L204P77k605k864K648K670Q21l995m09K145L237j747l274
$$ plain form
1729 1085 3078 1204 -2454 -1956 2276 2851 295 -3476 -759 1868 2618 -1910 -3030 -514 2826 1635
1745 1635 -2371 -2216 772 3790 361 -2095 -2145 2354 2593 -464 -3328 -1313 2510 1727 -1334 -3554
1761 -3554 520 2574 1972 -2463 -1905 1130 3314 587 -2911 -1518 1440 2844 -1479 -2813 -1579
1776 -1579 2719 1628 -1379 -2868 457 3317 1343 -1673 -2378 1883 2551 609 -3434 -1446 1441
1791 1441 2333 -1300 -3332 -582 2362 2330 -2004 -1910 428 3713 907 -1855 -2210 1499 2662 -538
1807 -538 -2955 -2097 2075 1520 -794 -3423 76 2612 2278 -1509 -2051 1149 3035 1378 -2739 -1652
1823 -1652 783 2748 -1012 -2949 -1952 1989 2009 -1210 -2386 -140 3480 1703 -849 -2410 1474 2631
1839 2631 940 -2898 -2102 1102 1879 -726 -3590 -942 1728 2549 -1446 -1855 290 3527 1780 -1494
1855a494l08K684K028l149k367n8M144k9k144k622K527L189j48k877j575L394
1871A195J710p86m287N44K062K052l014k584R26L163J054l341r97J428M048j186
1887A987k343j661L203J804j742l234m62L408N57j842l360K185K456J267l327
1902a104j072K231L005n92l521k79J839K673k860k425o12L505O85k221k359J341
1918a766L643o2k017k109L140J898j80l851k91K202J788j981l351Q38K282J812
1934A995l231j195R81L859l54k355j390K290K593j649k604j359L380O09j350l460
1950c240J280K590J134k408j963K247K463O62l593k90J421K845k097k617p05K670
1966C99J462k451k001K65L800Qj584k372K588K199J01l076j088K431J557j018
$$ plain form
1855 -1494 -1802 882 2910 -239 -2606 -2664 1480 1451 -693 -3315 -788 2401 2253 -624 -2199 1195
1871 1195 2905 2119 -2168 -1624 438 2490 -524 -3108 -2182 981 2035 -1306 -2303 -875 3173 1987
1887 1987 -356 -2017 1186 2990 1248 -1986 -2448 960 1517 -325 -3685 -1500 956 2223 -1104
1902 -1104 -2176 55 3060 2468 -1053 -1332 507 3180 320 -2105 -2717 788 1473 -748 -3107 -1766
1918 -1766 1877 1815 -202 -2311 829 2727 2547 -1304 -1595 607 2395 414 -2937 -2099 183 1995
1934 1995 -1236 -2431 -1450 2409 2055 -300 -1690 600 3193 1544 -1060 -2419 961 1570 220 -3240
1950 -3240 -1960 630 1764 -644 -2607 -360 2103 2765 -828 -1118 303 3148 1051 -1566 -2271 399
1966 399 1861 -590 -2591 -2326 1474 1482 -102 -2474 114 2313 2414 -662 -1750 681 2238 1220
1982A220l692O01J849K082k851j656P67L194N60k617j059J376L220j411k020j774
1998b211L027J120j159l110K02K792R00j685k648J915K201J102l261o59J353K713
2014B592r41k845n63J832K239k368j789n68L457L74j496k342J533K700P4k182
2030b93j781K590J449j21l586J88J757J970k087k294N68K399J284k776j052O48
2046a137L418p76j899j572K406J825j127k357p93K862O86j030l126J382J944J176
2062A882k562j426J539K337K11k970l38J280K716j859j904q45K802Q72j807k124
2078b196N22K975p7j432k179K304J701L29k948l87J964J667j099k951N54J614
2094C61J640k704j314K72L064n0j913j284J695K633r74j803j336K718Q14p21l087
$$ plain form
1982 1220 -2472 -1871 -22 2060 -791 -2447 -1680 1514 2074 -543 -1602 -226 2994 1583 -437 -2211
1998 -2211 816 1936 777 -2333 -2131 661 1561 -124 -2772 -857 1344 2446 -815 -1474 -121 2592
2014 2592 1651 -1194 -1757 75 2314 -54 -1843 -2411 1046 1420 -76 -2418 -885 1815 1889 -293
2030 -293 -2074 516 1965 1844 -1742 -1554 203 2173 86 -2208 -1640 759 2043 -733 -1785 -1137
2046 -1137 2281 1505 -394 -1966 440 2265 1138 -1219 -2012 850 1536 506 -2620 -1238 706 1882
2062 1882 -680 -2106 -567 1770 1981 -989 -1327 -47 2669 810 -1094 -1939 863 1735 -72 -2196
2078 -2196 -1674 1301 1224 -208 -2387 -83 1618 1947 -1001 -1388 576 2243 1144 -1807 -1253 361
2094 361 2001 -703 -2017 -1745 1319 1269 -644 -1928 -233 2400 1426 -377 -1713 1005 1819 1098 -1989
2111a989M82J955R33j808k147J472J953R94k835k85J070K825j170k007p68J999
2127F74J531j986j878l85K917m0j176k277J862K060L17k111j029K170J502l22
2143A829l127L25J229J734k254j768J22K415P23k126j017Q81L059o48j359j504
2159a486K398J276p04k568m79K148N90j186k603J212J529J361k444o84J167K499
2175B026j42k334m55J302K170j965j709r03K585L29j301k061Q45K513K61j416
2191b55j613K252J511L01k875q2J234J597j515k271M5J601J326k240r76K74L084
2208A398j91j295j273J777J960o85j936j120K228M84p56k924P28J475J238j873
2224g65j327J227K013P14k322j74Q75K397j426j675r92J941Q36j518j784n7K550
$$ plain form
2111 -1989 -1507 448 1381 -427 -2574 -1102 851 1845 -990 -1275 -205 2620 1450 -557 -1325 674
2127 674 2205 219 -1659 -2044 873 833 -343 -2620 -758 1302 1619 -492 -1521 649 2151 1829
2143 1829 -1298 -973 256 1990 -264 -2032 -1910 505 1228 -898 -1915 -1034 2025 1377 18 -1486
2159 -1486 912 2188 1484 -1084 -1563 585 1175 -11 -2614 -1402 127 1488 -956 -1640 -473 2026
2175 2026 1884 -450 -905 397 2567 602 -1107 -2010 575 904 -397 -2458 -1613 900 1161 -255
2191 -255 -1868 384 1895 2196 -679 -761 473 2070 555 -1716 -1671 -70 1256 -984 -1960 -1686 1398
2208 1398 1207 -88 -1361 416 2376 1691 -245 -1365 863 1347 591 -2333 -1605 -130 1108 -765
2224 -765 -2092 -865 1148 1862 -460 -634 241 2638 1212 -463 -1455 486 1322 -196 -1980 -2037 513
2241E13J65j016j877K025J588O16k211o43J535J391o42k721J42R43J646k175j258
2258a979J1K483M94j485j008J145K500n70j230j560K181O64n35k713k1J615Q13
2275H05j293k016J198J592J303k182k98Q39K452o94j798p74J300J450j639j653
2291a408p42K393K28q68j914J352J904N48j462j125J856J248N9k751r4P11J623
2308A558j660j775p0J827J089j723p56M52K753k43r66j470J768J176n39k085q32
2325a496J716N29q27k321R70J260J390j794p37R74K093K12j941n28P91J906j627
2342E70j400j101J997O00j023j752M46K256M27p95j640J758J227O15k407l94Q06
2359A90J363r79k191J6J117J508j846p39M0K629K03j063j233J234J783n54j568
$$ plain form
2241 513 678 -338 -2215 -190 1398 2014 -197 -840 695 2086 1444 -1277 -1135 -192 1454 -721 -1979
2258 -1979 -1968 515 1009 -476 -1484 -339 2161 1591 361 -1199 982 1646 1111 -1602 -1623 -8 805
2275 805 -488 -2504 -1306 286 1589 -593 -891 -52 2400 1706 -92 -866 434 1884 245 -1408
2291 -1408 -2150 243 471 -397 -2311 -959 945 1493 31 -1094 762 2010 2069 -682 -776 -65 1558
2308 1558 -102 -1877 -1947 -120 969 -754 -1510 -1058 1695 1452 486 -984 784 1960 1421 -664 -1496
2325 -1496 220 749 -78 -2399 -1429 -169 1221 -573 -1310 -336 1757 1969 28 -500 291 2197 570
2342 570 -830 -1931 66 666 -357 -2109 -1663 593 1020 225 -1415 343 1570 2185 -222 -616 190
2359 190 1553 574 -1617 -1601 -484 1024 -822 -1561 -1521 1108 1311 248 -985 249 2032 1478 -90
2376i0j327J869M50m20k377L10J301J198j222j384J047J664Q58k042l41N10K094
2393B098r79j509j111J505J061j222j376l36K265K95n11j780J396J364O54j718
2409I6j006J221J073k07k269j12P88J630j560j063q1J994O67j240r19N86K102
2426A700m49j068j510J709P48k99k045k20J506P84p31j821Q74J226J199j853n98
2443h48M94J882k38j677o48Q43J657j189j183p68K040M06n96j710P33J615M78
2460A291j131j390J340R52L87k209j26P12J528r81j499r6J333J053j411q27LK224
2478A153k00q79j335J281J276k55j503q07J603O45l72k113N36J015J170j418j083
2495a286N33J550M60j637m29N39J962r70j029r50J596O75p04j525q0J779J95n59
$$ plain form
2376 -90 -1417 452 902 482 -1895 -1585 -284 914 -308 -1692 -645 1019 1877 -165 -506 4 2098
2393 2098 1119 -390 -1501 4 1065 -157 -1533 -1869 396 691 180 -1600 -204 1160 1814 96
2409 96 -910 311 1384 1177 -1092 -1204 -416 1214 -346 -1409 -1490 504 1171 -69 -988 -402 1700
2426 1700 1251 183 -1327 382 1130 831 -1214 -1434 72 856 125 -1696 -822 404 1603 -250 -848
2443 -848 -354 1528 1290 -387 -1035 -192 1465 276 -907 -1675 365 771 175 -1535 -802 813 1291
2460 1291 160 -1230 110 1062 1449 -760 -886 -174 1354 373 -1126 -1222 111 1164 -247 -1074 -1071 1153
2478 1153 953 74 -1261 20 1296 1041 -462 -1269 334 979 607 -1506 -970 45 1215 -203 -1286
2495 -1286 -753 797 1257 -380 -809 -270 1692 722 -307 -1257 339 1014 310 -1215 -1295 484 679 120
2513A20j619J233J043N63j687m73R18J305m20j743k3P24J313j502r19k79J937
2530D91K80r56j068Q28J707j78r80j094J610N42j36k028j2R22R08r39j475N77
2548a001J207R88j620l41M00J950m11j184p35J071J082r58j296o78J736J44m58
2565a04j599Q90J264O46j110q52J112J071J89j870j32M46J328j250j185l45J390
2582a11O99j081p17K40K038j5o26j188J386P90o1j765n55R75O15n18j879N61Q25
2601c87J269j335m21L75J769K49j231n96N20J448r60j135j046J425L37n45j458
2618a722L83J498N88n94j089J267R00O05j718m02M33J058p27j558l31P48J110
2635D49j137n72k2K044J75l77j074R19J234j61j216j192J097L67k48j959J79P97
$$ plain form
2513 120 -1499 -266 777 1340 -347 -820 98 1403 983 -760 -783 -59 1254 -248 -1167 -1446 491
2530 491 771 -185 -1253 -425 1282 1104 124 -970 640 1182 1046 -982 -994 -72 836 -103 -1578 -1001
2548 -1001 206 1194 -426 -767 -367 1583 1172 -12 -747 324 1406 448 -848 -1526 210 354 -104
2565 -104 -1703 -813 451 1097 -13 -865 247 1318 1507 -363 -495 -49 1279 29 -1156 -1501 -111
2582 -111 588 -493 -1210 -970 1068 1053 427 -761 625 1415 1354 -411 -966 9 624 106 -1773 -1212 -387
2601 -387 882 -453 -874 -499 1270 1519 288 -308 212 1660 700 -435 -1481 -56 281 -264 -1722
2618 -1722 -1339 159 747 153 -936 331 1231 1836 118 -284 149 1207 480 -1078 -1409 -661 449
2635 449 -688 -1260 -1282 762 937 560 -514 405 1639 1478 262 -930 167 534 286 -1673 -1494 -697
2653f97J157q62p82O38J349Q98j294m22K30J534p79j118j112R94O06o69j196k10
2671a735J584N40j96j200J144J037P36j318p73N73P84l42j727m10M32J196r85
2688f60o69j89J742P03n33p49N34J482j65q31j397R63L84j48j767k97Q63Q57l45
2707b22j178P08J086J192j192k63R6J467l65j209r30M04R11q39q92o07J582L87
2725A36j7j121P40J211O98p97j084O29P60O9j857m06J80J117o77r65j94J323J004
2744G49o15n29J77J721J1o47j347P12O35k58j417p43R01N96r7j287N28Q78J300
2763A268q35n68L33J181J44j268p22P9J200q66q60q87J257O29j87r09K39J394
2781F22N52k96j157O62O50M09j579o09J76R03l45j299j55Q03J312p68l54j25J657
$$ plain form
2653 -697 460 -402 -1184 -546 803 1701 407 -15 215 1749 970 -148 -1260 -266 340 -329 -1525 -1735
2671 -1735 -151 389 193 -1007 137 1174 1910 592 -181 392 1176 834 -893 -1303 -871 325 -660
2688 -660 -1329 -1518 224 927 394 -355 179 1661 1496 665 -732 231 615 467 -1300 -1597 -734 123 -222
2707 -222 -1400 -692 394 1586 394 131 227 1694 1329 120 -810 -406 505 -334 -1226 -1833 -251 136
2725 136 119 -1002 -262 949 1647 850 -234 395 1155 1224 -633 -1039 -859 258 -419 -1384 -1578 -255 749
2744 749 134 -395 -218 1503 1514 867 -480 232 867 609 -808 -1551 -650 -54 -151 -1438 -910 -32 1268
2763 1268 433 -135 198 1379 1523 255 -467 -388 812 -54 -914 -1801 -544 85 -102 -1011 -772 622
2781 622 1174 878 -279 383 1033 1442 -137 -746 -570 333 -12 -1311 -1466 -663 649 -119 -473 -598 1059
2800A059K54m17j082L51R21k30j103j087Q47M83Q5j436J63Q94J118n41p19M15
2818b5R03P32j211n06r0J141n62q94r49P56Q88m00p42k19J432N32k6j215O79P26
2838I50N35j182q49L58O09pj439j31L26J274o08n31j63J394O50n51o99N9J172
2857A167j94p14j247O96M49N2j256k95Q68Q12m3j040M69P63J041j011n33j26J061
2876I19j03j024p74L01J012n07o06n87J321N55M4j059L97R01N03o47j070M40M57
2895D73L51j534k86J81J122l68p33j32R52R97n60n82j68J333n5m93j205N23N21
2914C37J2j007o46Q66N66J55j127K98P20J059p32o35M5Q13L63j088o29j8J137
2933D89m59o16o89R67O46l5p78m1J114M38k97j216N02M09N32j266n34K40Q31p
$$ plain form
2800 1059 1313 896 -186 165 1086 856 -247 -1334 -487 -4 81 -1355 -1192 -298 820 279 -440 -25
2818 -25 878 1610 399 -107 -197 944 382 -512 -1461 -705 183 -217 -959 -1178 254 786 760 -455 224 950
2838 950 1485 303 -546 -188 421 414 -1025 -1156 -830 444 -164 -695 -858 536 1186 635 -64 -5 1167
2857 1167 973 259 -988 -292 157 209 -1047 -1342 -474 338 295 -745 -276 487 1528 517 -16 -142 919
2876 919 816 -208 -982 -681 331 -176 -782 -1369 -48 507 551 -508 -111 790 1293 646 -424 16 473
2895 473 824 -710 -996 -815 307 -61 -794 -926 26 1023 463 -119 -287 1046 991 498 -707 -184 337
2914 337 349 -658 -1304 -438 128 283 -844 -546 174 1233 501 -134 -89 724 1087 -1 -630 -648 489
2933 489 30 -586 -1275 -308 338 303 -475 -516 598 1036 739 -477 25 434 966 -300 -834 -594 237 230
2953B30j033n5N04J165n91l82l24J194K31m52r26K16Q02j05o32j037Q33M76K64
2972C78j118J1O47Q80k56q94J69O60O58r80m68k93J098k27o19o70N24Q66j39n76
2992c49n33J187L67J8j164L34N69M97p99q70L94N29K59j105q3K59J192n18m53
3011b69l63R41N91m91o16k07J068j15l74j128P05M41K55r70k87O57O91O6j070
3030d75K27L97Q93q15n61j15Q62J95p90n95J82R70j79m50o48J000M18mr07N7P53
3051D15L90n01r68M59M21M19j065j99J10R86j17p00k11N51Q71n70m32l54J066
3070E71O0l67r79K98O97R5o06p14P64N06K45j050J40M11Q31n72o02o6N90M28q48
3091a68l59r0J084k49l96o83P78O19r9o40k55Q29K43j20j131L55L93N47q81m91
$$ plain form
2953 230 -803 -858 -354 811 220 -162 -486 708 939 487 -439 -223 579 474 -158 -1195 -362 114 378
2972 378 -740 -729 -82 798 542 -352 -183 477 1135 155 -313 -606 492 265 -354 -1024 -500 366 227 -349
2992 -349 -882 305 672 690 -474 -140 429 926 127 -743 -349 180 439 -666 -749 -490 702 184 -269
3011 -269 -632 309 900 409 -207 -414 654 539 165 -963 -258 183 438 -532 -819 -162 529 595 -475
3030 -475 -248 149 1042 227 -334 -449 413 608 -182 -777 -595 375 196 -254 -902 98 516 512 -395 -338 415
3051 415 805 304 -664 -205 216 635 -430 -629 -519 467 350 -350 -561 -10 861 291 -141 -495 571
3070 571 631 264 -715 -417 280 375 -231 -945 -181 325 570 -480 -340 71 902 330 -272 -338 252 680 -168
3091 -168 -527 -617 467 218 -178 -861 -83 536 437 -203 -458 371 614 494 -637 -282 111 658 -223 -714
3111g14L14P28J43q55n3K47J021m98m10m44R54J84m26p28r7Q85l1k53q62P10M13
3132B28M47r50j11M42O71j82q60N2L73O11q67l41k32J029k3l89n85L98R00k19
3152C92m15n22Q49K41K4j095J56M20L99n66o67L44N29M97r20p5J56J003k63m55
3172C2m46N57N39n31n18l32R07o5j36q73N85N40L12o61l25O06M46J19j014M8J71
3193c9P42p47m08k48P06K43m73l46Q7J116j61k82o21P47K86P4r53k18N37K99l29
3214A2r08L91L29O52o97j70J86R10l7o28k66L28P50o16l92n92Q26M3k38o84K14
3235e87P17K68l77m89O74L46L34r97MJ23O32m98p10j07M22M99n49k52p3J087n9
3256D08j67n44N61N08n0o44n59O51N3n8j055K74L56O21n52l59L34O30L92p64n5
$$ plain form
3111 -714 -400 328 471 -384 -437 -190 831 333 -77 -521 433 617 191 -537 -634 251 220 -33 -895 -185 228
3132 228 675 -275 -386 56 727 545 -315 -263 110 721 -146 -487 -719 310 287 -102 -687 -289 611 392
3152 392 -23 -545 304 545 569 -526 -370 50 449 -117 -784 -440 89 586 -334 -409 -253 750 487 32
3172 32 -414 143 682 151 -367 -699 208 143 7 -866 -281 259 571 -90 -415 191 637 756 -258 -210 -39
3193 -39 703 -44 -452 -700 6 249 -224 -570 -483 633 472 190 -431 316 602 676 -277 -495 42 341 12
3214 12 -896 -505 -176 476 -221 -391 -205 705 668 40 -226 102 852 236 -156 -748 78 121 -117 -801 -587
3235 -587 130 398 21 -468 206 552 886 -111 -107 16 648 150 -560 -667 -245 254 -295 -547 -620 467 408
3256 408 241 -303 258 766 716 72 -487 164 217 159 -896 -622 -266 355 -197 -556 -222 408 800 36 -19
3277a9J22P85m51m73n88N55K41l75n09j00P79K08l2p52O90L75M68q03j86K37M10
3298E82j84q64l8J82O31o23k33j37Q63J55k25l11L24O59j59l31o77O18M3K4r17
3319f18l8L35M20k63n41L87M13O24o42r2M4P77k83m56m98L51M46m56m22l25Q02
3340c5P3K8p23N01M88L87m61m75M95K39J04r00k5O2O06n53l01k30O78L39l46j75
3362b24qR03j32j89o57M90K32L6p83k50M05K19pp45L11L43N78n06j60O5O44Q0
3384F45n79k23L6O62m58l36n00P15J06j07n10J38O13K02j59o05N24K44L12p80
3404f0j60N5N58l08n60q4L40N53n28j26j63Q63K2j58n36L33M74j22m28m83N22
3425DJ30J3p63J80L03M89l68l53K11M28L97o41m3j21P69l92k77m87M68K71k11
$$ plain form
3277 -19 103 888 437 -36 -624 -69 172 -203 -712 -812 -33 175 143 -609 81 456 924 121 -65 172 582
3298 582 398 -466 -504 -322 309 -314 -547 -684 179 334 109 -202 122 781 622 291 -386 232 275 299 -618
3319 -618 -656 -321 99 -164 -705 -318 95 719 77 -15 29 806 523 67 -431 -80 366 -90 -512 -837 -35
3340 -35 38 66 -657 -156 332 719 258 -217 278 517 621 -279 -304 -242 364 -189 -490 -720 -42 297 -49 -224
3362 -224 -232 671 539 350 -307 183 415 451 -332 -582 -177 42 35 -710 -399 -56 522 16 -144 -79 565 645
3384 645 66 -157 -121 541 83 -253 -753 -38 68 -39 -549 -411 202 404 245 -360 164 408 720 -60
3404 -60 -220 -165 393 85 -475 -559 -219 334 -194 -320 -483 380 402 244 -292 41 515 393 -35 -518 4
3425 4 134 147 -616 -436 -133 356 -12 -365 -154 274 671 30 -13 -134 635 243 -34 -521 -53 218 7
3446Gm42j46O60N7J7o31M76L28L40o00k79K21L24O2p96j5J51O08n39j94j27O59
3468A41J59k46k95J24O67j36k42n47N28O7Q6p28rK48L42j70n13L53J98N44n28
3489D3j28n3O54o7m42l45K10M45l36l23l68O93P0M9n46K35M17K84k81m48L66J92
3511C21J94p18j5m1N80l81l59q0M25L88l20j64p7P76k06j1o02M19K34k6m81l24
3533d68L35K09L9o44K76K13M68m45j67O9N36J24n13j76j1N23k99k72m10N65J56
3554A08r5l40K6N63Q9n2n49L32J98K58o35j47O7L91q5n26k5K13M99l71j29r2O66
3577C64Qj58l83J36L78m9k84m39L39P4J23n92J39K02M12j75l19J85K52L50n03
3598F0j31l8N86k85l34l30K93L26j39k93k02O77J06J1n74K96K45K57n27j87J49
$$ plain form
3446 7 -435 -581 79 136 153 -478 -2 326 666 66 -213 8 332 394 -402 -417 -266 342 -197 -391 -518 141
3468 141 300 54 -241 -117 550 414 172 -375 153 220 306 -422 -431 -183 159 -11 -524 -171 27 571 43
3489 43 -85 -138 516 449 7 -338 -128 317 -19 -342 -710 -17 53 102 -444 -209 208 492 211 -237 129 321
3511 321 515 -203 -218 -259 321 -60 -419 -499 -74 314 -6 -170 -247 529 323 312 -290 129 363 337 -144 -468
3533 -468 -133 76 115 -529 -253 -40 428 -17 -184 -115 421 545 32 -144 -155 368 69 -203 -613 -48 108
3554 108 13 -327 -301 262 351 299 -250 82 280 538 -97 -244 -177 214 129 -397 -422 -209 290 -81 -210 -302 364
3577 364 372 214 -169 -33 345 296 12 -427 -88 -14 109 -483 -344 -142 270 95 -224 -39 213 563 60
3598 60 -71 -109 477 192 -142 -472 -179 147 8 -285 -487 190 296 307 -267 29 274 531 4 -183 -34
3619c4J80N2n92M8J8N91l59q9j66N38J40j76j60o9N31j60j52n28L57O7J22n46
3641c87m1L45K18J3m71K20K43M39m75r2j02M06Ml85k50J05M11k68j13l31N58J36
3663A83N9m84J56L82J64k38m76K89R9J73n89o3K2N19j93k88r1L55M40l14j68q1
3685a44N41n9j11n10K36K13k2l70k15L19J99J12n63J97J77M50l13k48N9L31J37
3706D16l86k00j07M83j92j87l30M48J62j2k89K0M47Q0n1m87K34J20J88n12j31
3727b86O2K76j6l39k9J28N01j81j47j33M67L7j64l19P1L72j14k20l95L37J24O5
3749I7m38J23J20M29j34l16J05K02K81m52j28j38M63j22k07k91K19L07q7j49j56
3770b72M88J6R6m86J84J80J93m23k75J56J78J16m67M5O8M76k00j17j87M46J70
$$ plain form
3619 -34 146 198 -394 -346 -328 263 -96 -185 -351 187 327 151 -9 -78 453 293 141 -387 -30 37 159 -387
3641 -387 -428 -83 135 148 -323 -103 140 579 104 12 -90 316 320 -65 -315 -210 201 -67 -180 -511 47 183
3663 183 242 -242 -86 296 460 222 -254 35 134 307 -282 -345 -323 196 3 -285 -376 -21 419 105 -63 -144
3685 -144 397 338 227 -283 -47 166 144 -226 -441 -122 77 189 -374 -177 0 450 137 -111 -52 279 416
3706 416 30 -170 -277 206 14 -173 -503 -55 107 95 -194 -174 273 353 302 -185 49 169 357 -155 -286
3727 -286 -224 52 36 -303 -332 -204 297 116 -31 -164 303 340 176 -143 -72 300 186 -34 -429 -92 32 97
3749 97 -341 -218 -98 331 197 -119 -14 188 469 17 -111 -249 214 92 -115 -406 -187 120 33 -116 -272
3770 -272 216 232 328 -158 26 206 399 -24 -299 -143 35 151 -316 -271 -203 273 73 -44 -231 215 385
3791C85k22j65j22L89j14q7n43K72K33R7l29j38L18K10M5m31J83Q0L56l22j35
3812d0j30L00M3l59j35M1M31j59o6k95M73J44Rl84J07K09J33j90l97K03M9K13
3834B00m87N1M1L68j01j93o2J97L52j87j49j88M35p4j33m24J20K67J6j26k89L04
3856f2K06J52m78K05O3L09k40k19q1K50J05l51r1p0M73j92o0k62M13J71j1k65
3878c5p0K89J1lm79J41P9K50l73j25J28K73Q3l08J2P3M58k50r6j65K61J20k41
3901C3k96L4L30q8j0l81L58J54J42l82K8J48K05l1l83J1J37J84k99j36p9M05l3
3924E1r8j84J84L34j14o8k76L30O6o1l81N1J75M7j80k18J77K43J87m09P2M3L70
3947C41j80r5k06K62J68k66j72j71L63m7qm06L69J30J58k20j67K57J51P5m17n0
$$ plain form
3791 385 163 -2 -124 265 151 64 -479 -207 26 123 -206 -344 -26 184 229 -202 -19 61 417 95 -40
3812 -40 -170 130 173 -186 -321 -280 151 -8 -74 -369 104 248 257 -127 -20 189 322 132 -265 -62 -13 200
3834 200 -287 -236 -195 173 72 -121 -183 14 366 179 30 -158 277 203 70 -354 -234 33 49 -77 -366 -62
3856 -62 144 296 -182 23 86 395 155 -64 -145 105 210 -141 -232 -302 171 -21 -81 -343 70 241 230 -35
3878 -35 -105 184 195 192 -287 -146 -67 183 -190 -315 -187 86 169 -139 -127 -54 404 154 58 -107 154 274 33
3901 33 -263 -229 101 13 3 -378 -20 134 276 -106 -78 70 275 244 -139 -128 9 193 -106 -242 -321 84 51
3924 51 -47 -231 -47 287 173 105 -171 159 225 164 -217 -166 9 56 -124 -342 -165 78 265 -144 -72 -29 341
3947 341 161 66 -140 122 290 24 -148 -319 44 -3 -11 -417 -48 82 240 20 -147 110 261 336 -81 -131
3969a31O1L35l33j47n1K73N7j21j31P2M11j06l2k88K58J16pl33q3J73R2n0l87
3992c52K21J02K41k72j7JL61l5k42q3O4K77k65j05k32L81k1n7k69J44K45M4r1
4015D0k18L17O6P7m10Q1%L03k86k33J9J50K32k50M9j05M14o1r5k49K87J25q2j74
4039cj19K11j2n2l29J53J05J81j56j11R1K44N6l00J1n8L41k90n6j55K45P9p8k15
4063b17N0L64j20K0k67K52P3O3k45j8L4J58m0k98J0J13K47k29l7j11L10L8r2j45
4087h7Q5K53j18r9k48K83k8J09l62N2J23J09k5k30J28J44J97l11O0j04L35j70
4109I6j29j30R1J99j67r2n4L08o9P4l66K34J24J17k32q2J36L0L8l19K6J20K17
4132A70k10n2o0K17J03k36o0J5L37j06m7k29J90P8m0j77r0K04R5%l26J85N4K23
$$ plain form
3969 -131 -70 265 -68 -215 -266 7 64 -57 -188 -116 295 189 157 -131 127 243 236 -97 -180 -7 85 35 -352
3992 -352 -131 -29 212 -60 -77 -76 285 250 8 -75 -11 266 1 -104 -336 45 24 -33 -302 -158 87 131 40
4015 40 -178 139 205 282 -128 -47 -47 256 -30 -263 -244 -94 138 -112 -63 -168 246 185 90 -159 128 253 171 -3
4039 -3 -122 89 77 25 -304 -151 -46 135 -21 -132 -41 203 259 -41 -30 -88 253 -37 -93 -248 -3 76 -2 -217
4063 -217 -167 197 77 97 -170 82 155 218 -27 -45 -11 147 107 -191 -181 -68 179 -50 -87 -198 112 150 58 -87
4087 -87 -2 251 133 34 -214 69 41 150 -212 -160 -37 72 47 -183 -55 89 286 -25 35 -69 266 96
4109 96 -33 -163 -72 127 -40 -132 -186 122 53 127 -239 -5 119 236 4 -78 58 88 126 -193 -167 -47 170
4132 170 -40 -92 -152 65 168 -68 -128 -113 224 118 71 -158 32 110 70 -107 -197 7 102 102 -224 -39 15 238
4156B38k31l7L9J82L1k86m6K9K81k26k9j88L10L1rk50O8K50K6r9k81K64N8Q3l24
4181a16J5J4J73p9k14P5J69J49j95j7j36L14m2m8j99J15J74q1j20j49K28J6M1
4204H7l14J25J18J46j34n3QJ24J47l43O0p6K59j16r8r5J60J06k12Qo2K89p4N6
4228A16k97K25LJ18j93j27J79J31k6k75L6OK34j62o7l4K66j0p9j30R0J85p3q6
4252C0k34J72J07J9k79O9J03J01n6k11K27l9K52k31n4m0K74j24j41r6J00J71j73
4275e3J3j08K66q0M8k13J41J31N2j69j87J59P1M6k69N6j9K07j56n3l0J70J78j76
4299B5om0J74m7jk79K03L3j5j68n3J58L2P7l12J92O3J87k63l1J10J04J6j91o8
4324a00KK03j83mj29K31ML1p7j8J72Npk25J19L7P5k21k0j6J77Kk27KJ03K16j69
$$ plain form
4156 238 7 -30 9 191 222 -64 -110 -81 200 -26 -55 -243 67 98 89 -161 -93 157 183 84 -197 67 125 208 -116
4181 -116 -101 -87 86 7 -207 -132 37 186 -9 -26 -162 152 110 62 -137 -22 152 71 -49 -198 30 46 87
4204 87 -227 -102 16 162 28 -25 -17 107 254 -89 -29 -105 154 38 -60 -155 5 111 -101 -93 -155 134 60 116
4228 116 -181 44 47 165 -28 -155 24 155 129 -146 -110 -104 130 -32 -99 -133 133 123 44 -86 4 189 116 30
4252 30 -204 -32 75 94 -185 -116 -13 88 32 -179 48 9 261 30 -24 -64 210 86 -55 -151 -51 120 -53
4275 -53 -40 -148 118 38 86 -127 14 145 197 28 -159 0 71 117 -152 -96 -115 92 -64 -117 -147 23 201 25
4299 25 19 -21 153 106 105 -174 29 62 47 -121 -174 -16 16 93 -219 -27 36 223 -40 -71 39 143 159 -32 -100
4324 -100 -98 105 -78 -82 -211 20 24 55 -22 -40 132 137 130 -95 24 61 136 -85 -105 -121 56 58 -169 -167 -64 152 -17
4351a7K8p6K48l8k1j88QJ55o8o7k13K00l1J34j80J14OJ90j29r5J16L1J01k10j9
4376b1o4K22j81n9j37J63J40p2l7n6K44Ro6j66R3M8O6j33j24P3M3O1k16R0oK17
4402A31j23J3n6J16N5j27K1o1J80j82P2k14J53K3Q4j91K0P3J64m4k49K12MJ54
4426B28j97m3j04J91k4j20p5J4J77j15J9q6K17J3P1j94QJ00qK6k00M0O9R6k70
4451a67M1L7J78n3o0J7P9N6p4o9j05K66j41N8k54J43J8Q7j31m7J16M8R9j88Q9
4476D3m4J85j59j26L3N9J35k23k7kK43p8j2j34J37J07m2j00k6J49ok9k39J44k9
4501d1Q7j75%M9J05M0j18N7oK35k12k5j17K23n6l1j37oK36q8m0j19J87J7P9k45
4527a01L5O4J25p1j13O9MP2j57P6j28J89j4n4n8J00O7k9n7j35K10m7K8j82M3L5
$$ plain form
4351 -17 11 -65 183 145 124 -64 -56 99 31 -36 -249 -49 -80 54 -126 -12 -6 184 55 -40 76 107 208 -2 -21
4376 -21 -85 137 -44 -103 -240 -77 63 -9 -46 -102 142 151 85 -81 12 60 126 -7 -131 -58 -15 46 -170 -80 -86 131
4402 131 8 21 -35 81 136 9 30 -31 149 -33 39 -175 -22 1 85 -106 -86 -13 151 107 -142 70 74 228
4426 228 31 -12 -116 75 51 -69 -144 -130 47 -68 -49 -135 82 95 166 -28 -20 80 72 98 -102 -62 7 103 -167
4451 -167 -126 -89 89 36 -24 -7 72 128 54 -15 -120 146 5 63 -191 -48 -30 57 -74 -121 -5 43 142 -46 43
4476 43 -1 184 25 -101 -68 -9 126 -97 -124 -126 117 39 27 -107 30 137 95 -5 -31 118 112 83 -156 -12 -41
4501 -41 46 -129 -129 -80 25 65 -53 4 -2 233 21 -4 -121 102 46 15 -122 -128 108 20 -20 -139 48 65 144 -101
4527 -101 -66 -2 123 52 -61 8 12 84 -73 3 -125 64 50 -4 -62 38 105 76 19 -116 94 47 75 -107 -64 -29
4553b9J01j81j2O9R4Q8k32N7P0J51j27n0r8J17P9j58l4j3J45n7O8k03K02l7J11
4578A21j26o2J51k3P7k01J6m1J41q7n8j0Q7P7o1n3L8J36Jj04j02J36rM2j65j1
4604i0J8Q8k4j43J25L1J31j61qR2Q8j18l1m6M0P3j10P5j72J93m2Jp0J4P8L5o9
4631bp5J07j5J56k18LQR5p4n4jR2J16j75Pm2J51l3Nj09J21L9k6j35J9J13j00N7
4659C0k00J07J3J09j05j%J26Q0j70K4JN8p3pj11K11o3j6m6m3J29o0L1r7Q9LP7
4687I6j56P3n0O2j2q6M6N0M0q5m3J0R8k0O8o8J4Q2j3o7j28J33m4O8j74N0qJ25
4715F1n8r1Q0KP8r1j0K8J31p2j08k9P8Ol5j5o1J60r5Q7j23lJ17L5q6m3Q2KO1r2
4745do4NJ32r5l1NP2J9l8Qk1J42q6Nq3P8lpo5n0J21l5J9j14N5QJ21j21N7n0J03
$$ plain form
4553 -29 72 -109 -121 -52 42 130 -102 -45 25 176 49 -1 -99 18 97 -61 -95 -108 37 -20 48 -155 47 10 121
4578 121 -5 -67 84 61 138 -63 -47 -88 53 -34 -92 -102 -15 62 1 -52 -14 122 123 19 -83 53 44 86 -79 -90
4604 -90 -72 16 -8 -151 -26 5 136 -25 -33 59 147 29 -2 -48 -8 65 -45 30 -142 51 9 10 -60 -46 32 67 -2
4631 -2 -77 30 15 171 -47 -44 -36 59 -15 -69 -70 22 138 -37 -30 -72 79 46 51 -58 63 102 76 -59 -40 73 -27 30
4659 30 -170 -63 -50 59 -46 -47 -47 79 159 -11 13 14 72 -1 -8 -119 92 29 13 -33 -76 53 -7 24 -73 16 19 96
4687 96 -60 13 -37 25 13 -73 -27 23 63 -22 -65 -55 43 23 91 23 37 119 106 39 -89 44 0 68 -106 -56 -64 61
4715 61 3 -88 -8 -6 72 -19 -29 -1 130 58 -50 -79 -1 5 -30 -45 -106 54 -41 46 -77 -80 37 72 -14 -57 25 27 88 -4
4745 -4 -68 -63 69 -26 -57 -52 20 39 1 9 -12 130 44 49 -34 44 41 34 -31 -81 40 5 24 -90 -35 -27 94 -27 30 -20 83
4776H3k3q1J9jJ34j56M2q2P2NN7q5k5M3P5Lj56J21K0K1o2m9pM8j7j0o2R8J05j91
4806f1J07j02J10k9N4r7j2J15m7o1o6J26k4k2j02M1M9N1l9k8QP6O4j01j1%J23
4833A22j31K8j01M8J04j03m7n5J50j9N3o1O5K2O6j40KK7l7M9j12R1q7J06o4p3
4859i7k8K03qo0j2l5J33n6j9pN9mo2p0M2K4K0ln2K8L2N4j01M0K7J04j60ql4M6
4889dK3l3m5k3P8m9M6j56J61M6j0L8j29P3M5J0j49J7K5M3o3qqM7P7n4J7L0Q6j21
4919A0O3j27Q5J6K9q7k9J1PN1j06O1k5J06n1n0J8R2k0p3P2j12J10k7j8j52J45
4946aj5N4o8K4P6k6k9m3O2k5M3q5J9k9R2l6p4k5P3M0j06M0J8Q1j1o7M7j6K2j9
4976A6jj03J02k4O4j59J31l4M5op3P3mL1o0L1q4J36l2k3p2L6J1L0m6mN8j2K1q9
$$ plain form
4776 83 60 -21 -2 -3 131 -25 17 -65 7 12 69 -16 -41 2 77 80 -76 45 65 86 24 -25 -32 16 -1 -11 -73 25 130 -61
4806 -61 46 -56 54 25 79 -18 -30 85 38 -23 -89 37 13 -9 -111 -70 -21 30 -9 -37 -29 47 111 10 -1 -1 122
4833 122 -9 19 -82 -34 70 -33 -80 -135 15 -4 49 -12 53 75 141 1 3 30 -7 42 -70 21 -66 40 -24 -97
4859 -97 -125 78 70 10 -2 -37 96 40 21 14 73 69 7 -63 -21 3 23 20 -32 -4 28 82 -19 21 48 152 -8 -16 -50 -4
4889 -4 19 -14 -59 -82 -4 -53 -7 -163 -2 44 34 72 -57 16 61 71 -78 -61 -36 7 -56 -64 -72 -25 52 -2 15 45 131 10
4919 10 73 -54 31 47 76 -11 -40 -29 -22 29 -77 -16 -41 65 14 -36 -18 74 54 -19 53 -59 51 24 6 -146 -1
4946 -1 -16 38 -30 -6 70 44 15 -28 34 9 52 -33 -14 -43 49 13 -61 -86 -13 27 -79 -39 -21 60 49 -18 29 13 35 16
4976 16 15 -88 14 -10 54 -105 26 -8 37 31 -42 31 27 58 -2 29 -55 81 49 26 -46 -10 1 31 -15 -19 39 27 48 -41
5006d1M0L7J8m2k2M3j3Om9O2m2Q1j06j6JL7M0J4j04K6M1nK2j22P3J8M8q9K8J8
5036BJ0M5q6J3K5R3j02rl8J21j10J14o6%L4m5K1j04O0KM1m3L2J2N4j1j12N8L6
5065D7J8r3N0k2J4l6k2jN5K5k5m0L0L5NJ3r9L2p2J38o5k8N3m1P7o0%M5M6r3M5
5096C1MJ4Lj05Qk9J06o0K4p7R6J3J5J2r1PN0L5j02Q7J4Mq0k4J5Q3Pq0L0l7J14
5127H7j40J07k5k2nK2p7M6P5n1J0p1J26r7J20j45M4K1l8Np1Q6k2N7j5m5j3M6o3
5156d8P5q2M4L8k4Jo2P6k6L2j05Q9n2Q6q3k4N9L3j4k5oK2j4L4L1r0L0L7k5k5K5
5187GK6jj4j00J6N4O4m7k3O7l9Kn0K6l3Q7q6J2J2K3p3L9L5k5M3l1J1l7R7l3ql7
5219a6m2O0J3Qj14R5pM8k8o4K9L3rk3KnP7p5O3j20N1m1N0o2J0O0J3m4M2M9p2Q1
$$ plain form
5006 -41 -1 36 54 12 -10 33 20 26 -23 39 -3 78 -28 -44 -43 -6 34 48 -56 -30 11 6 28 -94 -21 -3 45 -44 -16 2
5036 2 12 57 -29 -16 9 102 0 -9 -47 74 -36 78 12 12 46 1 22 -82 -22 -20 21 -22 10 22 76 65 -47 11 47
5065 47 65 -28 22 0 14 -22 -44 -45 10 35 10 -30 0 35 40 53 -46 -14 -86 52 -13 -41 12 -29 48 -12 -12 33 79 -14 31
5096 31 35 49 52 -53 -45 -74 32 -28 -4 -81 15 28 43 55 -36 -29 21 56 -46 41 55 59 -21 -45 -30 53 60 -20 10 -27 87
5127 87 -53 54 29 7 2 24 -53 -7 68 17 27 -44 82 -15 105 -40 4 25 -13 -8 -79 7 -15 42 27 -18 -31 15 -48
5156 -48 27 -55 -11 27 3 4 -58 18 -8 24 -81 8 -44 42 -41 -65 -6 27 13 -12 -18 4 -10 24 55 -35 -5 32 7 -18 7
5187 7 33 32 18 -82 -66 -12 52 5 -18 49 10 12 -38 -12 -45 42 -44 -32 -20 3 -70 -31 4 -21 22 -9 2 -35 62 29 21 -16
5219 -16 -58 2 15 23 -91 4 -3 45 17 -47 -18 15 6 -17 -15 -20 57 -18 45 -75 -24 -65 -15 -77 -67 -7 6 -38 4 53 -19 62
5251F2M5l6q7M7J6k7j15R5KN4m3j2J09j31K1j2L4QPj9m9N8n7%j9L4l9N1l4K1q
5282b4oP2l3M1q7Q1r8O6q4J16m7lk1l4N6O9k2r4Q7l1L0k2KpL0J4n8k7j3R6o0n3
5314f4M5L5j7N1n3N6ljk1o3J36j10N4j04M0j3L2J9n1N8KJ1j10N1K2Q6q1L1n1%
5344a3M1J3r2j1J19o7L3p2N0rM1j3J0o3N6M8j41N9q4J29o9J5oM2j3J3j9j8N1j1
5374A9K5k0K0J3k1m1j0l9L8Kq1J11m2N3l8M0J6J3j2j3rPj9K7o2k2L6j6NJ3p8Q8
5406CM3m7j4L7j7L3p2M7o4M2J6m2L4j4N6J2p4nM5k6J8k6L2L1m0Qp2P6l1kkK3l7
5439b9P6p1oM0K4m8l7J00o2j3M5m8J6LqNpl1O5q0J11n4KO0k5ll7K7J5L0n6Rjk1
5473in6P9J0rJ5rK2q0P6Nql7L2n7P3l3k0mK4l0QM9n3Q4q5M3m0K4j8K8m8J8Rl7
$$ plain form
5251 62 107 71 -16 31 47 20 -95 0 2 56 13 1 110 -21 0 -12 22 30 37 18 -31 27 -30 -30 -49 -15 -54 -3 -37 -16 -24
5282 -24 -30 42 9 50 -37 44 -54 12 -72 44 -3 -6 -27 -61 -5 64 42 -52 35 4 34 12 14 7 37 51 -7 -34 -47 49 -11 -64
5314 -64 -19 16 -1 50 -3 53 50 49 28 -35 101 -9 45 -59 -19 -32 0 19 -32 26 28 39 -71 -20 2 88 7 38 -13 -13
5344 -13 28 41 -51 -62 57 -10 23 -49 1 -8 33 20 30 -33 23 71 -70 -11 -95 34 -35 -20 -26 16 3 16 -3 -21 30 19
5374 19 44 24 44 57 36 -5 -15 -54 -16 -14 -95 16 -26 27 -11 29 45 58 46 33 24 31 12 39 -23 -45 -9 -25 -20 -7 -85 3
5406 3 46 -1 -15 22 5 38 -34 13 -51 -9 7 -35 -1 -15 41 53 -21 -26 19 -7 11 -15 17 48 8 16 -56 20 -11 -13 -15 8 -29
5439 -29 47 -24 -30 10 34 -14 -51 49 -13 -26 19 -29 -13 -10 -18 -13 -20 -51 14 -66 45 -9 -7 53 28 25 -12 15 30 60 4 13 12 -9
5473 -9 -65 14 24 15 30 21 43 -37 39 44 36 -1 31 -26 47 14 -6 -10 14 -16 -8 41 -12 72 -13 30 -10 14 -4 24 -24 -6 3 -34
5507c4O0j31J35J8k2p5K1KM6Jk0%j9K1jJ1l7j4K4M2n1j4N4n5kJ2P2j6K0l7N3p0
5539fQ1r6l7N7j0j2JM4r6P8pj4N1L4L1j47K9K3M1j10Q5n6L1M0m9RJ9K6l2J7m6
5570b1L5k2N7r0K8k6Q3m0J0n6N4k2m6k0J1Q4l8N2k3NK6Rm1%J6j5L9o9oP9m8J3
5602A8m5Pj0Q3m3Kl6J0K7j1pQJ3m7plM1k5J1MNpM3l0RMk5K5n6O1k1K2l7kj2P4
5638D3Lk5n8L4O6m2N3r0M9nK5o3mL4j0m6RN3o7N1K0n0NJ3K6j4l7PR0p8J3r9J08
5671A4l9P1m1l8K8J0KKmm0O4m1J5k2OM6m7Mj0L0M7k5n5O1q3J0L1LMM3p0J4NJ3
5705HM0o4j5j2M4j6J9nL2J3n5K6j4L5j3Op1R0J8Mn1j5M0l9L0n8K0l4L3m2N1j4
5737iNK5k9j0K4J7l9O1q8K9J4K0on8J9L3j7j6K7n0M9J7J9J0k6J4n0L4k5J0L7n9
$$ plain form
5507 -34 26 -105 30 48 26 -49 -28 -26 20 21 1 1 -18 3 2 13 -24 -38 -14 28 -23 -37 17 -38 -40 -28 44 28 48 11 64 -6
5539 -6 75 -21 -58 -1 -11 -23 -22 22 -74 4 -3 -17 34 68 99 -48 -19 4 45 -65 20 -36 -5 35 -14 -5 14 40 8 25 -21
5570 -21 14 -8 49 -41 -13 -39 44 4 14 -42 12 -10 -56 -76 -65 19 -19 33 10 15 41 50 9 9 25 10 49 -20 -26 53 5 18
5602 18 -27 -20 -30 53 10 12 -24 -14 13 2 -5 3 16 -31 -38 -41 0 -25 -14 -10 -5 -12 31 1 10 14 -11 14 -42 19 -2 20 -17 -19 -31 43
5638 43 46 21 -37 -3 63 21 74 -16 33 28 53 -10 -14 20 10 -36 -27 26 -41 10 30 -20 -15 -2 24 10 -27 -20 70 -8 5 -94 14
5671 14 -25 46 5 -33 -5 5 7 9 5 -35 29 -12 3 -19 -13 33 -14 -10 -20 10 57 32 -23 38 -45 -35 -4 -1 3 46 -24 -10 -5 8
5705 8 48 -16 -31 -43 1 -15 4 -1 31 44 -11 15 1 36 23 29 -42 48 66 70 19 4 44 5 35 -23 -3 -37 -4 -46 5 -9
5737 -9 -4 21 -8 -18 6 23 -16 45 -43 -14 0 20 14 -44 -25 8 -9 -25 2 -48 1 18 37 47 21 35 -15 19 -6 4 41 -18
5769a8MK5%om9M1pLN4o4M6n9P8o2Lk6%N1QOo0M2k4L5rK0lK7q3K9M2j7m3N9rm9
5805a5P0l0j6lj8n0P1m5J2N0k0KK2mj3k4o1O1P1m5j1k7N5o1Q2m3j7O8j06L8k2
5836b9L0p1P8l0oQ6J5q3L1n3L9J1j6O3j0l3n2O2n9N5oj1m0qN0K5L2m5J9o0L6k
5868A8km7nj0M1k0L8J5m4lK3m0Q3k4n8k0Q5J8m7l5k1L8N4j0m1l3O3k5k2O1OL2
5900F8m9j6n8J39j43R3n9j4M7J2J0m5J1K2qQn9M8J3K9l5j7N7r3N1nj5N7r9Q7n0
5931a3j0M6j3J8n2L0RK5m6J5m3L7j5k2O5j6j1J5j3jQkKj7mj1M9j9k7m2L3O2m7
5964a0J6k7k4J9K8rpM3ql8K2O5n9M5j0l4j2j0J4Nk0O7q1M0j9J2km7N1j8k2M2O
5997A8j2rn7M4j3L6J4l1qN0M4o6k9lk6M2M4j7m1K4M1p7O6j3L9qj2Lo6K9J8j8j2
$$ plain form
5769 -18 -14 11 11 5 -44 -3 -10 -7 47 -17 29 -30 48 -14 -11 -37 -37 14 22 28 -32 10 -14 21 12 32 29 56 -27 2 44 27 -16 43 34 -15
5805 -15 55 25 9 6 -12 -62 9 -36 -24 26 6 8 30 26 13 -11 -72 -11 60 15 4 -23 32 -29 53 10 -7 61 -45 -7 -29
5836 -29 1 -70 8 -22 -28 58 73 -10 21 -32 7 18 2 65 55 22 -30 32 -27 28 22 11 -29 -37 13 38 70 25 44 -16 20 18
5868 18 16 -31 -36 -46 -5 -25 13 28 -16 -19 4 -36 47 23 -35 -55 30 48 1 -34 -55 -17 37 27 -14 -47 16 -9 -31 30 36 68
5900 68 19 3 -55 84 -59 34 -25 -39 8 20 30 -15 -4 18 10 18 -41 7 20 49 14 -3 54 -39 12 7 -8 49 -50 37 -13
5931 -13 -23 23 10 28 -24 6 15 40 -6 9 -34 3 -12 -34 31 15 4 19 6 5 13 11 13 -4 -8 -19 30 11 -16 -58 -25 37 -10
5964 -10 6 -21 -45 -26 2 -7 -14 29 21 -17 5 70 11 56 46 12 0 -10 4 9 -11 56 -25 15 -4 8 6 -41 10 -8 -30 12 18
5997 18 6 -3 -60 -16 -29 7 21 -10 -18 32 76 10 -19 -22 -48 -6 38 21 -20 4 45 -32 34 21 60 52 40 43 -23 6 24 6 -6
6030fJ5Rm4K2%K5Ko0O9q5L5J4J3k2M4kj8pJk0ML9n5J4M8J1K3p2LkL9Jm9M2k6k6
6066b1l1L8RPJl0PM1n4O0k8J1M4o8P2rm9L4m6k2O7j8J1l7MnJ0Jj6J3o7J05k1P
6100B0J9p0OQ6Po5jKJ5j7L6l6K1k1J1l6L9k4Q6m4m5J4oJ1m5R1r5j0M4r3R4L0m4
6133b0nO1l6MpL3m0nK8o2O0J7k4M3p5K3LlN1rm7L0l7L1Rk7L0k7qQL6jK8o2pOM3
6170D2m1J5Qo3RN2m3mL4K8l9j9J3kK6J8K6r8M7L5Pl8o1L0RP8o6N5m9j5J03n9j4
6203B4m1K1M5o4n6K1N7n8K2L4l9J4k2MK6K9%m6J1K7m8K0l5Q2J4p0k6L5J9j9L7
6234A8j6k6J7Jj5M0j0rQj2J5J6Nj6o7K9Rk7L9qNOK1m5RNJK8j3Npj4K0k0L1j9j7
6271a3JPJ2NK5n7L6R4j52O3Mj1k0M2j2Rm4K8L2n1P3l1k8K1j9Nj4M5q6pj8J10m9
$$ plain form
6030 -6 9 18 -26 -4 -4 21 23 -37 32 -53 -18 -4 9 -13 31 29 11 4 5 -15 -11 28 -27 -13 35 46 69 -3 0 -2 37 38 -11 31 5 -21
6066 -21 -52 -14 -5 2 3 -27 -20 21 -33 27 -1 10 54 -14 58 49 0 34 -12 -34 33 15 26 -11 -7 -12 -2 -1 -17 -4 -71 34 13 20
6100 20 39 -31 -25 61 68 3 2 4 19 2 38 2 23 2 13 -23 16 -8 78 34 -11 3 -3 8 -37 54 -41 -51 -7 -100 -6 24 -20
6133 -20 -25 36 0 4 -3 30 -10 -15 13 -49 11 28 4 47 -28 -5 -2 -5 46 37 -10 20 -17 14 23 -4 26 -1 -9 -1 35 34 62 0 -7 -1 42
6170 42 1 16 24 -39 -30 22 -21 -25 9 37 -2 -21 -8 -10 16 34 60 -38 9 44 51 13 -48 -18 -9 69 3 58 9 -6 97 38 24
6203 24 -17 4 49 -15 -71 -50 7 -51 -29 5 -34 -20 -42 -38 -12 17 17 -29 -18 9 -39 -19 -54 28 42 -28 -54 -19 0 -19 18
6234 18 2 -24 -7 -6 -21 19 9 0 8 -4 11 27 32 16 -51 -22 -13 -40 -1 -9 -4 2 23 -22 -13 -8 -7 21 8 13 6 -8 12 -8 23 4 -13
6271 -13 -12 -5 7 12 37 -20 16 110 -42 21 25 14 -6 36 24 33 -11 17 49 -2 71 40 12 33 14 19 5 50 -36 -43 -61 49 0
6304@n8K5P6p5P5o1j1lN2L2o4K3J3kJ2l3M1m4j5M5oJ0Km4J8jn6K0L4k6L0Rpk7
6338a6K5o4P4m3PK1OJK0k2j6K9m2O4n2l2M2j0lnRl6N8j0pOm3Q4j06J06n3O4o9
6371a3pLL5L0r6lNJ09l2%jj6l5LJ8kj5Ol7L0K3j5jPm5N1L0Rm8kj5Q4p4M6J1l7
6407FL4j5JLo1M8o4J13pm0l7l1J30m0K0m0k2J7m7O4J5n3l7K8k6M9m7oJ0O4Nl3
6439AM3p9P0l3ll0KN6k2j9lqP2p8L0J8l2K7k6Q8j17P2rl3Lnk4k1O1n6K5K5j6j
6473b2M7o9M2j7J2L0k1j7J1M6ll6m9N5k9Q4m9J7L6m1m0J6l2M5J2Jm9K6L0n4pP
6505a8M6n0L9K8r3J06n0k3M7j5j1rL3k9k3QL6m6L2L1l1J4L5q0K6M0n1OmL6l9J3
6537Dj1L9L0m2k6Mj2l9J9M7L8m8o2M8Rl8O8lj6j5K7J0j2k0MOm4Q5k2J5p3J2J6
$$ plain form
6304 0 -58 -33 43 -32 43 -18 -29 -32 20 52 -12 11 24 22 34 1 42 -2 -17 28 22 32 34 -10 8 7 -49 -29 5 -21 9 18 11 -16
6338 -16 9 -55 19 -24 -17 4 10 11 31 9 -7 22 -20 44 -8 -40 2 -8 -11 -16 -7 -43 15 5 -2 4 -39 45 -61 45 -8 56 -13
6371 -13 -20 -17 18 48 -48 -51 -46 63 31 31 30 14 -21 -18 0 -2 -17 -11 -48 -18 5 -10 -11 -4 -49 2 32 41 -7 -9 -24 60 -14 32 43 6
6407 6 40 25 26 29 -32 16 -48 65 58 18 -19 -50 80 40 60 20 -2 15 -32 32 47 -6 -43 -15 -41 8 -39 -45 -35 29 34 1
6439 1 44 -35 35 2 -1 -31 -29 27 5 -14 -17 -25 47 -31 -1 17 -15 12 -14 74 -43 29 20 -13 -10 -15 -39 -60 1 -55 -30 -5 -21 -22
6473 -22 25 -44 -2 -19 -7 23 2 -15 -4 42 39 3 -46 9 -20 64 15 32 68 27 -13 3 -29 16 28 29 -20 6 36 -18 -25 -18
6505 -18 28 -22 17 45 -48 58 8 -15 32 17 6 -3 30 1 -22 -14 22 -24 8 39 8 22 57 -23 3 43 -8 -2 -6 30 -9 4
6537 4 -7 32 62 20 -6 -2 -14 -53 -34 13 51 3 -59 -11 -2 -40 28 25 9 -6 21 31 19 -1 3 9 -35 50 28 43 -30 -18 -2
6570bm6O8k8JO2q9M7m2M0n9L8J1M7l8o8L4L9J4o2N9q9pQ4rj8L8k2k3M6l2K0k9
6602a5nJ3j4O7n0M2k1j1j8K1J9Ll4j0rjj4M1J9m4PMM1mPL6n8K8J9m3k7K8Mpj3
6637Aj8L7j1Rm7N2k5k0K5Nj7M3q7J01k7k1j3K9ql9P1l0J0l7P5p8P9n7pK2o8N3
6669Bk4J3LL2m5O2q0k1K1M9j3oj7L5Jj9L5l4k7%J8K6pol1k2K6Q5k0q1O3k3lj3
6703b1J5M1n3N9J9m8j5K4J4K0o6N0M1q1n9N0j6k2P3j3RL3p6K9j5Jqj4M1n2L4K2
6735A6J2n7P0k0J4k0q3J18r4O7j7J6j6j2%RN6j8Rj7j8kN4n4k7j6L5m5N5n7M7N
6767A0m3K0Rj0K5m4L5l6M2K3k0Mp4Q2jk5J4k9O4k0j2l0J5J6l5k5j2M0K0j2mL9
6799B6n3K6j2PqL0o7O8k7k4%M1j8L1lk0Jk8N6rOn9MN1l0N0Qp3N2j1L1n3K5L2l8
$$ plain form
6570 -2 -48 20 -8 -7 55 -34 13 -29 11 -48 -10 1 48 10 -58 -24 15 29 -33 26 -63 -70 14 5 -13 25 3 -20 26 -6 14 -15
6602 -15 -20 -7 -21 46 -4 38 17 6 -12 9 28 31 -3 -13 -22 -23 -37 4 23 -21 -14 -10 31 27 34 70 12 40 59 16 -11 17 21 14 1
6637 1 -17 20 9 18 -29 23 -2 -22 3 8 -9 34 -53 48 21 0 -13 16 8 -31 40 10 20 -17 58 -20 59 2 -5 17 -51 2
6669 2 -22 -9 -6 26 -19 43 -37 -58 -37 12 -1 -7 -24 11 12 -7 28 -6 -33 -33 -15 11 4 -2 -33 -55 -29 56 36 -45 18 -5 -8 -21
6703 -21 -6 35 -18 41 60 12 -3 21 35 55 -11 39 80 -1 -60 -10 -26 -48 25 12 21 54 -22 7 -8 -7 -15 -29 12 -40 -6 16
6735 16 28 -29 41 21 35 15 -68 50 -44 23 6 22 6 -6 -6 3 59 41 50 33 15 13 67 13 -14 -30 5 -40 15 -42 5 10
6767 10 -33 -13 -4 -14 11 -33 2 -34 8 31 11 15 -59 23 22 -3 11 -18 46 26 14 -16 -1 15 -20 -45 -57 -17 3 -9 -13 26
6799 26 -27 -1 -13 -6 -14 16 -51 17 -10 -34 -34 7 -11 20 17 -3 -2 -30 26 17 23 -36 -32 19 -11 39 47 -26 26 15 46 -7 18 50 12
6834A2j9j6J6n7M4M4k4j8J9J4j8QM7n9M6j7k2j5L5p2Q3Kq7O5K0j8q4N2oL1kL1
6866C5l2K8m1M1O0m8lk3J6J9o7J4Qoj6nM1j2l2M6k5K6k6J6l7K1J3k5Nl6O4n3Q7
6899E3n7j0K9o1O7n0J07n0n6K2J3Oj5N2q1NM2M8r7M8l7KK3j9NL7m5j2J1M1J7m6
6931hJ7Jl3M7k8n0R5l4l1NjL1m3lL1mJ1LQqm6O2l1Pk5M7k3K3m4J5L0p0N8k8K2
6966Cnj3j0M1kn0K8j7L5j4K6kr2J13J0p6L3k4n7L3P9n1KK1m0Rl0L9M5k1l1j2N3
6999B3l6K4pl3P3K1l8n7KL2K0k1J1n6O3j7M8m5J0j0K1j8l8j2R0r2J8K2mL4j6m2
7031c0N3l9P3n2j6l1K0K2L1pk1M5k4JK8n2O6p3K2Mn6N4k4Qn2Q0j2Pj2m8O9l5L1
7064C0m2J4J4k8j3qL3k0K4j0QMJK4r8M4J2m3P5Pk1O1n1Ql6KL0m5J1JM0j1k7k5
$$ plain form
6834 12 -7 -23 -7 -64 -20 24 0 -18 1 15 -3 5 52 -7 39 22 0 -15 20 -52 31 33 -54 11 31 13 -71 -19 -25 6 4 35
6866 35 3 31 -10 31 91 43 40 17 33 52 -15 -1 7 1 -15 -20 21 9 -23 23 -2 24 -2 14 -23 -2 11 -14 -9 -45 19 -34 53
6899 53 -4 -14 15 -46 21 -29 78 28 -28 -6 7 13 -2 50 -31 -26 16 64 -33 15 -22 -20 3 -16 -11 26 -19 -31 -20 21 38 -8
6931 -8 9 10 -23 24 -4 -54 41 7 -24 -19 -20 11 -32 -35 -4 -8 3 6 14 6 -40 22 -9 -2 -27 20 -3 20 -24 -9 21 -49 9 -19 3
6966 3 -2 -15 -25 16 14 -36 -8 -25 10 -4 22 20 -72 41 51 -25 8 -16 -73 -40 39 -12 -10 11 -29 -20 -50 -11 34 13 -18 -30 23
6999 23 -13 11 4 -29 44 65 27 -30 -28 4 24 3 14 -42 21 4 52 7 17 7 28 10 -28 -40 50 -42 -24 -2 -6 28 12 -30
7031 -30 23 -16 57 5 -11 -42 -22 0 31 24 3 48 24 25 53 1 67 -6 16 20 -36 18 -6 2 -50 30 18 25 13 -35 34 -1 30
7064 30 -12 2 16 -12 -25 -33 0 -20 4 -6 2 6 7 31 -67 -23 -11 -54 21 28 7 68 17 25 -11 -9 21 -24 -13 -12 28 17 -10 -35
7098c5P3k0j9o5O9J7j8kK1qo2M7k6J3J2jMl6M3j9L5o0P7j1o5P1p6RJ5M1j3m2L2
7131Aj0M6l7j2M3n8N4m0pJ9Qj7m9O2Jj0l3M5k0mRK4k6lNl4O1k8K9o1P8k9j6l8
7165d7M5L3n1J6rN4m2L1L7o2J5Jk5K4J1j1o4K3M8k6O5q8O9m2Lk5K1j0k8O3j4n3
7197c8J6L1Kpo7O7omL7pKl6oN2m3L7j0M6n3l6J8j5L2J9j0j0n8O5Qm1N0pk7j7k5
7232d1J08j11M5k8Q7j47R9j06N5O1k1%l6Q6j6oq1M5l2L8J6jm0J02p0%Lk0rP5k8
7263B7rqKl9m4O1K5m5O4m1k7RP2m6k8Q0r0L0lonK3k0K1n2L8MqM8n4O3m3k6oM6
7298A3k4O7m0q0J27m4q4K1L7J4k4Ppl0P7lm7j8O8k7N0q6O4llll7pL7%pl6L3N4
7332E9p7QKL6L3np8J0ml4J07k9m2K9k5J6m7N9n6N9m5P3rm4j4K3%J7pj7QM1m4j3
$$ plain form
7098 -35 38 18 -1 -66 3 20 2 0 21 13 -49 -2 -28 -15 -3 -4 0 -36 7 -12 23 -37 40 29 -36 35 -41 -32 -17 24 11 -31 1
7131 1 -9 37 0 -12 31 -27 27 -13 -20 -1 7 -10 -59 3 4 -6 -39 6 -14 -18 -9 15 -11 -14 -9 -43 18 -10 19 -42 36 7 -9 -47
7165 -47 -2 31 -20 -4 -13 41 -1 30 67 5 20 21 -4 20 31 20 -44 -21 27 1 66 -22 47 5 8 -17 4 -6 -34 29 15 -38
7197 -38 -22 9 11 4 -63 4 -2 -6 31 24 26 -10 -16 36 -7 30 20 66 13 -23 -5 -20 12 31 21 11 -47 18 26 -15 35 28 1 -16 -41
7232 -41 67 -44 1 -27 60 -87 12 -94 -39 22 1 1 -35 51 35 29 -52 -7 -39 -1 15 14 -26 76 6 6 9 -11 -20 55 27
7263 27 18 10 12 -27 -71 -10 15 -30 34 -7 -34 -25 47 1 -27 53 -37 -7 -10 -16 -21 2 -18 3 -49 -11 -7 -15 33 -21 42 -1 -27 -33 13
7298 13 -11 56 16 -64 63 19 -65 -44 -7 7 -17 -10 -17 -47 30 27 -20 -38 30 3 53 -33 31 28 25 22 -15 -22 15 15 8 -28 5 59
7332 59 -18 -10 -8 28 61 56 -22 -12 -16 -50 57 28 -14 15 -10 6 -41 18 -38 21 -24 49 40 -4 -18 5 5 22 15 -2 6 47 3 -10
7366a0L5l3L5J1m1Rj1K4PK5n3K0l5j1j2QMO7Kl4oKL2k8Mm5K6k6K5j8rO8n6K4K7
7401B7K9k1l8J6j8Jj4k3P1j4n7L9k0L0l0K4nm0K3j6NmK1PRk9L6j5ok6O8j1l4K8
7435A3k6Nk7K9jPj4K2j2jpQ3j14M2j6k0J4J5k1N4L1n7J2k1J6j2J1L7l8J0lm2J9
7468a2L1j1J2p8L1O0m3m4L0L0Ml1K3J4L4k0o9j7K5M6mk1j1k6O6Qj2j7L2Jrll6
7501a7R2k5n0J9J3K6p2M5k0M2n4J8o8N7L9j8l5M1l8lqM8J0p8N6m5K8p6Q6nl3N
7533b0K2l1N9J8m6no4O5nL8l5k0O9k2l5N0k6ORj9om2O4m7RL8mJ0k1N3o7K0j6K6
7567B5k2Rn1J8l3O6ol1L8J1l6j1N5m0J2k5M9k5L4o5nM1l6j2M9qM6q6K0l4J1O2
7599B0km4O8n1%k7M6l5J0Ok4KK5J2k9K1J5L3l8lK4k6%L4r5M9mlJ7m5L6K1J2j7
$$ plain form
7366 -10 25 -8 27 38 -3 6 -5 19 26 51 -2 18 -17 -28 -40 -32 -28 39 41 7 1 3 35 7 11 -34 -8 -34 -9 -27 -36 32 -24 0 27
7401 27 56 35 -3 13 -5 -4 -18 -41 30 16 -41 -2 -22 8 -22 2 -3 -43 -20 -36 -31 -35 -14 -7 2 -27 9 -6 -12 -38 30 19 -15 13
7435 13 -13 -8 -35 -6 -7 0 -14 8 -4 -5 -12 71 -43 -1 -17 -37 -23 -8 -29 25 56 -1 11 -10 6 -6 5 42 4 14 11 -31 -12
7468 -12 19 8 20 -58 -27 33 -10 -54 -24 6 10 -21 2 16 50 30 -39 -56 -31 15 11 -10 -21 -47 19 27 15 -2 30 31 22 19 -17
7501 -17 75 50 0 19 32 58 -14 31 11 53 -1 17 -51 6 45 27 -8 33 -5 -8 -16 32 42 -36 20 -25 3 -73 13 8 -25 -20
7533 -20 2 -29 30 48 2 -3 -67 -2 -7 31 -4 -24 45 23 -12 38 12 18 27 8 2 -40 24 -23 -14 24 20 30 9 62 -5 15 -1 25
7567 25 3 12 -39 -21 -54 12 6 -25 13 24 -12 -23 32 -8 4 -21 28 3 37 -28 -33 8 -28 -40 9 1 47 -39 -19 -53 -42 20
7599 20 18 -26 42 -9 -9 -36 10 -25 -15 -9 -33 -31 -6 6 -23 -2 13 46 8 5 29 3 3 37 -58 -9 -13 -16 1 -44 -8 13 25 8
7633Hm1M7Kj6L7Ro1Oj0M2l9L5n3L6N5l6j1k5m2QQ3J7l2po8M9K2qjJ5k9L7m3J8
7667Dl2L5l0l2Q3j8m3O7l5J6M0l1rLK1n3PKp0O7k3Q5k1o7L9j4J2K9j6j9K7l3J6
7700Gp3P8n8L3j4M0n4qR3j6j0pj1k2P0o1M1k3JLj5PjM1o0L0K1j0lk4J7J0l1l9
7734d8Q5k5q6N8PL2l0oj4mPK8n1O3Oj8nK5l8J0rQ6p6J1Q1j05K8j7M8m3%KOJ4o
7769A6jm6O1o3P1n8K9M0k8Ql4JnM5J6j0p6mK6M4n4M0k2K7l2J6k7K8l0N7m3k5L1
7802bL6m7L9Ql6jM5m5L5n5j5mL6k6RO0n2M7m0M3p4M3J1j9l4P9j08O9j5m6N1l6
7834d4M8k0M6n2M5l4L9o1K9nl6N3J2qm1M5n5L5O1o6M5p1N8J3qj3o4Q6nmJk3K5
7867C1l7k5M4k3J4j9O8j14O2kL2n2j8M4K1K8p5M1k6K3k3%oJ3k2K2K2jj4j9k1M9
$$ plain form
7633 8 -33 14 16 0 37 46 -15 -9 -19 23 -16 19 -34 2 57 21 10 -15 -57 -49 34 51 19 12 -56 -7 15 7 6 21 -8 29 -14 4
7667 4 -28 7 -23 -55 28 10 -33 34 -1 15 55 24 15 18 39 -14 -7 -5 -75 -8 -31 54 33 -34 5 -9 3 32 16 -3 24 -9 7
7700 7 -66 12 -46 -13 -27 13 -41 -49 44 28 18 11 0 -22 48 -13 28 5 6 9 -6 1 0 41 -19 11 32 22 19 -5 12 22 -9 -48
7734 -48 37 12 -74 -16 -9 23 -7 -13 -27 -31 -24 4 -47 16 22 4 -1 24 -14 -4 -13 73 -3 8 89 -16 12 -5 43 0 0 2 8 22 16
7769 16 15 -31 30 -33 38 -20 9 49 21 29 -5 -4 -9 36 52 42 -34 -38 -12 32 -22 18 -4 23 -9 7 -20 8 -22 35 -8 -33 -2
7802 -2 34 -13 26 34 -2 -3 42 -3 32 -23 -38 -42 -6 -32 -23 37 -15 32 -8 35 -39 4 15 -4 -38 41 -67 2 -13 -59 -8 -44
7834 -44 4 -16 30 -22 23 -11 28 -33 -4 -9 -45 8 20 12 -29 16 -39 -4 57 -9 36 -35 23 36 28 15 -49 37 32 28 29 6 31
7867 31 -6 -31 13 -10 4 -15 53 -61 1 -1 31 -21 -39 5 26 54 -21 20 -6 17 -6 -6 -12 1 -21 1 23 22 8 -11 -32 17
7899A7j0J2N1j04J8N9p4j5J2K2Mk0L8kK4p7K1k7M3J8O8o1Rl2J6J8k9k5K5l7MO
7931b8J7N9p8OK5j1M1l0J7Rm3K9k0L9%k8j6j9N6K0jm6Jqk4L6n6P8m1rJ7K4j1Q
7965A3j8M6m5K9K3r5N2qJ1k0m1Q8Jmj3rl0O7o3N9k5om1O3m5j7k0J3M8m4N4p5O9
7998A7l6K5J7J1p1N4Pm3QJ8kk5J2q0R5L5k2Rj3J1L1Rq1M3k0j8MMj5J6L4l5JJ9
8032A9J0j3l9K9L6q6NJ8K0pJ7j8j6k2L2%O3n7k0L5KMl6J8L7qn9M2rN2n2K9K8o4
8066a0K0k3N1p1J8K3J6n0J6J2j5O0L7j37M6J9o5N0L5l0k0N5p0K4k4M5l2J4lnJ7
8097Ck9L4L1m3K6j7K4k5K4p2K4N9qp6O0QJ2r9KQ5l0K1qrj3K4JL7j14O2N3k0p6
8130d9Q0j0m6N8q3N3k9L8n6R6m5K1j2l2J7R5j15L0M5m0QK7n1j8M6k8Rm3M5m0L0
$$ plain form
7899 17 7 19 70 -34 -16 43 -31 -46 -34 -12 -8 -28 10 8 32 -45 -24 -51 -8 10 78 17 26 -6 10 28 -1 -26 -1 -38 -34 -28
7931 -28 -11 48 -30 -24 1 -10 31 1 18 27 -16 13 -7 32 32 4 -12 -31 25 45 44 -2 -1 -9 -33 3 -53 25 -16 -25 -8 16 5 13
7965 13 -5 41 -4 25 48 -47 5 -3 8 -12 -53 35 36 32 19 10 -20 47 -16 43 18 12 -29 34 -11 -28 -48 -35 13 -31 23 -52 17
7998 17 -19 6 23 34 -37 17 24 -19 -11 7 5 -20 -8 -88 7 42 20 29 16 27 58 67 -14 29 9 -9 -5 -1 -16 0 34 -1 0 19
8032 19 29 16 -23 6 42 -44 -39 -21 -1 -8 9 -9 -25 -47 -15 -15 48 -9 -29 6 8 12 -24 -6 31 23 -36 6 -3 49 -3 26 54 -10
8066 -10 10 -13 38 -33 -15 8 24 -26 -10 2 -13 47 84 -53 -7 12 -53 -3 32 2 -18 37 -33 -9 -33 12 -20 -6 -9 -14 3
8097 3 -26 8 39 -4 22 5 29 4 28 -44 -20 39 31 -45 15 23 35 -64 -62 23 -7 14 6 -3 -16 8 9 46 -68 -6 47 27 -49
8130 -49 31 21 -25 33 -50 3 -26 12 -44 52 7 28 16 -16 1 96 -19 11 56 16 24 51 0 -18 28 0 9 -34 11 -29 1
8161AK6Kj1p7R7kr8P9nK8l8lnl8%P6mrm2M5l8J8O2l6m8K4ol3O0p3
$$ plain form
8161 1 27 29 18 -59 38 36 -62 17 12 40 2 -1 -6 -44 -44 32 28 19 -23 22 -16 2 64 28 -20 4 -2 -35 25 -48
8191d8
$$ Imaginary data points
##PAGE= N=2
##DATA TABLE= (X++(I..I)), XYDATA
0@%%%%%%%%%%%%%Nj3J6j6J6j6K4l2L4m2N0n8P2q7R7j08J25j47J69j89K14k44K76
36A46l10L49l90M33m84N40n99O64p36Q12q96R90j090J200j321J456j604J767j951
55a024K158k392K657k962L321l748M262m901N721o815Q361j0738J4926k4585Q9405
70G3646P2960p5846k2501R790O333p8673p3871l3942M9740j73j9135l2286O5851
83e8107P4502M6011k1920J577N2236M0720j9481p8208k8563Q81O677o8485n9532
96a11692r535N0474K5678k0682j871M7747Q6016J6976j5669k1701M3375J7490
108A06606l0123p7553l4810J4022j486m1263n5819K1004M7426M3205k1349N372
120b4768M3689O8890R310l6717j9436J5583K0470m9617n8901l7264K9250J689
$$ plain form
0 0 0 0 0 0 0 0 0 0 0 0 0 0 0 5 -8 8 -8 8 -8 16 -16 18 -24 26 -32 40 -47 50 -58 67 -80 89 -100 114 -130 146
36 146 -164 185 -205 228 -256 284 -315 349 -387 425 -471 519 -571 629 -692 764 -840 927 -1024
55 -1024 1134 -1258 1399 -1563 1758 -1990 2272 -2629 3092 -3723 4638 -6100 8826 -15759 73646
70 73646 146606 70760 48259 58049 64382 -14291 -88162 -122104 -72364 -72537 -91672 -123958 -58107
83 -58107 16395 62406 40486 42063 94299 135019 115538 37330 8767 9648 16325 -52160 -111692
96 -111692 -121227 -70753 -45075 -65757 -67628 -19881 66135 83111 67442 45741 89116 106606
108 106606 76483 -1070 -35880 -21858 -23344 -64607 -120426 -99422 -51996 -8791 -30140 -24768
120 -24768 18921 87811 97121 60404 40968 56551 77021 27404 -31497 -68761 -39511 -37822
132c7822k5073l5870K6286N9288L0783q079r941M7244L9088P055n3016j9108O361
145B7196J3370m3012n6303j5598K4782K2317k7757j2014K1288O6553J8914r271
157C0465j5044L4066L2651j3029m7389l2131J8123R83k6679n4531K825K8782K8554
170a2354k0030j1185L0049N0130K1547k7706q726J4913L1772k6801m1573l0165
182c0129J9373P042k5910l4627J771M3751J7393o518j8291L4757L6188J5400l3036
195B7164j4983J4963J7634j9824m8732j3310J2659K0527k8749k0631M857M6130
207b295J7783j2147j2361K2847L9115k933k6990k6475K1522Q202j5621m5838p887
220d3078K1000J7154j6877k3935J8583L4416K3711k3233o778J3862L4488q815
$$ plain form
132 -37822 -62895 -98765 -72479 -13191 17592 9513 -428 46816 85904 92959 39943 20835 27196
145 27196 40566 -2446 -58749 -74347 -49565 -27248 -55005 -67019 -45731 20822 39736 30465
157 30465 15421 49487 82138 69109 21720 -10411 7712 8695 -17984 -72515 -69690 -40908 -12354
170 -12354 -32384 -43569 -13520 36610 58157 30451 21725 36638 68410 41609 36 -30129
182 -30129 -10756 -3714 -29624 -64251 -62480 -18729 -1336 -7854 -26145 8612 44800 60200 27164
195 27164 12181 27144 44778 24954 -23778 -37088 -24429 -3902 -32651 -53282 -48425 -2295
207 -2295 15488 3341 -9020 13827 52942 50009 23019 -3456 18066 26268 10647 -35191 -43078
220 -43078 -22078 -4924 -21801 -45736 -27153 7263 30974 7741 963 14825 49313 40498
232D0498l1038k0381J3912J5314k3074l0131j1260L2685J0692q752k3229K0801
244a3963L2982J5310j9954j6020J9980J9999l575m0097j0881R327J9718k3149
256a0323k6348k920L0065J7877j6741j2427J1537L9025K902j6934k1358K0521
268A4876J6247q204l4594j4291J8978J1474j2183l0572R249K3805K1737j9314
280b792j0650J2305L1342L856k5283j3195J0000K2143j7198k5435j6291K4101
292g097J0330j1206k3900O945L0143J2537j2042j8931J9778K0858O199l0973j1160
305h519R987J8792j3888k9398n609J8252J9014j8093j4172K852L4488P358j2957
318H107j7213J5088K2797l432k4058j8073J8175R946p410l1124P92J7858J8135
$$ plain form
232 40498 9460 -10921 2991 18305 -4769 -34900 -46160 -13475 -2783 -11535 -34764 -13963
244 -13963 19019 34329 14375 -1645 18335 38334 34759 -5338 -16219 -6892 12826 -10323
256 -10323 -36671 -39591 -9526 8351 -8390 -20817 -9280 29745 32647 15713 -5645 14876
268 14876 31123 22919 -11675 -25966 -6988 4486 -7697 -38269 -29020 -5215 16522 -2792
280 -2792 -13442 -1137 30205 34061 8778 -4417 5583 27726 10528 -14907 -31198 -7097
292 -7097 3233 -7973 -31873 -24928 5215 17752 5710 -13221 6557 27415 33614 2641 -8519
305 -8519 1468 20260 6372 -23026 -28635 -10383 8631 -9462 -23634 -20782 13706 21064 8107
318 8107 -9106 5982 28779 25347 1289 -16784 1391 11337 3927 -27197 -26405 -8547 9588
331I588j4323j6235J0452K5407J2275k1527r873P163K5103r709k2355j6108J6639
344c503J3199j2115k1915l559K7205J0251p928k0390J5431K1459J0071k2193j3401
357g388J1740J6951n154k9526o842J1109J9250j6165j6588j319K7412J1564j2073
370B971j3728Q549K6337l77j6727j9007J5793J1051m349k7719o357J5892J4196
383F525r134k0406Q147K0085J6657j7963r776N941K4287k327k1034j4097J0023
396c072J6709j1747j9469r753K3623J0171o034j9586Q838K2429J0747j4809j6099
409h052J2209J5206J506k7304q766P665J7960j1668j9036l213K0055J5787j1816
422E33j1556L157K6750K867j2527j8398J1483J3854k879k2726j2282J5130J1401
$$ plain form
331 9588 -4735 -20970 -10518 14889 27164 5637 -4236 2927 28030 18321 -4034 -20142 -3503
344 -3503 9696 -2419 -24334 -27893 -688 9563 1635 -18755 -3324 18135 28206 6013 -7388
357 -7388 4352 21303 16149 -13377 -20219 -9110 10140 -6025 -22613 -23932 3480 15044 2971
370 2971 -10757 -2208 24129 23752 7025 -11982 3811 14862 10513 -17206 -23563 -7671 6525
383 6525 -2609 -23015 -14868 5217 21874 3911 -5865 76 24363 22036 1002 -13095 -3072
396 -3072 13637 1890 -17579 -27332 -3709 6462 428 -19158 -10320 12109 22856 8047 -8052
409 -8052 4157 19363 20869 -6435 -15201 -7536 10424 -1244 -20280 -23493 -3438 12349 533
422 533 -11023 -7866 18884 21751 9224 -9174 2309 16163 13284 -9442 -21724 -6594 4807
435D807m321k2384M498J6927J7779j3417j1835N544K1127M975k0134j2306M983
448c757J9106r495j7852j2774J8601J2147n452j7673K043K2928J0243q667j8267
461h869J0754J4447N673k3129j1676O762J5562n606k1020m347J3810J8365j0537
474A89j0978m74K4319P227j0525j6123O075J7029j885j7563j6530J3278J0450
487D489j115k1938m86J5335J6599p847j4857N227J7407J0925j8255j1509J745
500d280J9174n009j7292j3598J2231J4924n709j4734m315K1930J0497m167j8172
513h520P262J4992P675j7249j4967O282J2761J20k1697n825Q813J8806p540j1952
527a1039k430J9912J1877r502j3220J054J8966P5j3294j8160R823J1080j7j9081
$$ plain form
435 4807 486 -21898 -17400 -473 17306 3889 -7946 -2402 18725 23700 3566 -8740 -3757
448 -3757 15349 5854 -11998 -24772 -6171 5976 524 -17149 -15106 7822 18065 9398 -8869
461 -8869 1885 16332 22005 -1124 -12800 -6038 9524 3918 -17102 -21449 -7639 10726 189
474 189 -10789 -11263 13056 20283 9758 -6365 -290 16739 14854 -2709 -19239 -5961 4489
487 4489 3374 -18564 -19050 -3715 12884 5037 -9820 -4593 12814 23739 5484 -6025 -4280
500 -4280 14894 9885 -7407 -21005 -8774 6150 441 -14293 -18608 3322 13819 9652 -8520
513 -8520 -1258 13734 21409 4160 -10807 -4525 8236 8356 -13341 -19166 -10353 8453 913 -11039
527 -11039 -13469 6443 18320 8818 -4402 -3348 15618 15693 2399 -15761 -5938 5142 5125 -13956
541a3956o148J4275J4508k629j6945M095J4378J4309j4512j2049N00J7181M52
554A3459j7144j2715O236J6755n094j2622q580J8962J1637k108j6031K557J6073
567A1385Q201j1232j7375N611J0665L870k0091q210N923J7147l240j3716k887
580a3949J4759J5608q271j1042k493J8919K905j0705j7546N303J2491L37j5366
593i050j1337J3147J2501J226j7024J526J2673J5292r491j3461K16J3931N611
606A5760j6530j1704J203J7057l083j1723j0317J4300J3479j203j2821k442J6817
619H793Q244n891j7991L895R694O040j6711j1429M582J4187J015j4993l431J0000
633c996J7667o073j0081m219J6720O689r252j5233M26J4078O73j1742j4406J0609
$$ plain form
541 -13956 -20104 -5829 8679 6050 -10895 -6800 7578 21887 7375 -4674 -4174 13007 13459
554 13459 -3685 -16400 -10164 6591 1497 -11125 -19705 -743 10894 8786 -7245 -4688 11385
567 11385 19586 8354 -9021 -3410 7255 11125 -8966 -17176 -11253 5894 2654 -11062 -13949
580 -13949 810 16418 8147 -2895 -5388 13531 16436 5731 -11815 -6512 5979 6316 -9050
593 -9050 -20387 -7240 5261 6487 -10537 -9011 3662 18954 9463 -3998 -3782 10149 15760
606 15760 -770 -12474 -11271 5786 2703 -9020 -19337 -5037 8442 7239 -5582 -8024 8793
619 8793 17037 11146 -6845 -2950 6744 12784 -3927 -15356 -10774 3413 4428 -10565 -13996 -3996
633 -3996 13671 7598 -2483 -6702 10018 16707 7455 -7778 -7352 6726 7399 -4343 -18749 -8140
647h140J1340L257j5326k438J1872J4175m176j4555L99J0697R581j4304j1395
660i013j422J5522P2j1479j0249Q663J5113j166j0002o419J5688Q645k568j6655
674e270J002J0033O740j1780j4079M132J1111M755j5013m705O504J7225l116j0399
688b860m540J2741J0310q094j2486l402J4606J902q656j5070P018J1347L709j2430
702e905o559J0891J1984K56j4975l89Q420J1531j0618j1583j980J2721L902j1359
716c663r339L648J5627p30q284q575J2736R729j179j3846k528J1055O612o977
730D286j5128L345R145O970j3373o857M597J4659J65j1430m380Q632J2808o707
744F732j0237n251J3801L961o795j3529K904J2036L171r209r907R445R977K687
$$ plain form
647 -8140 3200 6457 -8869 -11307 565 14740 10564 -3991 -3592 7105 16686 2382 -9013
660 -9013 -10435 5087 5159 -6320 -16569 -7906 7207 6041 -3961 -10380 5308 13953 11385 -5270
674 -5270 -4268 5765 12505 725 -13354 -9222 1889 6644 -8369 -13074 -6570 10655 7539 -2860
688 -2860 -7400 5341 15651 7557 -4929 -8331 6275 8177 -479 -15549 -8531 2816 6525 -5905
702 -5905 -12464 -1573 10411 10667 -4308 -4697 3723 15254 4636 -6947 -8927 3794 7696 -3663
716 -3663 -13002 -9354 6273 5543 -2741 -11316 1420 11149 9970 -3876 -6404 4651 11263 4286
730 4286 -10842 -7497 1648 8618 -4755 -11612 -7015 7644 7809 -3621 -8001 631 13439 6732
744 6732 -3505 -8756 5045 9006 2211 -11318 -8414 3622 6793 -2416 -12323 -2878 7099 9786
758I786j4171k206P362J1427o177j2169j377R888P492j0712q392K62J4734N10
772F257p842r224Q647J0951q79j0845n660J1517O445l197j4813J905Q573P588
786I423j0344r175L708J1610L391j2144m628N179J3707m656r195n813J1525O891
800I479n802j1202p39J2528K873o379j1809P077Q925L774j2134m861O947J0202
814H879j944j2606j089P373R862q856q182j538J2853K859q150q778M440J2155
828G278r14q312p981J0642P102j034j3211n09Q825P153o616j1273L170R070N766
843I156j1651n385K976J2851j730r273n358Q190R591n099q871l755J2219L550
857G411m705j1903M001R085L731r138p633O817Q606J547j2538j667N659J0500
$$ plain form
758 9786 -4385 -6591 771 12198 6021 -6148 -7525 2363 9855 -857 -9249 -8987 5747 6257
772 6257 -1585 -10809 -2162 8789 7910 -2935 -8595 2922 9367 6170 -8643 -6738 1835 9423
786 9423 -921 -10096 -6388 5222 8613 -3531 -8159 -2980 10727 6071 -3124 -8937 2588 9479
800 9479 3677 -7525 -8264 4264 7137 758 -11051 -3974 4951 8725 -3409 -8270 -1323 8879
814 8879 6935 -5671 -6760 613 10475 1619 -6563 -8101 4752 7611 -539 -9317 -4877 7278
828 7278 6364 -1948 -9929 713 7815 6781 -6430 -6939 1886 9039 2423 -8850 -5680 3390 9156
843 9156 -2495 -7880 -4904 7947 6217 -3056 -8414 -224 9367 4268 -4603 -8358 3861 7411
857 7411 2706 -9197 -5196 3889 7620 -1518 -9151 -2334 6272 7819 -4719 -6386 -727 9773
871I773o278q990j924J0247N504q189p682J013J2765j34o747q876Q394Q120j62
886F834j0908l560R010O415l339j2332K138P415P057r626o612K204J1050J579
900G325r627m790M916J1010m152p688n489J0601M890l841j0521P25R855L462o042
915F34r555O199P657L416j1335l336M846R718l344j0171j769P321P910p648o814
930f271j106J2191J765o074q350N386R408k38q404o463Q723N677j171j2086M01
945f612O829P317o718q166K294R016M604r487m511K376J1198k643p620o048P856
960c15O636l642q650k218J0470L593l497j0110M795P525M156r155n750M738P939
975F515l83j1184j931M991R166o265o782j817J0665M163n748p089K260J0487p9
$$ plain form
871 9773 3495 -5495 -7419 2828 8332 143 -7539 -6526 6239 6105 -642 -9518 -1124 6996 6834
886 6834 -4074 -7634 1376 7791 4452 -7880 -5742 1673 8730 -896 -7508 -5304 5746 7325
900 7325 -2302 -7092 -2176 8834 4682 -3006 -8495 2106 6996 3155 -7366 -6641 3214 6676 634
915 634 -8921 -2722 4935 8351 -2984 -6320 -1474 8244 4900 -5271 -7040 281 8191 543 -6271
930 -6271 -7377 4814 6579 505 -7845 -2459 6949 6711 -1693 -8156 567 6244 5073 -7013 -6612
945 -6612 217 7534 816 -7350 -5056 3960 8564 -923 -5434 -3058 8140 5497 -2123 -8171 -315
960 -315 6321 2679 -5971 -8189 2281 5874 2377 -7733 -2938 4587 8743 -412 -6162 -1424 6515
975 6515 6132 -5052 -6983 -1992 7174 909 -5873 -7690 2975 7138 1390 -5699 -3439 7048 6969
990F969o459q301P343N543n0j0836k164O939O606l339r331K292P296O597q403
1005G02m932J126J0166l52q068n707M639Q248l626p129m366R962M391k183r272
1020f401K531Q298M138o513p780M626O385J786j1005k982L624Q892l931p614j796
1035g742Q290O713n583n769j16J0762Q16n200q495M931O373o3q829m827O844N629
1051C734q21r724J439O306P523o306n815R57Q432K332q311n256J954R106l002
1066B548o458n533Q236N520j804p856J5R089L961l933q799L994N776L064r820
1081b000m602K949P704j400q554j714N820Q337m772n064j488J0046K599m686p713
1096d538K288P528j96o804p058O222M952O98r440j00N976P300l497p048J389O751
$$ plain form
990 6969 510 -7791 -448 5095 5045 -5791 -7955 -1016 5590 2251 -7080 -4788 2508 9105 702
1005 702 -4230 -3104 7062 6710 -1358 -7065 -2426 5822 2196 -4933 -9299 663 5054 2871 -6401
1020 -6401 -3870 4428 8566 2053 -5727 -1101 5284 7070 -3935 -6917 -3293 5599 1668 -5946 -7742
1035 -7742 548 7261 1678 -4091 -4207 6555 7371 2171 -6324 -1393 4980 4917 -3912 -8739 -1895 3734
1051 3734 2913 -6811 -5372 934 8457 2151 -3664 -2707 5725 8057 -254 -5510 -3556 5550 2548
1066 2548 -3910 -9443 -1207 4313 2509 -5347 -5332 3757 7718 3785 -5014 -1020 4756 7820 -2000
1081 -2000 -6602 -3653 4051 2651 -5903 -7617 -1797 6540 1768 -3296 -4784 5262 7861 3175 -4538
1096 -4538 -2250 5278 5082 -1722 -8780 -2558 2394 3092 -6348 -6448 -472 6828 3331 -3717 -2328 4423
1112D423M737q181m958K29Q826j663o500n753N757O924j977o189k456R246M112
1127F577j875q898K800N943L512p613o430K822O098Q77r180k034L796Q857l349
1142A903n172j906Q382M808m388o371j80Q290P7n117q195M786N114J031q135k456
1158g529O034O454r51p867J277N525O203o810n353m64P755M78o985n326L011Q071
1174C523j877n063m056Q479M677q95p886O35O556L406n019p914K601M920K594
1189D681q727l015K639Q324j288n939j751O143O689m102n251j914Q156J040m281
1204A404p964K721N838R66o109m695N899N567R35q113M48M847O438m785o314l17
1220c234O164K700p038m769Q73Q463j100m521m772O743N786q21o398j614O925
$$ plain form
1112 4423 9160 979 -3979 -3750 5076 3413 -3087 -8840 -3083 3841 1864 -4325 -6781 2465 6577
1127 6577 4702 -4196 -1396 4547 8059 446 -5984 -3162 2936 3813 -5367 -7401 -3605 5252 1903
1142 1903 -3269 -5175 3207 8015 3627 -2744 -2924 5366 5443 326 -7869 -3083 2031 3062 -5073 -7529
1158 -7529 -1495 4959 4008 -3859 -2582 2943 9146 2336 -3017 -3481 4274 4752 -2233 -7559 -4548 3523
1174 3523 1646 -3417 -7473 1006 5683 4788 -3098 -2463 4093 7499 2480 -5434 -2833 2087 4681
1189 4681 -4046 -7061 -4422 3902 2614 -3325 -5076 1067 7756 3654 -1597 -3511 4645 5685 1404
1204 1404 -6560 -3839 1999 2965 -3144 -7839 -1940 3627 4562 -3551 -3103 1744 8182 3397 -2917 -3234
1220 -3234 2930 5630 -1408 -6177 -5304 3159 2059 -2462 -7234 -491 5295 4474 -1924 -3538 3387
1235C387L159k884q639J972M377L440p214m359K412P066Q81o603j516L970P777
1250G226l419m862k909P245K472l989o964M25O708R33m465o070N380N297J854
1265D862p211j234M644N926k567p285l16M553M402o543m607k74P994M23m561m403
1281f197M435O861p46m984l476O714L141j575q293L65M502L436n116n753K426
1296d260N799K801o535j797K751P768k028n062l148N444M048m027n917j493P096
1311A440J134l288o405M161N549K197n696k923M770N034n73p766o61L295N093
1326E361n430n116o53O640K331m628l669K394P745m52l832m589N689L733j070
1341D454p412j513M756K974l211o782K229M788M138n801k392K282P162j23n591
$$ plain form
1235 3387 6546 3662 -4977 -3005 1372 4812 -2402 -6761 -4349 2717 3598 -3005 -4521 -551 7226
1250 7226 3807 -1055 -3964 3281 5753 1764 -5200 -4775 1933 2866 -1599 -7669 -2289 3008 4862
1265 4862 -2349 -3583 1061 6987 4420 -2865 -3181 1372 5774 -769 -5376 -5650 2344 2767 -1794 -6197
1281 -6197 -1762 5099 4353 -631 -4107 2607 5748 4173 -4120 -3755 747 4183 -933 -6686 -4260
1296 -4260 1539 4340 -2195 -3992 -1241 6527 4499 -563 -3711 1733 5781 1754 -4163 -5656 1440
1311 1440 2574 -714 -7119 -2958 2591 4788 -908 -3831 939 5973 5400 -2366 -3027 268 5361
1326 5361 -69 -5185 -5838 802 3133 -1495 -5164 -2770 4975 4523 691 -3898 1791 5524 4454
1341 4454 -2958 -4471 285 3259 48 -6734 -4505 283 4421 -1380 -3772 -1490 5672 5549 -42
1356d2k704L380N294l853n290k929O570J861k739n965K233O304K164l861m344
1371c921M662M574R35p522j501K780M751l673o005q05M914L981m656l191P89P954
1387D066N65l261m506M193M634r93n906l411M819K543j759p238J247M299M390
1402C682m438l404K334O123J823n661k399K030N966l113n005l566N153K902k803
1417c76n263K11O688K124k424n153M209M541J826o246k685K748M210j762o867
1432d219r06L361M791m242l415j11P070J981l144l859K501N789o67m469m529M427
1448C59K601j009p027l15M173L877k880m647K210N074L418n273k242J375O030
1463E724j541m995l450L467L936k981m591j660O300K231j681n155K844M917K300
$$ plain form
1356 -42 -2746 634 5928 2075 -3215 -6144 426 2287 -452 -6417 -4184 2120 4284 423 -3921
1371 -3921 741 5315 6250 -1272 -2773 7 4758 1085 -4920 -5725 -811 3170 -1486 -4677 -3888 4066
1387 4066 4631 1370 -3136 1057 5691 4698 -1208 -4619 200 2743 984 -6254 -5007 -708 3682
1402 3682 -756 -4160 -1826 4297 6120 459 -1940 90 6056 2943 -2062 -5628 -475 2427 -376
1417 -376 -5639 -5428 1260 3384 960 -4193 16 4557 6383 137 -2548 200 4410 2648 -4219
1432 -4219 -5125 -1764 3027 -1215 -4630 -4741 2329 4310 1166 -2693 -192 5597 4930 461 -4068 359
1448 359 2960 1951 -5076 -5391 -1218 2659 -221 -4868 -2658 2416 5834 561 -1681 -306 5724
1463 5724 4183 -812 -4262 -795 3141 160 -4431 -6091 209 2440 759 -4396 -1552 3365 5665
1478E665m450l781L083L736m3o909j332K204M863l346m186o90N555L333l316l165
1494b779J071O517M2l274m805L725L216p63n952k078L967L100j621n626J658M243
1510F41M060m217k705J341N625L42n013k934K063M801k734m271k795N235K504
1525A943j586m824J109N480K201k674m448L091L571J291o196k032J834M379k021
1540A118n113r29L860M200l318k892k7O439R58k683m273K609M251n01m666l490
1556d457L928K571p82n921M53L727L920l012l558J429M789K106m732k464J086
1571i17N218j757m052l211L866L184j839m205p42N424K166j667m802K577L786
1586C029J908m731k942K094L774n23n593j058K458M531k980l128p60N555K165
$$ plain form
1478 5665 1215 -2566 517 4253 4210 -2699 -4031 -1827 3036 -310 -4496 -5186 369 3702 386 -2779
1494 -2779 -1708 4809 4851 1577 -3228 497 3713 2950 -3002 -5080 -1113 1987 366 -5260 -3602 641
1510 641 4701 484 -2221 -880 4745 5087 74 -2860 -797 4004 1270 -3001 -5796 -561 1943
1525 1943 357 -4467 -3358 2122 4323 1649 -2799 292 3863 5154 -1042 -3074 -1240 3139 1118
1540 1118 -3995 -4924 -1064 3136 -182 -3074 -3101 3338 4296 1613 -2660 -51 4200 3699 -967 -4457
1556 -4457 -529 2042 1260 -4661 -4208 -481 3439 427 -3131 -1702 3087 5193 461 -2003 -917
1571 -917 4301 2544 -1508 -4719 -853 2331 492 -3713 -4455 969 3135 1468 -3334 -757 3029
1586 3029 4937 206 -2736 -642 3132 2609 -2984 -4042 -1584 2947 -33 -3161 -3921 1634 3799
1601C799k778l520J277N100r1l401m139L508K701k02n582q31L452L409j879m505
1617c682J302L785L235m211k420O84M997l20l983k951K549L942j800l645k102
1632d620M900K122j092m647J342M056K084l298l657K285L336P81n297j535J865
1647a375M418k140l785r53M141L051k807k992O9N385M18k562m140K756L307Mm451
1664a656k222L375K820p62n041O70L119L565l387k824O06M349J160l933k542J277
1680a426M627j466l223k645L975K519j095m150l5M271J841k032m232K189L003
1695B121J722m787j934J698L876q02m233j027K868L821k728k699p91M969J143
1710C217k322l797J608L900R0l290l100L232K592Q5m901j72K765L351k160l569
$$ plain form
1601 3799 1021 -2499 -1222 3878 3787 386 -3753 -245 2456 2254 -3328 -4159 -707 2702 823 -3682
1617 -3682 -2380 1405 4640 429 -1991 -1307 3690 3370 -613 -3564 -1015 2927 1127 -2518 -4620
1632 -4620 280 2402 1310 -3337 -1995 2061 4145 847 -2810 -525 2811 3592 -1705 -3240 -1375
1647 -1375 3043 903 -2882 -3835 306 3357 550 -2442 -2373 3012 3430 868 -3272 -516 2791 2795 -1656
1664 -1656 -3878 -503 2317 1555 -3486 -2816 303 3868 481 -2343 -1737 2612 3772 -161 -2703 -1426
1680 -1426 3201 1735 -1488 -4133 -158 2361 1266 -2884 -2919 1352 3193 1161 -3071 -882 2121
1695 2121 3843 -944 -2878 -1180 2696 1894 -2339 -3366 -498 3323 595 -2104 -2895 2074 3217
1710 3217 895 -2902 -1294 2606 2696 -594 -3694 -462 2130 2215 -2686 -2858 -93 3258 1098 -2471
1726b471N06L415K301l817k304N34M615o55l051k657K909L285j106l426j302M258
1742A034J727j154m485J408L016J858l668k755J741L320N28m455r76J975M133
1757C247k129k826j119M084J966k400l197K63M242J75k337l683K785K646O17m093
1773a759j171K836K952q95m132L62K635K931l557k481K8M109L74l097k401J862
1789a404M009r92k700k057L984J960p57m269M17L129J602k542l607J624K786J384
1805B567m185j109J496M076j050k996j084K994K819k386k746q48M181M27j922
1820B34l703J771K975P57l123k098L022K537J91m197N1K174K984k639l001j49
1836b214L172J415l251k085P77M280n85k189k307L365K449n43l489p98L339J384
$$ plain form
1726 -2471 -1965 1450 3751 -66 -2370 -1836 2779 2124 -927 -3584 -675 2610 1504 -1922 -3224 1034
1742 1034 2761 1607 -2878 -1470 1546 3404 -264 -3019 -1278 2042 2570 -1885 -2861 -886 3247
1757 3247 1118 -1708 -2827 1257 3223 823 -2374 -2111 2131 2306 -31 -3714 -929 1717 2334 -1759
1773 -1759 -2930 -94 2858 1963 -2169 -1807 828 3759 202 -2279 -2251 1858 2232 -865 -3266 -1404
1789 -1404 2605 1613 -1087 -3144 840 2800 2043 -2226 -1809 1320 2922 380 -3227 -1603 1183 2567
1805 2567 -1618 -2727 -1231 2845 1795 -1201 -2285 709 3528 1142 -1604 -2452 1729 2156 234
1820 234 -3469 -1698 1277 2034 -1089 -3187 -165 2372 2563 -1634 -1583 591 3575 936 -2065 -2214
1836 -2214 958 2373 -878 -2963 -2186 2094 1509 -680 -2987 378 2827 2284 -1205 -2003 1336 2720
1852B720j600m125J252K287J761l580j739J363L542L47l329p99J977L561k004
1867A634k496j452L665J021j932l383N00L413N03k158k806K828K514P96l720m08
1883a481J995K899j538l485r0K240K119l319k076j3M096P7k180k147K378L222
1899B697n35k551j622L317J429r19m116N30K138J656k692k551J263K858J237l272
1915a133p87J357L882j278k380j483K785J807j975k852o04L492M02j585l153K188
1931a317K532J057k984j252K380K418l04l737j48J631K549k819k359k83L310Q49
1947A523k348j836J244L697m17j826k106K965J718m38l625l49K313J426j700l300
1963c059J161K219J767l101j049R30L610l55k472j215J923K670j919k291j374
$$ plain form
1852 2720 1120 -3005 -1753 534 2295 -1285 -3024 -1661 1881 2228 -1101 -1900 77 3638 1634
1867 1634 -862 -2314 1351 2372 440 -2943 -2443 970 1473 -685 -3491 -663 1851 2647 -1073 -1481
1883 -1481 514 3413 1875 -1610 -1700 540 2659 -660 -2736 -2749 1347 1424 -756 -2903 -525 2697
1899 2697 2162 -389 -2011 1306 2735 1816 -2300 -1770 368 2024 -668 -3219 -1956 902 2139 -1133
1915 -1133 -1920 -563 3319 2041 -339 -1822 963 2770 795 -2057 -2661 831 1233 -352 -3505 -1317
1931 -1317 1215 2272 -712 -1964 416 2834 2530 -1207 -1355 276 2825 6 -2353 -2636 674 1523
1947 1523 -825 -2661 -1417 2280 1863 37 -2069 896 2614 2176 -1449 -1798 515 1941 241 -3059
1963 -3059 -1898 321 2088 -1013 -2062 -1132 2478 2123 -349 -1564 359 3029 1110 -1181 -2555
1978b555L343N95j317l077J217K742Q05k130k016K347K117O02l704k76J455K560
1994B708j881k657k97K434J643k556j670K51L775j47j729k097K241K340l61k725
2010g28j182K591J184p26l582P17J858J948k565j767R14K758O54k803q26J147
2026d08L148j397j941j563K832J256j271k717J7L020N06j451k734J960K057R35
2042B249l097p93J596K357p39k952j86J719K262k415j700l74L207L67j756k089
2058b344J356K786k64j835j840K686J345j65l276J52J767J730j777k546Q28J930
2074E33J386k872q93O13L242n97j947j220K153K056j343k120q83K909M77j121
2090C73k964J319J919R21k327j472J861K017L25k977o1J226K535j882j938n96
$$ plain form
1978 -2555 788 1383 66 -3011 -1794 948 1753 -377 -2393 -46 2071 2673 -1031 -1307 148 2708
1994 2708 827 -1830 -2127 307 1950 -606 -2276 -2025 1750 1603 -126 -2223 18 2358 1997 -728
2010 -728 -1910 681 1865 1139 -2443 -1726 132 2080 -485 -2252 -1338 1420 2074 -729 -1555 -408
2026 -408 2740 1343 -598 -2161 671 1927 656 -2061 -2044 976 1482 31 -2703 -743 1314 2249
2042 2249 -848 -1641 -45 2312 1573 -1379 -1565 154 2416 1 -1699 -2073 1134 1501 -255 -2344
2058 -2344 -988 1798 1534 -301 -2141 545 1890 1725 -1551 -1399 368 2098 321 -2225 -1397 533
2074 533 1919 -953 -1846 -1233 2009 1412 -535 -1755 398 2454 1111 -1009 -1892 1017 1494 373
2090 373 -2591 -1272 647 1568 -759 -2231 -370 1647 1972 -1005 -1066 160 2695 813 -1125 -1721
2106a721K423R79k019j776K70L074j88j347j997K351J775J68k627o15K067J299
2122B116r22l006N09J468J540k569j254M29K825J93j978r47J413K733j148j591
2138a89j387K702O15r39k815L33K083O85j547k182J832J742R48k684k80J200K460
2155B577j044k194m91J542J682k174j616m67K839J31j201k070J759K229J20j814
2171a92j234K303J187k42l094K42J216J513k116j800M18K110R81k184p30Q72L040
2188B290q10j384j390K170J285j095k267n49K255M05j024k607J410J625J218k273
2204g41p75J392K164Pk530j92J048K045j930j700q44K422M78j396j762Q01K560
2221A047Q8j145j581K197J271K72k755k51J416J230j333k458L64J466J369k278
$$ plain form
2106 -1721 702 1681 -338 -2114 -1844 1230 1042 -305 -2302 49 1824 1992 -635 -1250 817 2116
2122 2116 1194 -1812 -1303 165 1705 -864 -2118 -1689 1136 1329 -649 -1596 -183 2550 1402 -189
2138 -189 -1576 1126 1741 802 -2013 -1680 403 1088 -459 -2641 -809 933 1881 -803 -1083 117 2577
2155 2577 1533 -661 -1152 390 2072 -102 -1718 -2185 654 785 -416 -2486 -727 1502 1622 -192
2171 -192 -1426 877 2064 1822 -1272 -1030 186 1699 -417 -2217 -1799 311 1292 -892 -1622 -750 2290
2188 2290 1480 96 -1294 876 2161 1066 -1201 -1750 505 910 -114 -2721 -1311 314 1532 -741
2204 -741 -1516 -124 2040 2047 -483 -675 373 2418 488 -1212 -2056 366 844 -552 -2314 -1513 1047
2221 1047 1135 -10 -1591 606 1877 2149 -606 -857 559 1789 456 -2002 -1638 -172 1197 -1081
2237a081q02M59K853j01j429r49J522J982r99j721j167K134M28q11k664O49J656
2254d1R70j522j464J553J733R06k469k07Q80K227j403j803q33J662J054j770j484
2271b011j12K710J22q59j764J936J613L72k046q14J691R81n71k774K60R56J479
2288A169k081j135L42K266O43j490p76R47K465p06j316j427J932P01p51k440j34
2305a791J737O51r31k001J305J542J263k114l75Q93K082n06k013o17R70J549j783
2322a39j417p21K520K53q49j639J233K058K66j193j430J943Q80l9k670p7Q69J363
2340A211j477j740K46J665J209j698n99M30K654l72j105j318J468J211p57j890
2356h62r34J884M46n29k291R49J462J309j641r38J127J678L29k148m43O77J824
$$ plain form
2237 -1081 -1883 -1424 1429 1328 -101 -1050 472 2454 1455 -266 -1433 701 1129 318 -2346 -1697 -41
2254 -41 929 -593 -2057 -504 1229 2135 -334 -541 339 2566 1163 -640 -1473 189 1243 -527 -2011
2271 -2011 -2123 587 709 -150 -1914 22 1635 2007 -39 -853 838 1819 1248 -1526 -1266 -310 1169
2288 1169 -912 -2047 -1705 561 1204 -286 -1062 -115 2350 1644 328 -1099 833 1534 783 -1657 -1791
2305 -1791 -54 597 -334 -2335 -1030 512 1775 -339 -714 179 2261 1755 -258 -875 95 1644 -139
2322 -139 -1556 -2277 243 496 -353 -1992 -759 1299 1565 372 -1058 885 1765 1726 -944 -1021 -152 1211
2340 1211 -266 -2006 -1760 -95 1114 -584 -1183 -753 1901 1529 424 -894 574 1785 1028 -862
2356 -862 -1796 88 534 5 -2286 -1337 125 1434 -207 -1145 -18 1660 1989 -159 -602 75 1899
2373A899j586j343q76J879P27j139j378M52K350J38p25j663J743J105K60k288
2389d45n17J030J123p91k123K51J062J571j679p18J55K285K61j239j033R02J766
2406A861p17j423j281J764O37m27k259L66J538R40j052j412J093J393Q20k086
2422b45m09N81J876r51j571p20J307J244j284j069l70K280J72n56j706J269J362
2439A210L39j603j039J281R12jk312J13Q55J492j381j117K0J822O93j469p45L78
2457e52K104n39j000j301J479R33l31j846k93J555P07o54j904R36J061J132j803
2474c16o06N42J725q4j729m53P67J693j203j104p29J921M26p67j550O37J590K99
2492A059j040j323J417R25L61j989k21P97J316q89j573M1J146J225j684o36L4
$$ plain form
2373 1899 313 -1030 -1906 -27 700 -439 -1817 -1365 985 1123 398 -1265 478 1583 1843 -445
2389 -445 -962 68 1191 400 -1723 -1472 -410 1161 -518 -1236 -1081 1204 1465 226 -807 95 1861
2406 1861 1144 -279 -1560 204 841 414 -1845 -1479 59 999 -53 -1465 -372 1021 1841 -245
2422 -245 -654 -73 1803 852 -719 -1439 -132 1112 -172 -1241 -1611 669 841 285 -1421 -152 1210
2439 1210 1549 -54 -1093 188 1100 1099 -1213 -1100 -245 1247 -134 -1251 -1231 591 1284 -185 -930 -552
2457 -552 1552 1013 13 -1288 191 1124 793 -1053 -1346 209 916 262 -1642 -706 355 1487 -316
2474 -316 -922 -380 1345 1261 -468 -921 -154 1539 336 -768 -1497 424 850 83 -1467 -830 760 1059
2492 1059 19 -1304 113 1038 1399 -590 -811 -14 1302 413 -1160 -1119 27 1252 -432 -1068 -1034
2509a034K032o5r31j113J159J356m09j257r34J645M43k97k124N39J028R24j290
2526c28j046P76J384O02j725k51M60J881q74j168q53J361P76r47j266k14J786
2543C54J55m86j497J246J090N84j593n15R87J047l04j915n5O18J347j478q81j72
2561a468J847M57j053p45O38J843l41q86j191J506N38l26j903j09J072N90p21
2578b52j439P46J076J090j514k40M67J757l57j266p37Q00J104j149j109p28J751
2595@K69l58j472P84J471O01j008q61J091Q58J92k029j78M24J115j098j256j35
2613a590J362Q81j051m92K67K026j02o33j198J097P85l47j552p51J141M21l90
2630a26j723O22J023J191j174m16N83J438L19j419n53L15J335j142j041j028J387
$$ plain form
2509 -1034 998 933 2 -1111 48 1404 995 -262 -1196 449 892 595 -1529 -990 38 962 -328
2526 -328 -1374 -598 786 1388 -337 -588 -128 1753 879 -289 -1142 219 995 48 -1218 -1432 354
2543 354 509 23 -1474 -228 862 1446 -147 -662 325 1372 1068 -847 -902 -284 1063 -415 -1296 -1468
2561 -1468 379 836 -217 -962 -324 1519 1178 292 -899 607 1145 819 -1084 -1193 -121 469 -252
2578 -252 -1691 -945 131 1221 -293 -533 -66 1691 1334 68 -669 131 1235 86 -1023 -1751 0
2595 0 269 -89 -1561 -777 694 1295 287 -574 517 1375 1567 -462 -640 -216 899 -199 -1455 -1590
2613 -1590 -228 653 -398 -890 -623 1403 1301 668 -530 567 1352 1005 -547 -1298 -157 264 -126
2630 -126 -1849 -1227 -204 987 -187 -603 -20 1418 1737 318 -235 80 1415 273 -768 -1796 -409
2647d09M96m74j154L50J699M60m22j182J213Q86L32j757n34M02Q37o34j609n0
2665a550P91J210r90m73J32J898K83o17q93P27J121m94j151j207J042K84j77j702
2683a766K78J002J055n96q03P56J197P88j476l94O5J289p28j277r31R17P56o33
2701e01r01j53J786M65j15j151R62R47M21j313r26O06N97k69j809j05M47J352
2719C40r24m99N2J628O69p18n51K13J454m63q19j332P88L83j37j502k65J053Q34
2738B04j23j177P92J008J043j157n06J30J129l00j346q04L58J133q41p37n64J677
2756h1N60o2j094N91J260M04p64j166O73L72K15j847k69L53J055n29r05R8J154
2775A8J128p87m73K8J557j31o75j264N52O44l35j154p46J052N70O0j278N98Q37
$$ plain form
2647 -409 87 -387 -1541 -1191 508 968 546 -636 577 1463 1795 38 -496 -94 743 109 -1500 -1550
2665 -1550 -759 451 -539 -1012 -880 1018 1301 684 -209 518 1639 1145 -6 -1213 -171 113 -64 -1766
2683 -1766 -1488 -486 569 -27 -830 -74 1123 1911 435 41 106 1395 667 -610 -1541 -624 132 -501
2701 -501 -1402 -1555 231 696 581 -570 392 1339 1760 447 -479 127 724 455 -1354 -1459 -1012 340
2719 340 -584 -1083 -1031 597 1266 548 -3 210 1664 1201 382 -950 -162 221 84 -1418 -1683 -630 204
2738 204 81 -1096 -304 704 1747 590 84 214 1343 1043 -303 -1107 -749 384 -457 -1194 -1758 -81
2756 -81 479 417 -677 -86 1174 1578 814 -352 321 693 908 -939 -1208 -855 200 -329 -1234 -1136 18
2775 18 1146 359 -114 -86 1471 1340 665 -599 -47 597 262 -892 -1638 -586 -16 44 -1234 -636 201
2794B01J161p93o22K89R33K40j416o53j2J298p91p86p71J277P47k47p67J16J464
2813H68M21l94j208O68M92K90j514o51L76Q01j62j268P2P03J324o88l55j44J477
2832A108K14o07r82J87R70l92q88j072R52M52J93j311J46R28J035l42q85L96Q19
2851I21O46j306n26j62J116m55r30o69O94R96m96n16k77J497L67o2j159M74P60
2870I13K97j031r45M43N42J04j473L9L79J346n93m82j43J201O80o49o84j09J162
2889I97k73o62j179O74M99R0j081k94J045O92j0j037M99O15Q75j071n56m5R40
2908G18q7j017o15K41J102m93m41n21J289M84o0q80J63R59K19n68j132N03L99
2927B63K97j297l48L25J146l24p44oQ28R75o88m58k90J289j12n71j066L59O81
$$ plain form
2794 201 1362 569 -53 236 1169 1409 -7 -660 -672 626 -165 -951 -1722 -445 302 55 -712 -596 868
2813 868 1289 895 -313 355 847 1137 -377 -1028 -652 149 -13 -1281 -1209 -506 818 130 -225 -369 1108
2832 1108 1322 715 -267 -80 890 498 -390 -1462 -510 -58 135 -1176 -1030 -102 933 591 -294 102 921
2851 921 1567 261 -265 -427 689 234 -696 -1365 -671 325 -171 -687 -964 533 900 838 -321 153 913
2870 913 1210 179 -766 -323 219 323 -1150 -1111 -732 614 21 -461 -604 597 1277 628 -56 -165 997
2889 997 724 62 -1117 -443 56 146 -935 -1229 -184 508 498 -539 -40 575 1450 379 -177 -222 718
2908 718 631 -386 -1001 -760 342 -151 -592 -1113 176 660 600 -280 -117 842 1061 493 -639 -136 263
2927 263 560 -737 -1085 -760 386 62 -682 -688 140 1115 427 -31 -321 968 856 285 -781 -422 259
2946B59l1p97o23R29M97K45j191L51O27Q76o55p53J40O98L54j150m88L6J134m32
$$ plain form
2946 259 228 -569 -1192 -263 234 479 -712 -361 266 1142 487 -266 -126 572 926 -224 -712 -676 458 26
$$ [...]
8191h
##END NTUPLES=NMR FID
##END=
