##TITLE=1H_Pr BnBr
 200.13MHz,CDCl3,
 8 sc
 
 13.3.2025
##JCAMPDX= 6.0         $$ Bruker NMR JCAMP-DX V2.0
##DATA TYPE= NMR FID
##DATA CLASS= NTUPLES
##ORIGIN= UXNMR, Bruker Analytische Messtechnik GmbH
##OWNER= pz
$$ XWIN-NMR		Version 3.5
$$ Thu Mar 13 14:47:11 2025 Russian Standard Time (UT+4h)  she@DPX200
##.OBSERVE FREQUENCY= 200.1313
##.OBSERVE NUCLEUS= ^1H
##.DELAY= (6, 6)
##.ACQUISITION MODE= SIMULTANEOUS
##.ACQUISITION SCHEME= undefined
##.AVERAGES= 8
##.DIGITISER RES= 18
##SPECTROMETER/DATA SYSTEM= spect
##.PULSE SEQUENCE= zg30
##.SOLVENT NAME= CDCl3
##.SHIFT REFERENCE= (INTERNAL, CDCl3, 0, 14.3821)
##AUDIT TRAIL= $$ (NUMBER, WHEN, WHO, WHERE, WHAT)
$$ ##TITLE= Audit trail, XWIN-NMR		Version 3.5
$$ ##JCAMPDX= 5.01
$$ ##ORIGIN= Bruker BioSpin GmbH
$$ ##OWNER= she
$$ F:/spectra/data/she/nmr/H-C/1/audita.txt
$$ ##AUDIT TRAIL=  $$ (NUMBER, WHEN, WHO, WHERE, WHAT)
(   1,<2025-03-13 14:45:09.23 +0400>,<she>,<DPX200>,
      <created by zg, POWCHK disabled, PULCHK disabled
       configuration hash MD5:
       00 E9 B6 7A A2 85 ED C7 34 08 36 98 17 FE 4E 26
       data hash MD5: 16K
       FE E3 70 55 63 0F 8A C3 D0 FC DB 5E BC 28 33 90>)
$$ ##END=
$$ 
$$ hash MD5
$$ 67 A3 F3 E4 48 B0 7A C7 EC 9F 7A 1F B4 43 D3 5F
##$RELAX= 
##$RELAX= 
##$RELAX= 
##$RELAX= 
##$RELAX= 
##$RELAX= 
$$ Bruker specific parameters
$$ --------------------------
##$DU= <F:/spectra>
##$EXPNO= 1
##$NAME= <H-C>
##$PROCNO= 1
##$TYPE= <nmr>
##$USER= <she>
##$AMP= (0..31)
100 100 100 100 100 100 100 100 100 100 100 100 100 100 100 100 100 100 
100 100 100 100 100 100 100 100 100 100 100 100 100 100 
##$AQSEQ= 0
##$AQ_mod= 1
##$AUNM= <au_zg>
##$AUTOPOS= <>
##$BF1= 200.13
##$BF2= 200.13
##$BF3= 200.13
##$BF4= 200.13
##$BF5= 200.13
##$BF6= 200.13
##$BF7= 200.13
##$BF8= 200.13
##$BYTORDA= 1
##$CFDGTYP= 0
##$CFRGTYP= 5
##$CHEMSTR= <none>
##$CNST= (0..31)
1 1 145 1 1 1 1 1 1 1 1 1 1 1 1 1 1 1 1 1 1 1 1 1 1 1 1 1 1 1 1 1 
##$CPDPRG= <>
##$CPDPRG1= <>
##$CPDPRG2= <>
##$CPDPRG3= <>
##$CPDPRG4= <mlev>
##$CPDPRG5= <mlev>
##$CPDPRG6= <mlev>
##$CPDPRG7= <mlev>
##$CPDPRG8= <mlev>
##$CPDPRGB= <>
##$CPDPRGT= <>
##$D= (0..31)
0 0.7 0 0 0 0 0 0 0 0 0 0.03 0 0 0 0 0 0 0 0 0 0 0 0 0 0 0 0 0 0 0 0 
##$DATE= 1741862708
##$DBL= (0..7)
120 120 120 120 120 120 120 120 
##$DBP= (0..7)
150 150 150 150 150 150 150 150 
##$DBP07= 0
##$DBPNAM0= <>
##$DBPNAM1= <>
##$DBPNAM2= <>
##$DBPNAM3= <>
##$DBPNAM4= <>
##$DBPNAM5= <>
##$DBPNAM6= <>
##$DBPNAM7= <>
##$DBPOAL= (0..7)
0.5 0.5 0.5 0.5 0.5 0.5 0.5 0.5 
##$DBPOFFS= (0..7)
0 0 0 0 0 0 0 0 
##$DE= 6
##$DECBNUC= <off>
##$DECIM= 32
##$DECNUC= <off>
##$DECSTAT= 4
##$DIGMOD= 1
##$DIGTYP= 9
##$DL= (0..7)
0 120 120 120 120 120 120 120 
##$DP= (0..7)
150 150 150 150 150 150 150 150 
##$DP07= 0
##$DPNAME0= <>
##$DPNAME1= <>
##$DPNAME2= <>
##$DPNAME3= <>
##$DPNAME4= <>
##$DPNAME5= <>
##$DPNAME6= <>
##$DPNAME7= <>
##$DPOAL= (0..7)
0.5 0.5 0.5 0.5 0.5 0.5 0.5 0.5 
##$DPOFFS= (0..7)
0 0 0 0 0 0 0 0 
##$DQDMODE= 0
##$DR= 18
##$DS= 0
##$DSLIST= <SSSSSSSSSSSSSSS>
$$ [...]
##$SUBNAM0= <"">
##$SUBNAM1= <"">
##$SUBNAM2= <"">
##$SUBNAM3= <"">
##$SUBNAM4= <"">
##$SUBNAM5= <"">
##$SUBNAM6= <"">
##$SUBNAM7= <"">
##$SUBNAM8= <"">
##$SUBNAM9= <"">
##$SW= 18.0517328524113
##$SWIBOX= (0..15)
0 0 2 0 0 0 0 0 0 0 0 0 0 0 0 0 
##$SW_h= 3612.71676300578
##$TD= 16384
##$TD0= 1
##$TE= 0
##$TE2= 300
##$TE3= 300
##$TEG= 300
##$TL= (0..7)
0 120 120 120 120 120 120 120 
##$TP= (0..7)
150 150 150 150 150 150 150 150 
##$TP07= 0
##$TPNAME0= <>
##$TPNAME1= <>
##$TPNAME2= <>
##$TPNAME3= <>
##$TPNAME4= <>
##$TPNAME5= <>
##$TPNAME6= <>
##$TPNAME7= <>
##$TPOAL= (0..7)
0.5 0.5 0.5 0.5 0.5 0.5 0.5 0.5 
##$TPOFFS= (0..7)
0 0 0 0 0 0 0 0 
##$TUNHIN= 0
##$TUNHOUT= 0
##$TUNXOUT= 0
##$USERA1= <user>
##$USERA2= <user>
##$USERA3= <user>
##$USERA4= <user>
##$USERA5= <user>
##$V9= 5
##$VALIST= <valist>
##$VCLIST= <CCCCCCCCCCCCCCC>
##$VD= 0
##$VDLIST= <DDDDDDDDDDDDDDD>
##$VPLIST= <PPPPPPPPPPPPPPP>
##$VTLIST= <TTTTTTTTTTTTTTT>
##$WBST= 1024
##$WBSW= 4
##$XGAIN= (0..3)
0 0 0 0 
##$XL= 0
##$YL= 0
##$YMAX_a= 591628
##$YMIN_a= -620987
##$ZGOPTNS= <>
##$ZL1= 120
##$ZL2= 120
##$ZL3= 120
##$ZL4= 120
##$ABSF1= 10
##$ABSF2= 0
##$ABSG= 5
##$ABSL= 3
##$ALPHA= 0
##$AQORDER= 0
##$ASSFAC= 0
##$ASSFACI= 0
##$ASSFACX= 0
##$ASSWID= 0
##$AUNMP= <proc_1d>
##$AZFE= 0.1
##$AZFW= 0.1
##$BCFW= 1
##$BC_mod= 2
##$BYTORDP= 1
##$COROFFS= 0
##$CY= -3
##$DATMOD= 1
##$DC= 2
##$DFILT= <>
##$DTYPP= 0
##$F1P= 0
##$F2P= 0
##$FCOR= 0.5
##$FTSIZE= 0
##$FT_mod= 4
##$GAMMA= 1
##$GB= 0.15
##$INTBC= 1
##$INTSCL= 1
##$ISEN= 128
##$LB= 0.25
##$LEV0= 0
##$LPBIN= 0
##$MAXI= 10000
##$MC2= 0
##$MEAN= 0
##$ME_mod= 0
##$MI= 1.114404
##$NCOEF= 0
##$NC_proc= 0
##$NLEV= 6
##$NOISF1= 3.799351
##$NOISF2= 2.8
##$NSP= 1
##$NTH_PI= 0
##$NZP= 0
##$OFFSET= 14.38212
##$PC= 1
##$PHC0= -467.6974
##$PHC1= 7.59221
##$PH_mod= 1
##$PKNL= yes
##$PPARMOD= 0
##$PSCAL= 0
##$PSIGN= 0
##$REVERSE= no
##$SF= 200.129724274929
##$SI= 16384
##$SIGF1= 3
##$SIGF2= 2
##$SINO= 400
##$SIOLD= 16384
##$SREGLST= <1H.CDCl3>
##$SSB= 0
##$STSI= 0
##$STSR= 0
##$SW_p= 3205.1282051282
##$SYMM= 0
##$S_DEV= 0
##$TDeff= 0
##$TDoff= 0
##$TI= <>
##$TILT= no
##$TM1= 0
##$TM2= 0
##$TOPLEV= 0
##$USERP1= <user>
##$USERP2= <user>
##$USERP3= <user>
##$USERP4= <user>
##$USERP5= <user>
##$WDW= 1
##$XDIM= 8192
##$YMAX_p= 0
##$YMIN_p= 0
$$ End of Bruker specific parameters
$$ ---------------------------------
##NTUPLES= NMR FID
##VAR_NAME=  TIME,          FID/REAL,        FID/IMAG
##SYMBOL=    X,             R,               I
##VAR_TYPE=  INDEPENDENT,   DEPENDENT,       DEPENDENT
##VAR_FORM=  AFFN,          ASDF,            ASDF
##VAR_DIM=   8192,          8192,            8192
##UNITS=     SECONDS,       ARBITRARY UNITS, ARBITRARY UNITS
##FACTOR=    0.0002768,     1,               1
##FIRST=     0,             0,               0
##LAST=      2.2672688,     0,               0
##MIN=       0,             -620987,         0
##MAX=       2.2672688,     591628,          0
$$ Real data points
##PAGE= N=1
##DATA TABLE= (X++(R..R)), XYDATA
0@%%%%%%%%%%%%%mMqJ6j6J6j6K1k9L2l4M2m9N7o8P7r0J01j14J30j47J69j91K14
37A13k39K69l00L35l74M14m58N06n59O18o84P52q28R12j006J110j222J351j495
56g85J657j844K062k316K617k983L442m034M831n970P744j0925J8409p2404m3914
71a04413J22274J43560J79713J53822R6672l5366j47585k20518k29986k04977
81b46804j20041k4009M3705N9460N7268L1925L097j027M5335J05318J52634J73469
93B80330J59023Q4320k5784j24840j84307k02697j66790q9370r781L2942M0709
104b06245K5026p550l3037j6434M0364J06445J57151J78827J48982O7297l4106
115D26720j14964j61477j65792j22263n0454N710K7637K4136r48l6229n0500k2443
$$ plain form
0 0 0 0 0 0 0 0 0 0 0 0 0 0 0 -4 0 -8 8 -8 8 -8 13 -16 16 -18 24 -25 32 -36 41 -49 52 -62 68 -79 90 -101 113
37 113 -126 143 -157 178 -196 218 -240 266 -293 325 -359 393 -435 477 -529 581 -641 710 -785
56 -785 872 -972 1090 -1226 1391 -1592 1850 -2184 2647 -3323 4421 -6504 11905 -60499 -104413
71 -104413 17861 161421 341134 494956 591628 556262 408677 188159 -41827 -246804
81 -246804 -366845 -390854 -347149 -287689 -230421 -198496 -195399 -196426 -151091 -45773 106861 280330
93 280330 439353 523673 497889 373049 188742 -13955 -180745 -270115 -279896 -246954 -206245
104 -206245 -181219 -188769 -221806 -238240 -197876 -91431 65720 244547 393529 460826 426720
115 426720 311756 150279 -15513 -137776 -188230 -182520 -154883 -130747 -131695 -167924 -218424 -240867
127b40867L5098R6014J46301J65473J28946M8776l6893j03699j38082j29459p8083
138a06475j7519K0594K8230J1411k5436n9876n9549k1538L4350R3158J36852J41975
150A76177R9310K8259m1367r3932j13949r2204m2425L418K9551L0174L754l8654
162e1888o8838o4618k7000K8426Q7866J26499J22285P6784J1704n1195r1583r5413
174C029o0174q940K8273M2367K8779r050n1297p2780o0173k1285L2237Q2654J06683
187D0323R1895M7104p113n4800q0286p0559l2722J1394M1551M7839K6714j5671
199D5669n5238o9885n5944j7587L4612P8961R3693P1190K5744k5379o5246p5599
211a5009n2408j0023K9460N2942N0361K0042k3543n6376o3951m5599o418M0186
$$ plain form
127 -240867 -205769 -109755 36546 202019 330965 379741 342848 239149 101067 -28392 -106475
138 -106475 -123994 -103400 -75170 -63759 -89195 -149071 -208620 -230158 -195808 -102650 34202 176177
150 176177 275487 303746 262379 168447 54498 -37706 -80131 -76713 -47162 -16988 -13234 -51888
162 -51888 -120726 -185344 -212344 -183918 -96052 30447 152732 229516 241220 190025 98442 3029
174 3029 -57145 -66085 -37812 4555 33334 24284 -27013 -99793 -159966 -181251 -149014 -66360 40323
187 40323 132218 179322 172209 117409 37123 -33436 -66158 -54764 -13213 34626 61340 45669
199 45669 -9569 -79454 -135398 -152985 -118373 -39412 54281 125471 151215 125836 60590 -15009
211 -15009 -67417 -77440 -47980 4962 55323 75365 51822 -4554 -68505 -114104 -120522 -80336
223h0336P1965P4629M9245P159l8548o6702o5551l6125M337L9608N6682M6973
235F3336J3269k7834n4844n8109l5574N818M6862O8845O1608L0972j1513n0720
247E2116o8494n6404k1949J7751M7821N5374L7680K921l2094n1407m7655k1447
259h5787J7150N1167O2787M9412J6329k4740n6109o5019m7182j2420K4295M9953
271b0164N1870K8681o420l6078m8160l8876q246K8487N5214N8478L9404K976l5784
284G1382n9628n8782l6084k416L0763M7960M1508J6395j5737l8876m4320k7409
296g5244M906L8192N6270N4318L0179o770m1763n9475n2921k6374P191L5069M4327
309G905L1665M570k5333m3003m0644j7436J5789M5943N7322M7697K0332j5479
$$ plain form
223 -80336 -8371 66258 115503 122662 84114 17412 -48139 -84264 -79927 -40319 16363 63336
235 63336 76605 48771 -6073 -64182 -99756 -93938 -47076 21769 83377 114349 102836 52116
247 52116 -16378 -72782 -94731 -76980 -29159 26215 63895 66816 34722 -16685 -64340 -85787
259 -85787 -68637 -17470 45317 94729 111058 86318 30209 -34810 -81992 -94412 -70117 -20164
271 -20164 31706 60387 53967 17889 -30271 -69147 -77393 -48906 6308 64786 104190 107166 71382
284 71382 11754 -47028 -83112 -85528 -54765 -6805 34703 51098 35361 -3515 -47835 -75244
296 -75244 -70338 -32146 24124 78442 108621 101851 60088 613 -52308 -78682 -71491 -36422 7905
309 7905 39570 44140 18807 -24196 -64840 -82276 -66487 -20544 36778 84475 104807 89328
321H9328m3540n3385m1404j5528J4681L5109L7115J9520p162l1401m3493l4844
333g5004r499K2900M8306N5398M1585J2857k0934m4657m7832l2358m571K3219
345c0590L8077L2253R780j8404m0499m5347k9429qL0828N0428N1397L2447J501
358H2434k7331m2971l9121j9761P181K8466L5184K4493P75k5306m2054m1721k2672
371h2404O354L3621M8345M4018K3395n340l0647m0452l2940r973J5945L3435L4620
384C7977J8241p449l2011m3686l7937j5000J4335L7818M6425L6345J2087j4815
396E2330l4386l7470k4418r8K3928L6331L0644J1509j5114l6109m2344l1309o436
409g2942K1160L9852M3034K8192J880k2573l6824l3970j6027Q657K8637L5344
$$ plain form
321 89328 45788 -7597 -49001 -64529 -49848 -14739 22376 41896 34734 3333 -40160 -75004
333 -75004 -84503 -61603 -13297 42101 83686 96543 75609 30952 -16880 -49238 -53809 -30590
345 -30590 7487 39740 49520 31116 -9383 -54730 -84159 -84167 -53339 -2911 48486 80933 82434
358 82434 55103 12132 -26989 -46750 -39569 -11103 24081 48574 49349 24043 -18011 -59732 -82404
371 -82404 -76050 -42429 5916 49934 73329 67989 37342 -3110 -36050 -46023 -30078 3357 37977
384 37977 56218 48769 16758 -26928 -64865 -79865 -65530 -27712 18713 55058 67145 52330
396 52330 17944 -19526 -43944 -44042 -20114 16217 46861 58370 43256 7147 -35197 -66506 -72942
409 -72942 -51782 -11930 31104 59296 61176 38603 1779 -32191 -48218 -39561 -10924 24420
421B4420K5425L981k0862l7057l7472k1906J939K6044L9641L6627J8703o062k7350
434B6071l6134k9269r521J4440L0851L3617K0948k514k5017l8201l4108j5473
446f4310J1059L2433M1209L1947J0139j4991l3484l6759k4320j535K1029L3290
458E707K9233J2718r986k9092l4623k5895n537J8411L4598L7215K4260K308k0213
471C9104l3946l3014j8983L349K2450L0541K5131O714j5259l0407l1884j8920
483e5124K313K5489L7708L5739J8607n347k7450l5939l0673j2590R045K5233K8701
496A5712J8511j016k0646l0995k8117j1201J1527L0682L8431L1699J2669j1081
508E6175k9074l5163k5674p360J2675K4746K3746J0823q072k5435l0719k2919
$$ plain form
421 24420 49845 53826 32964 -4093 -41565 -63471 -61532 -35488 4153 40780 59483 53421 26071
434 26071 -10063 -39332 -48853 -34413 -3562 30055 51003 48489 23472 -14729 -48837 -64310
446 -64310 -53251 -20818 20391 52338 62477 47486 14002 -22757 -47077 -48612 -27583 5707
458 5707 34940 47658 37672 8580 -26043 -51938 -57475 -39064 -4466 32749 57009 59317 39104
471 39104 5158 -27856 -46839 -43490 -21040 9501 34632 41346 26087 -4320 -36204 -55124
483 -55124 -52811 -27322 10386 46125 64732 59385 31935 -4004 -34677 -47267 -38222 -12989 15712
496 15712 34223 33207 12561 -18434 -46551 -57752 -46225 -15543 22888 54587 67256 56175
508 56175 27101 -8062 -33736 -41096 -28421 -3675 20071 30894 22822 -2613 -33332 -56251
520e6251l672J9020L5485L8571K7049N919j5440l0201l1600j9859j451J5542K3314
533F426J8449K872j5012k7782k9443j8125K546K4100L7509L7211K3682J727j8747
546D5413l0295k7645j4878L613J8204K1899J3141l998k1754l1358k8120j2352
558f8130R344K9264L7429L4008J8151l085k0222k6855k1708p383Q149J8507J7581
571B5050O838j0359k5923l1768k5460p730J3275L0666L6902L0067J3529o606k0915
584B7566k4555j6209l62J3118K0473J5187J161j7115k9736l2446k2511l260J7572
597e1117L1539L3726K4484P121r798j9692j9251q913N448J7142J9654J2391m306
610C8428k0985l1850l0859j9556j52J9055L0490L0078J9069K134j2247j8943j4130
$$ plain form
520 -56251 -59923 -40903 -5418 33153 60202 66121 50681 20480 -11120 -30979 -32430 -16888 6426
533 6426 24875 27747 12735 -15047 -44490 -62615 -60069 -35969 1540 38751 62433 64160 45413
546 45413 15118 -12527 -27405 -23792 -5588 16311 29452 25454 3700 -27658 -55778 -68130
558 -68130 -58786 -29522 7907 41915 60066 56981 36759 9904 -11804 -19187 -11038 7469 25050
571 25050 31888 21529 -4394 -36162 -61622 -69352 -56077 -25411 11491 41558 55087 48481 27566
584 27566 3011 -13198 -13560 -442 20031 35218 36379 19264 -10472 -42918 -65429 -68689 -51117
597 -51117 -19578 14148 38632 45753 35955 16263 -2988 -11901 -6453 10689 30343 42734 38428
610 38428 17443 -14407 -45266 -64822 -64974 -45919 -15429 14649 33718 35852 23605 4662 -9468
623i468k237J1653K0901J9560P994r286k5404l2832k8711j4663M347K0828K8212
636i106K4819J2246k723j3628j6535r622M022J6266K1846J8665M954j2582k6452
649A2170l2295k6575j1417O887K0572K5561J9837P012o547j5257j3938m304R164
662i130K0484K3598J5869J159j5542k7263l0017k2364p002R003K0118K1573J3290
675A3776P79j0916j5270j1051n3J3870K3344K4099J4455j274j7703k7789k7415
688b1148j7766k780J0999J9294J7385P559n233j4170j5547q194M621J7450K4253
701A6723K2217J1681m166j8028k5657k2779j2443J297J2640J6721J2566K257r055
714C974j6575j5128o319P496J9723K5070K0275Q687o863j9258k3746j9163o890
$$ plain form
623 -9468 -11705 -52 20849 40409 48403 39117 13713 -19119 -47830 -62493 -58146 -37318 -9106
636 -9106 15713 27959 25236 11608 -4927 -14549 -10527 5739 27585 46250 51204 38622 12170
649 12170 -20125 -46700 -58117 -51230 -30658 -5097 14740 21752 15205 -52 -13990 -18294 -9130
662 -9130 11354 34952 50821 51980 36438 9175 -20842 -43206 -50208 -41205 -21087 486 13776
675 13776 14555 3639 -11631 -22682 -22735 -8865 14479 38578 53033 51759 34056 6267 -21148
688 -21148 -38914 -41694 -30695 -11401 5984 13543 8310 -5860 -21407 -29601 -24980 -7530 16723
701 16723 38940 50621 46455 28427 2770 -20009 -32452 -31155 -18515 -1794 10772 13029 3974
714 3974 -12601 -27729 -34048 -26552 -6829 18241 38516 47203 40340 21082 -2664 -21827 -28717
727b8717O333J5105J5819Q249l421j3526j7944j3875k810J0748K1160K3561J6455
740C7137L624r639j8710k0727j3573k516Q861J5580J3522N338o318j5324j7593
753b0338j1431m75J2585K0987K0993J3559p5j2699j9077j8294r823K629J1738
766i721J6202J1585J785j0173j6401j6554q095L869J5016K0613J8231Q850m450
779C0757j4794j9538j5455n413N674J3824J5315Q527j601j1822j6781j4298m838
792c0443P631J7064K0056J5454M329p836j6210j7708j2499k292Q541J3926J2503
805A2516N041n363j3231j5788j0867j126J0455J8102J9024J2562J322r786j6776
818F085j6380r480P88J0202J3739J0592J381q640j5361j5775q250K675J3502J9223
$$ plain form
727 -28717 -22384 -7279 8540 16789 13368 -158 -18102 -31977 -34787 -24039 -2879 20682 37137
740 37137 40761 31122 12412 -8315 -21888 -24404 -15543 37 13559 18897 12579 -2745 -20338
753 -20338 -31769 -32244 -19659 1328 22321 35880 35805 23106 4029 -14265 -24088 -21459 -9721
766 -9721 6481 18066 19851 9678 -6723 -23277 -31372 -27503 -12487 8126 26357 35207 30757
779 30757 15963 -3575 -19030 -24443 -18769 -4945 10370 18897 17296 5474 -11307 -25605 -30443
792 -30443 -22812 -5748 14308 29762 34091 26255 10045 -7663 -20162 -22454 -13913 13 12516
805 12516 17557 12194 -1037 -16825 -27692 -28818 -18363 -261 18763 31325 32647 22861 6085
818 6085 -10295 -19775 -18987 -8785 4954 15546 16927 8287 -7074 -22849 -31099 -28424 -14922 4301
832D301J8209R399k130j2109j6202j3595n189M358J1077J2497O698k412j1401
845C501j5979j3759n517N230J4901J8702J5306O787l990j1914j4837j1048k013
858a4630P174J2502J0762L762n529j3978j6650j2595l181Q268J5941J8027J3045
871B2918L032o559j2961j2877o965J977R982J2497R155R45q673j5479j6467j0529
885c0004n22R644J6328J5990R606O66q909j2508j0171l587N505J1683J2302P473
899B3496j845j1583j6372j5128q177K370J1067J5099J3904N788k426r836j1572
912e215p573r2Q379J2953J1954N013m645j2542j6579j3580n893M257J1803J4349
926B589J0829L428n680j1007j0597n437L557J0876J3769J0900K778o385j3750
$$ plain form
832 4301 22510 31909 29779 17670 1468 -12127 -17316 -12958 -1881 10616 17314 14902 3501
845 3501 -12478 -26237 -31754 -26524 -11623 7079 22385 29172 25182 13268 -1569 -12617 -14630
858 -14630 -7456 5046 15808 19570 14041 63 -16587 -29182 -32363 -24095 -8154 9873 22918
871 22918 25950 19391 6430 -6447 -13412 -11435 -1453 11044 20199 21144 12471 -3008 -19475 -30004
885 -30004 -30526 -20882 -4554 11436 21042 21708 12799 291 -9880 -13467 -7962 3721 16023 23496
899 23496 21651 10068 -6304 -21432 -29609 -27239 -16172 -1073 12831 18619 16193 6357 -5215
912 -5215 -12788 -12880 -4501 8452 20406 25419 20774 8232 -8347 -21927 -27820 -23563 -11760 2589
926 2589 13418 16846 11166 159 -10438 -15875 -12318 -1442 12327 23227 26005 19620 5870
939E870j5608j1451l449N943J1857J2314P688l06p517j1019r256k110N617J2881
953A454J3719R136J254q281j4047j4427r039l72P686J1830J0545M621m087j0017
967b5j1602p350L66Q477J3698J3218P851j220r449j3504j2336o039K160Q584J0919
982C748Q388J358o121j1268j1140n637K122R567J4177J1595O178k970r967j2523
996b493j0180l142M791R791J0160N918j701q406j1872j0622l998L960J1164J3197
1010F567J0572L208m815j0204j1545p102l40O955J0721R152M062l987j0189j2511
1024i456r028k559N295J1263J1792Q311J286o281j0291r854m705K644Q512J0629
1038G558Q445K327n854j0974j1605q072j051O559J0896J0639O386j705p550j0469
$$ plain form
939 5870 -9738 -21189 -24638 -18695 -6838 5476 13164 12858 5341 -5678 -14934 -17044 -11427 1454
953 1454 15173 24309 25563 17282 3235 -11192 -20231 -20603 -12917 -1087 9458 14079 9992 -25
967 -25 -11627 -18977 -18611 -10134 3564 16782 24633 23413 13964 460 -11876 -17915 -15755 -7171 3748
982 3748 12136 13494 7373 -3895 -15035 -20672 -18550 -8983 5194 16789 22967 19997 10030 -2493
996 -2493 -12673 -15815 -11024 -1233 8927 14845 13144 4738 -7134 -17756 -21754 -17794 -6630 6567
1010 6567 17139 20347 15532 5328 -6217 -13319 -13659 -6704 4017 13169 17231 13244 3055 -9456
1024 -9456 -18484 -21043 -15748 -4485 7307 15618 16904 10623 332 -9522 -14227 -11583 -3071 7558
1038 7558 16003 18330 12476 1502 -10103 -18175 -19226 -12667 -1771 8868 15254 13549 5999 -4470
1052d470q423j694M571J0037J1112O978M10p121j1915j1339n904J702P912J0393
1066B249Q887K776l684q893r780o543K17O824J0496J0378N561j797q062j1156
1080b527r146m350K942Q369R629O921J004n615r149r127m911K101Q046J0927R396
1095A4510L910l616r042j0558p905j980M288R051R127M813j226p681r610q146
1109a4065k470M410R518J0855P744J809n040r945r607o314M3O142Q881P251K640
1124A1852k948p754r564o918p47O101R643R927O782Q1n897r399r178m470J743
1139a0746O651Q532O128J002n123q705r185n182J224P336J0653R226M878j830
1153A4859p106r258p358k531L347P350Q023M426j085o578r704q062l309K472Q384
$$ plain form
1052 -4470 -12893 -14587 -10016 21 11133 18111 18521 11400 -515 -11854 -17758 -16056 -8144 2249
1066 2249 11136 13912 10228 1335 -8445 -14988 -14771 -7947 2549 12927 18488 16691 8629 -2527
1080 -2527 -11673 -16023 -13081 -4712 4917 11838 12842 7227 -1922 -11049 -15960 -13859 -5813 5114 14510
1095 14510 18420 14804 5762 -4796 -12701 -14681 -10393 -1342 7785 12598 11372 3691 -5919 -14065
1109 -14065 -16535 -12125 -2607 8248 15992 17801 12761 2816 -6791 -13105 -13062 -6920 1961 9212 11852
1124 11852 8904 1150 -8414 -15332 -16079 -9978 -335 9592 16374 16455 10558 1159 -8019 -12489 -10746
1139 -10746 -4095 4437 10565 11567 6444 -2261 -11446 -16628 -15404 -8068 2585 11811 16689 14859
1153 14859 7753 -1505 -8863 -11394 -8047 -697 7326 11752 10667 4089 -5615 -13677 -16986 -14514 -6130
1168f130J0547Q109K761k915p263q758n412p50M874P573O872L013l066p803r470
1183g818p197j807M018Q972R842O649J409m684p423p681l785J590N954P629O062
1198A1730J341m752q992r480n591m41N875R047Q952M742o30n541p966o021j725
1213i452L109P085P921M407p58o009r005q418m504J265O374R146P323L050k148
1228I386o222p033m901k52M752P617P402L052k247o860r355p495k842K744O987
1243e267Q444N847J297l438o913o608k925J416O284Q010O393J729l833p850r003
1258f417o354r09L473P354P588M143N5n003o685o063j054L189P178P925N287L43
1274A4050m508q234q367n228j52M714O982O492K399k223n943o238m289O0N345
$$ plain form
1168 -6130 4417 12526 15287 12372 5109 -3649 -9061 -9811 -4937 2636 9508 12521 9455 1652 -7818
1183 -7818 -15015 -16822 -12804 -3832 6010 12659 14068 9384 1961 -5720 -9505 -7915 -1961 5668 11730
1198 11730 13071 8319 -673 -10153 -15744 -16185 -10310 -1263 7689 12431 11801 6260 -1706 -7727 -9452
1213 -9452 -6343 742 8663 13070 12312 6303 -2702 -11120 -15624 -14359 -7985 1161 8484 11534 9386
1228 9386 3164 -3869 -8770 -9022 -4270 3347 10749 13801 11554 4694 -4661 -12156 -14998 -12254 -5267
1243 -5267 3177 9024 10321 6883 -30 -6638 -9563 -8147 -1863 6147 12540 14269 10436 2586 -6417
1258 -6417 -12771 -13680 -10207 -2853 4735 8878 8933 3930 -2755 -8818 -9872 -6683 495 8420 13707 14050
1274 14050 9542 1308 -7059 -12287 -12439 -7725 -743 5749 8148 5925 -18 -6256 -10545 -10485 -5140
1289e140P815P752M256j001n639q565p260l895J750N119O195N184Q99m021o357
1304b908o068l144K115O175Q553P379L375k599o080q093o474j741K163N480N563
1319C696L157r82m859o909n729j621L412P409Q642O210K107l053o258p271m974
1334g023n35L274N562M740J463l111o258p160m818J64M658P873Q386N608P26l827
1350I722o516o344l075P46M229N443L602k68m582p214o333m171J194N417Q302
1365A52P562M637m61m452n870n326j976K228N002M621K675j524n377p854o417
1380a2380k784K493O154Q371O730K792j450n097n783l674M7L464N225M460J001
1395I569l256o688p301n767j523L500O853P922N651J556k603n182n098k458Q15
$$ plain form
1289 -5140 2675 10427 14683 13682 8043 -522 -7782 -11677 -9927 -4808 1387 6571 7470 3449 -2908
1304 -2908 -8976 -12120 -10005 -3830 4723 12102 15477 12878 6798 -1295 -7769 -9510 -7347 -1867 3696
1319 3696 6853 5871 1012 -5897 -11626 -13247 -9835 -2426 6216 12426 14533 11480 5222 -2049 -7023
1334 -7023 -7558 -4284 1278 6018 7481 4370 -1888 -9048 -13866 -13702 -9044 -1171 7215 12823 13549 9722
1350 9722 3206 -3138 -6213 -5467 -1238 4205 7807 7539 2957 -4257 -10590 -14761 -13567 -8150 152
1365 152 7714 12351 11890 7438 1568 -3758 -5734 -3506 1496 6117 8792 7268 1891 -5963 -12380
1380 -12380 -15164 -12671 -6517 1854 8584 11376 9926 4829 -954 -4628 -4581 -1117 4108 8568 9569
1395 9569 6313 -375 -7676 -13443 -14966 -11466 -4613 3309 8960 10516 7913 2731 -2367 -4825 -4010
1410d010M620N272L487Mm210o979p434m763l7M446P082P039M762J31l510n010
1426H90m393j201K246M789N170K593j018n658p446o841l445J073N311P197O344
1441E611L074n60m019m923l240k5L344N421M467J776l097o004p641n864k670K375
1457a1975N980O469N465K119j747m272m329k430J488M178N113M295M08l587o432
1472G43p415n248j718L480N898O368M360M99k874m364l874q30K481N044N707L182
1488A1439p41m758o952o891m299K51L921O092N306L175q40l357m295l362J61L415
1504a735N407M919K376j328n273o823o019l032R44M736N655M766K006j968l868
1519G63m424k146J164L979N360M679J451k616n939o672m890j786K332N258N438
$$ plain form
1410 -4010 610 5882 9369 9373 5163 -1816 -9250 -14013 -14050 -9604 -2522 4517 9279 9410 5900 890
1426 890 -3503 -4704 -2458 2331 7501 10094 9076 3418 -4028 -10869 -14314 -13241 -7930 -733 5611
1441 5611 8685 8125 4106 -817 -4057 -4082 -738 4683 9150 10926 7829 1825 -5816 -11680 -14350 -11975
1457 -11975 -5995 474 5939 8058 6311 2039 -2290 -4720 -3232 946 6059 10354 10762 7175 743
1472 743 -6672 -11920 -13638 -10158 -4260 2108 6468 6967 4093 -271 -4145 -4975 -2494 2550 8257 11439
1488 11439 10698 5940 -1012 -7903 -12202 -11951 -8030 -1938 3368 6543 5703 2346 -1949 -5311 -5150 -1735
1504 -1735 3672 8591 10967 9639 4366 -2457 -8476 -11508 -10564 -5828 -173 4593 6599 4631 763
1519 763 -3661 -5807 -4643 -664 4696 9375 10826 8210 2271 -4401 -9291 -11077 -8745 -3487 1951
1534A951L758L08k849m230l810j223K394M695N342L715Ml719n833o538m022l19
1550a0376L230N266M735K748k04l291m155l146k36K977M927M959K678j001l978
1565E133o185n867l284O74M169M808M498J445j317l804l627k450O45M211M893
1580C942N036J431j738n395o121n129j817J606M036M785L639R77k708m028l808
1595e292q09J719M567N719L625Q53k808n211n734m311j091K015M255M421K033
1610C951j28l061l857k979l33K520N468N315L252p8m133m929n550l183j65K957
1626d933M387M011R59j788l491m025j989P84L709N050N099K247j297l925n090
1641b92m778k189Q13L367L902L058J17k507m013l206j424J458M214N187M382J713
$$ plain form
1534 1951 5709 6017 3168 -1062 -4872 -6095 -3701 994 6336 10051 10055 6336 503 -6035 -10057 -10376
1550 -10376 -7146 -1880 2855 5603 5399 2108 -2047 -5193 -5429 -2452 2475 7434 10112 9111 5133
1565 5133 -1052 -6919 -10203 -9529 -5360 -552 3946 5391 4074 270 -3357 -5807 -5162 -951 3942
1580 3942 8978 10409 8671 3276 -2845 -7974 -9791 -8185 -4149 636 4275 5252 2544 -1484 -5292
1595 -5292 -6101 -4382 185 5904 9529 10382 7574 2363 -3371 -7682 -8773 -6758 -2503 1918 3951
1610 3951 3823 762 -3095 -6074 -6407 -3887 1581 6896 10148 10070 5937 1008 -4542 -7725 -7890 -4933
1626 -4933 -546 3465 4424 2636 -855 -4880 -6869 -6085 -2376 2674 7773 10020 8723 4798 -292
1641 -292 -5070 -7259 -6446 -3079 823 3881 3998 1491 -2522 -5728 -7152 -5694 -1480 3707 8089 9802
1657I802j945m630n030l483j267J517L783L463K028j173k780m082l050m66K645
1672d668M738M744L522O33k443m741m725k586j29K052L799L018R17j505l463m032
1688d869k614L67L440M554M683K932l49l030m525l551k357P00K774L537K196L10
1704D198k471l788l846j483R53L310M971M283J975j210l332m217k935j036J212
1719c416L288L147J562j096k809m112l148j214J997L890M818L161J338j757l904
1734A745l503k265LJ923L452K499Q71j690l130m138k817k00K822L708M190K673
1750F143L91k207l699l467j414O09K943L546J988k7j886l897l579k093L22L084
1766c243L773L988J475q37l110l197k734o86J797K857L333J596o70k467l911k958
$$ plain form
1657 9802 7857 3227 -1803 -5286 -6553 -5036 -1253 2210 4238 3065 285 -3797 -6847 -7313 -4668
1672 -4668 70 4814 8336 8969 6526 1785 -2940 -5526 -5655 -3603 196 3214 4131 2626 -837 -4869
1688 -4869 -7483 -7116 -3676 878 5561 8493 8144 5114 589 -2962 -5319 -4619 -1845 1692 3888 4198
1704 4198 1727 -2061 -5907 -7390 -6437 -3127 1844 6127 8102 6892 3560 -657 -3592 -4628 -3416
1719 -3416 -128 3019 4581 3485 676 -3436 -6584 -7798 -5801 -1911 2907 6068 7406 5649 1745
1734 1745 -1758 -4023 -4020 -2097 1355 3854 4725 3035 -95 -4233 -7050 -7250 -4428 -720 3470 6143
1750 6143 6534 4327 628 -2839 -4253 -3644 -701 2845 4833 4806 2920 -977 -4556 -6649 -6327 -3243
1766 -3243 530 4518 5993 5156 2046 -1151 -3885 -4571 -2774 83 3416 5012 4342 1875 -2036 -4994
1782d994q93J014L314L659K961P39j705l200l677j867Q1K321L009K913J188j349
1798C514k502l818k124p7J571L481L355K063J09k074l727k767j697N21K412L222
1814A462K074N48j801l376k653j613P04K704L274L254J542q71k626l308k906p78
1830d370R72K487L062J208o2k522k723k795r30J694K661M066K398J070j188l125
1846A903l296k250l07J437K994J527J682j469k291l525j785m92K300L328L321
1861C077K472Q1j333l397k393j942O85J780K463J542j12j587k827l005j449M50
1877e495K429L530L221J828m84j775l038k034j292J332J861J923J409m51j973
1892I91l188k352j379J021K515L471K928J348j021k231k749j645k06J552K293
$$ plain form
1782 -4994 -5887 -4873 -1559 2100 5061 5800 4095 895 -2782 -4649 -4568 -2247 762 3675 4863 3514
1798 3514 1012 -2806 -4930 -5007 -3436 45 3400 5463 5572 3498 -229 -2996 -4693 -4172 -1760 1462
1814 1462 3536 4084 2283 -1093 -3746 -5359 -4655 -1951 1323 4577 6119 5248 2622 -686 -3592 -4370
1830 -4370 -3398 -911 2151 3359 3297 775 -1948 -4743 -5673 -3979 -1318 2748 5146 6216 5028 1903
1846 1903 -1393 -3643 -3950 -2513 481 2008 3690 2221 -70 -3595 -5380 -5872 -3572 -244 3077
1861 3077 5549 5630 4297 900 -1493 -3435 -2750 -970 1493 3035 2923 1336 -1491 -4496 -5945 -5495
1877 -5495 -3066 464 3685 5513 5029 3254 216 -1818 -3110 -1778 83 2006 3415 2964 991
1892 991 -2197 -4549 -5928 -4907 -2392 1079 4007 5355 4334 2103 -646 -2291 -2497 -945 1348
1907A348K009M35j201k547l075k327o70J693K858L162K549N72j284k294k557j152
1923b481O36J800K044J789J35j599k986l057j881j69K159K647L171K034k44j776
1939B222k205j350p82R49K091K023J218l50k251k626k993j481J75K134K956K772
1955B502J176n50j629k208j360K6J494K308K091Q36j138k182l422k049j204N42
1971d767K377K791K345K49j029j569k104p26P51J585K698J947K17j578k423k935
1987b171k136q15J588J993K498J558j63j166j813j753n61J316K034K769J227L14
2003D719j827k284l014j447m0Q53K526K174J140j079j567j975j313M01J343K601
2019A211K041J358n91j583k472k491j260M80J666K111J586M19j168j641k282j081
$$ plain form
1907 1348 3357 3792 2591 44 -3031 -5358 -6028 -4335 -1477 1685 4234 4806 3522 1228 -1329 -2481
1923 -2481 -1845 -45 1999 3788 3923 2324 -662 -3719 -5600 -5769 -3610 -963 2208 4242 3998 2222
1939 2222 17 -1333 -2115 -1166 925 2948 4166 3816 1565 -1061 -4054 -5535 -5360 -3226 -270 2502
1955 2502 3678 3128 1499 -709 -2069 -2043 -549 1759 3850 4686 3548 1366 -2056 -4105 -5309 -4767
1971 -4767 -2390 401 2746 2995 1966 397 -1707 -2433 -1682 -97 2601 4548 4765 3187 764 -2171
1987 -2171 -4307 -5122 -3534 -1541 957 2515 2352 1186 -627 -2380 -2941 -1625 409 3178 4405 4719
2003 4719 2892 608 -2406 -3853 -3893 -3040 -514 1660 2800 1721 154 -1821 -3134 -2733 -1390 1211
2019 1211 3252 4610 4019 2436 -36 -2527 -3787 -3307 -1641 470 2056 2475 1307 -334 -2616 -3697
2035c697J170J178K471K420Q24p32j990k607j784n57J184J510K203J034k38j582
2051H07k158j413r35Q35K087K553J667J24q72j863k693j076l8J370J990J809P15
2068B909n91j959j790j670j75J088K110K121J360l60j012k006k193p59J98J842
2084h87K115J351J95o18k192j927j038J13J252K018J922R10l99j981j749j522
2100b437m37Q26J725J969R82j66j238j718j738o48O39J093K148J670J09n63j771
2117D45j827j050k66J082K064J561P16m27j280j986j348l66N45J572K030J155
2133B620j09j212j484j554j194M24J486J947J449K32n31j658j459j408K33R12
2149a306J404J614P82k82j385j706j200n37Q57J256J688J316%j089j205j549q08
$$ plain form
2035 -3697 -2527 -1349 1122 3542 4366 3634 1644 -963 -2747 -3304 -2120 -610 1593 2627 2389 807
2051 807 -1351 -2764 -3699 -2864 -777 1776 3443 3567 2695 832 -1861 -2937 -2975 -1605 385 2194 2909
2068 2909 2318 359 -1431 -3101 -3276 -2188 -78 2043 3403 3043 2031 25 -2168 -2927 -2729 -887
2084 -887 1228 2579 2774 2156 -36 -1963 -3001 -2888 -1636 382 2304 3214 2815 834 -915 -2437
2100 -2437 -2874 -2048 -323 1646 2628 2462 1224 -494 -2232 -2880 -2241 -1148 1000 2670 2779 2216 445
2117 445 -1382 -2432 -2698 -1616 448 2009 2725 2298 1018 -968 -2316 -2682 -2137 -565 1465 2620
2133 2620 2511 1299 -185 -1739 -2933 -2509 -1023 924 2373 2605 2074 416 -1043 -2451 -2218 -1306
2149 -1306 98 1712 2494 2212 827 -879 -2079 -2616 -1759 -503 1185 2501 2501 1412 207 -1342 -2150
2166b150J38J313J554J305J16n53j371j959q43L0Q10J483J552P04K01j273j431
2183c74j129l01L28J552J288Q62J40r49j618j412j131J58J246J551J152N55j85
2200A733j596r80q13n1R53J302J209P92m46j023j663j321k06l26J587J248R46
2217A345M42o31j385j181m37K82J053J524Q58L46k78j476j338j164J15O90R91
2234b44R26P22K6j069j364o42k14P52J273Q69Q25M94j053j150j257n77M2J001
2252f40J195P20M72q06q75j093n76k00P69J151J299RK22q58j101p57n85N67P21
2271c66J189L69J87o44j010j120k37J15R52J025J231Q6n47l55j462p33k42Q23
2289g39J022P04Q06q75n54q84j017j60M16J200R19Q51l07l56r15r05o09L1R86
$$ plain form
2166 -2150 -2012 -699 855 2160 2276 1723 352 -1607 -2450 -2420 -1610 -127 1425 2129 2330 1057 -374
2183 -374 -1503 -1804 -1476 76 1364 2226 2366 1417 -201 -1613 -2744 -2586 -1340 211 1363 1918 1733
2200 1733 137 -843 -1656 -1707 -754 548 1757 2549 2103 1080 -583 -1904 -2110 -2436 -849 399 1345
2217 1345 1787 1156 -229 -1410 -1847 -1565 -512 1012 1870 2216 1938 462 -876 -2040 -1925 -1235 -244
2234 -244 682 1404 1430 361 -1003 -1645 -1859 -1107 166 1035 1860 2354 1301 151 -1106 -1683 -1641 -640
2252 -640 555 1275 1747 941 66 -1027 -1603 -1803 -1034 117 1416 1425 1647 789 -312 -1069 -1654 -1087 -366
2271 -366 823 1192 1379 735 -275 -1395 -1632 -1517 -565 460 1691 1777 1230 875 -587 -1320 -1562 -739
2289 -739 283 987 1793 918 364 -520 -1537 -1697 -1281 -81 838 1689 1382 1026 111 -794 -1403 -1372 -386
2308c86N30J118l07j61o06j212n40j85O94J421P31R26l52r59o13j158l43K94J146
2327C8O07L83J75m12j407n16o04M82Q41R84P58K49m17p54r53m82k34N54R26O94
2347I12K85l23q90j056l80L9N56N42J279M37R9l93p34r47n69K15P17O03N37K67
2367A196n39r40n46q42j19P22J037J122N97k07p79q40n13o9M07M82N03K06J73
2386A051n72j153n56p11Q68L04J139O91L43k45n40r57m58K63J5P37Q44N5l52n51
2406B15j355m44qL97O59Q53P88J55o5q43o17k43j1L44O77O36O7o28j035o94p74
2427a926J90M00P50J130K88J01l8r18j59n1j5R21K61K54k64n25j129o30k20j61
2447a741Q58N89Q04L73j14n07l53k61L35L67M62N67N2n50n71r67p62j18K73J66
$$ plain form
2308 -386 144 1262 955 794 188 -1024 -1564 -1749 -1055 366 1097 2023 1671 712 99 -1059 -1402 -1108 38
2327 38 645 1028 1203 791 -616 -1132 -1736 -1254 -413 571 1329 1578 1161 407 -546 -1028 -1262 -708 218 912
2347 912 1197 874 -16 -1072 -1452 -1413 -857 -315 964 1401 1500 1107 373 -574 -1143 -928 -211 392 929 1196
2367 1196 657 -283 -829 -1671 -1790 -1068 -31 1091 1688 1481 702 -138 -651 -720 -313 169 672 878 1051
2386 1051 479 -674 -1230 -1941 -1073 -769 370 1061 1404 1159 619 -338 -796 -533 -518 219 1063 1118 766 215
2406 215 -1140 -1584 -1592 -1195 -536 317 1105 1260 1195 352 -265 -508 -519 -175 502 1138 1205 577 -458 -1152 -1926
2427 -1926 -1736 -1336 -586 544 832 933 895 -23 -182 -233 -248 673 934 1188 924 399 -730 -1360 -1580 -1741
2447 -1741 -883 -294 510 883 769 262 -91 -352 -17 350 812 1379 1431 881 310 -657 -1419 -1537 -1264 -1098
2467a098J025N86j38j49n01q8q3M25N12Q30K28J57o75p45r67o29q4k07P90Q00
2487a1K23L56p01o40J78K96N5J001M15N18k2p30p53r64m26kjO76M60O2p3m56n25
2510a064PM09M90P29P01M03k5p27r38n53m21K16K57K90L07o1j88m73k93j73K03
2531i04Q49P79M92K45l84l03q72k78n99M26O04L64j33j22o67l68m83M08L54O24
2551C2Q30M15m4l35n51p61Kk20L66N23J80O8k71l14q86kj44N89N06M18P41k09
2573I33j73m90m95j23J15J16O35p0J95l98p07m46k74K26N33P00K16K97j20l33
2593C37l12p06J58M11J36O33M9l11n05n31m2k91L43K20O29L79J47k82o0m69k38
2614c05j00O16J71K69R5l72l48n57m29j74O74J25N34L37P3l86l90O2m19J69M07
$$ plain form
2467 -1098 -73 513 375 226 -275 -363 -446 -21 491 1321 1549 1706 1031 286 -681 -1310 -1394 -1601 -811 -11
2487 -11 212 568 -133 -773 -595 -299 -244 757 1172 1690 1668 938 185 -779 -1205 -1207 -1208 -532 -72 -10 -83 -539 -1064
2510 -1064 -1057 -648 -158 571 1272 1675 1650 923 -15 -568 -989 -773 -516 -226 81 20 -168 -641 -934 -1107 -904
2531 -904 -55 724 1216 1461 1077 774 -98 -376 -975 -549 55 419 286 164 -503 -871 -1354 -946 -592 32
2551 32 862 1277 1233 898 347 -414 -412 -632 -266 257 437 505 234 -80 -966 -968 -1112 -523 -17 401 1142 933
2573 933 760 270 -225 -348 -233 -117 518 448 643 245 -462 -908 -1182 -956 -423 277 493 790 670 337
2593 337 25 -681 -523 -112 24 657 706 395 -110 -641 -683 -974 -631 -411 218 597 744 462 402 -67 -305
2614 -305 -405 211 382 651 746 374 26 -531 -960 -1134 -460 -335 199 536 609 223 -167 -105 -524 -355 52
2635E2N19K68l61j70l66l24l91j56K70P26K18J09N8l88m05k49K51J33M33M38K58
2656I23k70l98k67l91l00K08O75J08M6J03l26m94k10L51j63L64K23M30O0k04m63
2677Er4m96n3J90M64J65K91j8m21m75q8M4J83L29L14J96j59M7l92j83j31J9L24
2700F1R7K81J42k39l52k12k30J42p2M30L60J41m12J41l21n16N0L85J66L08J26
2721D76k11K57n74l99j67J00K10R20j81j64K04o74j50j9L39O9j85M15J36o9j74
2742A59o39J96q9L9M79O3J77j79o9k80l70J24p3N22J51O8M73l14m50m97J82J52
2764a75j06L10K45M0Q1m21o32J19O0J81K95J44K64q6k54j25l55j77K38P6M29M3
2786A94q0o8l7l34l88P3O12J61J54J46k30q1k00q9l51L08J44L08K79k2m91p9m67
$$ plain form
2635 52 571 839 478 308 -58 -382 -773 -929 -659 67 285 394 452 64 -341 -590 -339 -206 227 665 923
2656 923 653 255 -12 -403 -703 -495 180 288 334 437 111 -383 -593 -242 -405 -41 182 612 672 468 5
2677 5 -89 -585 -638 -448 16 181 472 454 33 -442 -530 -486 -303 26 340 536 377 424 32 -151 -282 -263 61
2700 61 158 439 581 342 -10 -222 -452 -310 -382 48 408 549 137 278 -43 -559 -509 -124 42 350 476
2721 476 265 522 -52 -451 -618 -518 -308 612 431 267 471 -203 -353 -372 -33 36 -149 266 402 333 159
2742 159 -480 -284 -373 -334 145 208 385 206 137 -143 -513 -389 -462 60 211 279 752 438 -12 -509 -327 -175
2764 -175 -281 29 274 314 395 -26 -658 -539 -479 -298 -3 141 405 319 65 -60 -415 -592 -354 -278 151 194
2786 194 114 46 9 -325 -713 -640 -28 133 287 433 203 122 -78 -167 -518 -210 -66 242 521 499 8 -71 -538
2809e38J45L17q2O44J05l41N2j65o52M40K77l18L91J75p7k80k21l47J43j25K48
2830b09O67l68M03k32o2k69m69L38J91J6J04K67J08k20j89l04k99J07M87O5J92
2851C24Q4k24k90l33J82N4J19M22J52J14k9n88J06o25n1P19m01L08N29k85j28
2872A59o57L20j49j12K83M66J9n5K51l63l67j47M1J24O13q7J02j15l12j33l86
2893e05Q2N0L74J30K59j05N6j62n79k8L64K37J14J12P2m27q2j08k37J19P4J21
2915f9M80k6l42o0j21j03j33K26L97J6M15k34n9k26l37l21K14L10j10L23k26k08
2937a94k59N2Q2Q5J95m0N44j46k9n4j7l47j66N7M53r4l56L50j31M1n03R8J5O53
2961B89n0J70J25m27J10k01m69L71j73M62K14m29J53o25p7J76j84M38L14j3N48
$$ plain form
2809 -538 -393 -76 -158 486 591 250 302 137 -515 -75 202 -116 275 450 373 93 -128 -475 -332 -457 -209
2830 -209 458 90 493 261 199 -70 -539 -201 -10 6 110 377 485 265 76 -228 -527 -420 67 132 324
2851 324 408 184 -106 -439 -257 -203 -84 338 490 604 575 -13 93 -532 -583 136 -265 43 572 287 159
2872 159 -498 -178 -327 -439 -156 310 329 274 525 162 -205 -352 -311 -187 426 339 441 326 14 -119 -505
2893 -505 -423 -373 1 131 390 285 341 179 -400 -428 -64 173 287 399 471 44 -38 -146 -383 -264 -190 -69
2915 -69 411 385 43 -17 -138 -241 -374 -148 249 265 680 446 387 161 -176 -497 -283 27 -83 240 14 -194
2937 -194 -453 -401 -319 -234 -39 -79 465 319 290 236 219 -128 -294 -237 216 122 -234 116 -15 26 -477 -379 -364 289
2961 289 239 409 534 107 217 16 -453 -82 -255 207 421 -8 145 -480 -557 -381 -565 -127 187 174 722
2982G22j43k06k30k83j01K14j18K39Q9j63K61m21m06R2K38L0Q7L73J57l4k26m
3004A67l53L2k01L02O04k2k51j95l03l91K03r0K76J2M03j49J76k12j7j97P7J43
3026A4q9O91o9l42o4l84o4l97L43K36L46M0N3j40k57j82J11L37k12J83M00j08
3048D46k87j18k89j24J29Q1N5J07Q9N4l27J03j61J29pJ76J56N48m02n1j63j52
3070hl20J29P6O4K22l06k7q7K6k8K04K17J27O4K89n54J42j85j20l24M41j57J56
3093D1k1mj47l42o6L28J51j04K65K43K43j33j13l99K16j71J91J04J8k54l64M1
3115b77P3l29K79k53O34J25p9J73k92n5j36J99j70K43MJ27J65m05l77j86K54k5
3137c08J99m7K51J0K25k36r4o9J30k64K85Q6M3L5p8j97k04k71L13j5k8K11R0r6
$$ plain form
2982 722 579 373 143 -140 -241 -27 -145 94 183 20 281 -140 -546 -454 -216 -186 -99 274 431 397 171 167
3004 167 -186 -154 -355 -53 551 529 278 83 -220 -611 -408 -498 -222 -210 193 44 220 8 -9 -206 -129 14
3026 14 -75 616 547 205 141 -243 -307 -704 -361 -125 221 261 314 174 -83 -265 -154 183 -29 154 554 446
3048 446 159 41 -248 -372 -243 -162 -107 0 89 143 -184 -81 -242 -113 -120 56 212 760 358 307 144 -8
3070 -8 -328 -199 -123 -59 163 -143 -170 -257 -231 -259 -55 162 289 353 642 88 230 45 -75 -399 42 -115 41
3093 41 20 16 -131 -473 -539 -211 -60 -164 101 344 587 454 341 -58 158 -13 178 282 300 46 -318 -277
3115 -277 -204 -533 -254 -507 127 252 173 346 54 -1 -137 62 -108 135 139 266 431 26 -351 -537 -283 -308
3137 -308 -109 -156 95 105 330 94 0 -69 61 -203 82 168 211 246 168 -29 -233 -504 -191 -206 -234 -23 67 -29
3161b9j69J76j19L4N32l92N14j48o8l39M8n50K7K67j68N52J5O7n42R4l61K10L03
3184d6L25M3J18j12Lk37j34r6nl1J08K19k74M01n18O9l50J65L06N25M1J5o9k55
3208B11k40p0k19K70L53k44K89n7m61k16j75L97k8K83K11m7O4K0l08N0j83k57
3230c57j31M76J76kJ1j17k65l04N0L63R4O4K36K28n90J38k13L33m25L54K59k92
3252H6m3ok55l9k46L3O2N11M5N26p73L24p7l63J85j74M38q8l9L60o31l5j46q3
3276d28q5M06N9L32K90k97p5j46nl01Q6J68M37k02k78q4J2j6k75Kr3O64m8K69
3300C92l2l81K28q9j25K24K16p4j64j21k82l95L02k37K80J42K67K29L1j98q6k49
3322a22J53j33J31J77J35j84J60l75j96j22p3q8M03L01J18j48r7k48J03l8L3N53
$$ plain form
3161 -29 -198 -22 -141 -107 425 33 547 399 331 -8 40 -510 -483 -216 -384 168 183 250 -292 -198 -559 -349 -46
3184 -46 279 322 440 328 331 94 -40 -136 -141 -172 -64 155 -119 282 -236 -167 -517 -352 -46 479 520 535 466 211
3208 211 -29 -99 -318 -48 305 61 350 293 -168 -384 -559 -162 -190 93 304 257 321 341 33 83 -100 -357
3230 -357 -488 -12 164 162 173 56 -209 -513 -463 -100 -6 58 294 522 -68 70 -143 190 -235 119 378 86
3252 86 43 37 -218 -257 -503 -470 -408 103 148 674 -99 225 148 -215 -30 -204 234 146 107 467 -164 -199 -345 -428
3276 -428 -513 -107 -48 284 574 277 202 56 51 -250 -164 4 441 239 -39 -123 -111 -127 -402 -400 -493 171 123 392
3300 392 360 -21 207 118 -7 217 433 359 195 74 -208 -603 -301 -538 -258 -116 151 380 411 213 127 -122
3322 -122 31 -102 29 206 341 157 317 -58 -254 -376 -449 -537 -134 167 285 137 40 -208 -105 -143 -110 443
3344D43j63p2K41l32m99Km9lL86n5M12Km40m2K32j69r5J73K10P7J37k92j43j63
3368b02k95k83L95Q0L36K04o0j9j31j39k4M43m2rK08q1J17n22k89Lj19J28P0K04
3392b7j51M74l38m27N1K38k32M90L36L77l20j90m87p4J49j15J4M19p5m0j79R7
3414a0l14J61p1K94L5K42p8J19k52m8k02pr4j07K76j2L66l06k54l06M02J6J39
3437a1J42K53J26j3j85l87k79QK37J10r7O4K07j21m28k4O5N8K89L31N3j28p1J43
3461C42l98k24K64J17k04L2K12j9j45k05j11k40L26J96L87r3m5NJ31l75M4j0K22
3484B09k20K54j15l2j88L2m28M5J72K69L2K90K29k87l12Q6j15mN60j82J01j10
3506B86k97J60n23M5k28M32O1K30j71j29L21j74j30j44M06j7K54j80O1m25M0j65
$$ plain form
3344 443 280 208 449 117 -382 -380 -429 -432 -46 -101 311 313 -127 -169 63 -106 -201 -28 182 259 396 104 -39 -202
3368 -202 -497 -780 -385 -305 31 235 175 156 25 -114 -138 305 263 254 462 381 498 -24 -313 -310 -429 -301 -231 -27
3392 -27 -178 296 -42 -469 -418 -180 -412 78 414 791 471 281 -206 -280 -131 -246 -232 187 112 72 -107 -10
3414 -10 -324 -163 -234 60 95 337 259 378 126 78 -124 -131 -225 -332 -56 -68 298 -8 -262 -568 -166 -150 -11
3437 -11 131 384 510 497 312 -75 -354 -346 -109 1 -96 -32 175 54 -374 -398 -333 -275 14 345 398 270 199 342
3461 342 -56 -280 -16 101 -103 -71 141 122 -23 -228 -339 -579 -253 -57 330 237 192 197 328 -47 -3 -13 209
3484 209 -11 243 128 96 -92 -60 -488 -443 -271 -2 30 320 549 262 -50 36 -79 -83 477 295 396 286
3506 286 -11 149 -374 -329 -557 -125 -64 166 -5 -134 187 13 -117 -261 145 128 382 202 263 -162 -122 -287
3528b87kn3O4L17m3k69L40k56J69j76K19J53k23N60k0l61l02l18O2j16J13K72
3550a57K44l3J41k68j46J1M1N9L56o2J63Q2l05j72k75k2J02Q3J4Q9K95r1J13l39
3574g7k16O8M62n9K98r7j82lj39n18P0LK43K80j67J64m77L40J6N4l14M55l5j08
3598F1L06K83k68l81k14J77N4j49L6L89m89J48j04m90O42LJ61M2L16Q2k73j72
3620A60m14J67j75nN44j36j60p1p7n0r2K22n0N25l05J51J4k19J05l73q2L01k7
3643d7N89n51K59m15J26r1N5j21PK34L01l34P3L3P1l10K06P3r2k7J7j5r5q7n4
3668a95K8j6M9J00K64j82l0K7l28J10J30J6J94J64m04L12n93K46k04J14K70l22
3690b50K81L62k87j55K7j09O1k52N69K19k99J3j83j07r6j03K00k38M01j2M24j60
$$ plain form
3528 -287 -289 -342 -278 39 -4 -273 67 -189 -20 -196 23 176 -47 513 493 132 -170 -488 -426 -542 -429 -157
3550 -157 87 54 195 -73 -219 -208 -167 -108 248 186 349 431 126 -46 -321 -343 -241 -158 -144 -55 240 149 262 -77
3574 -77 -293 -225 237 178 476 379 197 194 55 -463 -393 -390 -147 133 -34 130 -347 -7 9 63 -251 204 169 61
3598 61 367 650 382 1 -213 -36 18 -131 -95 294 -195 -47 -151 -641 1 4 165 207 523 605 332 160
3620 160 -254 -87 -262 -267 277 141 -19 -90 -167 -217 -309 -87 -137 388 83 234 248 29 134 -239 -321 -20 -47
3643 -47 542 -9 250 -165 -39 -130 -75 -196 -189 45 346 12 85 118 189 -121 85 158 66 39 56 41 -54 -141 -195
3668 -195 -167 -183 -134 -34 230 48 18 45 -283 -173 -43 -27 167 331 -73 239 -354 -108 -312 -198 72 -250
3690 -250 31 393 106 -49 -22 -131 -70 -322 247 466 167 180 -3 -110 -206 -309 -109 -347 54 42 466 306
3712C06o41J43k5J09k07N39j86K22K16l99l57J56l07p3L21M45k23l7R0l32J60
3733h0j26o2L36L31k90L34k56l04J10k85OL07j46K33k47K90L9l99Kj20K55K97
3755B25k33K5M18l21j18J36m48L5J25K24o4K63J18j57m84j24mJ77M63J91j68J98
3777D77m28O2m43J11K4K00K92Q5m30Q3j27j56k57J28L03J0M66J38k99j96p7j17
3799a51k64L16K07P9M0m7k94k77L97k03J84R7J66Q0K06l53R5j13m14j8J80j68
3821b55M57l78J79l15Q2m22M38Q7K17N26j83J27l61L4k84l6j08J58N1J06J20m78
3843b38K2j17R5j86L35L00K85K2n53K18o3l5j51o5J99J83r9P6l88k55r3p7L56
3866b29J40L86o7L12k35k15L9l55m2N95j91J3m7k58L1m62J28LJ89M83jJ80J75
$$ plain form
3712 306 -335 -192 -217 -108 -315 224 38 260 476 77 -280 -124 -431 -504 -183 262 39 2 92 -240 -80
3733 -80 -206 -268 68 399 109 443 187 -117 -7 -292 -286 21 -125 108 -139 151 190 -209 -207 -327 -72 225
3755 225 -8 17 435 114 -4 132 -316 -281 -156 68 4 267 385 228 -256 -380 -384 -207 256 447 279 477
3777 477 49 111 -332 -221 -197 3 295 380 -50 33 -94 -250 -507 -379 -76 -66 400 538 239 43 -34 -151
3799 -151 -415 -99 108 187 227 180 -114 -391 6 -197 -13 84 250 330 536 183 278 165 -249 -267 -87 -255
3821 -255 202 -176 3 -312 -230 -652 -214 -127 90 616 433 560 199 233 -51 -87 -195 -37 14 120 240 -238
3843 -238 -216 -333 -238 -424 -89 211 496 518 -35 183 120 85 -66 -131 68 251 152 228 -160 -415 -508 -585 -229
3866 -229 -89 297 230 542 307 92 131 -224 -266 329 138 151 104 -154 -123 -585 -457 -454 -265 218 217 397 572
3889E72j45m04O5k4j33O2LN12j84j44m51k30j35l5O03Q0p6L31J2l46J92k37N3
3912e9M24k12J54M13o47m0m53j08J18K3nL64J76l1M3q6k84J81%K01L6M17J07n93
3936A39J00n73Q1k78J08J84L80J46j25l1J2k25QJ15L40j52K96j75K2l73k61J3
3958b49n47M55K36K40l7L6k56l5j5M7qJ92O44n1k12k65j62j33l7J4q5N2J42O9
3982C5K12l49n03L01j00N11L05J1K37k17k05k41j24j62J55qo8K29L6k53R9l78
4004d77j15N72N4K68J21L08l01m6l2k71k87R8MK21n5k01J38m34J9J08R8J13N75
4027D78k65K98j30j67j61j06Qj24P5L58k37l15K3j68Q1l3l2M67q9M74j15kk08
4050A10o6R4k37K67m4J36J22m31q3m12P3o9K98N45n0K03R9l18J44k22k40J19J03
$$ plain form
3889 572 427 23 88 64 -69 -7 -4 508 324 180 -271 -501 -636 -671 -68 12 -64 267 279 -67 125 -112 -59
3912 -59 365 153 307 720 73 33 -420 -528 -410 -387 -392 -28 148 117 160 74 -210 -29 -29 172 208 625 732 139
3936 139 239 -334 -253 -531 -423 -239 141 287 162 131 143 -82 -74 41 381 229 525 350 372 -1 -262 -249
3958 -249 -796 -341 -105 135 98 134 -122 -157 -172 -125 -133 59 703 652 440 175 13 -120 -157 -143 -228 -176 -34 35
3982 35 247 -102 -605 -304 -404 107 412 423 660 443 238 -3 -127 -289 -134 -142 -210 19 55 -198 -99 -477
4004 -477 -592 -20 34 302 423 731 430 384 352 81 -206 -108 -104 117 62 -139 -1 -435 -416 -308 -210 -97 478
4027 478 213 511 381 214 53 -53 -45 -169 -94 264 27 -288 -265 -433 -352 -385 -417 50 -39 435 320 318 110
4050 110 44 138 -99 168 124 260 382 -49 -132 -544 -471 -540 -242 303 253 456 555 237 381 159 -81 38 141
4073A41Q2J04l20m76J60J9NN6l0L61Q6K36k90k23J44k79L92kOK52j57O5o40J64
4097a44j88k8J43k18N78J11k29J65j80j34O4K70J14j57J67j81j5k96r1k35J00
4118c84q1K39K99M50k41J68p17L75k28M08J67l50K10l57K14n15n2p3r4J83L73
4139fq1J29K96k13q0k17J90J76N0J45j49q6l55j52J32k56j54M83N7J85q8K49K48
4162E03m44m63O18J34L3J39l27n5j59o01P2K81k4J37M9N02k18l23Q3N8k10M54
4184B39K50j51J01m8l11j31r8m39J67K49M04k10P8j82p3R8P1p3M26n6lQ5%k67
4208A26L4l62k19J74J06L05k24J87o2k06m2o2J93M2L47N7K35q7n48qk02p7J13
4231a80L31%k66L9j08O8j43j43J46M97K24j96K34l28J50o94J09k23J33L03O9m0
$$ plain form
4073 141 223 327 7 -469 -309 -290 -285 -229 -259 102 188 424 134 -89 55 -224 168 166 172 424 267 332 -308 -144
4097 -144 -332 -360 -217 -435 143 254 25 190 10 -124 -60 210 324 167 334 153 138 -158 -249 -484 -384
4118 -384 -465 -226 73 523 282 450 -267 108 -120 288 455 105 315 -42 172 -343 -395 -468 -562 -379 -6
4139 -6 -87 42 338 125 45 -172 18 194 244 389 240 154 -201 -353 -221 -477 -631 -148 -91 94 6 255 503
4162 503 59 -404 214 348 381 520 193 138 -21 -622 -550 -269 -293 -156 -107 395 177 -146 -63 -5 -215 239
4184 239 489 338 439 391 80 -51 -149 -588 -421 -172 232 22 100 -82 -155 -57 14 -59 367 311 308 393 393 126
4208 126 160 -202 -421 -247 -141 164 -60 127 65 -141 -183 -245 -52 -10 337 394 629 542 -6 -14 -216 -293 -180
4231 -180 151 151 -115 -76 -184 -116 -259 -402 -256 241 465 269 503 175 325 -369 -260 -483 -350 -47 22 -18
4253a8q4N5j48L6j36K65J14J59L35j82m65J06l36K65q6J08K6J24l0l37L02l45
4275b72j02L47j1N31n6p3k73L42m81l93M92l32M69Pj29J58k69k90Q7j79J2M88
4297G3L15R2J03m93r4r4J2j91K06l2O03l88l5l53J44k25k05N16J03K26r4Q2j71
4320A00j5o5n43N97J50%j00k33l4l1j49k90J50K91J20J90L03m35J82j97K3qJ90
4343A96k09L41j96P2k36j52j14n0Kk9M38L88l06j0j49m7l38M75j56J90Q7J55r1
4366B61k86q3k47N9J48mJ50K21l5j64K94k97m67K00K94J84P7kQ0o11k51R4M36
4389E1k88K51O66n93L7j68J4j86L4L4L60P3J05R9p1l36j41j64J38K84k52PK50
4412B04j59q5k11j16j64M98N4l6K86J17m99o0OJ76j01M3L94k07K6k2J2n25K17
$$ plain form
4253 -18 -102 -47 -195 -159 -295 -30 84 243 578 396 -69 37 -299 -34 -120 -12 14 138 108 -229 73 -272
4275 -272 -374 -27 -38 493 437 364 91 433 -48 -441 51 -281 188 195 66 224 -45 -335 -248 -427 -415 73
4297 73 388 480 583 90 -4 -98 -86 -277 -71 -103 500 112 77 -276 -132 -357 -562 -46 57 283 189 271 100
4320 100 85 20 -523 74 224 224 124 -109 -143 -174 -323 -613 -463 -172 -52 138 441 6 188 -9 14 6 196
4343 196 -13 328 132 204 -32 -184 -298 -348 -346 -375 63 451 145 135 -14 -61 -399 76 -80 110 197 352 261
4366 261 -25 -108 -355 -296 -148 -152 -2 219 184 20 314 17 -450 -250 44 228 305 303 383 -228 -479 -385 51
4389 51 -237 14 680 87 124 -44 -30 -216 -182 -148 212 285 390 489 418 82 -59 -223 -85 199 -53 -46 204
4412 204 45 -40 -251 -367 -531 -33 21 -15 271 388 -111 -171 -165 11 -90 -47 347 140 166 144 156 -369 -152
4435a52l0J73J4L9j59J61p4p4K0j07j04L95J91l56J51O8m75K44m81L74J37J76
4457A31M9k1n2j20j92k43K63J05JN41r3m27j27j08k4L9J92K35nK60m5n44L37l50
4481a98K09l66M63R3J51o7P0k49l65lj39M46k10J59o9K01L1m77L3K86O8J1L43
4504D21j00l7L7n04K20k65l73K73M24r4K06k57L9j1p5Q9JL97j58j6l68p7Q9l38
4528d77K42J09J57j3o0K88j92q4o9j83J98j22M41L51k03K06n88L4j10k2R4l61
4550c64K44J45j78J10m72M39k0J12nK58q2K18j00q6k10m18J86k9L75j8l46J77
4572f4L8k77P9l3L67j22L08k97K9o7O7k88K47j18L20L6M9Lqj22l64K07j65J04
4596g1J49L45n70O27m63j87k0j02K16K64j44M5j00j23j58K06Q8j53L62p7J63n07
$$ plain form
4435 -152 -182 -9 5 44 -115 46 -28 -102 -82 -189 -293 102 293 -63 88 156 -319 -75 -556 -182 -45 131
4457 131 180 159 107 -13 -205 -448 -185 -80 -79 462 369 -58 -185 -293 -317 -278 -86 149 144 404 359 -185 152 -198
4481 -198 11 -355 108 201 352 285 355 106 -259 -262 -401 45 -165 -6 -75 126 157 -320 -287 -1 67 78 421
4504 421 321 284 321 -183 37 -228 -601 -328 96 2 208 -49 -10 -21 -96 -7 -6 391 233 217 -151 -228 -139 -477
4528 -477 -235 -126 31 18 -42 246 54 -30 -99 -282 -84 -206 235 586 383 589 1 35 -75 -97 -3 -364
4550 -364 -120 25 -153 -43 -515 -76 -96 16 11 269 187 405 305 219 9 -409 -223 -252 123 105 -241 -64
4572 -64 -26 -303 -224 -257 110 -12 296 -1 28 -39 28 -260 -13 -131 189 225 274 277 269 147 -217 -10 -175 -71
4596 -71 78 423 -147 480 17 -170 -190 -292 -76 188 44 89 -11 -134 -292 -86 2 -151 211 134 297 -210
4618b10L21J8Jk55K04m03N15k24K39n9K5m84K84J19k54M41j21J7J72r2l65N1j82
4641b42k66J79M37oj47r8J14N1m34K79R3L8K69J06m0R7l39J9n67L98n8M4oL9j
4666d1m60k4L62L65k37K46kn8L13j91Q4m11j74k4K93J02Ql53K65k44rL01j26J1
4690dJ47J14P4M6k06N1l08O9m7K07J06k71j24k0Q5k74m5K47M2L36n0M9K18l89
4714E3K34n7k67J44k37J67J96k32n39J05L09J92j72l1K66J36J2J0m2k65N5k48
4736b11K78l7rn4k0k50K8p3K03J5o2M28Lj5q9m3k78j78K04K79l3k62R5p1o0k61
4762d73o5K06K72q5K68p9J47n8n2j61J29K13r9O2k76K73k35l11j91J30KJ84J82
4785a7L79n7k31k9j52QQ2K01L12j4l52k71M7l84j8M61l34L77K85Q6r0k64J73k37
$$ plain form
4618 -210 111 129 130 -125 79 -324 191 -33 206 147 172 -312 -28 91 -163 278 157 174 346 254 -111 -60 -242
4641 -242 -508 -329 108 102 -45 -143 -29 22 -412 -133 -40 -2 267 373 333 430 91 110 -457 -59 -117 -73 -79 -40 -41
4666 -41 -501 -525 -163 202 -35 211 209 151 464 273 357 -54 -228 -252 41 143 151 -202 63 -181 -190 111 -15 -4
4690 -4 143 257 331 377 171 222 -86 -17 -64 143 249 -22 -146 -166 -81 -355 -400 -153 -111 225 175 224 442 53
4714 53 287 230 -37 107 -130 37 233 1 -538 -433 -124 68 -104 -135 131 267 279 289 247 -18 37 -211
4736 -211 67 30 21 -33 -53 -303 -275 -348 -145 -130 -192 236 239 224 135 92 -186 -364 -160 119 86 -176 -81 -152 -212 -473
4762 -473 -538 -332 -60 -145 123 44 191 133 81 -80 49 262 163 225 -51 222 -13 -324 -515 -385 -383 -199 -17
4785 -17 362 305 74 45 -107 -99 -17 184 496 482 130 -141 -94 -478 -496 -35 -369 8 293 379 289 25 198 -39
4809c9k51J58K88K72k82O2j15k44J67n3P8k50K18n0J43k19J41K61m07M76l17J82
4831B19k9j3j46L6J52k64j05l65L03L77k29R2M6J49o43L35M08k64L40k55o1L26
4853D09j56l09K4r7P1J2j53L97k10J97n06K27j06J41p1K28l25M94m93J93l15J85
4875a63L3R5K75j07K68l19J84l56J1k12L17j03K53K77k56j43l31j36L00q8J71
4896c0Q7J87k53R1j15j93K46j24j61K96j17J30n2R0j93l17J10L18J07NK83m06
4918a1O1j56K60k12J55j72M4K66l63R5q6k04M0K18k68K13K55j42J98r9nk65r1
4941b69L14K87l21P8R3k83L4j37M6k4J82o9O8K65l06J42N9j99k07L68k22J95R3
4964A87r2j70k09K03j10k43K20K42r7J08N3P6L1n6j57P1J65k46P0r4j04j11K48
$$ plain form
4809 -39 -290 -132 156 428 146 208 93 -151 16 -37 41 -209 9 -41 102 -117 24 285 -122 354 37 219
4831 219 190 177 31 67 219 -45 -150 -515 -212 165 -64 28 74 223 -420 -85 323 59 399 144 83 409
4853 409 253 -56 -32 -129 -58 -46 -199 198 -12 185 -321 -94 -200 -59 -130 98 -227 267 -226 -33 -348 -163
4875 -163 -130 -35 240 133 401 82 266 -90 -79 -291 26 -77 176 453 197 54 -277 -413 -113 -201 -30
4896 -30 57 244 -9 82 -33 -226 20 -104 -265 31 -86 44 -8 82 -111 -428 -318 0 107 112 395 -11
4918 -11 50 -106 154 -58 97 -75 -31 235 -128 -33 -119 -323 -283 -65 -333 -120 135 -7 191 92 87 -178 -269
4941 -269 45 332 11 89 182 -101 -67 -204 -158 -182 0 -69 -1 264 -42 100 159 -40 -247 121 -101 94 187
4964 187 95 -75 -284 -81 -191 -434 -214 28 -69 39 92 168 199 143 -14 57 222 -24 46 -48 -152 -263 -15
4987a5j86K7J35P9K33l03k30J79J68k7l14L32l5J44q8j02jK11l37M2M04j50m5
5010A21p2K38m01K08k39j52M73l25K17k6j06J66m4j87O3j18L76o6j23L49l26j12
5032h6r0rJ95j49J91K25j68Lm3j87K66j13K1l11L27m9L3J64n4q4r3o6K65l19K67
5057A36j08r9M3k86J76q5L16j64J23J99k44j43L41j26l25M22O0n4q5j0J10k25
5079b8q4J55j43j21J78J71K22m03nj54K14j34rjJ40j02J59r8j75M8j37J33J83
5102Ij81J80J39J55Ok25nl41L60j84J47R2%k33o3j73L40R5j31J63j32m4R2k09
5126a43J13k2Qm0K03J8j57M5m34L11j97L53O3r6K05l36L46K42m11j2k74K28J13
5149A26L4k32R0r5Q3m62J56J51K76q9k3P4K87l90j05J31K01j18L20K4j60k07k3
$$ plain form
4987 -15 -201 -174 -39 40 273 -30 -260 -81 87 60 -254 78 43 187 99 -3 -4 207 -130 -88 316 166 121
5010 121 49 287 -114 94 -145 -297 176 -149 68 42 -64 102 58 -129 -66 -184 192 126 3 352 26 -86
5032 -86 -176 -185 10 -139 52 277 109 112 69 -118 148 35 56 -255 72 23 56 220 166 82 -11 -77 188 -131 136
5057 136 28 -71 -28 -314 -138 -223 93 -71 52 251 7 -136 205 79 -246 176 236 182 97 87 197 -28
5079 -28 -112 43 -100 -221 -43 128 350 -53 -58 -212 2 -132 -141 -142 -2 -104 55 -43 -218 -170 -307 -174 9
5102 9 -172 8 147 302 308 83 78 -263 97 -87 60 152 152 -81 -144 -317 23 118 -13 150 18 -26 66 -143
5126 -143 -30 -52 -44 -84 119 137 -20 25 -409 -98 -295 58 121 25 230 -106 240 482 71 59 -215 13 126
5149 126 160 -72 18 -77 6 -456 -300 -149 127 38 15 89 376 -14 -119 12 213 95 415 439 279 72 49
5172D9jr8j49j36J82J43J9n2K97k01Q5k98j40M47J66m27J66J54k04M6j51o4r6
5195b63L3M1J24K48j64L08n32N15k40k03M26k91J25l7j21J13l51K39P5l98L73
5216B0J00N5j29N6Mj76J58j69L15l35J29J32k87L22l75j9K25oj85j3M49j07j04
5239F0j05R7j36N4L1P0j19J24m0mK1Rn21L31K16M1J76l44J38j11j95M74j17j3
5263A37j1j00k38L06j03l20J76J23L9J23j91P0K71l82J5L55J1l94M42j05l52J29
5285AK05k01k95K7L10k84K92M1O9j45K87n43K12K77rP6j33j88j95L56j18m25J58
5308b25M28k09k1P0j71J97j79J39kR0J57j63j09k69L28l98L33j31J25L6j68M85
5330C43m50K13k48Q4K6l57K96M39j3l90n1Q7j47Q6J6L85m4p1Q5p4l80R9k80J14
$$ plain form
5172 49 48 -50 -199 -335 -153 -10 9 -43 254 53 138 -160 -300 147 313 -114 52 206 2 48 -103 -167 -263
5195 -263 -230 -189 -65 183 19 327 -205 310 70 -133 293 2 127 90 -31 82 -269 -30 45 -353 20
5216 20 120 175 46 102 106 -70 88 -81 234 -101 28 160 -127 195 -180 -199 26 20 -165 -178 271 164 60
5239 60 -45 52 -84 -30 1 71 -48 76 36 32 53 62 -459 -128 88 129 305 -39 99 -12 -207 267 150 137
5263 137 126 26 -212 94 -9 -329 -153 -30 9 132 -59 11 282 -100 -85 270 281 -113 329 224 -128 1
5285 1 206 5 -290 -263 47 -237 55 96 165 20 307 -236 -24 253 244 320 187 -1 -196 160 42 -383 -225
5308 -225 203 -6 -27 43 -128 69 -110 29 27 117 274 111 2 -267 61 -337 -4 -135 -10 26 -142 343
5330 343 -107 106 -142 -58 -32 -389 -93 346 333 -57 -108 -21 -168 -82 -66 319 275 204 289 215 -165 -66 -346 -232
5354b32K24K06k65L11j14j69J64j32J58m05K07J37J33j65j84l4J47j53L53k77
5374i0k38N36m09J28n2L2M7o9J13K72j39J99k54J09l97J62R0j13M55l33N7j85
5396g9J03m9o5k5J9K4K39N2j92L6J11j43lJ56j14n9J16O6l65J99k68J40l6K34
5420I7N1j58J85j20N6k04L8N8K69q4q6J04k01k08J17j14L41j05m69M26J96j83
5442FK00m0k18m0J51n6Q9m8j08OK01N6k19j89K03Q7o0K80l09K41O2l37R4j47K67
5467A72m0j24K79j84Nk21j81J28L0J31J29k82M71k67N0J56j95O3n7K71j61k96
5489a23K99k33j69J99j62o8L07j07J25k0j03J36J30k05j06L87k37p7o2J20p9j24
5511a72O3J83j75N0jp3Q0O7l54M36j12o6J15K08r2k01q4j18J54J04j32k01J13
$$ plain form
5354 -232 -8 198 -67 244 130 -39 125 -7 151 -254 -47 90 223 58 -126 -160 -13 -166 187 -90
5374 -90 -328 208 -201 -73 -125 -93 -46 -115 -2 270 131 330 76 185 -212 -50 40 -73 382 49 106 -79
5396 -79 24 -25 -90 -115 -96 -72 167 219 27 63 174 31 28 184 70 11 127 193 -172 27 -241 -101 -137 97
5420 97 148 -10 175 55 111 -93 -55 3 272 188 102 206 5 -203 -86 -200 141 36 -433 -7 189 6
5442 6 206 166 -52 -92 59 3 92 44 -64 -58 143 199 -20 -209 -6 81 21 301 -8 233 295 -42 52 -95 172
5467 172 132 8 287 103 108 -113 -294 -166 -136 -5 124 -158 313 46 96 252 57 120 63 334 173 -123
5489 -123 176 -57 -226 -27 -189 -257 50 -57 68 48 -55 81 211 6 -100 287 50 -27 -89 31 -48 -172
5511 -172 -109 74 -101 -51 -52 -125 -45 22 -332 104 -8 -74 41 249 157 -44 -128 -246 -92 12 -120 -321 -208
5534b08J82j52K59m59N69p0j07j2J60J45p9J70m08K4k24r8K21j96K30Q8j28K17
5556A24j51O3J43k50K74K1l66M04j63l2J6Rl79K69j09j7P6J8K10o4k68L82J1k66
5580d5J58l19K76j46j2r5m5J85J72j38P1O0j28J00R4k5q2j96oK64r5K06k75J96
5604A75l49k5J9M13k90K26l88L74k48J21k49J70J13P6l8N9q8j01J89j99p9mJ32
5627IO0P9k26o4L05k40N2o0N1J86j67J30K9j30k6jl64N54m19L51j58j18K67k75
5651a75K45J31p8J17k50j9R9K92n02O9K00q3l18K56O5N7J2j13j52j78K58l0qk47
5675c52K50Q0j75N17k62r2K14k09K42l36n8L11k42P6k32Q7rK21K09k81m4J24k43
5698b04M8J01M4J00L57l69p7m5p6p1L4R3NP3L4j25j44K56k50K37k38K35O8J10
$$ plain form
5534 -208 -26 -178 81 -378 191 121 14 2 162 307 228 398 -10 14 -210 -308 -87 -283 -53 35 -93 124
5556 124 -27 36 179 -71 203 224 -142 262 99 67 83 92 -287 -18 -127 -144 -68 -50 160 96 -172 210 221 -45
5580 -45 113 -206 70 -76 -88 -183 -228 -43 129 -9 62 122 -6 94 188 163 81 -115 -121 143 48 254 -21 175
5604 175 -174 -199 -180 233 -57 169 -219 155 -93 28 -221 -51 62 138 100 159 71 -30 159 -40 -119 -123 9
5627 9 69 148 -78 -142 163 -77 -25 -85 -34 152 -15 115 144 14 -12 -13 -377 177 -242 109 -49 -167 100 -175
5651 -175 70 201 123 240 -10 -29 70 362 -140 -71 129 46 -272 -16 49 106 118 5 -147 -325 -67 -97 -105 -352
5675 -352 -102 -22 -197 320 58 -34 180 -29 213 -123 -181 130 -112 -36 -268 -181 -190 31 240 -41 -85 39 -204
5698 -204 -156 -55 -11 89 446 77 0 -45 -121 -192 -158 -65 -60 13 47 -78 -222 34 -216 21 -217 18 86 196
5722A96r2L3j03j85O1K16m6k13J9%K3J81k78j54M40R5M3j7O6k37l0o9J24l01M74
5747B46j53k16R2J04k63k7J02m6P8J57o0j57m7L79j26j64P6P5n0K50k04J1M3m85
5771c85O35k97Q8j83K79k20J90J40l0N4m28j37J28N70k25p7m5K9k93p0K58J8j68
5794a69J30K55j63r7Q4L1P9L10l00K5l8r8l1K91k61j93nJ31p2l4K38k23K56j61
5818a5J33J58p1k34J52N0j4J18j38l30J6J38k0M3o3o3J25K15k15j24j03M62q6
5841A34Q0M2j10k60m6N8L68q5k20J8k15K04mj3K9k99L84J5k69K92J47k41J07k1
5865I5j63mj7n7R7q9p6K97J50n15M09p8j21L02M5k57J56Q9k03J50k38J20k57M3
5889a22J36k58J09L36j17j87j65K78J34j18J06J06k13L13k84M3j46n5r8L01k5
$$ plain form
5722 196 104 137 34 -151 -90 126 80 -133 -114 -114 -91 90 -188 -342 98 193 236 219 285 48 18 -51 73 -228 246
5747 246 93 -123 -31 73 -190 -217 -115 -161 -83 74 14 -143 -190 189 63 -101 -25 50 0 250 46 57 100 -385
5771 -385 250 -47 41 -142 137 -83 107 247 217 271 -157 -294 -166 404 179 102 57 86 -207 -277 -19 -1 -169
5794 -169 -39 216 53 -44 40 71 150 460 160 185 147 49 18 309 48 -145 -150 -19 -91 -125 113 -110 146 -15
5818 -15 118 276 205 -29 123 173 159 277 139 -191 -175 -37 -57 -14 -77 -140 -15 200 -15 -139 -242 220 134
5841 134 214 256 146 -114 -160 -102 266 181 -39 -21 -236 -32 -36 -49 -20 -319 65 80 -189 103 250 9 116 95
5865 95 -68 -72 -89 -146 -49 -138 -214 83 233 -282 127 49 -72 230 275 18 174 263 60 210 -28 92 -165 -122
5889 -122 14 -244 -135 201 84 -103 -268 10 144 26 132 238 25 338 54 97 -49 -104 -202 99 74
5910G4l19j9L57n1Q3j16O6M3N7k3r7l26K38k8K86M0J35m71j47J59P8k39j86L01
5934a05K21N5l1j77J06L6J1lN1k10pQ2P0l68K58j94K54l0k91J46K02m3M9l23K84
5959D3j28j88L56k18K00k17K36%M3n3k88R7P3j57P3P5K54q8m24L01j63M8rJ84
5983E0J8r1K2p4L0K24k57r3L0R5L04k49l17J21J64K12K61n06l1L08n4o5m5j64
6007a07K55l94J85p6JM46n01o7J03j13J39J07K50j72mK37l87j8J77O9J13k36j8
6030a1N7j56J37r7o5j34p8L44J67j8r8J36k53J70Q5k87J44K2o6L59k25J17o10
6053c60J95K39l01L82j67j2l16L99l01J76J82K6l45J89M6j51L24m18l3L37o4j61
6075a34P6j73o6L30j49K62n1k93K07J53R5l93k2K76k15n0N7k98M54k26K95k96
$$ plain form
5910 74 -245 -264 93 42 125 9 75 118 175 152 55 -271 -33 -61 225 265 400 -71 -218 -59 19 -220 -406 -105
5934 -105 116 171 140 -37 69 105 116 113 164 -46 -53 29 99 -269 -11 -205 49 19 -272 -126 76 33 82 -241 43
5959 43 -85 -273 83 -135 65 -152 84 84 127 74 -214 -117 -44 -201 -128 -53 201 113 -311 -10 -173 -125 -134 50
5983 50 68 -23 -1 -75 -45 179 -78 -171 -141 -46 258 9 -308 -187 -23 189 450 -56 -87 221 167 102 57 -107
6007 -107 148 -246 -61 -137 -136 310 -191 -258 -155 -268 -129 -22 228 56 52 289 -98 -116 61 130 243 7 -11
6030 -11 46 -110 27 -70 -135 -269 -347 -3 164 146 48 184 -69 101 186 -101 43 65 -1 358 133 250 -360
6053 -360 -165 74 -227 155 -12 -24 -340 59 -242 -66 116 142 -203 -14 32 -119 205 -213 -246 91 27 -134
6075 -134 -58 -231 -297 33 -116 146 95 -198 9 162 257 -136 -158 118 -97 -147 -90 -388 66 -160 135 -161
6097a61O7L6j51Q2K28Q3m6k13l5L06l18K34k07L0K78l36QK14M7k94l2MK12j22
6121h6Q1K31k03J13K28m83K32l00Q7j22K97k97LM5r5L01j04J47l92K62Q4j2r2
6144g5L07j09j91K37k10L15j68j25k1N6k50K35jM3r7k04L71L5j28k06M44k88K23
6167A93m14K39K45k48J21J07l65J40J3j35L14pj18q8J13j3N6Rm97K53J26L8P1
6190A53J8O4k30Q4j77ON7j36N82m18j20mJ85k58L54J56k70J37j70j9k20k7K25
6213b8j78K87n2N0j91j57L20k04O4P0n2L56m27L74p5j72m5m9N7J63l79M33lk71
6237a09OK44l64L10J27p0k90K05o3j22j02M95k64k0j49J51j07K25J80k71J08J30
6259B50n18J30j0J15l1L38j81o8j67J3j79K65L27k14J56l58K65m6j81J10k32J34
$$ plain form
6097 -161 -94 -58 -209 -127 101 184 138 -75 -110 196 -122 112 -95 -65 213 -123 -115 99 146 -148 -180 -176 36 -86
6121 -86 -5 226 23 136 364 -119 113 -187 -100 -222 75 -222 -219 -174 -269 32 -72 75 -317 -55 29 17 -75
6144 -75 232 123 -68 169 -41 274 106 -19 -40 16 -234 1 0 43 -54 -258 113 148 20 -186 258 -30 193
6167 193 -221 18 263 15 136 243 -122 18 31 -104 210 203 85 -3 110 97 153 162 -335 -82 44 82 153
6190 153 171 235 5 89 -88 -82 -25 -161 421 3 -117 -121 64 -194 160 316 46 183 13 -6 -226 -253 -28
6213 -28 -206 81 29 79 -112 -269 51 -153 -89 -19 -71 285 -142 232 157 -15 -60 -109 -52 111 -268 165 162 -109
6237 -109 -103 141 -223 87 214 144 -146 59 -4 -126 -228 267 3 -17 -166 -15 -122 103 283 12 120 250
6259 250 -268 -138 -148 -33 -64 274 93 25 -142 -129 -308 -43 284 70 226 -132 133 87 -94 16 -216 -82
6281h2J29j05m7p1K9J54m9J49k23K52l2J0p2L2m8l02L82k05J05J12j16J52k93
6304a39J70J87k24J06j03J21m1R2k70K15l31K01j54l8j53L14L66k27N7j37K9l7
6326Dop3Q7l22N59j69L4k8j1l6j00k08J11L02l15J81K14l09N6K28j90q8M2K56
6350B19k76m9J47l22L80k33K25J46k55j05J07M0o4J53j46J07J14j80J80j19J01
6371A70k76n5M0K52j55l9j84K83l5j5j9K24j68K06l56M68m46J22j54J4K31j53
6393d5J08k18R3L45m27L47l83k0L79m06M3K16R3k52J08J87Q8j54l49R7K65q9j76
6416a50l0m7Q1K06m57K52O2N02n83J96K00m46J13J01J68j03j97M0J16o2J4J78
6438A54k61l7J40r1k0K82J9k39J50k66J85q5L10J25m72j26M24l43M06k27n2M4
$$ plain form
6281 -82 47 -58 -105 -176 -147 7 -42 107 -116 136 104 114 42 74 26 -276 106 -99 6 118 2 154 -139
6304 -139 31 218 -6 100 -3 118 77 169 -101 114 -217 -16 -170 -208 -361 -47 319 92 149 12 41 4
6326 4 -2 -75 12 -310 249 80 114 86 75 39 -61 -269 -158 144 -171 10 224 -85 -29 199 9 -79 -37 219
6350 219 -57 -106 41 -281 99 -134 91 237 -18 -123 -16 24 -40 113 -33 74 188 8 188 69 170
6371 170 -106 -161 -121 131 -24 -63 -247 36 1 -14 -33 191 23 229 -127 341 -105 17 -137 -123 108 -45
6393 -45 63 -155 -62 283 -144 203 -180 -200 179 -227 -184 32 125 -127 -19 168 256 102 -247 -150 115 26 -150
6416 -150 -180 -227 -146 60 -397 -145 -83 419 -164 32 232 -214 -101 0 168 65 -132 -92 24 -38 -24 154
6438 154 -107 -144 -4 -95 -115 167 186 -53 97 -169 16 -69 241 366 -106 -232 192 -151 255 28 -24 20
6460B0k63K52j43K31j34J21j49J1P2k22L68j97j68L17k48j14K68M3l07J74Q2o1
6482d7Qp1o4rK80o2k12K17O2R6l81K67k30j05J48J48l2j24J3K80q6j14P0J99k44
6507GQ2j51N3n2Q9k9k04J95M2k9k1p0O9L5j40J47K22M4k95n2J24K13om94K67J3
6533E9k21K52R8K6k01q9J25J12k50J69k92L70l53P8J73j97Q0K0Q5p5L27l90K1
6556g3Q3J97n38J88M55k30j98J86j62L14N9l03K8J65l49K94q6k29J83j33L03k10
6578e6J98q7k07K10J46k24K11j52j47L24k91o1K57o5j6j0j74k57J67M12j05PL
6601H3j71J26j81P6k18M22J7j22K00l93k5J94qn4K0q8J66J04L8r8l6j04j85L08
6625G1K8k39K78k56J45P7k59Mj76O41k54q9k16K17K38k56K67j05j31N6l03J06
$$ plain form
6460 20 -243 9 -134 97 -37 84 -65 -54 18 -204 164 -33 -201 116 -132 -246 22 65 -242 -68 14 -47
6482 -47 -39 -110 -174 -183 97 35 -177 40 102 198 -183 84 -146 -251 -103 45 13 -111 -98 182 96 -18 52 251 7
6507 7 89 -62 -9 -61 28 -1 -205 -10 32 3 -18 -88 -19 16 -124 23 245 289 -6 -58 66 279 273 -221 46 59
6533 59 -162 90 188 214 13 -76 49 161 -89 80 -212 158 -195 -117 56 -141 -61 -41 44 -31 296 -94 -73
6556 -73 10 207 -331 -143 312 82 -116 70 -92 222 281 -22 6 171 -178 116 30 -199 -16 -149 154 -56
6578 -56 142 55 -152 58 204 -20 191 39 -108 216 -75 -136 121 56 40 30 -144 -401 -234 178 73 80 83
6601 83 -88 38 -143 -67 -285 137 154 32 232 -161 -186 8 0 -54 -34 -122 44 148 186 88 52 -52 -237 71
6625 71 99 -140 138 -118 27 104 -155 -151 -327 314 60 -29 -245 -28 210 -46 221 116 -15 41 -262 -156
6647a56P1L41j39k58J76K0j29m4J46N6k11N64k71q4j56k3K17rr7J35n9J42j99
6670C3r4K06l73Q3J03J27k72K31q7j16L02J69k63j48P7j7J12m6j98j69K17K15
6692I2j08j76RP8L16k29n7l7P5n1J37K04k18j84O9R8j83J71L34k31j20J06R5k31
6716d1j72K86j86K38k88J64j22J82k2R3m3m12J26J67L6J20k66oK19j0j19l8K39
6739A45r5J34l4r1m9K38l05j10J20j7k0O6J65l76J56j22J04K06pl4k22K55L4n
6763A36q1j45o7j24J50n9N8O3l72M02l3J4o5p0L43k95m8L05k24kJ10N3r4J89k48
6788a04K64l54J21K71j51M9k2M6o9Q5l10J59M6L7Pn2j59K47J09l38O5J8n5rK77
6813A78l66P6J48m4J45J40k37o7K91r6N7j69M0l8k7j80j13K65j57K07k7J17k52
$$ plain form
6647 -156 -85 256 117 -141 35 55 -74 -118 28 84 -127 437 166 82 -74 -97 120 111 14 149 90 232 33
6670 33 -61 145 -228 -145 -42 85 -187 44 -43 -159 143 312 49 -99 -22 -39 73 27 -171 -340 -123 92
6692 92 -16 -192 -183 -105 211 -18 -75 -112 -37 -88 49 253 35 -149 -80 18 -165 6 340 109 -11 95 190 -41
6716 -41 -213 73 -113 125 -163 1 -121 61 39 132 89 -323 -197 -30 6 126 -140 -146 73 63 -56 -94 145
6739 145 50 184 150 59 10 248 -57 -167 -47 -64 -84 -18 147 -229 -73 -195 -91 115 108 74 -148 107 141 136
6763 136 55 -90 -157 -281 -131 -190 -132 -69 -441 -39 -72 -58 -123 -193 150 -145 -193 112 -112 -114 -4 49 -45 144 -104
6788 -104 160 -194 -73 198 47 96 74 120 51 136 -174 -15 31 68 75 23 -136 111 220 -118 -53 -35 -90 -99 178
6813 178 -188 -112 36 -8 137 277 40 -27 264 168 225 56 96 58 31 -149 -262 3 -154 53 26 143 -109
6836a09O9o5n0o9L17k12R5J16L9k11J12J34l50J89J54k21K47j86R2J28l06K32
6858A45l63L15k06L08j22j24r0j59K02l2j6%K77J65k22R5j3Pl48L99o1n3J1J5
6882A30j03j36J87j39M1k7o7nK68j24K6L4j44j44L07j53k19N09R3l23J63J27m14
6905a13j24L59j30J32L7q7k33J85O9n6n7j82L30j94M84m22P4nR5m43K74J15j10
6928bN3J80n6m14K92j61K31l39J60k26N12m7K5n11L82k2p2J39J26l45L09q7q8
6951C9j13j32K40l25L61J09j72n9j25q7J27m9K35j38J18L16j54l86J99K4P8j69
6973f3K00Lk41K22P1k61l42M45r1p1K03k5o8L2J0O2K1j21M91n26Q7O7j85L14m74
6998b40L50O0r1j49L3P4K06k3k53J24O0k79J29K72J9k90r6J13l1P8j69j38L82
$$ plain form
6836 -109 -40 -105 -155 -224 93 -119 -24 92 131 -80 32 166 -184 5 159 -62 185 -1 91 219 -87 145
6858 145 -218 97 -109 199 77 -47 -137 -296 -94 -126 -142 -142 135 300 78 173 160 167 -181 218 157 104 115 130
6882 130 27 -109 78 -61 -20 -47 -114 -119 149 25 51 85 -59 -203 104 -49 -268 241 334 11 174 301 -113
6905 -113 -237 122 -8 124 161 74 -159 26 95 39 -18 -200 130 -64 420 -2 72 67 162 -281 -7 108 -2
6928 -2 51 231 175 -239 53 -108 123 -216 -56 -282 230 183 208 -303 79 57 -15 124 250 -95 214 127 39
6951 39 -74 -206 34 -291 70 179 7 -52 -177 -264 -137 -186 49 -89 29 345 191 -195 4 28 106 -63
6973 -63 137 140 -101 121 192 -69 -411 34 -57 -128 75 50 -18 14 24 86 107 -14 477 -49 38 105 -80 234 -240
6998 -240 110 170 79 -70 -37 37 243 220 -33 91 151 -128 1 273 292 2 -94 19 -12 66 -103 -241 141
7021A41j96J85j42l41L69m7J50J20%j63J5j4L41l86M1M7r3R2k19l7mj13R7L23
7045A66K00n05K22m6J08m07M78k89p2J53K64k26k58M57m12K90k09K66k92Q1l0
7066f1K05N2j07j00k6J57j39n07P37j90n5Q9k63O8J26M0L7k0k89L05k16R9J24
7089F6q5l7M7J02k35L10j64n5j32K47q7j82m2K99j37l3J27R8j06n9r0J03K18j43
7113C0n5mJ55L9j15l28K88j75l9L13j50o5M9q2J76k28R7K51o4n6Q8j14l1k18O2
7138a76Q6j59J05M9m0K5O9J21k05J34j49N0J5P5k5N3K0K2k01J08ln4J44j68j3
7163a17r9O1M97k34j05P0p6J48k7k54J0J86l38J84p5PJ96M2k01K57l4j34Q0j09
7187f5n2M42j43k93K14J63k98j08K8J30J67j92j31K2J45L1k45J82j01O4N8j35
$$ plain form
7021 141 -55 130 -12 -353 16 -31 119 239 239 76 91 77 418 32 73 120 27 119 -100 -137 -141 -254 -157 166
7045 166 366 -139 83 37 145 -262 216 -73 -145 8 272 46 -212 245 -167 123 -86 180 -112 -31 -61
7066 -61 144 196 89 -11 -37 120 -19 -526 211 21 -34 55 -208 -140 -14 26 63 43 -246 59 -157 -58 66
7089 66 -19 -56 -9 93 -142 168 4 -51 -183 64 -23 -205 -247 52 -85 -118 9 107 1 -58 -148 -45 173 30
7113 30 -25 -29 126 165 50 -278 10 -165 -204 109 -41 -106 -57 -139 37 -191 -94 157 93 37 125 11 -20 -238 -176
7138 -176 -90 -249 -144 -95 -135 -110 -41 80 -125 9 -140 -90 -75 0 -25 28 48 70 -131 -23 -26 -80 64 -104 -117
7163 -117 -216 -155 342 108 3 73 -3 145 118 -136 -126 60 -278 -94 -169 -162 34 76 -125 132 98 -36 44 -65
7187 -65 -117 325 182 -111 103 266 -32 -140 -112 18 185 -7 -138 -116 29 60 -185 -3 -104 -40 18 -117
7209a17L31k60J88J38l29j22MK00q6J23k42J71j82K5P4M8O7j32J62J08l47J18
7231f0O9Jr3L11q2K4q3n1j11r8J32j80J82j9K28J6j40K06p6k26J40l70L63k04
7255a21K34N6j47K1l5j57K87m48J96o0q2K12J2K17M6j91J31m36L36r9K05l68K9
7278a62J36k89L68j03P3o4M5J1O9j41M4l0MK2k29N0L02j34L13K1n49J42M60k50
7302A09k79Q6J19j18j10J93o0j13K41J38j97P7l28J35L92j36k74J64K75R0o91
7323b87N51k65Lk93J11K33j80M16l70K82r6p0L1J71m48L73r3L5l45J48J85j37
7345d5j89P9M52k25j57J0K33j79L9j31o7K08K48j89K1r7O8o4r0pJ06l73Q6J00
7369a63J91L76m63j87K27M8j29R0k07L11j71K33m14M11k57K81k52J70j08k6%J87
$$ plain form
7209 -117 214 -46 142 280 -49 -171 -167 33 -53 70 -172 -1 -183 -158 -84 -36 31 -101 61 169 -178 -60
7231 -60 9 10 -83 228 146 170 87 36 -75 -173 -41 -221 -39 -58 170 186 46 252 176 -50 90 -280 83 -121
7255 -121 113 169 22 43 8 -149 138 -310 -114 -174 -256 -44 -32 185 231 40 171 -265 71 -28 177 -191 -162
7278 -162 -26 -315 53 -50 23 -41 4 15 84 -57 -13 -43 -39 -17 -246 -196 106 -28 285 306 -243 -101 359 109
7302 109 -170 -84 35 -83 -193 0 -60 -173 68 206 9 86 -242 -107 285 149 -125 39 314 404 -287
7323 -287 264 -1 2 -291 -180 53 -127 289 -81 201 105 35 66 237 -211 162 69 104 -241 -93 92 -45
7345 -45 -234 -155 297 72 -85 -75 158 -21 18 -113 -180 28 276 87 108 11 79 15 -75 -82 24 -349 -263 -163
7369 -163 28 404 -59 -246 -19 29 -100 -10 -217 94 -77 156 -258 153 -104 177 -75 95 -13 -39 -39 148
7391A48j1j28L27Lk78L6k67K34j77J29J12k66J57q8L96k41k36J14L14j89J57k74
7413b8l4K61j31k23J60l21J14K38N8p3J79j51r6j03M3J98k35M26l66k2p9J88k4
7436b1j9R2q8J07k7n8j58M0j24J26j05Q5p8K23l8J10j4M0l3L8Lj04J22j91J3J13
7462E4k86L61k66N9K1j76M32k92j10K66L3k87J65O9l95M53r6jn2k23J73l11L59
7485e0j01J73l81J24M50k73J85k24J27k3j16N4K00n8j67O9j11J06q4P9N8J32j61
7508Hj60K97k9l9k21K0J68q5J17j41J07l34M73k28p7K11j19m3J25n5kJ88K64k31
7532B14l50J14k4K25l2k19L71n55J64J73O6j00J38jj42o7J45l26J77K22k87J22
7554B8j79j6j90M30j83J88J3r4K97j53j20p0K31m6l93L46j62K26k44R9k1p8N6
$$ plain form
7391 148 137 9 336 339 61 97 -170 64 -113 16 128 -138 19 -69 327 86 -150 -36 278 89 246 -28
7413 -28 -62 199 68 -155 5 -316 -202 36 94 21 200 49 -47 -150 -107 91 -144 282 -84 -106 -185 3 -21
7436 -21 -40 52 -36 71 44 -14 -172 -132 -256 -130 -235 -150 -228 -5 -43 67 53 93 60 98 101 -3 119 -72 -59 54
7462 54 -232 129 -137 -78 -57 -233 199 -93 -203 63 96 -191 -26 43 -352 101 5 4 -48 -271 -98 -409 -50
7485 -50 -151 22 -359 -235 215 -58 127 -97 30 7 -109 -55 145 87 -80 -11 -122 -16 -100 -21 37 169 8
7508 8 -152 145 116 77 -144 -124 44 -41 76 -65 42 -292 181 -47 -124 87 -32 -75 50 -5 -7 181 445 214
7532 214 -136 -22 -46 179 147 -72 299 -256 -92 81 147 47 185 184 42 -25 120 -206 -29 193 -94 28
7554 28 -151 -167 -357 73 -110 78 91 -3 294 141 21 -49 182 136 -257 89 -73 153 -91 8 -13 -91 -35
7577c5l5K19Q8m51K89J27K4l42Q6K46l7j54K48l37L22j89j65m3M5K68j07k6k94
7600b53K73K7P9l69O8M47l0j39j07J38j70L12m03o2p4M6J87p6Q8k62M98j07k48
7623a37K02j2J30k31Q9j60J60j23j51P3J34Oj84J59%l4j9O8K83k27j22P6p0J93
7647A03j95J14k74P0R1J45j42k8J93k90L03j16rJ35j88o0K60n9k05J83K38j27
7669A42n80J06M09p3J71j44M5Qj84J87j24K51j65K22l85J07j44J78o9l5j88J77
7691h8j1K41k49K6J33k14q1J00L14j90R3K7k17K12q9P4j36l6J6J14q6J37K94m25
7715d1L6K21j60n5M0J34k81K74N2k73K39k72O2K19n89M71o1K04l59j4p0J03K26
7738A06j57J09j2Rj08K87k01K9j41K94j90Lm0k68mK94o7J48N5R4m35L62p1j10
$$ plain form
7577 -35 -70 149 237 -214 75 202 226 -116 -30 216 179 25 273 -64 258 69 -96 -139 -94 174 67 41 -253
7600 -253 20 47 126 -243 -175 272 242 103 -4 134 -36 276 -127 -189 -263 -217 -30 -106 -18 -280 218 111 -137
7623 -137 65 53 183 -48 41 -119 41 -82 -233 -160 -26 -20 -204 -45 -45 -79 -98 -30 253 26 -96 -20 -90 103
7647 103 -92 22 -252 -182 -91 54 -88 -116 77 -213 90 -26 -35 100 -88 -148 112 53 -152 31 269 142
7669 142 -438 -332 77 4 175 31 76 84 -100 87 -37 214 49 271 -114 -7 -151 27 -42 -77 -265 -88
7691 -88 -99 142 -107 -81 52 -162 -243 -143 171 -19 74 101 -116 96 7 81 -55 -91 -75 39 -47 90 384 -41
7715 -41 -5 216 56 1 41 175 -106 168 220 -53 186 -86 -24 195 -394 77 16 220 -139 -153 -223 -120 106
7738 106 -51 58 46 55 -53 234 33 62 -79 215 25 28 -12 -280 -284 10 -57 91 146 240 -195 167 96 -14
7762a4%J86j80J58Q6l68P0P0j02l7J49Q5k99K09R3m05M22r1k32L7K0K68P3o16
7786d18L78K79l55QJ32k9K73n16J60K09k26K0K35q4l80K78J50l4R6l71O9M1j8
7809a03j66L65l46K72K09q1k85K09Nk86K12j56JM2O7j87r4K32r1J49N7j17OJ25
7833C9L98k69J5j36o3J44k81L20J34k20j53j25J19r4J10p4J06K58k89P2J82l63
7855a70L20j61M4K9j17k73N65k90k47J24NK63p8L2l3J43j96j60K63K7m1J38l26
7878a39L9O4P3L8l82Q5o3K51o6P0K54j28K7J9p5J10j54k84K15RP9j1j51O2J9J46
7904A07j82J73n8lk4J73M6l71J90k70m3K95J1Q0j9j06N9M1J91l12J90mj71K41
7928B34k33j82L00k83K76j4j37J58K78m18J2j37L96j43M3k64J58j23K04L1j94
$$ plain form
7762 -14 -14 172 -8 150 236 -132 -62 8 -94 -131 18 103 -196 13 106 -299 123 32 -200 -163 -143 125 198 -418
7786 -418 -40 239 -116 -108 24 -5 268 -248 -88 121 -105 -85 150 66 -314 -36 114 80 176 -195 -126 -85 -103
7809 -103 -269 96 -250 22 231 150 -135 74 79 -207 5 -151 -150 -108 -41 -228 -322 -90 -181 -32 25 -92 -86 39
7833 39 437 168 183 47 -16 128 -153 167 301 81 -72 -197 -78 -172 -62 -136 -30 228 -61 11 193 -170
7855 -170 150 -11 33 62 -55 -328 237 -53 -300 -176 -171 92 14 46 13 156 -40 -200 63 90 49 187 -139
7878 -139 -100 -36 37 75 -307 -222 -285 -34 -100 -30 224 96 123 142 67 177 23 -261 -46 -37 42 31 -120 -58 -39 107
7904 107 -75 98 40 37 13 186 232 -139 51 -219 -262 33 44 124 105 -1 58 99 290 -22 168 164 -7 234
7928 234 1 -181 119 -164 112 98 -39 119 397 -21 -9 -146 250 107 150 -114 44 -79 125 156 -38
7949c8J79j30l38K75NL1M9j16n4kJ52J1O7j15jO0J32o6j46J89k42J48J2j94K90
7974A58k47r9RJ79P4J35k67L4k30K27J37j81M64n09q9M09k53N4j61R3P4l8J51
7997A24R7l73J19j3J99j19j65M0L9M12n00P3M8J59K44l50k07L85m7O7j15R3m82
8020b72M20j76J88m84L56j52n6J83n6J40n5J2k00j1J43K3K60k72K32k59K6Q6k44
8043a68J49P3j7k27L07j29J81m1p7J71j38Q7p7j50M48n32J40o6J60K68m08P4J75
8066B03o2j04j46J22O6L2k26J90J9L9j46n1Q1j61l5J61J34k77L56L2q1j25l0J53
8090A44K4j86l1M4n0J56k31J5K77j97N9k3Q6L4M8l73K58M4M6k47k32O40m54J47
8114bq0K89q5J66k21J03o7P9j32j71J40p2NK2L07m76L15k19J76K46l35k10K93
$$ plain form
7949 -38 141 11 -327 -52 -47 -16 33 -83 -137 -139 13 24 91 -24 -25 35 167 101 -45 144 -98 50 62 -132 158
7974 158 -89 -188 -179 0 74 209 -58 -24 -254 -27 110 -71 393 -116 -205 204 -49 5 -156 -63 11 -27 124
7997 124 221 -152 -33 -46 153 34 -131 -91 -52 360 -140 -67 -19 140 384 34 -173 212 165 232 117 210 -272
8020 -272 148 -28 160 -324 32 -120 -176 7 -49 91 36 48 -152 -163 -20 3 263 -9 223 -36 -10 76 -168
8043 -168 -19 54 37 -190 117 -12 169 128 51 222 84 171 94 -56 392 -140 0 -66 94 362 -46 28 203
8066 203 141 37 -109 13 79 111 -115 75 94 133 -13 -64 17 -144 -179 -18 116 -161 195 227 146 21 -9 144
8090 144 168 -18 -49 -5 -55 101 -130 -115 162 -35 24 1 87 121 169 -204 54 98 144 -103 -335 305 -149 -2
8114 -2 -82 207 122 288 67 170 103 182 50 -121 19 -53 -48 -26 281 -195 120 -99 77 323 -12 -222 71
8137G1j69MJ1q3m2K56k36M69k90j17J77p7o1J05j78L87j75L4j84N2J3j02k0k7
8161a82P3Q1k9j0k90M75r5k94K80J71j27R7j39%J33j29j08R5Q6j38J68k07Q9o2
8185f2J16o4J30r2J32J00
$$ plain form
8137 71 -98 -94 -83 -166 -208 48 -188 281 -9 -126 51 -26 -87 18 -160 227 52 86 -98 -46 -33 -135 -155 -182
8161 -182 -109 -28 -57 -67 -357 118 23 -271 9 180 53 150 11 11 144 15 -93 2 88 -50 118 -89 0 -62
8185 -62 54 -10 120 28 160 260
8191B60
$$ Imaginary data points
##PAGE= N=2
##DATA TABLE= (X++(I..I)), XYDATA
0@%%%%%%%%JmJ1j6J6k4L2m0M8n7P1q7J06j23J47j72K00k33K73l19L67m23M85n54
32b95O29p12Q05r08J019j145J283j430J594j772J967k179K412k666K943l249L581
49A877l945M346m786N274n820O427p111P886q772R800j1004J2441j4191J6377
63H799j9197K2999k8436L6918n2140Q8120l42553l35497K46729J35253K16897
74b2108J06456Q3932r847K8215K6292P5021O5594P4875j0272r3855j88345k13953
86g7995k24299j56882o2078N5084J14279J49911J33463R3345L0917J2114K3194
97I1053N5774Q1813J03742P8295O120r1346j66649k09584k01690j37543l5172
108d25187N0680J02681J16250R3898M3728M313K051L1130O7551J02385J13138
$$ plain form
0 0 0 0 0 0 0 0 0 0 1 -3 8 -8 8 -16 16 -24 24 -33 38 -49 57 -66 81 -91 109 -124 149 -170 197 -226 259 -295
32 -295 334 -378 427 -481 538 -607 676 -754 840 -932 1035 -1144 1268 -1398 1545 -1704 1877
49 1877 -2068 2278 -2508 2766 -3054 3373 -3738 4148 -4624 5176 -5828 6613 -7578 8799
63 8799 -10398 12601 -15835 21083 -31057 57063 -285490 -620987 -374258 -239005 -22108
74 -22108 84348 168280 158433 186648 212940 287961 353555 428430 418158 324303 135958 -77995
86 -77995 -302294 -459176 -521254 -466170 -351891 -201980 -68517 24828 55745 67859 91053
97 91053 146827 228640 332382 410677 416797 325451 158802 -50782 -252472 -390015 -425187
108 -425187 -374507 -271826 -155576 -61678 -17950 -13637 -11586 19544 87095 189480 302618
119C02618P7316j124q4170j50412j84419j69026j01598j5646M9852Q6052Q8893
130a01664N5956P919j6832o018K7249P1320J10455J14833O9819o057p9832j37289
142A09859j59236j29980o3614M532N2490P2752N8962J8932j8136k6990q597K7425
154f1601P4040J07865J03539N8298p556p3929j22800j33109r7565l7873J9391
165a71300N8002O6745L9339o063l8961m2640j6951K7902P7358J04753R1748M4217
177B34149j7219p5949j10138j03029n9909o653L6948N8431N1338J5524k5843m7862
189e0212m4573j6651K9177P3045R0223P2979L0436k3641p2015r4414p8194l5446
201a19286J2736N0638O2773M1432M05l8235n6224m7825j4093L3750P1968P9895
$$ plain form
119 302618 379934 378810 294640 144228 -40191 -209217 -310815 -326461 -276609 -190557 -101664
130 -101664 -45708 -37789 -54621 -60639 -33390 37930 148385 263218 333037 326980 247148 109859
142 109859 -49377 -179357 -242971 -238439 -185949 -113197 -54235 -35303 -53439 -80429 -89026 -61601
154 -61601 12439 120304 223843 282141 274585 200656 77856 -55253 -152818 -190691 -171300
165 -171300 -113298 -46553 -7214 -13277 -52238 -94878 -111829 -83927 -6569 98184 189932 234149
177 234149 216930 140981 30843 -72186 -132095 -138748 -101800 -43369 7969 23493 -2350 -50212
189 -50212 -94785 -111436 -82259 -9214 81009 153988 184424 160783 88768 -5646 -83840 -119286
201 -119286 -106550 -55912 6861 48293 48698 10463 -45761 -93586 -107679 -73929 -1961 77934
213G7934N6805J2842l6615p3977p9508n4039j1782L0952N8725N8439K9313j0837
225E8252m3282n6397m2656p716L5280O4120O6405M1906l58m5048p1724o6497l6942
238a04657N305M3835O3201N2745J9111k0842m8245n4031l3712M215M1866N9709
250B8500N2974K4660j7555n3586o8475n4956k0352J9900N1529O0861M3620R722
262G6842k4890m7994m7561k4171J2433M4447N5032M3208J1604k8589n8457o4323
274e2419m5470r785K9452N5184N6315L3298k08l0618m5812l7669j0286K3643M7133
287A2758N0576L1896l212l9363n9899n8085l5126N31L5331N3515M8127K3047r036
300E1060l4765m2387k7578J852L2644M9987M7787K3322j3081m6537o0874n2685
$$ plain form
213 77934 134739 147581 110966 36989 -42519 -96558 -108340 -77388 -18663 39776 69089 58252
225 58252 14970 -41427 -84083 -91799 -56519 7601 74006 115912 115554 70506 -1218 -67715 -104657
238 -104657 -99352 -55517 7684 60429 79540 58698 10453 -43578 -77290 -73075 -31209 28500
250 28500 81474 106134 88579 34993 -33482 -88438 -108790 -88890 -37361 23500 67120 76842
262 76842 51952 3958 -43603 -67774 -55341 -10894 44138 87346 98950 70361 11904 -52419
274 -52419 -97889 -107674 -78222 -23038 33277 66575 66367 35749 -10063 -47732 -58018 -34375 12758
287 12758 63334 95230 92018 52655 -7244 -65329 -100455 -99924 -64593 -11078 37049 60096 51060
300 51060 16295 -26092 -53670 -51818 -19174 30813 78600 101922 88841 42304 -18570 -71255
312g1255k5098J0047L8826M8870L7045J0518j8018l7114l6843j5977J3941L9638
324e420N0536M0755J3836k0022m7344n5756m3924j6479J6081L8424M2066K5855
336C8608M65k5350l8854l2305q107K2354M5876N1995L6596N339k7473m9050n1787
349c1693l4496n068K5130L9288L5022J4441j2773l4158l8291k4739J841K9549
361c5947M7894M7160K7493k538l0837m6041m3096k3327M172K7288L6668K7683
373C6572N789j9759l6802l7104j8902Q024L4178M7406M2111J9692r972l4612m4600
386g979l5857j2300J4434L2830L4422K0495m068k7766l9530l3624j1552J6084
398e4411L7985M6056L4989R589j7794l7458m1408k7698k277K1980L5060L1475
$$ plain form
312 -71255 -96353 -86306 -47480 1390 38435 48953 30935 -6179 -43022 -58999 -45058 -5420
324 -5420 45116 85871 99707 79685 32341 -23415 -67339 -83818 -67737 -29313 12753 38608
336 38608 39073 13723 -25131 -57436 -65543 -43189 2687 54682 91278 96617 69144 20094 -31693
349 -31693 -66189 -71257 -46127 -6839 28183 42624 29851 -4307 -42598 -67337 -65496 -35947
361 -35947 11947 59107 86600 84062 53225 7184 -35912 -59239 -55067 -27779 8889 36572
373 36572 42361 22602 -14200 -51304 -70206 -62182 -28004 19402 61513 81205 71233 36621 -7979
386 -7979 -43836 -56136 -41702 -8872 25550 46045 41977 14211 -25319 -58943 -70495 -54411
398 -54411 -16426 29630 64619 74208 56414 18956 -22452 -50150 -52427 -30447 4613 36088
410C6088J3495j2045l2406l7982k7262m066K2254M0146M1118K5412m86k4838l7899
423A529l5741j7717N890K6916L4574K6471N647j7436l3498l4034k0647L312K6028
436b8706L9731L6317J7574p753l0423l9117l2284j1313J3803L1140L4991K2501
448D6461p2k3863l5444l0878j3013J2095L1917L9120K9608P464j7356l4859l7839
461b6659k4791k708K0006L1741L0354J5221o457k4689l1259k4167n167J7527L3306
474B258L4918K2585j76k2851l6885l6000k0287K923K3359L3462K7418J0032j2149
487B8607k6572k9675j7338L706K4206L5781L1724J5085r352k9662l8764l1885
499d4139j3635Q413K6017L0814K1981L191j5914k6859k4532r974J1638K9107L6123
$$ plain form
410 36088 49583 37538 5132 -32850 -60112 -64178 -41924 -1778 39340 64752 64266 39428 1529
423 1529 -34212 -51929 -46039 -19123 15451 41922 47569 30133 -3365 -37399 -58046 -54734 -28706
436 -28706 11025 47342 64916 57163 26740 -12377 -44661 -55974 -42171 -11031 23960 46461
448 46461 46389 22526 -12918 -43796 -56809 -44714 -12797 26323 55931 63395 46039 11180 -26659
461 -26659 -51450 -54158 -34152 -2411 27943 43164 36707 12018 -19241 -43408 -48575 -31048 2258
474 2258 37176 59761 59585 36734 -151 -36151 -56438 -53515 -30156 3306 30724 40756 28607
487 28607 2035 -27640 -44978 -41272 -17066 18715 50439 65524 56172 26510 -12254 -44139
499 -44139 -57774 -49361 -23344 7470 29451 32642 16728 -10131 -34663 -44637 -32999 -3892 32231
512C2231K8423Q349j5140l3621l8229k8166q725J2486K5725K7187J4880l870j9149
525B381k5661j8792r12J8750L3525L4690K2508K147k0303l4882l5514k3396l793
538d9252J5045K5267K1834Q629q743k2440k4459j4277N392K4573L6573L4744J9128
551G2014l525k4315l5532l3186j8309J484J7462K2435J6316M97j4987k4111k0699
564d4456p612J2128K9243L6776L0582J4146p932k5442l2868k7036j2682N204J6926
577a3023J9403J0054n172j9631k5735j9399k648J7191L2864L6580K8258R656j1853
590E6545k7002k9808k1631n932J0384J7634J5438L228j1923k3824k5812j6099
602e8802K152K0774L3247L4153K3355N355j3341k4391k4889j5565N8J2497J7532
$$ plain form
512 32231 60654 69003 53863 20242 -17987 -46153 -54878 -42392 -16667 10520 25400 21530 2381
525 2381 -23280 -42072 -42984 -24234 9291 43981 66489 68636 48333 13451 -22063 -45459 -49252
538 -49252 -34207 -8940 12894 21523 12780 -9660 -34119 -48396 -43004 -18431 18142 52886 72014
551 72014 68489 44174 8642 -24544 -42853 -41369 -23907 -1472 14844 15341 354 -23757 -44456
564 -44456 -52068 -39940 -10697 26079 56661 70807 62875 37433 4565 -22471 -35153 -29949 -13023
577 -13023 6380 16434 11262 -8369 -34104 -53503 -56151 -38960 -6096 30484 58742 68398 56545
590 56545 29543 -265 -21896 -27828 -17444 190 15628 18856 6933 -16891 -42703 -58802
602 -58802 -56650 -35876 -2629 31524 54879 60234 46893 22502 -2387 -17952 -17894 -5397 12135
615A2135J1243k528j7226k7157k5735j3158N659K4173L3959L1483J8545O61j6073
628C5981k3107j9893q056O084J5721J6182O619q296k2107k8335k3567r206R105
641e2875K4979L1875K7105J4167l348j5784k0167j4856k102J0313J7159J4438
653C0904L110j2385k5137k9133k1825o014J1587K5506K9127K2556R025o436j6393
666A4492j7012q181M205J4413J8488J2049p57j6264k6933k8130j8958k907J3326
679d2169K4569K5527J6944L440r375j5795j3493l366R394J8901J8892J0478m551
692C9396j9084k7646k5984j5460L51J4977K2693K0449J1256j789j2033j4831r043
705a6748J555J3658J9864J8094Q328p104j9655k6240k3049j1453L146J5658K0619
$$ plain form
615 12135 23378 20850 3624 -23533 -49268 -62426 -56767 -32594 1365 32848 51393 52054 35981
628 35981 12874 -7019 -15075 -8991 6730 22912 29531 21235 -872 -29207 -52774 -61980 -52875
641 -52875 -27896 3979 31084 45251 41903 26119 5952 -8904 -11006 -693 16466 30904
653 30904 34014 21629 -3508 -32641 -54466 -60480 -48893 -23387 5740 28296 37321 30885 14492
666 14492 -2520 -10701 -6496 7917 26405 38454 37697 21433 -5500 -33630 -52588 -55495 -42169
679 -42169 -17600 7927 24871 28311 18936 3141 -10352 -13718 -4324 14577 33469 43947 39396
692 39396 20312 -7334 -33318 -48778 -48427 -33450 -10757 9692 20948 19159 7126 -7705 -16748
705 -16748 -15193 -1535 18329 36423 44751 37647 17992 -8248 -31297 -42750 -39604 -23946 -3327
718c327J6523N815o684j4672j4534o604O383J7023K1755J7233M934j0035k1327
731A2483k4842j8855o193P519J6905J8257J1241K39j0365j5603j2720l141R595
744a5480J8142K0427J3857J707j1536k0523k1933j4634k217J0096J7421J5585
756A0912P918l583j2574j5959j0795l90J1894J9235J8930J0433k290j4650k0803
769a722j9078r639K629J3041J7271J3689L672p343j4445j4794p811L509J4016
782g005J9068J6188O668n753j6921k0510j6474n919O333J4647J6314J0880N55
795A8071r813j4870j2626m182P063J5803J8191J3414K638r728j7564j9248j2965
808b5816k388Q059J5027J3798P483k689j0859j4279r993q50R853J7723J8011J0807
$$ plain form
718 -3327 13196 19011 12327 -2345 -16879 -23483 -17100 -77 21678 38911 43845 33810 12483
731 12483 -12359 -31214 -37407 -29888 -12983 5274 16515 16754 6389 -9214 -21934 -25075 -15480
744 -15480 2662 23089 36946 38653 27117 6594 -15339 -29973 -32190 -22094 -4673 10912
756 10912 18830 15247 2673 -13286 -24081 -24471 -12577 6658 25588 36021 33731 19081 -1722
769 -1722 -20800 -30439 -27810 -14769 2502 16191 19863 12520 -1925 -16719 -24530 -21021 -7005
782 -7005 12063 28251 34919 29166 12245 -8265 -24739 -30658 -24325 -9678 6636 17516 18071
795 18071 8258 -6612 -19238 -23420 -16357 -554 17637 31051 33689 23961 6397 -12851 -25816
808 -25816 -28204 -20145 -5118 8680 16163 13474 2615 -11664 -21657 -22507 -12654 5069 23080 33887
822C3887r75j2041j9016j7980j0056O92J0827J5023J1509L485o746j3215j3398
835a8004o847L313J3641J8015J6447P808m265j3774j7475j5075o808L393J0997
848h634J2760Q499L9r133j3619j1934m237O193J4863J8374J4722N108o132j4481
862A2388j6885j2323k906N900J2230J1557N045m150j1880j4691j0600j379R134
875a8560J6594J7426J2250K717q349j4526j4706r030M51Q352J2042R234J881p234
889H542j3778j4261q623J016J1122J6606J6152R644n29r722j3802j2131n015L654
903a1125J0356J1086P127j543j0361j4645j3236o092L027J2105J6996J3571P235
916B4501l201j0526j3037r383j478O386J1570J0666M968m357j2331j5356j2755
$$ plain form
822 33887 32912 20871 1855 -16125 -26181 -25489 -14662 361 11870 15355 8609 -4606 -18004
835 -18004 -24851 -21538 -7897 10118 26565 34373 30108 16334 -1141 -16216 -23024 -19631 -8634
848 -8634 4126 12625 12664 3531 -10088 -22022 -26259 -20066 -5203 13171 27893 33001 26869 12388
862 12388 -4497 -16820 -19726 -13826 -1596 9961 15006 10856 -1024 -15715 -26315 -27694 -18560
875 -18560 -1966 15460 27710 30427 22078 7552 -7154 -16184 -15733 -7381 4661 13895 15776 8542
889 8542 -5236 -19497 -28120 -27104 -15982 624 16776 26420 25891 16169 2367 -9764 -14779 -11125
903 -11125 -769 10317 17444 15901 5540 -9105 -22341 -28433 -25406 -13301 3695 17266 24501
916 24501 21300 10774 -2263 -11646 -13124 -6738 4832 15498 20466 16109 3778 -11578 -24333
929b4333m300N602J3274J5446J1755L173m848j1273j1296o151J591R212J2386
942A0238R372K051o678j2945j5354j0864k057O959J2940J4088Q377M42o984j1089
956a504r439l643N039J1170J2293Q676R9r231j4090j4127q627MQ786J2782J1397
971I585N524k516r214j0527p691l54P556J2336J2388O276j783r862j4172j2278
985a4732o189K196R101J1853R205K246m922r922j0734n750K427R210J2742J1760
999A8491M758l767j0696j3220j0250l761M813R804J0795O537q54p404j1325j0054
1013a6133l502M399J0914J2716R837K815m804j0885j1792p813j022O748R763R946
1027A1187L970l311r175j1683q901k221N734J1079J2170Q645R07o473j0464r842
$$ plain form
929 -24333 -28633 -23031 -9757 5689 17444 20617 15769 4496 -6800 -12951 -11360 -2148 10238
942 10238 19610 21661 14983 2038 -13316 -24180 -26237 -19278 -6338 7750 16127 16569 9585 -1504
956 -1504 -10943 -14586 -9547 1623 13916 22592 22691 13460 -630 -14757 -23384 -23380 -14594 -1812 9585
971 9585 15109 12593 3379 -7148 -14839 -15193 -7637 4699 17087 23363 21580 11718 -2454 -14732
985 -14732 -20921 -18725 -9624 2229 11434 13680 8758 -1164 -11898 -17648 -15221 -6011 6731 18491
999 18491 23249 19482 8786 -4434 -14684 -18445 -13632 -3828 6967 13504 12650 5246 -6079 -16133
1013 -16133 -19635 -15236 -4322 8394 18231 21046 16242 5357 -6435 -14248 -15270 -8522 1241 11187
1027 11187 15157 11846 2671 -9012 -17913 -20134 -14400 -3321 8849 17494 18401 11928 1464 -8378
1041h378n494J672Q116J0183Q174J981n368j0469j1450p453n32O904J1043J1277
1055A0206N925q91p963j0382q449k736M715R355J0353O839j23p257j1538j0659
1069a2605n824J250Q570J0730R025L453l020q595r374o921k5N944J0149R557N153
1084A7467k124p995j1138r318m320L188Q322J0338P335J288m500r056q755m911
1098a4179K067P575J0687Q736L191m016r411j0876q356k065M671R016R730N566
1112A2336p02o833q799p538k881M327Q846R991P626J393n841r748j0189o467m86
1127a4965N747Q766Q236L945k419p354q939o125n88N725R475R858O051m14p128
1142I871j0068r490m810J492O807Q617O715J442m171q130q150m616J613P117J0406
$$ plain form
1041 -8378 -13872 -12200 -4084 6099 14273 16254 10886 417 -11033 -18486 -19018 -12114 -1071 10206
1055 10206 16131 15240 7277 -3105 -11554 -14290 -9575 -220 10133 16972 16849 9592 -1946 -12605
1069 -12605 -18429 -17179 -8609 2121 11146 14599 11579 2984 -6390 -13311 -13336 -7392 2757 12314 17467
1084 17467 15343 7348 -3790 -13108 -17428 -14240 -5918 4420 11755 13043 8543 -513 -9268 -14179
1098 -14179 -12112 -4537 6150 14886 18077 14061 4650 -6226 -14582 -16647 -11976 -2960 6770 12336
1112 12336 11634 4801 -3998 -11536 -14417 -10090 -1244 8747 16373 17766 11925 2177 -8012 -14479 -14965
1127 -14965 -9218 -452 7784 11729 9310 1956 -6983 -13108 -13696 -7971 1504 11362 17413 16999 9871
1142 9871 -197 -9687 -14497 -13005 -6198 2419 9134 10576 6405 -1725 -9875 -14491 -12878 -5761 4645
1157D645Q839M021k177p576j0084q226k648K932P088Q272N017o80n847q433o975
1172a1832l550L413Q300J0009Q276K652l762q381r107o191j296M116P319P256
1186G222K957k471o954q407o247j160M478Q999R583O915P07m895q269q436m567
1201a0545R30N732P466N922J246m101q134q617m980N00N864R350Q788N003o31
1216A3793o161q250o580k819K686O564P018M369k72n737q129q008l732J662O753
1231f843R184P748L325k226o168p780n657q99M254O993O936K926k192o916q675
1246e990o820k567L200P771Q935O261J487l765o547o878l901J170N251P507N589
1261A0703J705l884p781q580n815j176M494P863P741N197k9m615o932n463j976
$$ plain form
1157 4645 13484 17505 15328 7752 -2332 -10558 -13206 -10274 -3186 5086 10103 9423 3576 -4857 -11832
1172 -11832 -15382 -11969 -3669 6340 14616 17268 13506 5125 -3982 -10173 -11469 -7353 -34 7222
1186 7222 10179 7708 754 -7653 -13900 -15060 -10582 -1583 8000 14915 15622 10727 2458 -5978 -10545
1201 -10545 -9615 -3883 3583 9505 10751 6650 -1484 -10101 -15081 -14581 -8717 633 9421 14424 13793
1216 13793 7632 -618 -7198 -10017 -7331 -767 6251 10620 10348 4611 -3518 -11526 -15258 -13596 -6843
1231 -6843 2341 10089 13414 11188 5020 -2760 -8417 -9316 -5062 1931 8867 11793 9601 2685 -5990
1246 -5990 -12810 -15377 -12177 -4406 4529 10790 12277 8512 1965 -4913 -8814 -7644 -2393 5114 10703
1261 10703 12408 8524 743 -7837 -13652 -14828 -10334 -2471 5270 10467 10438 5823 -1109 -6572 -8548
1276h548K740O517P168M768j34m855q676q109m736Q9N121P818O788L086j344n326
1292B367o159m150l38M667P328P162L244j654o167q576p906l502J480N481P561
1307H38N281J399k479o008n613k697J843N894P687O403K736k809p604q365o527
1322a0021k604K497N986O282L605J45m462n552m859j246L298P178Q150N843J139
1337A5379l783p758q131n588q28L443N522N383K414k247n127o201l708L06N225
1352e699P727P944M822j0m720p782o919m294M16L764N460M022O53l273o251n274
1368i414k929J608O030P825P728L485n04n554p358o252k741J456M683M849L064
1383E976j044m460o632n246j896L659O433Q231O879K348k348o133p018m384j478
$$ plain form
1276 -8548 -5808 709 7877 12645 12511 7656 -1020 -9129 -13865 -13776 -8655 -837 5951 9037 7693 2367
1292 2367 -3792 -7942 -8280 -3613 3715 10877 14121 12467 6300 -2276 -10182 -13684 -12204 -6723 838
1307 838 6119 7518 5039 -969 -6582 -9279 -7436 -1542 6145 12548 15284 12475 4871 -3494 -10021
1322 -10021 -12625 -10128 -4142 2140 5745 5890 1428 -4124 -8983 -10229 -6931 247 8397 14240 15379
1337 15379 11596 3838 -4293 -9881 -10709 -7266 -1744 3639 6053 3806 -1321 -7522 -11230 -10924 -5699
1352 -5699 2028 9972 14794 14784 10064 2282 -4637 -8931 -8515 -4751 709 4731 5384 2111 -4140 -9414
1368 -9414 -12343 -10735 -4705 3120 10848 14333 13829 8275 917 -5335 -8076 -6620 -1937 2912 5976
1383 5976 4932 472 -6160 -11406 -13302 -9643 -3210 5021 11900 14248 11900 5767 -1251 -5635 -7113
1398g113K579M977M131J524k295n477o403m539k20M206P477P738N503J271l244
1413A0115n927o637l588J39K954M983L545M99l250o224o225l721R46N336P884
1428H29P181M437k35m107n900n366k827J320M221M427K448j016m546o622n462
1443a1218k365K228O092Q159O547K962j528m192o064m556r03K171M044M027J611
1458G015k257n690o203m726j635K887O867P336N955J912k229m754n645l048P3
1473d142L096M867L393J69l330o208o497m408j4M545O424P127M465O35l013n229
1489A880m689j768J408M185M359K695o94m112o570o123l114P62M748O859O052
1504E878L307o05l637n011l912o95K011M853M180J718j346n019o376n089k452
$$ plain form
1398 -7113 -4534 443 4574 6098 3803 -1674 -8077 -12616 -12836 -8630 -1153 6585 12088 13359 10115
1413 10115 4188 -2449 -6037 -5898 -2944 2039 5584 6083 2833 -3391 -9616 -13337 -12391 -7055 829
1428 829 8010 12447 12212 8105 2205 -3161 -5988 -4668 -447 3980 6428 5412 866 -5756 -11218
1443 -11218 -13583 -11355 -5263 2896 9443 12405 10877 6685 621 -3935 -4838 -2667 1377 5404 7015
1458 7015 4758 -932 -7135 -11861 -13496 -10609 -3742 3594 9549 11461 9232 4478 -1167 -4215 -4142
1473 -4142 -1046 3821 7214 7383 4053 -2155 -8652 -13060 -13074 -8529 -2105 5022 9487 10122 7109 1880
1489 1880 -2809 -4577 -3169 1016 5375 8070 7376 3264 -3306 -9429 -12543 -11781 -7033 -174 5878
1504 5878 9185 8580 4943 -68 -3980 -4675 -2664 2189 6369 8087 6741 1722 -4654 -9743 -12195
1519a2195K153N303O523N270J971j615m869m595k788PL384M718M153J018k875
1534E563n578o106m517r94L377N661O031M246J060k808m737m551j554J235L507
1549a65M625K921L85l827n411n712l720K98L648O315N313K962j7l247m203l737
1565c572j110J868M512M526J780j168m002o095n215l055J992M375N454N418J978
1580G686j232l654m571k581L99K875M570L631J712k698m851n926m795j415J824
1595i026N057N635L845J519k246l886l602j762J365L569M644L054M62l080n360
1610A88n653l991n06K504N132M965K778J9k431m051l275l30K359M324M608K270
1626H910m90l857n851n152k879J94L686M694M513J391p01l274l699k727O90K903
$$ plain form
1519 -12195 -10042 -4739 1784 7054 9025 7410 2541 -2054 -4842 -4835 -1451 3267 7420 8438 5563
1534 5563 -15 -6121 -10638 -11632 -8255 -2594 3437 7683 8743 5935 1198 -3353 -4907 -3672 -165
1549 -165 4460 7381 7766 3939 -1472 -7184 -10904 -10606 -6958 -643 4670 7632 7615 4368 165 -3572
1565 -3572 -4682 -2814 1698 6224 8004 6836 2834 -3261 -8476 -11531 -9539 -5164 290 5708 7686
1580 7686 6454 2800 -1771 -4352 -3953 -1078 3492 7123 8835 6137 1286 -4640 -9435 -10850 -9026
1595 -9026 -3969 1666 5511 7030 4784 898 -2704 -4466 -3101 468 5112 8166 8628 5548 188
1610 188 -5465 -9456 -9962 -7458 -2326 2639 5417 5436 3005 -1046 -4321 -4651 -2292 2032 6640 8910
1626 8910 8420 4563 -1288 -6440 -9319 -9125 -5439 -745 3768 5159 4458 1184 -2515 -5242 -4552 -1649
1642a649M915M159J566j372m301n409m769k030J201L629M503L685O18j901l312
1657d67l253j589J234L803M758L587O40k131m670n402l551j030J906L659M524
1672B018K342l24k424l477k895p44K292M045M788K701J89k961m754n173k434m93
1688g304K451M173L387J350p15l223l563k039J30L120M620M053K179r39l355m837
1704e12m072k174O04L008L486K920O08j906l398l207j386P69L687M577L630J706
1720H340j563l753m551l423j250J440L383L209K016p23k233l473k949l73J590
1735d313M074M058L191N72k063l921l902k683j60J972L051L045J363j076l078
1750A30l636k298l38K494M158L929K438o42k252l824l307j867Q42K490L293K438
$$ plain form
1642 -1649 3266 7425 8991 7619 3318 -2091 -6860 -8890 -7689 -4060 443 4128 4746 2845 -467
1657 -467 -3720 -5309 -4075 -272 4486 8073 8713 6582 1912 -3490 -7041 -8071 -6165 -2506 2018
1672 2018 4360 4036 1612 -1865 -4760 -5504 -3212 833 5621 8322 8511 5550 796 -4377 -6811 -7304
1688 -7304 -4853 -680 2707 4057 3342 119 -3444 -5483 -5353 -2233 2387 6440 8619 7680 4325 -512
1704 -512 -4584 -6758 -6154 -3146 340 3260 3868 1962 -1436 -4643 -6029 -5260 -1573 3004 6634 8340
1720 8340 6777 3024 -1527 -4950 -6200 -4760 -1377 1832 3848 3125 892 -2581 -5530 -5903 -4313
1735 -4313 -239 3819 7010 7582 5519 1598 -2304 -4987 -5147 -3175 -124 2921 4284 3208 130
1750 130 -3506 -5804 -6142 -3648 510 4439 6877 6235 3983 159 -3148 -5015 -4173 -1683 1610 4048
1766D048J64k071k847l611j509O81K976L909L650J159j180l064l677l047p60J725
1782c454L031L201J938k55k766l103l074r45J380L022L715K597N45j508l610l532
1798b818k305O0J790L419K811J546j064k312l110k139k41J857L308L238K085p07
1814E418k367l777l165j801P52K469L381K029J198j775k501k662j503O73K414
1829a217L329K992R93j016k946l617l020o87R55K589L179J584j22j777k831j978
1845c590r66J502K921L484K448K43j374l285l431k521l84J343K836K399J487q65
1861B247k257k614j822K27K003L086L094K182l95k059l123l114j730N57J368K483
1877A33K294J22j358k417k337j379Q29K298L657K860J280o01k419l289k491j380
$$ plain form
1766 4048 4212 2141 -706 -4317 -5826 -5145 -2169 1740 5390 6549 5369 2305 -1372 -4419 -5179 -3454
1782 -3454 -423 2778 4716 4461 1695 -1408 -4482 -5427 -4047 -1025 2690 5287 5832 4324 714 -2818
1798 -2818 -5123 -5063 -3273 146 2957 4503 3439 1127 -1983 -4122 -4363 -2506 802 4040 6125 5418
1814 5418 3051 -726 -3891 -5692 -4940 -2471 910 2939 4137 2362 -139 -2801 -4304 -3631 -1217
1829 -1217 2112 5104 6097 5081 2135 -1482 -4502 -5189 -4234 -1645 1534 3118 2996 1219 -1612 -3590
1845 -3590 -4556 -3054 -133 3351 5799 6042 4668 1383 -2048 -4569 -4953 -3610 -774 1625 3112 2247
1861 2247 -10 -2624 -4446 -4219 -2216 870 3964 6146 5751 3692 569 -2545 -4275 -3718 -2350 133
1877 133 2427 2549 1191 -1226 -3563 -4942 -4113 -1815 1842 4702 5982 5381 2962 -327 -2818 -4198
1893d198J090J947K141J396M3j745k773k260p93J175K955L287K605J102j186k642
1909B144k869j907p85J001K573J810Q24q34k527k556j738l28K070K498L619K227
1925E222K96j398k852k431j664j61J476K324J742O8j471k231k944j211J31K062
1941c042L427L026J690J73k045k708k085j090P06J497J997J456p11j397k812k343
1957d261j160P49K482K976K622J028l51k091k196j887K6J138J880J750P88m84
1973C009k852k556k487p36J422K483L284J995M54o59k252k007j220L39J448K307
1989A972J463J9q72k665l077j575l09J275K612K932J450nj064k044j904l48O33
2006a507K030K013J334Q1k054k573k748j248K82J607K423K263J134m22j577k003
$$ plain form
1893 -4198 -3108 -1161 980 2376 2419 674 -2099 -4359 -5152 -3977 -1022 2265 4870 5972 4786 2144
1909 2144 -725 -2632 -3417 -2416 157 1967 2791 1957 -570 -3126 -4864 -5192 -3122 -624 2995 5222
1925 5222 5518 4120 1268 -1163 -2827 -2988 -1512 812 2554 2622 1151 -1080 -4024 -5235 -5104 -3042
1941 -3042 385 3411 5101 5274 3229 521 -1564 -2654 -1948 -451 1546 3002 2291 894 -1918 -4261
1957 -4261 -5421 -4672 -2190 786 3408 4436 4085 1994 -202 -2089 -2063 -925 955 2705 3493 3009
1973 3009 157 -2399 -4886 -5622 -4200 -1717 1567 3562 4016 3357 1105 -902 -2122 -1783 -335 1972
1989 1972 3435 3454 2582 -83 -3160 -4735 -5044 -3769 -1157 1775 3225 3220 2156 112 -1792 -2140 -1507
2006 -1507 523 2536 3870 3951 1897 -676 -3424 -4672 -4390 -2783 -360 1903 3037 2615 1038 -965
2022i65j377j28J421J975K061J173m85k167k339k274j184M46K342K077J706N46
2038B828q78j963j585j321L10J861K262J629Q77j057j958k470j760m43R76K399
2054b93J678J264j67j055k215j490n39Q24J533K352J307K29j147j899k031j469
$$ plain form
2022 -965 -2342 -2470 -1049 926 2987 4160 3675 1508 -831 -3105 -4289 -3843 -1501 576 2282 2828
2038 2828 1950 -13 -1598 -2919 -2609 -748 1514 3143 4020 2963 1005 -1465 -3225 -3668 -2692 -293
2054 -293 1385 2649 2482 1427 -788 -2278 -2817 -1993 -460 1892 3199 3428 2281 382 -1649 -3118
$$ [...]
8191F3
##END NTUPLES=NMR FID
##END=
