##TITLE=1H_Pr BnAm
 CDCl3, 8 sc, 
 7.07.2021
##JCAMPDX= 6.0         $$ Bruker NMR JCAMP-DX V2.0
##DATA TYPE= NMR FID
##DATA CLASS= NTUPLES
##ORIGIN= UXNMR, Bruker Analytische Messtechnik GmbH
##OWNER= root
$$ XWIN-NMR		Version 3.5
$$ Wed Jul  7 11:55:35 2021 Russian Standard Time (UT+4h)  she@DPX200
##.OBSERVE FREQUENCY= 200.131506
##.OBSERVE NUCLEUS= ^1H
##.DELAY= (6, 6)
##.ACQUISITION MODE= SIMULTANEOUS
##.ACQUISITION SCHEME= undefined
##.AVERAGES= 8
##.DIGITISER RES= 18
##SPECTROMETER/DATA SYSTEM= spect
##.PULSE SEQUENCE= zg30
##.SOLVENT NAME= DMSO
##.SHIFT REFERENCE= (INTERNAL, DMSO, 0, 15.7039)
##AUDIT TRAIL= $$ (NUMBER, WHEN, WHO, WHERE, WHAT)
$$ ##TITLE= Audit trail, XWIN-NMR		Version 3.5
$$ ##JCAMPDX= 5.01
$$ ##ORIGIN= Bruker BioSpin GmbH
$$ ##OWNER= she
$$ F:/spectra/data/she/nmr/H-F/1/audita.txt
$$ ##AUDIT TRAIL=  $$ (NUMBER, WHEN, WHO, WHERE, WHAT)
(   1,<2021-07-07 11:54:05.37 +0400>,<she>,<DPX200>,
      <created by zg, POWCHK disabled, PULCHK disabled
       configuration hash MD5:
       00 E9 B6 7A A2 85 ED C7 34 08 36 98 17 FE 4E 26
       data hash MD5: 16K
       BC 7D D1 C9 FE BA 65 7A F1 10 FC C3 18 7E 01 7D>)
$$ ##END=
$$ 
$$ hash MD5
$$ E2 28 71 56 E9 FE 95 97 A2 3C 20 FF 80 A4 CE 18
##$RELAX= 
##$RELAX= 
##$RELAX= 
##$RELAX= 
##$RELAX= 
##$RELAX= 
$$ Bruker specific parameters
$$ --------------------------
##$DU= <F:/spectra>
##$EXPNO= 1
##$NAME= <H-F>
##$PROCNO= 1
##$TYPE= <nmr>
##$USER= <she>
##$AMP= (0..31)
100 100 100 100 100 100 100 100 100 100 100 100 100 100 100 100 100 100 
100 100 100 100 100 100 100 100 100 100 100 100 100 100 
##$AQSEQ= 0
##$AQ_mod= 1
##$AUNM= <au_zg>
##$AUTOPOS= <>
##$BF1= 200.13
##$BF2= 200.13
##$BF3= 200.13
##$BF4= 200.13
##$BF5= 200.13
##$BF6= 200.13
##$BF7= 200.13
##$BF8= 200.13
##$BYTORDA= 1
##$CFDGTYP= 0
##$CFRGTYP= 5
##$CHEMSTR= <none>
##$CNST= (0..31)
1 1 145 1 1 1 1 1 1 1 1 1 1 1 1 1 1 1 1 1 1 1 1 1 1 1 1 1 1 1 1 1 
##$CPDPRG= <>
##$CPDPRG1= <>
##$CPDPRG2= <>
##$CPDPRG3= <>
##$CPDPRG4= <mlev>
##$CPDPRG5= <mlev>
##$CPDPRG6= <mlev>
##$CPDPRG7= <mlev>
##$CPDPRG8= <mlev>
##$CPDPRGB= <>
##$CPDPRGT= <>
##$D= (0..31)
0 1.2 0 0 0 0 0 0 0 0.06 0 0.03 0 0 0 0 0.0002 0 0 0 0 0 0 0 0 0 0 0 0 
0 0 0 
##$DATE= 1625644444
##$DBL= (0..7)
120 120 120 120 120 120 120 120 
##$DBP= (0..7)
150 150 150 150 150 150 150 150 
##$DBP07= 0
##$DBPNAM0= <>
##$DBPNAM1= <>
##$DBPNAM2= <>
##$DBPNAM3= <>
##$DBPNAM4= <>
##$DBPNAM5= <>
##$DBPNAM6= <>
##$DBPNAM7= <>
##$DBPOAL= (0..7)
0.5 0.5 0.5 0.5 0.5 0.5 0.5 0.5 
##$DBPOFFS= (0..7)
0 0 0 0 0 0 0 0 
##$DE= 6
##$DECBNUC= <off>
##$DECIM= 32
##$DECNUC= <off>
##$DECSTAT= 4
##$DIGMOD= 1
##$DIGTYP= 9
##$DL= (0..7)
0 120 120 120 120 120 120 120 
##$DP= (0..7)
150 150 150 150 150 150 150 150 
##$DP07= 0
##$DPNAME0= <>
##$DPNAME1= <>
##$DPNAME2= <>
##$DPNAME3= <>
##$DPNAME4= <>
##$DPNAME5= <>
##$DPNAME6= <>
##$DPNAME7= <>
##$DPOAL= (0..7)
0.5 0.5 0.5 0.5 0.5 0.5 0.5 0.5 
##$DPOFFS= (0..7)
0 0 0 0 0 0 0 0 
##$DQDMODE= 0
##$DR= 18
##$DS= 0
##$DSLIST= <SSSSSSSSSSSSSSS>
$$ [...]
##$SUBNAM2= <"">
##$SUBNAM3= <"">
##$SUBNAM4= <"">
##$SUBNAM5= <"">
##$SUBNAM6= <"">
##$SUBNAM7= <"">
##$SUBNAM8= <"">
##$SUBNAM9= <"">
##$SW= 20.0188882624521
##$SWIBOX= (0..15)
0 0 2 0 0 0 0 0 0 0 0 0 0 0 0 0 
##$SW_h= 4006.41025641026
##$TD= 16384
##$TD0= 1
##$TE= 0
##$TE2= 300
##$TE3= 300
##$TEG= 300
##$TL= (0..7)
0 120 120 120 120 120 120 120 
##$TP= (0..7)
150 150 150 150 150 150 150 150 
##$TP07= 0
##$TPNAME0= <>
##$TPNAME1= <>
##$TPNAME2= <>
##$TPNAME3= <>
##$TPNAME4= <>
##$TPNAME5= <>
##$TPNAME6= <>
##$TPNAME7= <>
##$TPOAL= (0..7)
0.5 0.5 0.5 0.5 0.5 0.5 0.5 0.5 
##$TPOFFS= (0..7)
0 0 0 0 0 0 0 0 
##$TUNHIN= 0
##$TUNHOUT= 0
##$TUNXOUT= 0
##$USERA1= <user>
##$USERA2= <user>
##$USERA3= <user>
##$USERA4= <user>
##$USERA5= <user>
##$V9= 5
##$VALIST= <valist>
##$VCLIST= <CCCCCCCCCCCCCCC>
##$VD= 0
##$VDLIST= <DDDDDDDDDDDDDDD>
##$VPLIST= <PPPPPPPPPPPPPPP>
##$VTLIST= <TTTTTTTTTTTTTTT>
##$WBST= 1024
##$WBSW= 4
##$XGAIN= (0..3)
0 0 0 0 
##$XL= 0
##$YL= 0
##$YMAX_a= 182330
##$YMIN_a= -140345
##$ZGOPTNS= <>
##$ZL1= 120
##$ZL2= 120
##$ZL3= 120
##$ZL4= 120
##$ABSF1= 10
##$ABSF2= 0
##$ABSG= 5
##$ABSL= 3
##$ALPHA= 0
##$AQORDER= 0
##$ASSFAC= 0
##$ASSFACI= 0
##$ASSFACX= 0
##$ASSWID= 0
##$AUNMP= <proc_1d>
##$AZFE= 0.1
##$AZFW= 0.1
##$BCFW= 1
##$BC_mod= 2
##$BYTORDP= 1
##$COROFFS= 0
##$CY= 11.3945322036743
##$DATMOD= 1
##$DC= 2
##$DFILT= <>
##$DTYPP= 0
##$F1P= 15.9154993809931
##$F2P= -4.1035820241983
##$FCOR= 0.5
##$FTSIZE= 0
##$FT_mod= 4
##$GAMMA= 1
##$GB= 0.15
##$INTBC= 1
##$INTSCL= 1
##$ISEN= 128
##$LB= 0.24
##$LEV0= 0
##$LPBIN= 0
##$MAXI= 10000
##$MC2= 0
##$MEAN= 0
##$ME_mod= 0
##$MI= 1.114404
##$NCOEF= 0
##$NC_proc= 0
##$NLEV= 6
##$NOISF1= 3.799351
##$NOISF2= 2.8
##$NSP= 1
##$NTH_PI= 0
##$NZP= 0
##$OFFSET= 15.70392
##$PC= 1
##$PHC0= -12071.95
##$PHC1= 11.00099
##$PH_mod= 1
##$PKNL= yes
##$PPARMOD= 0
##$PSCAL= 0
##$PSIGN= 0
##$REVERSE= no
##$SF= 200.130013532006
##$SI= 16384
##$SIGF1= 3
##$SIGF2= 2
##$SINO= 400
##$SIOLD= 16384
##$SREGLST= <1H.CDCl3>
##$SSB= 0
##$STSI= 0
##$STSR= 0
##$SW_p= 3612.71676300578
##$SYMM= 0
##$S_DEV= 0
##$TDeff= 0
##$TDoff= 0
##$TI= <>
##$TILT= no
##$TM1= 0
##$TM2= 0
##$TOPLEV= 0
##$USERP1= <user>
##$USERP2= <user>
##$USERP3= <user>
##$USERP4= <user>
##$USERP5= <user>
##$WDW= 1
##$XDIM= 8192
##$YMAX_p= 0
##$YMIN_p= 0
$$ End of Bruker specific parameters
$$ ---------------------------------
##NTUPLES= NMR FID
##VAR_NAME=  TIME,          FID/REAL,        FID/IMAG
##SYMBOL=    X,             R,               I
##VAR_TYPE=  INDEPENDENT,   DEPENDENT,       DEPENDENT
##VAR_FORM=  AFFN,          ASDF,            ASDF
##VAR_DIM=   8192,          8192,            8192
##UNITS=     SECONDS,       ARBITRARY UNITS, ARBITRARY UNITS
##FACTOR=    0.0002496,     1,               1
##FIRST=     0,             0,               0
##LAST=      2.0444736,     0,               0
##MIN=       0,             -140345,         0
##MAX=       2.0444736,     182330,          0
$$ Real data points
##PAGE= N=1
##DATA TABLE= (X++(R..R)), XYDATA
$$ [...]
1219G64j131q07K246q69j389J574Q3j688O31J853j409j453J967K8j811J365Q54
$$ 764 -367 -1174 1072 203 -1186 388 471 -1217 -586 1267 -142 -1595 372 400 -1411 -46 808
1236H08j345l64N84M79k62l94M60m8p20M34P15j21j056O04J029j750J01K602j689
$$ 808 -537 -901 -317 162 -100 -494 -34 -82 -802 -368 347 226 -830 -226 803 -947 -846 1756 67
1255F7k146K393J089k451Q2K691j367k400K372J168k294O12J175j310m39J282
$$ 67 -2079 314 1403 -1048 -966 1725 358 -2042 330 1498 -796 -184 991 -319 -758 524
1271E24N75j346k83J272n55o79Q10P14p40r60M83J378j113o16J637o34j318J124
$$ 524 1099 -247 -530 742 187 -492 318 1032 292 -668 -185 1193 80 -536 1101 467 -851 273
1289B73Q61j246l10J375p28j400J940O30k389Q56J164j368k24J376j34j538L40
$$ 273 1134 -112 -422 953 225 -1175 765 1395 -994 -138 1026 -342 -566 810 676 -862 -522
1306e22J260r82k22J108o06o35M96J17k4k76O5M04q61K64P01m60m32M74M82p83
$$ -522 738 -244 -466 642 36 -599 -103 14 -10 -286 -221 183 -678 -414 287 -173 -605 -131 351 -432
1326d32n36J562m01j587J282Q08j404p3J313m95j134J081Q96j601k74K011j078
$$ -432 -968 594 193 -1394 -112 696 -708 -781 532 37 -1097 -16 880 -721 -995 1016 -62
1343f2r69J213N19r86m07J001K15j175N77P96j102K1R20j6q80O5J008n02r39J388
$$ -62 -1031 182 701 -285 -692 309 524 -651 -74 722 -380 -359 561 545 -335 -270 738 236 -703 685
1363F85J93j446K67J043j56r14M40Q17j173k58J443n94o99Q62Kq14K43Q46j96
$$ 685 878 -568 -301 742 586 -328 112 929 -244 -502 941 347 -352 510 512 -302 -59 787 591
1382E91j166N84P92r60R5N91l88l44O9M26k49l89Q23k88q58P83K41o49P7K19R9
$$ 591 -575 9 801 -159 -64 527 139 -205 -136 290 41 -348 475 187 -671 112 353 -296 -219 0 99
1403I9p44K91J006r85l64R63l57n74L71M76l00o09O67K02j068O69N34q34J17N34
$$ 99 -645 -354 652 -333 -697 266 -91 -665 -294 182 -118 -727 -60 142 -926 -257 277 -557 -440 94
1423I4j40m30J36Q07q59m93J134j20p92N32M41l71o17O34O59r99M0R30o72m08
$$ 94 -46 -476 -340 467 -392 -885 249 129 -663 -131 310 -61 -678 -44 615 -384 -344 586 -86 -494
1443d94P92K20n25l83Q17N7j087Q55N36q86j38N99J71o38J49R05p23o38R13N9
$$ -494 298 518 -7 -390 427 484 -603 252 788 -98 -236 363 534 -104 45 950 227 -411 502 561
1463E61p34M26K32k26l12J34N13n58L1M41m27j04K42M6l4l56L52P0o22N37J65
$$ 561 -173 253 485 259 -53 81 594 36 67 508 81 -23 219 265 231 -125 227 297 -325 212 377
1484C77n95J46J11k23J73%Nl3k94N35o13K6O64m09k83J75J83o9l91M94K09q34
$$ 377 -218 -72 39 -184 -11 -11 -6 -39 -333 202 -411 -385 279 -130 -413 -238 -55 -124 -515 -21 188 -646
1506f46L03M24k95j79K81R3l19k10O10j40n62N09J92l95J4K58K11m70j32Q36m53
$$ -646 -343 81 -214 -393 -112 -19 -338 -548 62 -78 -640 -131 61 -334 -320 -62 149 -321 -453 383 -70
1527g0l16O33k87k76J96J37J76k71K16J02m87K21L37l84J37J55m8J67l14J57J08
$$ -70 -386 247 -40 -316 -120 17 193 -78 138 240 -247 -26 311 -73 64 219 171 338 24 181 289
1548B89k46L07k10j29K81j4O8j00k08N20l86k95O21j85k25j3J46L3k21K43J68
$$ 289 43 350 140 11 292 278 346 246 38 558 172 -123 498 313 88 75 221 254 33 276 444
1569D44p22M10L57o09J99J60q2j80j93L29R8l25k7J30J56j18l07N52k06p92O94
$$ 444 -278 132 489 -120 79 239 157 -23 -216 113 211 -114 -141 -11 145 27 -280 272 66 -726 -32
1590c2J49l81P8K29k23l16J93M80n31q9M59k62j3QK6L01m65k29O47j9l74r0M92
$$ -32 117 -264 -186 43 -180 -496 -303 177 -354 -443 16 -246 -259 -251 -225 76 -389 -618 29 10 -364 -454 38
1613C8q5m44L66M75q93J27P91n81j67M42J1j99k93N62J22l44j20L7M28j60l98
$$ 38 -47 -491 -125 350 -543 -416 375 -206 -373 69 80 -119 -412 150 272 -72 -192 -155 273 113 -285
1634b85N57L28r81K77P31l62l31L17J23n02l1R14n12n40O82Kk62M5O6K29m78l64
$$ -285 272 600 -381 -104 627 265 -66 251 374 -128 -159 755 243 -297 385 387 125 170 236 465 -13 -377
1656c77O31L32m91m12N25K26p82K89R43r70n13Q87l1n72M80K98n60n04Q41K27
$$ -377 254 586 95 -317 208 434 -348 -59 884 -86 -599 288 257 -315 165 463 -97 -601 240 467
1676D67p36J68J71j89N5j32L04J37o99QO25j32l75K93K53o80l00J190k66q84O51
$$ 467 -269 -101 70 -119 -64 -196 108 245 -454 -446 179 47 -328 -35 218 -462 -762 428 162 -722 -71
1697g1J25n63L87K99n4m66LM52k26J71k27j00M19k90j88Q64m21o24M56J91k39
$$ -71 54 -509 -122 177 123 -343 -340 112 -114 57 -170 -270 149 -141 -329 535 114 -510 -54 137 -102
1718a02p3O17l03p97O71N57p85K25L04k88j12J33J20K79m01j85K02O3R9k88M94
$$ -102 -175 442 139 -658 13 570 -215 10 314 26 -86 47 167 446 45 -140 62 125 224 -64 430
1739D30k32o42O09M24p80L25L58n98k04O43K40o98k0N23m88J11N00m31j97j0j62
$$ 430 198 -444 165 589 -191 134 492 -106 -310 333 573 -125 -145 378 -110 1 501 70 -127 -137 -299
1760b99M31J40l60n3mJ4k8L89k7o04J55N40n02J30M68n17l02L04K66j68k2J11
$$ -299 132 272 -88 -141 -145 -131 -159 230 203 -401 -246 294 -208 -78 390 -127 -429 -125 141 -27 -49 62
1782F2l24j49P02l52k0K57n29l9N89j31r1J20j98k25J53O25m45k71K87j89n0N55
$$ 62 -262 -411 291 -61 -81 176 -353 -392 197 66 -25 95 -103 -328 -175 450 5 -266 21 -168 -218 337
1804C37k28j47O1k22O1L61J30l38j77M02k86o1O10n01m25O68j51j18L45r8l33
$$ 337 109 -38 23 -199 -138 223 353 15 -162 240 -46 -107 503 2 -423 245 94 -24 321 223 -110
1825a10o1K66J31l10M26k31l87M59N8j96J42j48j58J84Q6k3q3Q4j75j49N21k88
$$ -110 -171 95 226 -84 342 111 -276 183 241 45 187 39 -119 65 151 128 45 129 -46 -195 326 38
1847C8k17M37l76j49M36K3l53K7J97k57n0O72l70n18N21N4m38M37Q1m70l6K32
$$ 38 -179 258 -118 -267 169 192 -161 -134 63 -194 -244 428 58 -460 61 115 -323 114 195 -275 -311 -79
1869g9O5p0R4J8j73n0J07j1K70l12k60N83j70l41M02P5l90M3M21n5n02L59K74
$$ -79 -14 -84 10 28 -145 -195 -88 -99 171 -141 -401 182 12 -329 73 148 -242 -199 222 167 -335 24 298
1892B98o14K07M74m81K6J80r7nOJ08q2j04R2KQ1J42l30L27j24k02J58K28k90q0
$$ 298 -316 -109 365 -116 -90 90 -7 -12 -6 102 20 -84 8 10 91 233 -97 230 106 -96 62 290 0 -80
1916h0K20j07P7o0L17k61k05M17k97J03K1j97J40J12k77R2Q8j42j47R2K89k96
$$ -80 140 33 110 50 367 106 -99 318 21 124 145 -52 88 200 -77 15 103 -39 -186 -94 195 -101
1938a01n4L91k70j51L00j21O1j61P0J39m55K24L23k45L1k10K27Q6l68K72J15l48
$$ -101 -155 236 -34 -185 115 -6 55 -106 -36 103 -352 -128 195 -50 -19 -229 -2 84 -284 -12 103 -245
1960b45R7L34k04q3RK21k76j45M25J1m63K97J09k27Q4k6Q2o0r6K65k00N3P8j44
$$ -245 -148 186 -18 -101 -92 129 -147 -292 133 144 -319 -22 87 -140 -56 -82 0 -60 -156 109 -91 -38 40 -104
1984a04J68r3p7K39k46J0J50o9m0J77j81J60j61K3J05j54L01k08j10K25L2j18
$$ -104 64 -29 -106 133 -113 -103 47 -22 -62 115 -66 94 -67 -44 61 -93 208 0 -110 115 147 29
2006B9J33j29J18mj23J29j25pJ18j31m8J33j08J89k29N9J42k50N0J69p6N7j54
$$ 29 162 33 151 147 24 153 28 21 139 8 -40 93 -15 174 -55 4 146 -104 -54 115 39 96 -58
2029e8J59q9j93R2k6R5Q0K4j74J70j38P3j2j40k4QJ46o3j26K29o3j23J93j51Q8
$$ -58 101 12 -181 -89 -115 -20 60 84 -90 80 -58 15 3 -137 -161 -153 -7 -70 -196 33 -30 -153 40 -111 -23
2054b3N3k01K45o8j69J88n0q3R9K6J02j54j22K49j26j45K32Jj69m0j7L27k35p4
$$ -23 30 -171 74 6 -163 25 -25 -108 -9 17 119 -35 -157 92 -34 -179 53 54 -115 -155 -172 155 -80 -154
2078a54K90k27j07K48n9Q0j51J55K16n43J82K05j50mk4J54r5k42L90J07l61Q2
$$ -154 136 -91 -198 50 -9 71 -80 75 291 -252 -70 135 -15 -19 -43 111 16 -226 164 271 -90 -8
2100hJ88j29ro9K65j78k74L97q6j46J73jj76J22j20K23j78n1O2J33r1p3N0J64
$$ -8 180 51 42 -27 238 60 -214 183 97 -49 124 123 -53 69 -51 172 -6 -57 5 138 47 -26 24 188
2124A88l27r9N26k87j29J49M1M1l36J83J58k75L3K09j23n4Q6M6O9m34J66K48j83
$$ 188 -139 -238 288 1 -128 21 62 103 -233 -50 108 -167 -134 75 -48 -102 -16 30 99 -335 -169 79 -104
2147a04j19J46R0K6l46M07o1l84L05J08j71J8N8j3j13m1L46k59Q4K5j0l0o6p4
$$ -104 -223 -77 13 39 -307 100 39 -345 -40 68 -103 -85 -27 -40 -153 -194 152 -107 -23 2 -8 -38 -104 -178
2171a78L67j65j58K81k3k13L6K18J18l90Q1L77m95J95K15k75jJ13M5k0k8J4mq5
$$ -178 189 24 -134 147 124 -89 -53 165 283 -107 -26 351 -144 51 266 -9 -10 103 148 128 100 114 110 25
2195B5K0QJ25Q0n33L38K20m21J13K44k91r0L25o1l7m9L3k37J76J96m07L19J2k83
$$ 25 45 53 178 258 -275 63 283 -138 -25 219 -72 -162 163 102 65 16 49 -188 -12 184 -223 96 108 -175
2219a75J01K57k55p2J43k9j97J57L12m35M0K99l21j8K26j61m4NR2K1k1J46k59
$$ -175 -74 183 -72 -144 -1 -30 -227 -70 242 -193 -153 146 -175 -193 33 -128 -172 -167 -75 -54 -75 71 -188
2242a88O5J63j58L9M45o66N3L92k20M0L10k12l71K42L75k07k33L26k39j61M26
$$ -188 -123 40 -118 -79 366 -300 -247 145 -75 -35 275 63 -308 -66 309 102 -131 195 -44 -205 221
2263B21j39j55K64k33j32K45J30k42J6O8j52J06L64j04l95K48r1m7L80j88j98
$$ 221 82 -73 191 -42 -174 71 201 -41 -25 43 -109 -3 361 257 -138 110 19 -28 352 164 -34
2284c4J12mq0J95J66l45k37N44k51k34M75j41n20L32K95k72p1L45k60l20M67j2
$$ -34 78 74 -6 189 355 10 -227 317 66 -168 307 166 -354 -22 273 1 -70 275 15 -305 162 150
2306A50k62J97j96k26M00P4j27qj46p0K61rj91R8n1l4j28N05k07l99L56m8k25
$$ 150 -112 85 -111 -337 63 137 10 2 -144 -214 47 38 -153 -55 -106 -140 -268 237 30 -369 -13 -61 -286
2329b86J47J76j24j32K28Rk62L93r7l98J88J91k62K51p7m9j05J61K42k61L1K12
$$ -286 -139 37 -87 -219 9 18 -244 149 52 -346 -158 33 -229 22 -55 -104 -209 -48 194 -67 -36 176
2351A76k98J9J78j01K01k19k01L26Q4l06L24J5m71J19L68J22m33J93K61o97L30
$$ 176 -122 -103 75 -26 175 -44 -245 81 165 -141 183 198 -273 -154 214 336 -97 96 357 -340 -10
2372a0M14l12k24L18O4k26L0K59j69k00J82n1q6J90j45Nq6o4K41L4k52J10o9J34
$$ -10 404 92 -132 186 250 24 54 313 144 -56 126 75 -11 179 34 39 -47 -111 130 164 -88 22 -47 87
2396H7k74L38m9l11J28J73j63K4J66k86Q6P1Q0j68N0J04j63m5L68k18p8Q8n0j69
$$ 87 -187 151 102 -209 -81 92 -71 -47 119 -167 -81 -10 70 -98 -48 56 -107 -152 216 -2 -80 8 -42 -211
2420b11J85J05l9k44J49J79l63K01K24l32K7J1K20m0l01L13j26j75K12M4n5n9
$$ -211 -26 79 40 -204 -55 124 -239 -38 186 -146 -119 -108 112 72 -229 84 -42 -217 -5 39 -16 -75
2442g5O2J89k56k30N99k10l36K70j7l4l4K89j84k67K17L06l02LJ21o6JJ36n0k3
$$ -75 -13 176 -80 -310 289 79 -257 13 -4 -38 -72 217 33 -234 -17 289 -13 -10 111 45 46 182 132 109
2466A09k84L03oj30J20q5l9o4N6J41op6J12j94o8J71R1j30K6M1p8j20J59M9j79
$$ 109 -175 128 122 -8 112 27 -12 -76 -20 121 115 39 151 -43 -111 60 151 21 47 88 10 -110 49 98 -81
2491h1P5J98k70j2J02r7j46R7Q9L6r4J02M6k37K24j76R1r1m6J90q9J3O1jm1O7
$$ -81 -6 192 -78 -90 12 -85 -231 -134 -45 -9 -103 -1 45 -192 32 -144 -53 -144 -190 0 -89 -76 -15 -16 -57 10
2517A0q0m7j6J58Jj41N7K77l39k2J63j39J0M3J65j08p6J72p7j23J66J13j78l4
$$ 10 -70 -117 -133 25 26 -115 -58 219 -120 -142 21 -118 -108 -65 100 -8 -84 88 11 -112 54 167 -11 -45
2541d5J51Ok02P3J79j97N9K09j00l53K30J34m5k78K69J55l64K11J35j67j82J59
$$ -45 106 112 -90 -17 162 -35 24 233 133 -220 10 144 99 -179 90 245 -119 92 227 60 -122 37
2563C7J60j43j00L16j61l19K74K8j75k2K05p9j15M3J63j60j62L53j85K1N8j26
$$ 37 197 54 -46 270 109 -210 64 92 -83 -105 100 21 -94 -51 112 -48 -210 143 -42 -21 37 -89
2585h9J57j77P1R9j28N9kj34J54r4k5O4p9M3n2N3Q0p0q3J77m0j65J60P2j6j41
$$ -89 68 -109 -38 61 -67 -8 -10 -144 10 -84 -109 -45 -124 -81 -133 -80 0 -70 -153 24 -16 -181 -21 51 35 -106
2611a06O4J75k20l3K55k86l5L32o7j05j04L61j49q1L4J65k51r3J77K01k70k4L37
$$ -106 -42 133 -87 -120 135 -151 -186 146 79 -26 -130 231 82 1 35 200 -51 -144 33 234 -36 -60 277
2634B77k29j48L36k5j84R2k5Q9k85J12J95j31o1R7K8q4J9L2k9j41J24O3j96OJ19
$$ 277 48 -100 236 211 27 119 94 183 -102 10 205 74 13 110 138 54 73 105 76 -65 59 122 -74 -68 51
2659E1j32J8M2O3mj39K43k10M3lm9P0k1r5J74r9M8M7j29pQ0o0N4P8p5j71J52P3
$$ 51 -81 -63 -21 42 38 -101 142 -68 -25 -28 -77 -7 -28 -123 51 -48 0 47 -82 -89 -9 -69 -15 63 -12 -183 -31 42
2687D2j55r9J10N4m0N7K1n2L8j16J69j66J31lj23K07j28J10o5j41J03J30j08J
$$ 42 -113 -212 -102 -48 -88 -31 -10 -62 -24 -140 29 -137 -6 -9 -132 75 -53 57 -8 -149 -46 84 -24 -23
2711b3J76k20O8J2K5L6o5J32j70m8K34j57P8J03j14j00N0Q3j0j24N7Q0j47J20
$$ -23 153 -67 1 13 38 74 9 141 -29 -77 157 0 78 181 67 -33 17 100 90 -34 23 103 -44 76
2735G6L6n5P7p1JL8n5j91K10j06J29P8k05J09j68J80j08r5K75k56q9K40p6K8J1
$$ 76 112 57 134 63 64 102 47 -144 66 -40 89 167 -38 71 -97 83 -25 -120 155 -101 -190 50 -26 2 13
2760A3p6oo0J47J08j09J3K8j35R0r2j26J14K9m4J46r7o9%m0qm9J85O6j36K5P3
$$ 13 -63 -69 -129 18 126 17 30 58 -77 13 -79 -205 -91 -62 -106 40 -57 -126 -126 -166 -174 -223 -38 28 -108 -83 -10
2787a0j01K5J19n2J3k2MN7Pk8r9L2Q5j35J88K6k32J23j5J29m0j38K05j70N4J42
$$ -10 -111 -86 33 -19 -6 -28 -24 33 40 12 -87 -55 30 -105 83 109 -123 0 -15 114 74 -64 141 -29 25 167
2813A67j59Q3J24k77j1J01r4K93j66n8N8jO6J2n1L1j64Q9Q1q6j1L6rj00L9R7o2
$$ 167 8 91 215 -62 -73 28 -66 227 61 3 61 60 126 138 87 118 -46 43 124 38 27 63 54 -46 -7 90 28
2840B8o1J36j10P0p8L2l9M7n3MJ0k5J42j55P1jj78J79J6k29J30Q3j77J83J7j34
$$ 28 -33 103 -7 63 -15 17 -22 25 -28 -24 -14 -39 103 -52 19 18 -160 19 35 -194 -64 19 -158 25 42 -92
2866i2M0L1P7j19N6L8k52K04l0J3J5jm2K2j5N9j5l6M2m1J89j15p8O9L3j46J17
$$ -92 -52 -21 56 -63 -7 31 -221 -17 -47 -34 -19 -20 -62 -40 -55 4 -11 -47 -5 -46 143 28 -50 19 52 -94 23
2893B3K71k67m0kM4J0J3J65k58K6J91k09J29P6k23J8J57q0M4l9l2l3P6N7j64K52
$$ 23 294 27 -13 -15 29 39 52 217 -41 -15 176 -33 96 172 -51 -33 124 44 88 49 17 -16 60 117 -47 205
2919B05n5k82K22Lk9p0J12l4k10J07J02o5M4O9k21K7J94j88J29M4k92k1L39o1
$$ 205 150 -132 90 93 64 -6 106 72 -138 -31 71 6 50 119 -102 -75 119 -69 60 104 -188 -209 130 69
2943F9k13J62J9k74K66Q7k30n2K43k63R5P3j77Q9J8J6N9J24q3j04m8J66j97J18
$$ 69 -144 18 37 -237 29 116 -114 -166 77 -186 -91 -18 -195 -106 -88 -72 -13 111 28 -76 -124 42 -155 -37
2967c7J86l55j2L53j14j70J09L10l95k8L09p3j15Q8L1k77K06J15j52J60k58P5
$$ -37 149 -206 -218 135 21 -149 -40 270 -125 -153 156 83 -32 56 87 -190 16 131 -21 139 -119 -44
2989d4QJ51j25J5J11j78J94J30j82k19K56r7j26J90m2m4P8q4Rr4J60L4j00J11
$$ -44 -36 115 -10 5 116 -62 132 262 80 -139 117 20 -106 84 42 -2 76 -8 1 -93 67 101 1 112
3013A12j46M1O5j2j38J45P5j27n4L7k9P1M0J6j98J97j0j55K3k9M8J31j54J0M2
$$ 112 -34 7 72 60 -78 67 142 15 -39 -2 -31 40 80 96 -102 95 85 -70 -47 -76 -28 103 -51 -41 1
3038Ak7r8JK07k47p4L23m5k29J36K11k83O8M0M9k42J01J81j46J7M7lm6m4O2J17
$$ 1 -26 -124 -123 84 -163 -237 86 41 -188 -52 159 -124 -56 -16 33 -209 -108 73 -73 -56 -9 -12 -58 -102 -40 77
3064G7k49J21J66j28l5K5J81j17k23K27n5o6R7J1j18K0J03P4j25m6J40r9R3n1
$$ 77 -172 -51 115 -13 -48 -23 158 41 -182 45 -10 -76 21 32 -86 -66 37 111 -14 -60 80 -19 74 23
3088B3o5P0O9r5J74l7r2J2j31J13N2j48K02n7j24O6J9n4Pl7J10k9j31K8m6M4j2
$$ 23 -42 28 97 2 176 139 47 59 -72 41 93 -55 147 90 -34 32 51 -3 4 -33 77 48 -83 -55 -101 -57 -69
3115f9J11n3L7Mjq9R2Q9k38j4O8J21o8j21K37j41j20M5J53j95j04K99J14j23j41
$$ -69 42 -11 26 30 29 -60 32 121 -117 -131 -63 58 -10 -131 106 -35 -155 -110 43 -152 -256 43 157 34 -107
3140a07J78o7k29K76l6q6pJ03j26J04p5J41j36m3J27K7M0j05N8j58J8P4o9K7J43
$$ -107 71 4 -225 51 15 -71 -78 25 -101 3 -72 69 -67 -110 17 44 84 -21 37 -121 -103 -29 -98 -71 72
3165G2J9k08J83K4n7m0M5N8m0j56J47P8j37PL3J9j2Q0j30j05J66J19k20Q5J35
$$ 72 91 -117 66 90 33 -7 38 96 56 -100 47 125 -12 -5 28 47 35 115 -15 -120 46 165 -55 30 165
3190A65p7o0q7K62j98k1J60j21qjJ9k8J02k30J14n9k9J27k8r3M0J31k5o8P1L1
$$ 165 88 28 -59 203 5 -16 144 23 15 14 33 5 107 -123 -9 -68 -97 30 2 -91 -51 80 55 -13 58 89
3216H9j08l0Q5j87J29L7j43K18j36PK2r5P1KK7J60k69l1J63n2l8J00m5o4K4K5
$$ 89 -19 -49 36 -151 -22 15 -128 90 -46 -39 -17 -112 -41 -39 -12 148 -121 -152 11 -41 -79 21 -24 -88 -64 -39
3242c9J68k77J70Mq4j6J05R2j59j0J08k3m7qN4k5l0MJ4P1m1J5J03j01n1J97j64
$$ -39 129 -148 22 26 -58 -74 31 123 -36 -46 62 39 -8 -16 38 13 -17 -13 1 72 31 46 149 48 -3 194 30
3269C0j0J5J08j66P9Q9l2j99J40N0n3j46J14P1j69J33j8j5O3j65O5J95j54p5J65
$$ 30 20 35 143 -23 56 145 113 -86 54 104 51 -95 19 90 -79 54 36 21 84 -81 -16 179 25 -50 115
3294A15k16J30j35K05mj14O6r4O2P2m0j07L7k6M1j11J04P5k2k29P2j4J29m1m0
$$ 115 -101 29 -106 99 95 -19 47 -47 15 87 47 -60 -23 -49 -8 -119 -15 60 38 -191 -119 -133 -4 -45 -85
3319h5J46q7q5J53Ln5m3j34K54k30J41P7j2r7J22j38Q9r6K8Q9n3j7J44N4j83j34
$$ -85 61 -26 -111 42 45 -10 -53 -187 67 -163 -22 55 43 -54 68 -70 19 -77 -49 40 -13 -30 114 168 -15 -149
3345a49K43n5j80J78K7j85M9K24j42l3J36j22n0R2M6m9Q8j28R7J0J11k15J11M9
$$ -149 94 39 -141 37 64 -121 -72 152 10 -23 113 -9 -59 33 79 30 118 -10 87 97 208 -7 104 153
3369A53k28J79j3qj56l2M9j7J62K0k42J16N1j30J69M1q5l3N8o4p5J26j39l9J04
$$ 153 -75 104 91 83 -73 -105 -56 -73 89 109 -133 -17 34 -96 73 114 29 -4 54 -10 -85 41 -98 -137 -33
3394c3J37j25J13j21j94J17P9l4K0J44j80j11K45J1k04N8J04j48J4J55j08K3m2
$$ -33 104 -21 92 -29 -223 -106 -27 -61 -41 103 -77 -188 57 68 -136 -78 26 -122 -108 47 -61 -38 -80
3417h0l5n0K68j76J0J2J62r0j8O7j48L4J13j07p3J63r2r9K4K26j41J55j4k14J52
$$ -80 -115 -165 103 -73 -63 -51 111 21 3 70 -78 -44 69 -38 -111 52 -40 -139 -115 111 -30 125 111 -103 49
3442D9J95j95l6K55k26o8J08qj17J51L3j51l8K82j59k10K87j09j6R7L9k42N8M7
$$ 49 244 49 13 268 42 -26 82 74 -43 108 141 -10 -48 234 75 -135 152 43 27 124 163 -79 -21 26
3466B6J6pN3j18J3J69k96J02K28k16j02K91j95MJ95o9k71K8J56Mj22J07n9q6K10
$$ 26 42 35 88 -30 -17 152 -144 -42 186 -30 -132 159 -36 -32 163 94 -177 -149 7 11 -111 -4 -63 -149 61
3491F1m1j63K48r7m0n9P4MnJ4m2j2N0l6r8K00j18q1K71j41k2R9l4l3r5O9Oo1K45
$$ 61 20 -143 105 8 -32 -91 -17 -13 -18 -4 -46 -58 -8 -44 -142 58 -60 -141 130 -11 -33 66 32 -1 -96 -27 -21 -82 163
3520A63j36j75J80M7j95Q8j08K78k07J87m5j62J04j3j15Q6R4j4p6L4M8r6Q2O7
$$ 163 27 -148 32 79 -116 -28 -136 142 -65 122 77 -85 19 6 -109 -23 71 57 -19 15 63 -33 49 116
3544A16j16L5K8q5J13n0K0L7k1j80L00p5k39J73J05r9p5l8J28j46J26Q4k41J84
$$ 116 0 35 63 -22 91 41 61 98 77 -103 197 122 -117 56 161 62 -13 -51 77 -69 57 141 -100 84
3568H4j69K4j0k4J49o9j59K72j94J33o7N1kr5O5j4j8l5J22j40K3k9P8L6p9j4L7
$$ 84 -85 -61 -71 -95 54 -15 -174 98 -96 37 -30 21 19 -76 -11 -25 -43 -78 44 -96 -73 -102 -24 12 -67 -81 -44
3595d4k6R4J45k03r9K30k30J04M2mr9n0K07j8j29L9k5R4L2j18J51n6m1Q4n4q0
$$ -44 -70 24 169 -34 -133 97 -133 -29 13 9 -90 -140 67 49 -80 -41 -66 28 60 -58 93 37 -4 80 26 -54
3621e4Q0n1j3Q7j0KN7q6O2l0j1Q9j34oJ26p6O6j6k9K9k6L1j2n5Q5rnj15k6K03
$$ -54 26 -25 -38 49 39 41 98 12 74 44 33 122 -12 -18 108 32 98 82 53 82 56 87 75 20 105 96 91 -24 -50 153
3651A53j00j0n7k7M9L6k4k2K8L0l3j15J74k8r0j17J60L4j4p2k0J23j84J98r5k1
$$ 153 53 43 -14 -41 8 44 20 -2 26 56 23 -92 82 54 -36 -153 7 41 27 -45 -65 58 -126 72 -23 -44
3677d4q9jO5l0K4J76j98l9K78j38n8mN2P3r9l4J28k27J58L9p3O5r1Q2O0j19MR2
$$ -44 -133 -134 -69 -99 -75 101 -97 -136 142 4 -54 -58 -6 67 -32 -66 62 -165 -7 32 -41 24 -67 15 75 -44 -40 52
3705E2j30R6J7MN5p4o7J15j10R3o1P6N7j79M3L8m5j9J45n2J5j67J85n4O6M2p6
$$ 52 -78 18 35 39 94 20 -47 68 -42 51 -10 66 123 -56 -13 25 -20 -39 106 54 69 -98 87 33 99 141 65
3732F5n2P7L4q7j7K6J27j60m6J28o8p7j9J17O6j52K2P2k5j16R5q8j6L0kO6j31
$$ 65 13 90 124 37 20 46 173 13 -33 95 27 -50 -69 48 114 -38 -16 56 31 -85 10 -78 -94 -64 -66 0 -131
3759a31Q4kq9j8J19Lp3N2N8Nj23Q9M9k52K16j19P1nn3J80j08m5J55r2l7N6J8M4
$$ -131 -47 -49 -138 -156 -37 -34 -107 -55 3 8 -115 -26 23 -229 -13 -132 -61 -66 -119 61 -47 -92 63 -29 -66 -10 8 52
3787E2l6QJ8m3j8N3j19J47r0j9J67q3p1L7m3J63j16O6r1m8J58L8j09o6J06m7J14
$$ 52 16 24 42 -1 -19 34 -85 62 -28 -47 120 37 -34 3 -40 123 7 73 -18 -66 92 130 21 -45 61 14 128
3814A28j65M8J44k33J10J7L6q8P3K9o2j44J81N2n1k0J4n8L3M2L0j23j40K75r2
$$ 128 -37 11 155 -78 32 49 85 -3 70 99 37 -107 74 126 75 55 69 11 44 86 116 -7 -147 128 36
3839C6Jj7l6Q4J2p9P2j12l2R5j7j22P3mJ21j86M8Q6j91J15lLN9J4p9j54J16J61
$$ 36 37 20 -16 68 80 1 73 -39 -71 24 7 -115 -42 -46 75 -111 -63 23 -168 -53 -56 -53 6 20 -59 -213 -97 64
3867F4n1j40J36p8P1J00k99K44N9j66J10L9Qq4r9K28j17q9R2l8J59k29n4J24N9
$$ 64 13 -127 9 -69 2 102 -197 47 106 -60 50 89 97 13 -86 142 25 -64 28 -10 149 -80 -134 -10 49
3892D9o4Q6j72J23n5M2P3k17J45J14j50J37p1j20j3Q7R2o6ooj0N0j25j9R5O4r9
$$ 49 -15 71 -101 22 -33 9 82 -135 10 124 -26 111 40 -80 -93 -6 86 20 14 8 -2 48 -77 -96 -1 63 -36
3919c6LJ19P5j36L8q7L7j12K17j55k6J77j8j72K03j97J18K3j29L0J37r1k8jO7
$$ -36 -33 86 161 25 63 -24 13 -99 118 -37 -63 114 96 -76 127 -70 48 71 -58 -28 109 18 -10 -11 56
3944E6j34k6J37o0j49J71K9q6J45j61J05m0l0j7O7J3lj29l1J98j6J05j41j45K18
$$ 56 -78 -104 33 -27 -176 -5 24 -62 83 -78 27 -13 -43 -60 7 20 17 -112 -143 55 39 144 3 -142 76
3969G6lj4%o3J4QL8k7J04j21O3o2J2J7l7O0k1n0m6J16l8Kn6o2L4K01Qo9l3J1p0
$$ 76 73 59 59 -4 10 18 56 29 133 12 75 13 25 42 5 65 44 -6 -52 64 26 28 -28 -90 -56 145 153 84 51 62 -8
4000hOmJ1m3O4J36j98k5J36n9m1J03o5J11k8j55M0p7O5J04j48J08rJ12q2j23M
$$ -8 -2 -6 5 -38 26 162 -36 -61 75 16 -25 78 13 124 96 -59 -19 -96 -31 73 -75 33 24 136 54 -69 -65
4027f5J8k4o2J21J22p1k03J74Jl1N1n9K5Q9k29J15J12j09M9j24j1PR1Rk1K3j7
$$ -65 -47 -71 -133 -12 110 39 -164 10 11 -20 31 -28 -3 86 -143 -28 84 -25 24 -100 -111 -104 -13 -4 -25 -2 -19
4054a9N2K5p0m7QrN9J17j14n6M9j9K8J29k23K54k70L8J57l9j42K50j37qjJ00K4
$$ -19 33 58 -12 -59 -51 -60 -1 116 2 -54 -5 -24 4 133 -90 164 -106 -68 89 50 -92 158 21 13 12 112 136
4081A36j85K29p2k8o3R3k25J26Q3K4j22J40j00P4n2lM1j47nj8P9K2r2R0p9LJ00
$$ 136 -49 180 108 80 17 110 -115 11 94 118 -4 136 36 110 58 55 96 -51 -56 -74 5 27 -65 25 -54 -51 49
4108D9j24J64p6J02j9k39J66m0j15J33j8q0J76L4q2p9k6J8K2N5r7j8J30J4j74
$$ 49 -75 89 13 115 96 -143 23 -17 -132 1 -17 -97 79 113 31 -48 -74 -56 -34 21 -76 -94 36 50 -124
4133a24J30K6o1n7P5qk0P5O4r6j06J45K1j5Pm9l2L1rKN5O5r8P2Lj68R7O8j70O3
$$ -124 6 32 -29 -86 -11 -19 -39 36 100 4 -102 43 64 49 56 7 -25 6 -3 -1 54 119 21 93 96 -72 25 93 -77 -14
4163a4J19j20m6J59r2Pm9O6Q0j44M9m3M6O7j24N0P5j56J39r9J17k0j11J07n9L
$$ -14 105 -15 -61 98 6 13 -36 30 110 -34 15 -28 18 85 -39 11 86 -70 69 -30 87 67 -44 63 4 7
4189Gl4N6LO7j49M0R5j07%LmJ8j08J04M6o7P8q7p7J21o9J04P2j84R7n4jj7o5P1
$$ 7 -27 29 32 99 -50 -10 85 -22 -22 -19 -23 -5 -113 -9 37 -30 48 -39 -116 5 -64 40 112 -72 25 -29 -30 -47 -112 -41
4219d1PJ5N4r5L2qJ6r4N3M1K1J1lj39P3m6J77j59R6jo1L6K1M7j26M1J89q6j26
$$ -41 -34 -19 35 -60 -28 -36 -20 -114 -61 -20 1 12 9 -130 -57 -103 74 -85 11 10 -51 -15 6 53 -73 -32 157 71 -55
4248e5J46n6j0N8p9l3O8l9l8J7L6O1j12R2J03q8kq3J3L5N9rl6p6J12M1k15J35
$$ -55 91 35 25 83 4 -29 39 0 -38 -21 15 76 -36 56 159 71 69 -14 -1 34 93 84 48 -28 84 125 -90 45
4276D5j60J91l0n6j6J02j10Nk8N5n0P6J5o4R4Ln5qL5j30J29m4j24R8MJ12j70O7
$$ 45 -115 76 46 -10 -26 76 -34 -29 -57 -2 -52 24 39 -25 69 72 17 9 44 -86 43 -1 -125 -27 -23 89 -81 -14
4304a4m6K2N3oq6m2R0N2j3j09LJ15j22M8R6K0Rj37N5j56J14J02J20r2p7P8J3o2
$$ -14 -60 -38 15 9 -77 -119 -29 23 10 -99 -96 19 -103 -55 41 61 70 -67 -12 -168 -54 48 168 76 -1 77 90 28
4332B8j2Q3Jm2l0J6K9j28J01K9n9O5K0j29%J76j91O2J65k17K5J7J5L3K7p6J0l7
$$ 28 16 99 100 58 28 44 73 -55 46 75 16 81 101 -28 -28 148 -43 19 184 -33 -8 9 24 57 84 8 18 -19
4360a9R3j49l3J93q8M6j76K02n8K8L5m9l7P8j11L1K5K6j29R7p0P4L5k4j23%Q5
$$ -19 74 -75 -108 85 -3 43 -133 69 11 39 74 25 -12 66 -45 -14 11 37 -92 5 -65 9 44 20 -103 -103 -18
4387a8kp1Q6M0j13N5l5l9K2J19j02Pj7J62k37J14Q6j11J24J3o2q2N9J3j01Q8p0
$$ -18 -20 -91 -5 35 -78 -23 -58 -97 -75 44 -58 -51 -68 94 -143 -29 57 -54 70 83 21 -61 -2 11 -90 -2 -72
4414g2N2MK9jK3m3q0J52q5K5n2j9r8J05N1M5l2J29r7q2%R0j8L1J7n2l9P0j3k0
$$ -72 -20 -16 13 12 35 -8 -88 64 -21 4 -48 -67 -165 -60 -9 36 4 133 36 -46 -46 44 26 57 74 22 -17 53 40 20
4444B0Q8l9O9j26N9p8O3k2j47L19k03p7J81q0r2N9K4P4l2r6P8m3n1L9K0K3k8n4
$$ 20 108 69 138 12 71 -7 56 34 -113 206 3 -74 107 27 -65 -6 18 92 60 -36 42 -1 -52 -13 7 30 2 -52
4472e2Q5J9j35L0N9l5P7j42R7l1mJ03j00k0J08lm4k3Pl8N9l6N2m2k7l2nO2o6J9
$$ -52 33 52 -83 -53 6 -29 48 -94 3 -28 -32 71 -29 -49 59 56 12 -11 -4 -42 17 -19 33 -9 -36 -68 -73 -11 -77 -58
4502e8P2q0j06J73J09j30k3k0J59j85K01j19M3J3p5Q5K6j14OJ31o9n7n5J64m9
$$ -58 14 -66 -172 1 110 -20 -43 -63 96 -89 112 -7 36 49 -26 59 85 -29 -23 108 39 -18 -73 91 42
4527D2Mn7J85k26J33j1o7L2no8K0J52j30j3L1N5j24J77j17%L1o5J9L9L5j4J7j37
$$ 42 46 -11 174 -52 81 70 3 35 30 -38 -18 134 4 -9 22 77 -47 130 13 13 44 -21 -2 37 72 58 75 -62
4555f2rQ4J41r4k08J96K8j35M2Q5q5k1Q4r0N4p2J8o1K08p1n6K5k2k1q4N9K6P8
$$ -62 -71 13 154 60 -148 48 76 -59 -17 68 -17 -38 46 -44 10 -62 -44 -105 103 32 -24 1 -21 -42 -126 -67 -41 37
4583C7p2l5kJ41o3p0M2J04j89J11j1J8n7J34o6pK8k7l8L8m5l1lJ14j15R9L6j24
$$ 37 -35 -70 -72 69 6 -64 -22 82 -107 4 -7 11 -46 88 22 15 43 16 -22 16 -29 -60 -63 51 -64 35 71 -53
4611e3P7M2J3r8k2O2J7J6M2j34J56o2l8Q4j9OKj70J64O6p5J6j25O4L7j04M0m3
$$ -53 24 66 79 -19 -41 21 38 54 96 -38 118 56 18 102 83 89 91 -79 85 151 76 92 -33 31 68 -36 4 -39
4639c9M1J6J10m2o3J2M8p7k8R9j79J89r7j04M6J05q7M6j2n2L1J31k42J91q3J17
$$ -39 2 18 128 86 23 35 83 6 -22 77 -102 87 -10 -114 -68 37 -50 -4 -16 -68 -37 94 -148 43 -40 77
4665G7k24J75J03k65L9L2j3L9J59j15J69k44J15r8J7m2Pm6N0O9o2P1m7J42j50
$$ 77 -147 28 131 -134 -95 -63 -76 -37 122 7 176 -68 47 -51 -34 -76 -69 -115 -65 4 -58 13 -34 108 -42
4690d2M0L8n7M4L0j19K03k31m4J78Qj15K56r3q6J52j10o3R2Ok1j31NJ17n4J0Q1
$$ -42 -2 36 -21 23 53 -66 137 -94 -138 40 48 -67 189 96 10 162 52 -11 81 87 66 -65 -60 57 3 13 94
4717I4l8L8j06J35j32J6r8L1N3J31m2j8k7k9R0j57lR5j15JN4nQ6p3J9o7J05j10
$$ 94 56 94 -12 123 -9 7 -91 -60 -7 124 82 64 37 8 98 -59 -62 33 -82 -81 -27 -32 54 -19 0 -67 38 -72
4745g2k4J08N1l9j49J66j34J07m1n3p1K1R8L2n3J84q2p3J33k32J72l6o4j3P0O0
$$ -72 -96 12 63 24 -125 41 -93 14 -27 -80 -151 -130 -32 0 -53 131 49 -24 109 -123 49 13 -51 -64 6 66
4771F6j02l0rJ23o8M8j8j8O4m6J6P0j26J32j28J01j36R9L1j6m2p1M1J6R7p7q1
$$ 66 -36 -66 -75 48 -20 28 10 -8 56 10 26 96 -30 102 -26 75 -61 38 69 53 11 -60 -19 -3 94 17 -64
4798f4K19j63l1mM1M5Q7j49Q5L4q8J1L4k9n2J40q2r5R1p5LJ09L1j00n1J10r2P6
$$ -64 155 -8 -39 -43 -2 43 130 -19 66 100 12 23 57 28 -24 116 34 -61 30 -45 -42 67 98 -2 -53 57 -35 41
4826D1n4N8m1k3N5o3m0qM9J5p3M8p5J19j04P3k8J00p4L7k7l0l3K9jn6K1O2K6J4
$$ 41 -13 45 4 -19 36 -27 -67 -75 -26 -11 -84 -36 -111 8 -96 -23 -51 49 -25 12 -15 -45 -78 -49 -50 -106 -85 -23 3 17
4856A7J1M0m9J4m9o3J87r1lQ2j65J83o0r4N6o7q6P6Q7q4J11j42J76q5n3J27j77
$$ 17 28 68 19 33 -16 -79 108 17 14 96 -69 114 54 -40 16 -51 -137 -61 26 -58 53 -89 87 2 -51 76 -101
4883a01J15kj2R3o7L2Qj80R3nQ6Oj98J63k8p0R2k6O3l6mp9QJ37q5J11n0o3M3k2
$$ -101 14 12 0 93 26 58 66 -114 -21 -26 60 66 -132 31 3 -67 25 -1 62 26 22 -57 -49 88 3 114 64 1 44 22
4913B2L4j6K6j1l8k8n4J71j37k3Q0ml8%l1Q3r7q0J47RP2l3r7j3N9nO2l6q8J30
$$ 22 56 40 66 55 17 -11 -65 106 -31 -54 26 22 -16 -16 -47 36 -61 -141 6 15 87 54 -43 -56 3 -2 60 24 -64 66
4943F6j45P1Lq1J14J6r4n2P4J02j36R9oJ7p9R7%m9O4j42J71j60J32j19J11n1j05
$$ 66 -79 -8 -5 -86 28 44 -50 -102 -28 74 -62 37 31 48 -31 66 66 17 81 -61 110 -50 82 -37 74 23 -82
4970h2kJK8L5N6q4M6k2L9J0m4Q2j0m9r0J37n3N5rj11J67j00j9J06n6%n7K6M4k5
$$ -82 -84 -83 -55 -20 36 -48 -2 -24 15 25 -19 63 53 4 -86 51 -2 53 44 -67 100 0 -19 87 31 31 -26 0 44 19
5000A9NM2q7N0j1j02J66p5n5L9q6O8j2J1kO7p4P7q8O2oqR1j64NJ2k7N0r9J09j4
$$ 19 24 66 -21 29 18 -84 82 7 -48 -9 -95 -27 -39 -28 -30 37 -37 40 -48 14 8 0 91 -73 -68 -56 -83 -33 -132 -23 -37
5031c7m1j6K11j25m0J20n2Q3o6q2J52l4q0Q4p5QO5Lj15l3j7K9k6R2J4Pk6P7p0
$$ -37 -78 -94 117 -8 -48 72 20 103 37 -45 107 73 -7 77 2 10 75 78 -37 -70 -87 -58 -84 8 22 29 3 80 10
5060A0L8J3k5r8O2J11j42K0N2L6l1j7j1K8NK6m6J27j46n4N2n2O2n0J7L9N9n6l7
$$ 10 48 61 36 -62 0 111 -31 -11 41 77 46 29 18 46 51 77 31 158 12 -42 10 -42 20 -30 -13 26 85 29 -8
5089hJ5n5P1j01M9Q3J6r4J05j03j3N7m5OmL6J48j71P2o2m3N2j41O9P4k6l6L5k8
$$ -8 7 -48 23 -78 -29 54 70 -24 81 -22 -35 22 -23 -17 -21 15 163 -8 64 2 -41 11 -130 -61 13 -13 -49 -14 -42
5118d2J8OKk2M1rL7l3m1KJ2Jj8J11q6J04n5P0m4q4l4Q9lj0j5K1J7K1k7j56O4P1
$$ -42 -24 -18 -16 -38 3 -6 31 -2 -43 -41 -29 -28 -46 65 -21 83 28 98 54 -30 -64 25 22 12 -3 18 35 56 29 -127 -63 8
5150HP7m5j3q0J4L6J6nJ7o6q5J57Oj8n0l0O7M3LK4j72J19J13j87J17n8j1J09k10
$$ 8 85 40 27 -53 -39 -3 13 8 25 -41 -126 31 37 19 -31 -61 6 49 52 76 -96 23 136 -51 66 8 -3 106 -104
5179a04Q9J08k3K4q2N6j77J95k2r2R2j27J86j82J06k8m1L2qO5r1J5R8q4q2J73
$$ -104 -15 93 70 94 12 68 -109 86 64 -28 64 -63 123 -59 47 19 -22 10 2 67 -24 -9 89 5 -77 96
5205I6j35J08j44j6M1Qm5J36rj33P4R7j48L9P4o8j73K74N5j28rl5l5J20l2mL8
$$ 96 -39 69 -75 -91 -50 -42 -87 49 40 -93 -19 78 -70 -31 43 -25 -198 76 131 3 -6 -41 -76 44 12 8 46
5232D6m3M1o3lM4j4Q7j9j48O9k1R5n0o2J06o9o8R3m5JK03k36K1O8p1J04J8j25
$$ 46 3 44 -19 -22 22 8 95 76 -72 -3 -24 71 21 -41 65 -4 -72 21 -24 -23 180 -56 -35 33 -38 66 84 -41
5260d1L4l4L6MN0k6J5l3J38q9M1m1q5P6J7j14J71j07%q2J2K4mQ4j4Km9K0l4o1
$$ -41 -7 -41 -5 -1 49 23 38 5 143 54 95 54 -31 45 62 -52 119 12 12 -70 -58 -34 -38 46 32 34 -15 5 -29 -90
5290i0Q4N4q1J57j05l0N8j70J06k0l9m3l9K12m8m3O5j10M7m1Q1M5j33R7J1l5R0
$$ -90 -6 48 -33 124 19 -11 47 -123 -17 -37 -76 -119 -158 54 6 -37 28 -82 -35 -76 5 50 -83 14 25 -10 80
5317H0P9j24po9K2M3N6q2MJ4L6j34J89p2K6m1m8m4Q7o5P2j1QJ7NN6j51J23L2j03
$$ 80 159 35 28 -41 -19 24 80 -2 2 16 52 -82 107 35 61 20 -28 -72 15 -50 22 11 19 36 41 97 -54 69 101 -2
5347bj6Pk2p5J59n2J6NM3o7J70j39n3N3O2l2j31P8l8L2L2qK6m7k2m3L7m6N4J16
$$ -2 -18 -11 -33 -108 51 -1 15 20 63 -4 166 27 -26 27 89 57 -74 4 -34 -2 30 22 48 1 -21 -64 -27 -73 -19 97
5377I7j41P0J3k5j05O3N1k1m0J26k7n1l0J8m4J32m2J6k6j18j1nJ39l1m7J47o6
$$ 97 -44 26 39 14 -91 -28 23 2 -38 88 61 10 -20 -2 -46 86 44 60 34 -84 -95 -100 39 8 -39 108 42
5404D2n7pJ9K5Jo0k9m7J22M2m9K3k9N0m1J2M7j3J4J8q3N5j18J32rj61J07P5j4
$$ 42 -15 -22 -3 22 23 -37 -66 -113 9 51 2 25 -4 46 5 17 64 51 65 83 0 55 -63 69 60 -101 6 81 67
5433F7pj36P1J00o7J03j65N5nR2j79N2K2j0n5M6N6qM7K0j14l4J20j39M4Pq1Q5
$$ 67 60 -76 -5 95 28 131 -34 21 16 108 -71 -19 3 -7 -62 -16 40 32 79 99 -15 -49 71 -68 -24 -17 -98 -13
5461a3R2j24J49j40J7N5R7r7j52J04m2J7L2l3O1Qj28J30j2k0NK0O0qj40p0M3Q4
$$ -13 79 -45 104 -36 -19 36 133 36 -116 -12 -54 -37 -5 -38 23 31 -97 33 21 1 6 26 86 78 -62 -132 -89 -5
5489en2kK5P3m0l7O4j07J59p4n7J38j67L8j9M5l6k3Q5P1p2M0O9r3k6N9k9L7j06
$$ -5 -57 -59 -34 39 -1 -38 26 -81 78 4 -53 85 -82 -44 -63 -18 -54 -77 8 79 7 47 116 23 -3 56 27 64 -42
5518d2R1j04M6RjJ7M7l8p8N6r5J40j8o1O8J10k23NJ44q5L0MJ2q2L3N1m2r1N5L6
$$ -42 49 -55 -9 0 -1 16 63 25 -53 3 -92 48 30 -31 37 147 -76 -71 73 -12 18 22 34 -48 -15 36 -6 -97 -42 -6
5548fQ7j67R0J9r0K9P3J19j58NL5p5j4J3JN0q4J8N4l1Jm2j6P0N7r5J19j21P2l
$$ -6 81 -86 4 23 -67 -38 35 154 -4 1 36 -39 -53 -40 -39 11 -73 -55 -1 -32 -31 -73 -89 -19 38 -57 62 -59 13 10
5578A0j06M0R3j83J31oQ8Qj14j8J04k0n3k6R8j23MJ68j08J11m5k5o7J11j3j61
$$ 10 -96 -56 37 -146 -15 -21 67 75 -39 -57 47 27 -26 -52 46 -77 -73 95 -13 98 53 28 -39 72 59 -102
5604a02K28j18j0qM7P3q2k7n7R7l3L5j41J03o6J5J22o1k3J19j5j01R5j36M7p0
$$ -102 126 8 -2 -10 37 110 28 1 -56 41 8 43 -98 5 -61 -46 76 15 -8 111 96 -5 90 -46 1 -69
5630f9M3kPj24J48k5Q4n1j92K47m2j6j0p6J82p5P8l5k11K64o6k17K22j6k0J9K0
$$ -69 -26 -28 -21 -145 3 -22 62 11 -181 66 24 8 -2 -78 104 29 107 72 -139 125 59 -158 64 48 28 47 67
5657F7l6n8J31r4J7J4l4p1k2J00j12l8L0R8N0N7j29j13K06q9K5Rm6rl3N8M6oM
$$ 67 31 -27 104 10 27 41 7 -64 -86 14 -98 -136 -106 -8 42 99 -30 -143 63 -26 -1 8 -38 -47 -80 -22 24 18 22
5686B2p3R7J2j69K10j2j15k6K5R1q2O0j07J6J10n9K4N8N9j49P4r1J08j2N1l1j79
$$ 22 -51 46 58 -111 99 87 -28 -54 -29 62 -20 40 -67 -51 59 0 24 82 141 -8 66 -25 83 71 122 91 -88
5713h8R2j05J81p3K4q4M8J06j40Q6k4L0o5MQ7j44Q5jj8J20j34k7N5L3L0r6p2J64
$$ -88 4 -101 80 7 31 -53 -5 101 -39 47 23 53 -12 -8 79 -65 20 19 1 121 -13 -40 15 48 78 -18 -90 74
5741G4j07N4M9j66Q5q0J14P0p9L6j37J62r2m3J35M7q7m1m0mR1j10N9k7l9N9O8
$$ 74 -33 21 70 -96 -11 -91 23 93 14 50 -87 75 -17 -60 75 122 35 -6 -46 -50 41 -69 -10 -37 -76 -17 51
5768E1l1j0k2k6L0K0n1P5j16J22J4j31P1M7l0j11L7J83jp9k5K4J6Q1j22l7K1P3
$$ 51 20 10 -12 -38 -8 12 -39 36 -80 42 56 -75 -4 43 13 -98 -61 122 121 42 17 41 57 138 16 -21 0 73
5796G3p7LOR3k4qj3Kq2j3k4J32p9o6M0rL8j13J42j09l5J83K1l6j66N5K9j7LJ32
$$ 73 -4 -1 5 98 74 66 53 55 -27 -40 -64 68 -11 -77 -37 -46 -8 -121 21 -88 -123 60 81 45 -121 -66 -37 -54 -51 81
5826H1j12o3J09M3Rj39Lk4J29p5N4k2kq2R7o2K4o1J41o6M8L3j79R9j1K1lm3O7
$$ 81 -31 -94 15 58 67 -72 -69 -93 36 -39 15 -7 -9 -91 6 -56 -32 -93 48 -18 30 63 -116 -17 -28 -7 -10 -53 14
5855A4k0n0J25M6p6N9n3kPr5N7K9j31K7K6J13K0r9m0J15m6n3Q8r2O6j04N4L9M9
$$ 14 -6 -56 69 115 39 98 45 43 50 -45 12 41 -90 -63 -37 76 96 -3 -43 72 26 -27 61 -31 35 -69 -15 24 73
5884G3l5k9K7K3j36J10O7L1p6j06P0K9n9L1K3l9l0J03k5n8K6K4j03P9o5Q0j8q7
$$ 73 38 9 36 59 -77 33 100 131 55 -51 19 48 -11 20 43 4 -26 77 52 -6 20 44 -59 20 -45 35 17 -70
5912g0k8P3jL0j2mk1n3J00K5k1j3K9j40k4J14O1r7J3n0J72q0K7q4J01l7N2j21
$$ -70 -98 -25 -26 4 -8 -12 -33 -86 14 39 18 5 34 -106 -130 -16 45 -52 -39 -89 83 3 30 -54 47 10 62 -59
5940e9J9j5j6P0L6J12j12P6o0j56J83l0m8m0l6R2Q7Qj14J1l3N1kj02J68r8L8K
$$ -59 -40 -55 -71 -1 35 147 35 111 51 -105 78 48 0 -40 -76 16 103 111 -3 8 -25 26 24 -78 90 -8 30 32
5968C2k9j2N8lq9M8R9l8k1K4j07R3OJ00r7j3K5o7j2K8p8J18k0J7j28L1k1K2R2
$$ 32 3 -9 49 46 -43 5 104 66 45 69 -38 55 61 161 64 51 76 9 -3 25 -53 65 45 62 -66 -35 -56 -34 58
5997E8j78J42J2j22K4l8k0K09j33O2J9r1l4M3P9j01K27j21j79J32o8R2l5K0j6
$$ 58 -120 22 34 -88 -64 -102 -122 87 -46 16 35 -56 -90 -47 32 -69 158 37 -142 -10 -78 14 -21 -1 -17
6022a7L4O9k4j05O3j58K14n7j71J50k6m3N2o9J77j26kM3Ojl5k8P5n1j7P5l8O6
$$ -17 17 86 62 -43 20 -138 76 19 -152 -2 -28 -71 -19 -88 89 -37 -39 4 10 9 -26 -54 21 -30 -47 28 -10 56
6050E6l2J0n6J66q0m4o7j4R5l0J0Rk9j11K1J43L8j20n5J40r9J84j38P1l3j13k0
$$ 56 24 34 -22 144 64 20 -47 -61 34 4 14 23 -6 -117 -96 47 85 -35 -90 50 -49 135 -3 68 35 -78 -98
6077i8J28M0l4j38J17M9j8j0p0k1K06j57q4M9m5J29Ol7j8k7J9k7r6N1J36l5J0
$$ -98 30 70 36 -102 15 64 46 36 -34 -55 151 -6 -90 -41 -86 43 49 12 -6 -33 -14 -41 -137 -86 50 15 25
6104B5Q3m8m9Po7n2L4O6n3l9N2q2J28Q8p5j03L4k5J44m4m2o5OM5r0J38Mj0J11
$$ 25 108 60 11 18 -49 -101 -67 -1 -54 -93 -41 -123 5 93 18 -85 -51 -76 68 24 -18 -83 -77 -32 -122 16 20 10 121
6133A21j38j4O7n3M0K4j38J12j5j7L1o4R9l4kJ33j27Pm1j8Qo3j1J80p8p2Q5j07
$$ 121 -17 -31 36 -17 23 47 -91 21 6 -11 20 -44 55 21 19 152 25 32 -9 -27 -19 -82 -93 87 9 -63 22 -85
6161h5J6R3L1K0o0j9r2P3P2oq7Q6J4r6P6l0mLj09L2R8jl6J4q3n5O3J01p7K0j0
$$ -85 -69 24 55 75 15 -4 -96 -23 49 43 -44 42 56 -40 36 6 2 5 -104 -72 26 25 -11 3 -80 -135 -72 29 -48 -28 -38
6192c8J22r2n2K9k0J4m9J28p5N3pj00J19k7M4O5j93L4L5M2p5K1M3k0jp6N2R1l2
$$ -38 84 -8 -60 -31 -51 -37 -86 42 -33 20 13 -87 32 5 49 114 -79 -45 -10 32 -43 -22 21 1 0 -76 -24 67 35
6221C5q3N3p1Q1j34P8O1K2j44P4N1K6m0O6Rl2m4J26r0J0j1Lm3PM0r9K19j42M1
$$ 35 -48 5 -66 15 -119 -41 20 42 -102 -28 23 49 9 75 84 52 8 134 44 54 43 46 3 10 50 -49 170 28 69
6250F9j00O4O5l1j56M5OR4n7Q4j04J45j27M4o6j6j0NJ46o1M4j03m3PJ60j50K9
$$ 69 -31 33 98 67 -89 -44 -38 56 -1 83 -21 124 -3 41 -25 -41 -51 -46 100 39 83 -20 -63 -56 104 -46 -17
6277a7P9J6j06R2q0l1KJ42j44m4N6%n4P5P8j80J30lp5N3L0o9N0J8l9K2Q1n2K8
$$ -17 62 78 -28 64 -16 -47 -45 97 -47 -91 -35 -35 -89 -14 64 -116 14 11 -64 -11 19 -50 0 18 -21 1 82 30 58
6306E8j49O8l7M6L1K7R8j25nm7LQL8J8j28J45Jo9o3J00j4J17m9Rl6l3n3Q5q4J22
$$ 58 -91 -23 -60 -14 17 44 142 17 12 -35 -32 -24 14 32 -96 49 50 -19 -82 18 4 121 72 81 45 12 -41 44 -40 82
6336H2j83j6J95p0r6J36m0m1pP0J02j69N3k8l0R4k3LQ8l8q4rM1N8l6j23J50n0
$$ 82 -101 -117 78 8 -88 48 8 -33 -40 30 132 -37 16 -12 -42 52 29 32 120 82 -2 -11 30 88 52 -71 79 29
6364B9r4l8J54j21JJ24Kr4J8j9J8J5j41J55j07O5j6J19j10L7q3N9j9N0p2lJ5Q0
$$ 29 -65 -103 51 -70 -69 55 57 -37 -19 -38 -20 -5 -146 9 -98 -33 -49 70 -40 -3 -86 -27 -46 4 -68 -71 -56 24
6392B4M8j44R0q6J48j56K6J09j36NO5k1R9n4M2j34R0K3r9M0J2J7R9n5j29Q7l0
$$ 24 72 -72 18 -68 80 -76 -50 59 -77 -72 -7 -28 71 17 59 -75 15 38 -61 -21 -9 8 107 52 -77 10 -20
6419b0l9N9RJ1J6p4J63r3%k7o8MR3m7k9P7K9K8q6n0J52j42O3L3n7j9K9N3p5p4
$$ -20 -59 0 9 20 36 -38 125 32 32 5 -63 -59 34 -13 -42 35 64 92 6 -44 108 -34 29 62 5 -14 15 68 -7 -81
6449h1J26m3l5nJ57p0j46J27q1Q3j47J25L7m5m6M9j20J24j13J42j4j00Q8j40J52
$$ -81 45 2 -33 -38 119 49 -97 30 -51 32 -115 10 47 2 -44 5 -115 9 -104 38 24 -76 12 -128 24
6474B4q0P6K0O0j22L3o8r5P8N2k5J0j1M7K1%L2L7q5K4m5O9J7l6rJ5r8Q0j49J98
$$ 24 -56 20 40 100 -22 11 -57 -152 -74 -22 -47 -37 -48 -1 20 20 52 89 4 28 -17 52 69 33 24 39 -59 21 -128 70
6504G0q1m4R7K2j8q6RJ04nj17R0o1N6K2k1r6J07Lm3l6R3k3j46QJ40P7j29R4q9
$$ 70 -11 -55 42 64 46 -40 -31 73 68 -49 41 -20 36 58 37 -59 48 51 8 -28 65 42 -104 -96 44 121 -8 86 -3
6533cK4M6p4o1R5j0Jk9k6J25j9Qn8M5n0Nor7J8N9P6j08L8k2N6j9L9p6J8jP9k9
$$ -3 21 67 -7 -68 27 17 18 -11 -37 88 69 77 19 64 14 19 13 -84 -66 -7 69 -39 -1 -23 33 14 53 -23 -5 -6 73 44
6565D4m4j7L8j1m6No2R6R4o1p9l7j6J32o7J22o2q4QN7q7J01q9R2L0k9l0M5N4j05
$$ 44 0 -17 21 10 -36 -31 -93 3 97 36 -43 -80 -96 36 -31 91 29 -55 -47 10 -77 24 -65 27 57 28 -2 43 97 -8
6595hl4J43p7l2nN2o0L2jo2N1l3P5Mr9N9k6k6M5Nm4J27o2n8%M8J20j03O4o6K2
$$ -8 -42 101 24 -8 -13 39 -21 11 10 -52 -1 -34 41 45 -54 5 -21 -47 -2 3 -41 86 24 -34 -34 14 134 31 95 29 51
6626E1o2K7l1P0k0n5N7j5K2j01J44j06k9pN1n9J19j05pJ29j20L2rj6M6L0j09J25
$$ 51 -11 16 -15 55 35 -20 37 22 44 -57 87 -19 -48 -55 -4 -63 56 -49 -56 73 -47 -15 -24 -40 6 36 -73 52
6654E2p6j1M9q8P9J9p7N2n5N3L5j99K52m7r0J57j02N5p6J5r7Q5J8J01r8r3J41
$$ 52 -24 -35 14 -74 5 24 -53 -1 -56 -3 32 -167 85 38 -52 105 3 58 -18 -3 -100 -15 3 104 6 -87 54
6681E4N4j04J7N1k7m9L3J05j08K2r2j3k9lJ27k0n5J00O2j2l7j88P9m7Q8n1j1o9
$$ 54 108 4 21 72 45 -4 29 134 26 48 -44 -57 -86 -89 38 18 -37 63 125 113 76 -112 -33 -80 8 -43 -54 -123
6709a23J19R6j84J29K3n0p2L0l2O5L0q5L1j8J22m7L5J3j25M7k6M2o1J16k00J63
$$ -123 -4 92 -92 37 60 10 -62 -32 -64 1 31 -54 -23 -41 81 34 69 82 -43 4 -22 20 -41 75 -125 38
6735C8JJ19j05o4M2k4M7n1K6pO5p5KM3o4KO1o7j19P2J05j99J42O9Qj32J22j04
$$ 38 39 158 53 -11 31 7 54 3 29 22 87 12 14 57 -7 -5 56 -11 -130 -58 47 -152 -10 59 67 -65 57 -47
6763d7n8J25M7j0mj0P2j65K07j99P4j01L1K8J24Lj85M7P7j8M7j8n4N2o6Q6j82
$$ -47 -105 20 67 57 53 43 115 -50 157 -42 32 -69 -38 -10 114 117 -68 -21 56 38 85 67 13 65 -1 85 -97
6790i7J51n0j2j20J13PL3j3j1o7N1n1P9Q2j01J5k9J06j54Q0k3M5Q2o3L2o6j5j7
$$ -97 54 4 -8 -128 -15 -8 25 12 1 -66 -15 -66 13 95 -6 9 -20 86 -68 12 -11 34 116 53 85 19 4 -13
6818a3K2J01j26k9K3K5R1q3M9k1l2nrk1R8J7m5Mm4j39L1J75o1P6r3l2p0J24j6
$$ -13 9 110 -16 -45 -22 3 94 11 60 39 7 2 -7 -28 70 87 42 46 2 -137 -106 69 8 84 -9 -41 -111 13 -3
6847cm4P3k7l7P2k4M0k1r3j0N2m1J72j14j5P2m9K1rpM0l7m6O1o1N2k1J58p5q2
$$ -3 -47 26 -1 -38 34 10 50 29 -64 -74 -22 -63 109 -5 -20 52 3 24 15 8 48 11 -35 26 -35 17 -4 154 79 -3
6877cn4O3j00K2M3M4J3n2P1%j10j0N9OJ06j07M1kk5n6J41r0m6L4J35j10j09Q1
$$ -3 -57 6 -94 -72 -29 15 28 -24 47 47 -63 -73 -14 -8 98 -9 32 30 5 -51 90 0 -46 -12 123 13 -96 -15
6905a5J01rk6n3j35J67l3N0O5j17O8l6k0J8KJ3M5m3j25J96j55N5o9j4J25j03j8
$$ -15 86 77 51 -2 -137 30 -3 47 112 -5 63 27 7 25 27 40 85 42 -83 113 -42 13 -56 -70 55 -48 -66
6932f6J60j75J16Jp3Rl4K0q5L9J06o5Q5k5k6o9J11J2n3j0m8P0j3k1P6q8M1P4r7
$$ -66 94 -81 35 36 -37 -28 -62 -42 -127 -88 18 -47 38 13 -13 -82 29 41 -12 -22 -70 0 -13 -34 42 -46 -5 69 -28
6961b8J2P7m3J05j28Q0N6j72J24j26N0K7m0R2j18O5p2m6J29Ml3rk9Q3j07K0P1
$$ -28 -16 61 18 123 -5 75 131 -41 83 -43 7 34 -6 86 -32 33 -39 -85 44 48 15 6 -23 60 -47 -27 44
6988D4L6j11N3k8m1jK7l0n8J52j04J08m7k2j4Ojl0O7K5L9Q0k31%kR3K3N1j31q
$$ 44 80 -31 22 -6 -47 -48 -21 -51 -109 43 -61 47 0 -22 -36 -30 -31 -61 6 31 70 150 -81 -81 -83 10 33 84 -47 -55
7018e5J14l3m6J03j05m8R4o8PM2Rj0j11J50ko7k8J2R3N0k1M0q5l2P2l6m6N7pr9
$$ -55 59 26 -20 83 -22 -70 24 -44 -37 5 14 4 -107 43 41 -26 -54 -42 51 101 80 120 35 3 75 39 -7 50 43 -56
7048e6J67j26J7J49j08j8L7k2Q3l8j35J27q7L5o1j5P2r9J21jp5K8l3k9J7K0L4
$$ -56 111 -15 2 151 43 25 62 40 123 85 -50 77 -10 25 -36 -51 21 -78 43 42 -33 -5 -38 -67 -50 -30 4
7075Dq7J33m9K9q3R1M4j22J28j48J0O2q7J68j80L3J42j6q8L4mK9O8p6mn9P8o7
$$ 4 -83 50 1 30 -53 38 82 -40 88 -60 -50 12 -75 93 -87 -54 88 72 -16 18 14 43 111 35 31 -28 50 -17
7103a7K7K3j29R8j4m3J8J33o5Jk6L1q9L2j5P2k1Oo8M2Q8l4m7J7L0j17N5r3Q7m4
$$ -17 10 33 -96 2 -12 -55 -37 96 31 32 6 37 -52 -20 -35 37 16 22 -46 -4 84 50 3 20 50 -67 -12 -105 -18 -62
7133f2j9k0p0K10kQl8qj25J76J4Nj7j38M4K7R9o5J0j5j7O1k0r4mJ5R1o5j6K5j6
$$ -62 -81 -101 -171 39 37 45 7 -1 -126 50 64 69 52 -86 -42 -15 84 19 29 14 -3 58 38 -56 -60 -45 46 -19 -35 -10 -26
7164b6O8o2rL3K1L5n9j86J99k7K4M9Lo2j2k2J6KN6o9qQ6p6O4L0K3j28Q3m0o4%
$$ -26 42 -20 -29 4 25 60 1 -185 14 -13 11 60 63 1 -11 -33 -17 -15 41 -28 -36 50 -26 38 68 91 -37 46 6 -58 -58
7195e8K8J46j09q3J75r1O8j08l5l7R0J06j27K0J3p3Q5J33p8o7l7J4LJj8N1Rk4
$$ -58 -30 116 7 -76 99 8 76 -32 -67 -104 -14 92 -35 -15 -2 -75 10 143 65 -2 -39 -25 -22 -21 -39 12 21 -3
7223co2J24j59L9J75p9qk9O0oL5j39J89n7M2j59L0K9Nj08J00N5j05M9r0p1O5l
$$ -3 -65 59 -100 -61 114 35 27 -2 58 52 87 -52 137 80 122 -37 -7 22 27 -81 19 74 -31 18 -72 -143 -78 -81
7251h1J3R1k4L5j35Q5M9l1l7K6M6n4K2j15K9P7L9m5J0J3M9j47M3Q6jp9l0J09q2
$$ -81 -68 23 -1 34 -101 -16 33 2 -35 -9 37 -17 5 -110 -81 -4 35 -10 0 13 62 -85 -42 44 43 -36 -66 43 -39
7280c9j1J12l6o8j1l1J28K8j3m0p6Q2j43J81j65J14m5J9n8Q0K7j43Q5N9lN2j99
$$ -39 -50 62 26 -42 -53 -84 44 72 59 19 -57 25 -118 63 -102 12 -33 -14 -72 8 35 -108 -23 36 33 85 -114
7307a14J61j19P5P3n7o8M3J08j1l3j4m2n1N0QK6J8j16M7NO8l0L6p3Om8R2J5L9
$$ -114 47 -72 3 76 19 -49 -6 102 91 58 44 2 -49 1 9 35 53 -63 -16 -11 57 27 63 -10 -4 -52 40 55 94
7336I4n0J21j26M9p1M2j31J03m1n2Q4O5j2r7O2L2r5MJ17J3l2j28N7P3j21J26l5
$$ 94 44 165 39 88 17 59 -72 31 -10 -62 22 87 75 -22 40 72 -23 -19 98 111 79 -49 8 81 -40 86 51
7363E1j31M3O7L6p5j4J5n3K6Q0m0nm4l9M5J34k59J27n0K3P0M4on5q2O6J24j27
$$ 51 -80 -37 30 66 -9 -23 -8 -61 -35 45 5 0 -44 -83 -38 96 -163 -36 -86 -63 7 51 45 -10 -92 -26 98 -29
7391b9P4J00k16N0nN4K2j22N2J15n8l3n2J26p0P7m5L6j06K7P6j07j9lOPJ09j22
$$ -29 45 145 -71 -21 -26 28 50 -72 -20 95 37 4 -48 78 8 85 40 76 -30 -3 73 -34 -53 -56 -50 -43 66 -56
7419e6M4P7L5j30J25m7o4n6J28m6L3p2L2m8J7R0p1Pq3P8L5Jo4R4n6P8j48Q0n6
$$ -56 -12 65 100 -30 95 48 -16 -72 56 10 43 -29 3 -45 -28 62 -9 -2 -85 -7 28 29 -35 59 3 81 -67 13 -43
7448d3K1n6K30j99M2MO4j07J06j51J13k4o6P8q0jJ37j18O7j9j7N7q1Q4k8n0L0
$$ -43 -22 -78 152 -47 -5 -1 63 -44 62 -89 24 0 -66 12 -68 -69 68 -50 17 -2 -19 38 -43 41 13 -37 -7
7475gO1q9Q1j29K1J42m0j2o4L6p5J31K8j12N0M8l4p6J31j48jpL2K8Rl4J05j57
$$ -7 54 -35 46 -83 -62 80 40 28 -36 0 -75 56 84 -28 22 70 36 -40 91 -57 -58 -65 -33 -5 4 -30 75 -82
7503h2K19j18O9o8l0PN4j18J20l3o0JJ2J4o7R9L6J3n5o7n5J92n0%q4k9J51j26
$$ -82 137 19 88 20 -10 -3 51 -67 53 20 -40 -39 -27 -13 -80 19 55 68 13 -54 -109 83 33 33 -51 -80 71 -55
7531e5k2N4mP4j01J36n4L6j89J27ok2J33j18K2l0n5J9l6J05n0J9K1L2o7J2P0k2
$$ -55 -77 -23 -27 47 -54 82 28 64 -125 2 -4 -26 107 -11 11 -19 -74 -55 -91 14 -36 -17 4 36 -31 -19 51 29
7559B9q0k4rJ10J07r0QJ7j5l9R6k7j20J35q3n5%oM5O5j27MJ10K5o3l2rM3Mo2k4
$$ 29 -51 -75 -84 26 133 43 51 68 53 14 110 83 -37 98 15 -40 -40 -46 -1 64 -63 -59 51 76 13 -19 -28 15 19 -43 -67
7590f7O1k9Q8r4L7o0M2P9n1K0q8J33n3K5q6J18L9p7l2m5Q0l1k6R0m4j4j1J3j58
$$ -67 -6 -35 53 -41 -4 -64 -22 57 6 26 -62 71 18 43 -43 75 114 37 5 -40 40 9 -17 73 29 15 4 17 -141
7619a41J33M3m4K4k2n9N6K1K3m7j13K02j34J5N8nRMo4M5p2O9O3p5L0K2m5j29K16
$$ -141 -8 35 -9 15 -7 -66 -10 11 34 -13 -126 76 -58 -43 15 10 19 23 -41 4 -68 1 64 -11 19 41 -4 -133 83
7648H3j36l9rM5Q8m6Q7o5op5R5L0k8l2N0k8r2K1R2J05j33p9M0N3N4o4M7j9o9Q0
$$ 83 -53 -92 -101 -56 32 -14 73 8 2 -73 22 52 24 -8 42 14 -78 -57 35 140 7 -72 -32 21 75 11 58 39 -30 50
7678E0L6j11M2O7o0Q3j57J05l9L9j08N4m7ML9K6j9K5k6mM1r5J05j11J16r9J06
$$ 50 86 -25 17 84 24 107 -50 55 16 55 -53 1 -46 -42 -3 23 4 29 3 -1 40 -55 50 -61 55 -44 62
7705F2q1k2M7k2R1j19N5j39K11j56J38k4o0R6n5O7o5j11J13j17P5q4M6J02n4M0
$$ 62 -19 -41 6 -16 75 -44 11 -128 83 -73 65 41 -19 77 22 89 24 -87 26 -91 -16 -100 -54 48 -6 34
7731C4Pl4J1N7j1n8M4mn7l4J01j32R5K8j4OK7j19N1p0R9n0M9k8o2J9N6M0J4p2
$$ 34 41 7 18 75 64 6 50 46 -11 -45 56 -76 19 47 33 39 66 -53 -2 -72 27 -23 26 -2 -64 -45 11 51 65 -7
7761gO4j51P2J06m2M0r1K8J5N5n6m9%L5Q1r6M6p2N9J0l3J9j3R7j06m8O2j0n1M1
$$ -7 57 -94 -22 84 42 82 -9 19 34 89 33 -16 -16 19 100 4 50 -22 37 47 14 33 20 117 11 -37 25 15 -36 5
7791El4L7R0r3M4L8q3L8j1N1j5m1L9q2KJ3%J03n1j44J41o9L0o6M5J74j83o2J67
$$ 5 -29 8 98 5 49 87 4 42 31 82 67 26 65 -17 -15 -2 -2 101 50 -94 47 -22 8 -58 -13 161 -22 -84 83
7820H3o2l0L2Q4j30N5J0p7J6p2R6rO1j45L3J49m0J1O1j97N5l4R2j18M0J39l9p8
$$ 83 21 -9 23 107 -23 32 42 -35 -19 -91 5 -4 57 -88 -55 94 54 65 126 -71 -16 -50 42 -76 -36 103 64 -14
7848a4M7p2J03o1O9q3J6k7k9J34o0p0M1L1j3m4J6qQ1Pj8l5l6K0J3L9p2M1J38j53
$$ -14 33 -39 64 3 72 -11 5 -22 -51 83 23 -47 -6 25 12 -32 -16 -24 57 64 46 11 -25 -5 8 47 -25 16 154 1
7878AJ8M8k8mk3l9q%JO5p0Q6j37Q1J7J31o0n2j4Rj04K00p2J5q0L0p1J11m5o0l4
$$ 1 19 67 39 35 12 -27 -35 -35 -34 31 -39 47 -90 -9 8 139 79 27 13 22 -82 118 46 61 -19 11 -60 51 6 -54 -88
7909h8J12o8N4o2J09j0k5J4m7%l0N3n6m4J71p4m4J5n6K8K1N0m5J51o6k0l1j0M
$$ -88 24 -44 10 -52 57 47 22 36 -11 -11 -41 12 -44 -88 83 9 -35 -20 -76 -48 -27 23 -22 129 63 43 12 2 6
7938FQ8j84R0j1k5K9J4J30j55l6j8Q4r2J06r1Q4k5p8M6j9J44q1J1n2K4K3rJ45
$$ 6 94 -90 0 -11 -36 -7 7 137 -18 -54 -72 12 -80 26 -65 19 -6 -84 -38 -57 87 6 17 -35 -11 12 3 148
7966A48j21M9J5j85O7J44j4j46N3%l1Q9o6m1J78m3l8m1k5Q8k7rjp6K9%rk1Rq9
$$ 148 27 76 91 -94 -27 117 103 -43 10 10 -21 68 2 -39 139 96 58 17 -8 80 53 44 43 -33 -4 -4 -13 -34 -25 -114
7996a14R5J1J62j47r4L3L1Q0p1qR2N6j98Q7Mj3j2P3j14L6j6M8o4k4n6J33O6q5
$$ -114 -19 -8 154 7 -87 -54 -23 57 -14 -22 70 126 -72 15 19 6 -6 67 -47 -11 -27 21 -43 -67 -123 10 76 -9
8024iN9k7n2O0j36J36j43K65k59l5K32j59P3k9N6J7n5l5J01jj57R6l8rm0J29j14
$$ -9 50 23 -29 31 -105 31 -112 153 -106 -141 91 -68 5 -24 32 49 -6 -41 60 59 -98 -2 -40 -49 -89 40 -74
8051g4oQ0m6R5Lj22J7K4J15r4J20k14J01O2%l8P9J6j35M1j8K8J06j42K3P6j88
$$ -74 -80 0 -46 49 52 -70 -53 -29 86 -8 112 -102 -1 61 61 23 102 118 -17 24 6 34 140 -2 21 97 -91
8078i1P3q9N7J06j08J40j11P3n8JM8k6n7JLL3k1N4j08O1J3O6Ro2J18J2j13J3l6
$$ -91 -18 -107 -50 56 -52 88 -23 50 -8 -7 41 15 -42 -41 -38 -5 -26 28 -80 -19 -6 60 69 7 125 137 24 37 1
8107AL8r9oN4MN6p8k4J6K2N9n7R5O5j25j21R2jj5K0L4r7O6m0J37j04q0J08QRr
$$ 1 39 -60 -66 -12 -8 48 -30 -54 -38 -16 43 -14 81 146 21 -100 -8 -9 -24 -4 30 -67 -1 -41 96 -8 -88 20 28 37 28
8138B8J51p7j40N5m7l5M2Q5o6k5R0p3p9P0j24R7k2M0q6K84j76j02O7J0O1j20J56
$$ 28 179 102 -38 17 -30 -65 -23 62 -4 -29 61 -12 -91 -21 -145 -48 -70 -30 -116 168 -8 -110 -43 -33 28 -92 64
8165F4mj12J00l3J1K6j2k5OL1O7k29J69k0j20n1J51J8K9o7K8q3M7m3N3p6
$$ 64 60 -52 48 15 26 52 40 15 21 52 119 -110 59 39 -81 -132 19 37 66 -1 27 -56 -9 -52 1 -75
8191g5
$$ Imaginary data points
##PAGE= N=2
##DATA TABLE= (X++(I..I)), XYDATA
0@%%%%%%%%%%%%%%%%%%%%%%%%%%lPrJ0j1J2j3J4j5J6j9K2k3K4k5K8l1L3l5L8m3
$$ 0 0 0 0 0 0 0 0 0 0 0 0 0 0 0 0 0 0 0 0 0 0 0 0 0 0 0 -3 4 -5 5 -6 6 -7 7 -8 8 -11 11 -12 12 -13 15 -16 17 -18 20 -23
47b3M7n1N4n9O7p5Q2r2J06j21J40j64J96k37K93l73M91o77R95j589K902o828L6146
$$ -23 24 -27 27 -32 35 -40 42 -50 56 -65 75 -89 107 -130 163 -210 281 -396 599 -990 1912 -4916 31230
70C1230J51100j71395j51280J49431Q8473j12691l8142R0780R496o2510q072K3249
$$ 31230 182330 10935 -140345 9086 97559 -15132 -53274 37506 47002 -15508 -23580 -331
82c31K5114K2207l8312n9429K9915Q5782r137r6538K012R4023j0568p8150K3925
$$ -331 24783 46990 8678 -50751 -20836 64946 55809 -40729 -38717 55306 44738 -33412 -9487
95i487O0444l4318m5256L8023K3089l0518M990J363l2079L3645M2518o1301m4133
$$ -9487 50957 16639 -28617 9406 32495 1977 6967 8330 -23749 9896 52414 -8887 -53020
108e3020O9100L6737o2621j8125M4485q128k0583K1770k517j5740J3487m252k1491
$$ -53020 16080 52817 -9804 -27929 16556 8428 -12155 9615 7098 -8642 4845 593 -20898
121b0898J9434L1065l1781m5011L5601M5704l4610l4453L1345J7983l4608J445
$$ -20898 -1464 29601 -2180 -47191 -11590 34114 -496 -34949 -3604 14379 -20229 -18784
133a8784M5384k6173n0332N1255L9150o5781j3492P1121j6668p5595M3687P5543
$$ -18784 26600 427 -49905 1350 40500 -25281 -38773 32348 15680 -59915 -16228 59315
145E9315o2808o2930O5505M0062m8492j5410K8576k837j4525J5749Q194j4538
$$ 59315 -3493 -66423 -918 39144 -9348 -24758 3818 981 -13544 2205 10399 -4139
157d139M227K988j9039J1499L3078j5037m2664J0198M7171j0084m0420K0892K5225
$$ -4139 88 3076 -15963 -4464 28614 13577 -29087 -18889 28282 18198 -22222 -1330 23895
170B3895l2970j0158M0051K896l7708M754K8547j4448r881K2132r859k0974J9201
$$ 23895 -9075 -19233 20818 23714 -13994 -9240 19307 4859 -5022 17110 7251 -13723 5478
183E478J3693j8972o358J4739k779j1442J2500L581j8316M901J5035q647o892
$$ 5478 19171 199 -6159 8580 5801 -5641 6859 10440 -7876 -2975 12060 3413 -3479
196c479R061p81j3444P791K0383j6411k3237K0363J6589k1831p071K4113l794
$$ -3479 5582 4801 -8643 -852 19531 3120 -20117 246 16835 -4996 -12067 12046 8252
209H252l2819J2595L7200j9153l0656J9714J7060j6511n478J5216j588j4664N461
$$ 8252 -24567 -11972 25228 6075 -24581 -4867 12193 -4318 -9796 5420 3832 -10832 -5371
222e371Q010m061L609k558j4131P381J8595p822k0506Q347K1031j3055j6224J9342
$$ -5371 2639 -1422 2187 -371 -14502 -7121 11474 3652 -16854 -8507 12524 -531 -16755 2587
236B587R137k0272l768J9428K392j7339J345J2267o633j327R659r302r643J3357
$$ 2587 11724 -8548 -12316 7112 9504 -7835 -6490 5777 -856 -2183 7476 -1826 -11469 1888
250A888R346j3006p234J3851J118j4192P203J2528q904q567M745N897J98j022
$$ 1888 11234 -1772 -9006 4845 5963 -8229 -1026 11502 2598 -5969 -1224 4673 4871 3849
264C849k276o962M638J2268q815j1652J1534P035j3174n086J6804L616k1058k11
$$ 3849 1573 -5389 -751 11517 2702 -8950 2584 9619 -3555 -8641 8163 11779 -9279 -9490
278i490K0182l037j3430L228O988k639l636M136n90n447M325J903n076K796J497
$$ -9490 10692 7655 -5775 -2547 4441 1802 -1834 2302 1712 -3735 590 2493 -2583 213 1710
293A710n451j106O000L667p151l553O407n86k245N101j710o659J951P127j546
$$ 1710 -3741 -4847 1153 4820 -2331 -5884 523 -63 -2308 2793 1083 -5576 -3625 3502 1956
308A956p725M782N070r898J5J1129k250r983R98Q783k42o306K968J183l215L183
$$ 1956 -5769 -987 4083 -5815 -5800 5329 3079 -6904 -5906 2877 2635 -3671 -703 480 -2735 448
324D48O27k457J747P58k724o90M493K044q121j191R817r09p304R66M938q10m295
$$ 448 1075 -1382 365 1123 -1601 -2291 2202 4246 -3875 -5066 4751 3842 -3462 -2496 2442 1632 -2663
341b663M289L537p536m30O403j602k157K121l45l637Q40O509k660o835M425K879
$$ -2663 1626 5163 -2373 -2803 3600 1998 -159 1962 1617 -2020 -1180 5329 2669 -4166 259 3138
357C138l404N02J599q19k392O95L744j656j822J558j938K03K950n90k416j405
$$ 3138 -266 236 1835 1016 -1376 -681 3063 1407 -415 1143 -795 -592 2358 1768 -648 -2053
373b053K933J718m395Q34L099l473o42L298M99l120j496L662O62k619J671n96
$$ -2053 880 2598 -1797 -963 2136 -1337 -1979 1319 1818 -1302 -2798 864 1526 -1093 578 -18
389a8k113K057K00j70M67j552k39M40J329Q65l026rK141k01L7r87j93J540j666
$$ -18 -2131 -74 126 -44 423 -1129 -1368 -928 401 1266 -1760 -1769 372 171 208 -779 -972 568 -1098
408a098P80J797k259J43N57q36Q39J228j51l209p3N236j363m467K469J416l25
$$ -1098 -318 1479 -780 -637 -80 -916 -77 1151 1000 -2209 -2282 2954 1591 -2876 -407 1009 684
425F84l86j363J267J273j155j887P97M333j534o179K322N029n27l834k399M754
$$ 684 298 -1065 202 1475 320 -1567 -770 3563 2029 -4150 -1828 3201 2674 -1160 -3559 1195
441A195L204n942k186N720K122n054k732N120K103m222p48N07J729K790m435l348
$$ 1195 4399 -1543 -3729 1991 4113 -941 -3673 1447 3550 -672 -1420 -913 816 3606 -829 -4177
457d177N189K630l666l287K961L482k697k409R92K200J361m517j523O867l34n943
$$ -4177 1012 3642 -24 -3311 -350 3132 435 -1974 -982 1218 2579 -1938 -3461 3406 3072 -2871
473b871N76L189O44j251n06o51n17K941m14l481K883J560l248n3J058J257J038
$$ -2871 -2295 894 1538 287 -219 -870 -1387 1554 1140 -2341 542 2102 -1146 -1199 -141 1116 2154
490B154l109j768L366K714l160l166L573J046l054K690k88l761L776J781n308
$$ 2154 -955 -2723 643 3357 197 -2969 604 1650 -1404 1286 998 -2763 1013 2794 -2514
505b514O2N997K22p506n78P842J146o179l457M867O617o653p324Q811N232q483
$$ -2514 -2452 3545 3767 -3739 -4317 3525 4671 -1508 -4965 -98 6519 -134 -7458 1353 6585 -1898
521a898m012O473L994m433l024J108J799L439k308o855M987O679o213n699M442
$$ -1898 -5910 563 4557 124 -2900 -1792 7 3446 1138 -5717 -730 5949 -264 -5963 -1521
536a521O930k428q525P23Q479J330q596l074J0813K060j2268L85J0408n06o600
$$ -1521 5409 2981 -5544 -4821 3658 4988 -3608 -6682 4131 6191 -6077 -5692 4716 4210 -2390
551b390j282L348L011j154k880j406L682K560n496j168N282Q74l249l687J729
$$ -2390 -3672 -324 2687 1533 -1347 -2753 929 3489 -2007 -3175 2107 2981 -268 -3955 -2226
566b226P702j622r222J669R160k017q882M152Q341o928n955P221K814m640j412
$$ -2226 5476 3854 -5368 -3699 5461 3444 -5438 -1286 7055 127 -5828 1393 4207 -433 -1845
581a845K862O09l225R41L788k422l419K255L693k255m832M732L887o884j233O298
$$ -1845 1017 1626 -1599 -658 3130 708 -2711 -456 3237 982 -3850 882 4769 -2115 -3348 2950
597B950j033l522J306J255k045O37L169l355k992N773N07n924K93N476J348o471
$$ 2950 1917 -1605 -299 956 -1089 -452 2717 -638 -3630 2143 2650 -3274 -2981 2495 3843 -2628
613b628k772P190L037o487k993N267L683n642l580O406K081m724j790J378L060
$$ -2628 -5400 1790 4827 -1660 -4653 614 4297 -1345 -4925 1481 3562 -1162 -2952 -1574 1486
628A486Q79l079k202J375L915m71m941R97N077j514m692l35O907K260r268k874
$$ 1486 2365 -714 -2916 -1541 2374 1903 -3038 -2041 3036 1522 -3170 -3505 3402 5662 -3606 -6480
644f480R489K826q177k640Q021J212q543J208P555k177m838R53K713k95r74J696
$$ -6480 3009 5835 -2342 -4982 3039 4251 -4292 -3084 4471 2294 -2544 -1591 1122 827 -147 1549
660A549j181k557K562J449k006R6Q57r2k096j72M150n68l849J121J501j431j28
$$ 1549 368 -2189 373 1822 -184 -88 769 677 -1419 -1591 2559 1991 -1858 -737 764 -667 -795
677g95K809j75m799J078M993k700k615L073O09k601p38K102J911j839j836l96
$$ -795 2014 1839 -2960 -1882 3111 411 -2204 869 1478 -1123 -1861 241 2152 313 -1523 -1919
693a919J751K568k269k306K247M87j146N4M05J231l90k218o56K668L104l402m274
$$ -1919 -168 2400 131 -2175 72 559 -587 -533 -128 1103 713 -1505 -2161 507 3611 209 -4065
710d065L640L527k645k598J177L542j143n155K271N829k215o054J557O229j984
$$ -4065 -425 3102 457 -2141 -964 2578 1435 -3720 -1449 4380 2165 -3889 -2332 3897 1913
725A913m576K730J523k257O57M11l17J265n42k336L66L168K78l613J54K272o28
$$ 1913 -2663 67 1590 -667 -10 401 84 1349 807 -1529 -1163 2005 2283 -1330 -1176 1096 468
742D68k99j72J92R29j698p51K411Q4j417l93N44J02j51J482j010k104K223J80
$$ 468 169 -3 189 1118 -580 -1331 1080 1164 -253 -646 -102 0 -151 1331 321 -1783 440 620
760F20k093J881P15k068k20J061K19m80O89k90j571J338O98j694J451M89k274
$$ 620 -1473 408 1123 -945 -1165 -104 115 -365 324 34 -1537 -199 499 -1195 256 745 -1529
777a529L91J462l53p60L74Q14j082n42J615j43m10n12j90J583o92j210J899j04
$$ -1529 -1138 324 -29 -789 -415 399 -683 -1225 390 247 -163 -675 -865 718 26 -1184 715 611
795F11j937P74J657p36j406J163J020k046N25J572j159q3P43q86M17M75l14o70
$$ 611 -1326 -552 1105 369 -1037 126 1146 -900 -375 1197 38 -45 698 -188 229 704 390 -280
813b80Q10R12j489m87J727j56r45p4J84J123r30j451J953O84j690n78J245R44
$$ -280 530 1442 -47 -534 1193 1037 92 18 202 1325 395 -1056 897 1581 -109 -687 558 1502
831A502j625l16J466o93m60O53o87M74K74j096L30L86j4J9m57L27l31j82Q92j037
$$ 1502 -123 -439 1027 334 -126 527 -160 314 588 -508 -178 208 194 213 -244 83 -248 -430 462 -575
851e75Q9J007j156k51M90K48K28q17O1O74p57K30K06k26L80n98k0O57o74O50j9
$$ -575 -486 521 -635 -886 -396 -148 80 -737 -676 -2 -759 -529 -323 -549 -169 -767 -787 -130 -804 -154 -173
872a73j037P73M07l52k23K3Q58o95o47J429k43o76O92m52j15N13J42K4o75L47
$$ -173 -1210 -437 -30 -382 -605 -582 276 -419 -1066 363 120 -556 136 -316 -431 82 224 248 -427 -80
892h0Q05j043n7J177r4o97n92J057P24j585L72J188o02n09r8P62K96q92K61J97
$$ -80 725 -318 -375 802 708 11 -581 476 1200 -385 -13 1175 573 64 -34 728 1024 132 393 590
912E90l61O32n27k95Q92l66o77K12N46M29j174l59J279l57n29R0L07M31j180j29
$$ 590 229 861 334 39 931 565 -112 100 646 1075 -99 -458 821 464 -65 25 332 763 -417 -546
932e46J058k56m22J53m47O29l30l22L68k3K69o84m59J075J07p73K62k57M00Q8
$$ -546 512 256 -166 -13 -460 169 -161 -483 -115 -138 131 -553 -1012 63 170 -603 -341 -598 -198 -110
952a10p03M32J73J58m02p60J150P01j460l9R12o7k14n30R02J51q76L47J43k30
$$ -110 -813 -381 -208 -50 -452 -1212 -62 639 -821 -860 52 -15 -229 -759 143 294 -582 -235 -92 -322
972c22O04r4m22k42M57J077j359m47J783k89j574M19J153J81j315J53R80r05N43
$$ -322 282 188 -234 -476 -19 1058 -301 -748 1035 746 -828 -409 744 925 -390 -237 743 -162 381
991C81M63j226N14Q66m65r03K14J546m43j989J151J213q20q98N6J272j00j373
$$ 381 844 -382 132 998 533 -370 -156 1390 947 -1042 109 1322 502 -396 -340 932 832 -541
1009e41M37L24K95m4j073K39J344n56j204pJ222M79j861J97J400p52l11J53k74
$$ -541 -104 220 515 471 -602 -363 981 425 -779 -786 436 915 -946 -749 651 -101 -412 -259 -533
1028e33M20M7j13p38L14J513j237j535J883R28j539m73Q35O62j204k0J343r19
$$ -533 -113 -66 -179 -917 -603 910 -327 -1862 21 949 -590 -1063 -228 434 -770 -790 553 -366
1046c66l64R10l79m28L10R37l74j672J093J679j535p04J050N31q50m97J119J33
$$ -366 -730 180 -199 -627 -317 620 246 -1426 -333 1346 -189 -893 157 688 -162 -659 460 593
1064E93q48O53m64o43J746L9j617j0J355K45j363Q4J416q31l75J06l97J611M8
$$ 593 -255 398 -66 -709 1037 1076 -541 -551 804 1049 -314 -230 1186 355 -20 86 -311 1300 1348
1083A348k065p7J819O02k056o79K413l4k427L72J865L05j949o65K218k85j231
$$ 1348 -717 -794 1025 1627 -429 -1108 1305 1271 -1156 -784 1081 1386 -563 -1228 990 705 -526
1100e26J054k76j233R92J082j698p12K682k33l716J603L770k866k453K653J041
$$ -526 528 252 -981 11 1093 -605 -1317 1365 1132 -2584 -981 2789 -77 -2530 123 1164
1116A164j999m56K112l55k097J049R19n65m5L5rn65k96J918n4k176O52J397j058
$$ 1164 -835 -1291 821 466 -1631 -582 337 -228 -273 -238 -247 -812 -1108 810 756 -1420 -768 629 -429
1135d29m37J349K19j962K52J972j301J06J362j619p64J742rm97L83j88q19O87
$$ -429 -866 483 702 -1260 -1008 964 -337 -231 1131 -488 -1252 490 481 -16 367 179 -640 47
1153D7J279j742j23K348j999j709K863J163k274j052J556R30j520n6J394m00j072
$$ 47 1326 -416 -539 1809 -190 -1899 964 2127 -147 -1199 357 1287 -233 -289 1105 705 -367
1170c67k29J356O23j708O22O95j999Q28K582k187k150K809J154l500mM354j877
$$ -367 -596 760 1383 -325 297 992 -1007 -179 2403 216 -1934 875 2029 -1471 -1475 2879 1002
1187A002l944L181K044k844k50J524m98r59N94R01r76k17N48l51p6K24L66J28
$$ 1002 -2942 239 2283 -561 -811 713 215 -744 -150 751 -225 -442 106 -245 -321 -97 269 397
1205C97j759N39K103j532j125J793n5j624L97J830r56j348J638l70j349J934o3
$$ 397 -1362 -823 1280 -252 -1377 416 361 -1263 -866 964 8 -1340 298 -72 -1421 513 450
1222D50j776J311N62j438K42J752j018j830J806R14k114R58J111j330n42J110
$$ 450 -1326 -15 547 -891 -649 1103 85 -1745 61 975 -1139 -181 930 -400 -942 168
1238A68K60k02m92K62K10n68M07N49j48r61K29J296j152o02K308r00k537K222
$$ 168 428 226 -266 -4 206 -362 45 594 446 -515 -286 1010 -142 -744 1564 664 -1873 349
1256C49J542k330o46K575n92k602J901K001k642k85J921j167p35J424L92j458
$$ 349 1891 -439 -1085 1490 898 -1704 197 2198 -444 -729 1192 25 -710 714 1106 -352
1272c52k02J302k97j055P84O63q01p85N18J140p49j072J443j00j550J035R06j179
$$ -352 -554 748 451 -604 180 843 42 -743 -225 915 166 -906 537 437 -1113 -78 828 -351
1290c51n23J191j41j352J306J029k163o4J910j171o21J391L5j311J03J209n79
$$ -351 -874 317 176 -1176 130 1159 -1004 -1068 842 -329 -950 441 476 -835 -732 477 -102
1307a02p58J089j07r24O23L82k06l29r3M48m08k0P41l93n39O01M08m55o72J123
$$ -102 -860 229 122 -802 -179 203 -3 -332 -425 23 -385 -405 336 -57 -596 5 413 -42 -714 409
1327D09J76j563Q55J198j398k61J326k50j184P06R33j122o31J779k65j563J201
$$ 409 585 -978 -123 1075 -323 -584 742 492 -692 14 947 -175 -806 973 708 -855 346
1344C46P79j305k40J084K63j175J01J054p96n05J039qr05kR10j29j108Q90O90
$$ 346 1125 -180 -420 664 927 -248 -147 907 111 -394 645 637 -268 -270 640 511 -597 293 983
1363I83j617J29J282l28r30K60R17q33o60J520j98j358Q34L89q62O7P94j53j008
$$ 983 -634 -505 777 449 -481 -221 696 -137 -797 723 525 -833 1 390 -472 -405 389 236 -772
1382g72K63J075p65l51R05m31n02L61L53q0p56O51J82q58N23M37p65J72L74n0
$$ -772 -509 566 -199 -550 355 -76 -578 -217 136 56 -700 -49 133 -725 -202 235 -530 -358 16 -34
1402c4n02l5J070n35p12Q82N7p89N23M85l67m45M87N10j004K03Q79r41o9P61m1
$$ -34 -536 -571 499 -36 -748 134 191 -598 -75 410 43 -402 85 595 -409 -206 673 -268 -337 424 383
1423C83n51K6O60k30p71R50K60j117N70M31l89m08M09O98q76l84J173l89p93P09
$$ 383 -168 -142 518 288 -483 467 727 -390 180 611 222 -186 223 921 45 -339 834 445 -348 361
1443C61M06o62l77N70L28r46M26Q58j031l24P90r2m82m8P27j98r69Q95L34q80
$$ 361 767 105 -272 298 626 -320 106 964 -67 -391 399 307 -175 -223 504 306 -663 232 566 -314
1463c14J70M82l23l10J80M56m69l26P29m29l70N72j00j73nl9K81l87J04N78o00
$$ -314 -144 338 15 -295 -115 341 -128 -454 275 -154 -524 48 -52 -225 -230 -269 12 -375 -271 307 -293
1484b93l1J42k05J73j3L3K4k71L84j38l20O35j60n75L45K94k24j19J38M79p20
$$ -293 -324 -182 -387 -214 -227 -194 -170 -441 -57 -195 -515 120 -40 -615 -270 24 -200 -319 -181 298 -422
1505d22M1P86n56j58L90J4j05k12M91rm46J30M51m96J36J99K5k26k42O64j49m44
$$ -422 -381 405 -151 -309 81 95 -10 -222 269 260 -186 -56 395 -101 35 234 259 33 -209 455 306 -138
1527a38N44L1m39J80K35j76o5j8M18n27K6M21l89O3K01l80K25o2j48K98k45L7
$$ -138 406 437 -2 178 413 237 172 154 572 45 71 492 103 166 367 -13 212 150 2 300 55 92
1549I2L5k65L78j01k11K84m27M01k03l90N25J3m73Q7K08M5k06jK74l60n6N06m99
$$ 92 127 -138 240 139 -72 212 -215 186 -17 -407 118 131 -342 -255 -47 -2 -208 -209 65 -295 -351 155 -344
1572c44M1K37k11q3m0K79J74m86RK96l2j49j57L98K15q88M91O49q04ML31r6o9
$$ -344 -303 -66 -277 -360 -400 -121 53 -433 -424 -128 -160 -309 -466 -68 147 -741 -250 399 -405 -401 -70 -166 -235
1595b35Q6L19k70l03N63j18j54K08j07mn6k47N81K8m93J16K24P7k91L0N75p12
$$ -235 -149 170 -100 -403 160 42 -112 96 -11 -15 -71 -318 263 291 -202 -86 138 215 -76 -46 529 -183
1617a83j29R70m02k88L27J51m52n0L40K83n14j19L00J57O4n74K85M08q29P7Q45
$$ -183 -312 658 256 -32 295 446 -6 -56 284 567 53 -66 234 391 455 -119 166 574 -255 -178 667
1638F67l78n31K79L53m13j07O50l24q42P07K99n09J48O0J8j86l00N84K05o19k20
$$ 667 289 -242 37 390 -23 -130 520 196 -646 61 360 -149 -1 59 77 -109 -409 175 380 -239 -459
1659d59M01K96n27l9R26p08q91J210po04J26N99o16l01P04M22r09nM40j97o7j8
$$ -459 -58 238 -289 -328 598 -110 -1001 209 202 -402 -276 323 -293 -594 110 532 -377 -382 58 -139 -206 -224
1681b24K09K14o32o1Q25r3n39J04L50k65m74J058J5j009L88N79o23J70M93m27
$$ -224 -15 199 -433 -494 331 238 -301 -197 153 -112 -586 472 487 -522 -134 445 -178 -8 485 58
1701E8j77j30M35J93k49m5j51K25P0m34P50r6r97N18M24m32m6N49j84o68L69P06
$$ 58 -119 -249 186 379 130 85 -66 159 229 -205 545 449 -548 -30 394 -38 -84 465 281 -387 -18 688
1723F88p27q2N10l33j05O7J77L5j80k88L07J39J0l37J72J23o88L33P90q72r0O05
$$ 688 -39 -121 389 56 -49 18 195 230 50 -238 69 208 218 -119 53 176 -512 -179 611 -261 -351 254
1745B54l22k75N41K77q06j40P00k64l29M88k18k26K96j15K03K46n87Q8K47j59
$$ 254 -68 -343 198 475 -331 -471 229 -35 -364 124 -94 -320 -24 -139 64 310 -277 -189 58 -101
1765a01kK09J22o49J8P74n55k01P78m87l63M48K36k22o5P7j89o3M89j16l50L72
$$ -101 -103 106 228 -421 -403 371 -184 -385 393 -94 -457 -9 227 5 -60 17 -172 -235 254 138 -212 160
1787A60k18k45O11r5l03L0oj16J74M66k17n85L93J25l77N29m4o08L42On0K56J03
$$ 160 -58 -303 308 213 -90 -60 -66 -182 -8 458 241 -344 49 174 -203 326 282 -326 16 22 -28 228 331
1810C31m58j55M47Nk52N00k66n58N45J37l57K03J02n11M4M03O2l67K22m7m14N36
$$ 331 -127 -282 165 170 -82 418 152 -406 139 276 -81 122 224 -287 -243 160 222 -145 77 30 -384 152
1832A52J33n15K91K7n00L91K51k13j54R0o6j92M16M6m98L09J0l63N65M8n03j4
$$ 152 285 -230 61 88 -412 -21 230 17 -137 -47 -113 -305 111 157 -341 -32 -22 -385 180 228 -275 -289
1854b89L02j11j38L54J1n87L20M21n99J12M20m79r2K03K05K0j98J3L6k1K17q1
$$ -289 13 -98 -236 118 129 -458 -138 283 -316 -204 216 -263 -355 -152 53 73 -125 -112 -76 -97 120 39
1876C9l1P8k90K41K10n39M61J01m17M8L86l2l96J35L83n74n6P30m50j58K95r1
$$ 39 8 86 -204 37 247 -292 169 270 -147 -99 287 255 -141 -6 377 -197 -253 477 27 -131 164 73
1898G3n3R7l9J03j49N8p6J08O7j78o5K85l01Q7L23m00k5P6J48j59J8N8q9j82J88
$$ 73 20 117 78 181 32 90 14 122 189 11 -54 231 -70 17 340 -60 -85 -9 139 -20 -2 56 -33 -215 -27
1923b7Q2n1R3k88J29K44k51j25J87m4j16m5L54k08j87K96o5k39L44j0k20p3kL75
$$ -27 55 4 97 -191 -62 182 -69 -194 -7 -51 -167 -212 142 -66 -253 43 -22 -261 83 73 -147 -220 -222 153
1947A53k43q7K26j44rQ1l2P5j16j1K85l38l5L83j48k13L0K34q1k11K55J72m33
$$ 153 -90 -177 49 -95 -104 -23 -55 20 -96 -107 178 -160 -195 188 40 -173 -143 91 10 -201 54 226 -207
1970b07K08J80k47Q3JR0m4l6N0Q6k44J44m7P5Om1J81m4k93L19k23L7J37m1j8j34
$$ -207 1 181 -66 17 18 108 64 28 78 164 -80 64 17 92 98 57 238 194 -99 220 -3 34 171 130 112 -22
1996b2J55kj53O4J1j13J35N9k34P1k2J0J9l5J56j45pK36k47o3J23n3L4M7k03J73
$$ -22 133 131 -22 42 53 -60 75 134 -100 -29 -51 -41 -22 -57 99 -46 -53 183 -64 -127 -4 -57 -23 24 -179 -6
2022fK9j59J03J2k8o0K9J41k78J46R3j39l5K08j50k%O4O0j93J08Q2m7J8o2J05
$$ -6 23 -136 -33 -21 -49 -109 -80 61 -217 -71 22 -117 -152 56 -94 -96 -96 -32 28 -165 -57 25 -22 -4 -66 39
2048C9k6q8J22R2n5j55K8MJ62k62J89P9j04Lm6Q1m7j35K57Ml01M06j02j68P7j00
$$ 39 13 -75 47 139 84 -71 -43 -39 123 -139 50 129 25 28 -18 63 16 -119 138 142 -159 247 145 -23 54 -46
2074d6K08k58j03M73r1k39J39j14L1K9j4J97j95q5K66k00O1Q0j49jq2M7J81l26
$$ -46 162 -96 -199 274 183 -56 83 -31 0 29 15 212 17 -68 198 -2 59 139 -10 -11 -93 -46 135 -191
2098a91J08P0P8m1j15J45Mj92Q7O0j99J03N2j9l6j10J60P6l27K49Lj8K7m4J14
$$ -191 -83 -13 65 24 -91 54 58 -134 -47 13 -186 -83 -31 -50 -86 -196 -36 40 -287 -38 -35 -53 -26 -70 44
2123D4k6l80M12l6k56J92N5n7p5j9K61k66J0L01k28j5k3P7J95l69J37K24j81j02
$$ 44 18 -362 50 14 -242 -50 5 -52 -127 -146 115 -151 -141 160 -68 -83 -106 -29 166 -203 -66 158 -23 -125
2147a25J66K2J0j60K54Q2m63K19K24l06P5J61j42J7k06L40K0k48J32l3l2J01j31
$$ -125 41 63 73 -87 167 249 -214 5 229 -77 -2 159 17 34 -172 168 188 -60 72 39 7 108 -23
2170b3J30J46m35K71K23m28P6K83m9k41m9L14k59j33L46j02j02J10p4J47k07L5
$$ -23 107 253 -182 89 312 -116 -40 243 194 -47 -96 218 -41 -174 172 70 -32 78 4 151 -56 -21
2192b1K1oP9k11J32R0l01J42K91l43KK39k46j40K97J2j56j15K20j07p4K40j69
$$ -21 0 -6 73 -138 -6 84 -217 -75 216 -127 -125 114 -132 -272 25 37 -119 -234 -14 -121 -195 45 -124
2215a24q6K28k74P0L42k28j26K24Jk25J52J97k70k20M83k12j14M19k40j57J26
$$ -124 -210 18 -256 -186 156 -72 -198 26 27 -198 -46 151 -119 -339 144 -68 -182 237 -3 -160 -34
2236c4M9o6J52j30J8j4J30J1j22K48l67j87N89j65j64K34M5m39J97L30k04l09
$$ -34 15 -51 101 -29 -11 -25 105 116 -6 242 -125 -312 277 112 -52 182 227 -212 -15 315 111 -198
2258a98M08j09k35M42l0l15K08j21j78K58Q6j73k80J82J3j6K96r1m89K75P2J6
$$ -198 210 101 -134 308 278 -37 171 50 -128 130 216 43 -237 -55 -42 -58 238 147 -342 -67 5 21
2280B1K80j79l39K52J13j78J24K3k57k07N07M8n97N03N9n56K00L86k29j70K39
$$ 21 301 122 -217 35 148 -30 94 117 -140 -347 160 208 -389 114 173 -383 -183 203 -26 -196 43
2301D3r1k94K56L50n10K8J68j95K96J22l87J05pp9J11K07k47j02K54o4m8K24P0
$$ 43 -48 -342 -86 264 -246 -218 -50 -245 51 173 -214 -109 -116 -195 -84 123 -124 -226 28 -36 -84 140 210
2324B10n63K87J96l33K25K33k76p7J12O3j34K08O8m12J86K98l85K03J79k93k9
$$ 210 -353 -66 130 -203 22 255 -21 -98 14 77 -57 151 219 -193 -7 291 -94 109 288 -5 -34
2345c4P2K12j87M1n5k6K1J27k38J60J18l82L10Q1l94L32K6k29j13M14N6m86J03
$$ -34 38 250 63 104 49 23 44 171 -67 93 211 -171 139 220 -174 158 184 -45 -158 256 312 -174 -71
2368g1K56k76K0M03j18m21K26R7j95%L02l06j80K81P0k03N9on9R7p1J05l4j42
$$ -71 185 -91 -71 332 214 -207 19 116 -79 -79 223 -83 -263 18 88 -115 -56 -62 -121 -24 -95 10 -24 -166
2392a66P4lm5J28L0Q3k50q2L19q8j94K40j89j66M34j33J2j54J65j17j5K72K3m20
$$ -166 -92 -95 -140 -12 18 101 -149 -231 88 0 -194 46 -143 -309 125 -8 4 -150 15 -102 -117 155 178 -242
2416b42L07j16r6J17J29j41n9n2K18j26p6L84l01r8J78o4J86j81N1R0k48J78K69
$$ -242 65 -51 -147 -30 99 -42 -101 -153 65 -61 -137 247 -54 -152 26 -38 148 -33 18 108 -140 38 307
2439C07k13n5k4J42K6k25J73k2l39L27P7k18P4J05Ol58K29K77k58j71K30j21j74
$$ 307 94 39 15 157 183 -42 131 109 -230 97 174 -44 30 135 141 -217 12 289 31 -140 90 -31 -205
2462b05K29J18j55j65J71M2m4J5Rj52J18Q1p4R8k79K48m3l36K66J21l22J96j4
$$ -205 24 142 -13 -178 -7 35 -9 6 15 -137 -19 62 -12 86 -193 55 12 -324 -58 63 -259 -63 -77
2485g7k2n9J24J43l24o7M24k52q2K22n8j34M7J54M9l16K74M6k95K34M2j85O4Q5
$$ -77 -99 -158 -34 109 -215 -282 142 -110 -192 30 -28 -162 -115 39 88 -228 46 92 -203 31 73 -112 -48 37
2509C7n5L9r7K37j50j69K60J7j52J09K0J40m17J47K44j88l9K02j54j7P4L4q9k75
$$ 37 -18 21 -76 161 11 -158 102 119 -33 76 96 236 -181 -34 210 22 -17 185 31 14 88 122 33 -242
2533b42L66L7l38L20L1j85J7J59p5j62R5J45o5j45K27j16j07j2K2q1KJ45J37l50
$$ -242 124 161 -177 143 174 -11 6 165 90 -72 23 168 103 -42 185 69 -38 -50 -28 -109 -107 38 175 -175
2557a75K3L13j60p2J46km6k04L36l4m11K59O0q9q4J13k1q1L4K22j31k03L50j34
$$ -175 -152 161 1 -71 75 73 27 -177 159 125 -286 -27 33 -56 -140 -27 -48 -129 -95 127 -4 -207 143 9
2581Ij96J19K4J16j35L0J58j93l3O9j5P2J7j76P1J15n4L4m3oo8J3R8Rm6M3J19
$$ 9 -187 -68 -44 72 -63 -33 125 -68 -101 -32 -47 25 42 -134 -63 52 -2 32 -11 -17 -85 -72 26 35 -11 32 151
2608A51j2j95J94L3k26m3K59j26k2N9L3r2KJ47m5k31Q9M1L9q3L1Q0Kk19L15k3
$$ 151 139 -56 138 171 -55 -98 161 35 13 72 105 13 15 162 117 -114 -25 16 55 -28 3 83 85 -134 181 158
2634A58l79L31Pj09n3Q9P5q7q9J38j56p5L01j45q1R9P7n1j07m4K01j84J38r0n6
$$ 158 -221 110 117 8 -45 44 119 32 -57 81 -75 -150 151 6 -75 24 101 50 -57 -101 100 -84 54 -36 -92
2659i2Q2r0J31r7j9O2k8j24J73jj17O5P7M0j40k8J91j20L5J55k06l7O8R4o2M9
$$ -92 -10 -100 31 -66 -85 -23 -51 -175 -2 -3 -120 -55 22 62 -78 -106 85 -35 0 155 -51 -88 -20 74 12 61
2685F1k8M7k33L05m3o9K6jp3N8j3J02o4m7J23p0j2l3J0J4L4J4J18r0n9J69k18
$$ 61 33 80 -153 152 109 40 66 65 -8 50 37 139 75 28 151 81 69 36 46 60 94 108 226 136 77 246 28
2712B8oJ04q3J0P7O1p0r8L3P8j83J17j8r8N9l2M1r4J24j7j71J58N1j94Q3N4o3
$$ 28 22 126 43 53 130 191 121 23 56 134 -49 68 50 -48 11 -21 20 -74 50 33 -138 20 71 -123 -40 14 -49
2739d9J12M2j72J8k4qJ24j81P2j9N7K3j41J96n0k88K58J13k85K57l3n8m7J2J3
$$ -49 63 105 -67 -49 -73 -81 43 -138 -66 -85 -28 -5 -146 50 0 -288 -30 83 -202 55 22 -36 -83 -71 -58
2764e8j18J23P8j83J44R8q5J16j68j62K71Jq8PJ9J36j29L9O6j93J14l2m8N2K55
$$ -58 -176 -53 25 -158 -14 84 -1 115 -53 -215 56 57 -31 -24 -5 131 2 41 107 -86 28 -4 -52 0 255
2789B55j86J39k47Q0O8r6J17j32Q9P0j75J0P3j05P4Q4j72J44j05j0N5j40K56n8
$$ 255 69 208 -39 41 109 13 130 -2 87 157 -18 -8 65 -40 34 118 -54 90 -15 -25 30 -110 146 88
2813H8o2J28j67L5J80j83mj52J29R1j29P1L5j43J46j35m3J98j27j6J58k26L4P
$$ 88 26 154 -13 22 202 19 15 -137 -8 83 -46 25 60 -83 63 -72 -115 83 -44 -60 98 -128 -94 -87
2837h7J67o6k06J53K4LQ5j05k1R1o4O1M7j12j29J59n2J48k26Q7Q8j87J64J02j41
$$ -87 80 14 -192 -39 -15 -12 73 -32 -53 38 -26 35 82 -30 -159 0 -52 96 -130 -43 45 -142 22 124 -17
2862a7J77j04n7q4K5J52r3r0J84j00j6J70r4k6l7O0L2j8p8J18m7N9j28O6J24k19
$$ -17 160 56 -1 -85 -60 92 -1 -91 93 -7 -23 147 53 27 -10 50 82 64 -14 104 57 116 -12 54 178 -41
2888d1k3J71j74J43J44j69n1P2j7j22J74Q3l01R8J60j89Q1J45k13rN4O9J19j98
$$ -41 -64 107 -67 76 220 51 0 72 55 -67 107 190 -111 -13 147 -42 39 184 -29 -38 16 85 204 6
2912FQ9j99P2J51j76NR5j47j3L31k67L2K5q4j3N0J43l40N6J78j28k4L55l83M2
$$ 6 95 -104 -32 119 -57 -52 43 -104 -117 214 -53 -21 4 -80 -93 -43 100 -240 -184 -6 -134 -158 197 -186 -144
2937a44J91k00OK12o8j95K36k6j51J36K49k73j89L23j6j57J64j49m1J29k5K2K0
$$ -144 47 -153 -147 65 -3 -198 38 12 -139 -3 246 -27 -216 107 91 -66 98 -51 -92 37 12 34 54
2960E4m9j07J07J36k05jK67l21P6J73j57j4J03K6p1j4J38o2k19K45J08k82J97
$$ 54 5 -102 5 141 -64 -65 202 -119 -43 130 -27 -41 62 88 17 3 141 79 -140 105 213 -69 128
2983A28pl2j11l4J63J0j25o8O2J21k05l8K58n8k63K06M8n0k0J71j97M3J5l1k8
$$ 128 121 89 -22 -56 107 117 -8 -76 -14 107 -98 -136 122 64 -199 7 55 5 -15 156 -41 2 17 -14 -42
3008d2J10o8j35J58j2r8J32n9q7J11j8o9n6J10j29J2J11J08k16Q2N9k5p4j5L6
$$ -42 68 0 -135 23 11 -87 45 -14 -101 10 -8 -77 -133 -23 -152 -140 -29 79 -137 -55 4 -21 -95 -110 -74
3033g4Or5J46Oj5m9N1L7j1j51J82N1j93J06R4k18M7J69K0k92Q8J92r0l0J62n1
$$ -74 -68 -163 -17 -11 -26 -75 -24 13 2 -149 33 84 -109 -3 91 -127 -80 89 109 -183 -95 97 7 -23 139 88
3059H8p6L8m8J32n6JJ8%j3l6J3M8k74L92r3j16J3J48j63O8K6m2k4q1O6K%m1O8
$$ 88 12 50 2 134 78 79 97 97 84 48 61 109 -165 227 134 18 31 179 16 84 110 68 44 -37 29 31 31 -10 58
3088E8r9J87j08L8K5j71J83k2j85J07n4Q0j8r4P5M9J4j05k2M6P9j38P8Oj54J66
$$ 58 -41 146 38 76 101 -70 113 91 -94 13 -41 39 21 -73 2 51 65 -40 -62 -16 63 -75 3 9 -145 21
3114B1K3k14R0P2L1j46N3J70j61j25J93L0r8N4KO0k30J08O4p8R6q4R6j1k03K19
$$ 21 44 -170 -80 -8 23 -123 -70 100 -61 -186 7 37 -61 -7 -5 55 -175 -67 -3 -81 15 -69 27 16 -187 32
3140C2n4j00K74q0j01j6J40j31J23j13J38K0k19K43q5m3m0Q3R2j86L7J55j02M9
$$ 32 -22 -122 152 72 -29 -45 95 -36 87 -26 112 132 -87 156 71 28 -12 71 163 -23 14 169 67 116
3164A16j11k7J10o0pm0o3J66n3j21J81q3m1J73m3j31N8n9N6o2LJ12r3J6P7j13
$$ 116 5 -22 88 28 21 -19 -82 84 31 -90 91 8 -33 140 97 -34 24 -35 21 -41 -38 74 -19 -3 74 -39
3190c9M8Q6j12k4JK4M0k01K02p5j9kL0%J8n2J23n7j73K39p6n0J25o1N6j48mJ27
$$ -39 9 95 -17 -41 -40 -16 24 -177 25 -50 -69 -71 -41 -41 -23 -75 48 -9 -182 57 -19 -69 56 -5 51 -97 -101 26
3218B6j14NJ01n1Q6j0q1o0M2K5L8j1N8q6j06J87M4j42K24j43P8j15k6J23r0q2
$$ 26 -88 -83 18 -33 53 43 -38 -98 -56 -31 7 -4 54 -32 -138 49 93 -49 175 32 110 -5 -31 92 2 -80
3244h0J43Oj17p3K49l2j09J67p4o9r0J89l8o7M7M5m9j1R6j39n6M4R0L7j91J24
$$ -80 63 69 -48 -121 128 96 -13 154 80 11 -79 110 72 5 52 97 48 37 133 -6 -62 -18 72 109 -82 42
3270D2J36j17k14J77M1k78K25r4K33j94k7K01j72m2M2r0O4J13j53J39Oj53J06
$$ 42 178 61 -153 24 65 -213 12 -82 151 -43 -70 131 -41 -83 -41 -131 -67 46 -107 32 38 -115 -9
3293in8m8J0J25n1m2lJ19j74J27J3j63J22Jl1Lm6M5J48j09j31J44R0M2k21RN0
$$ -9 -67 -115 -105 20 -31 -73 -76 43 -131 -4 9 -154 -32 -31 -62 -59 -105 -60 88 -21 -152 -8 82 124 -97 -88 -38
3320c8rL8K5j49O4J42j4n5j6O9m7j14K36j03j22J50m4kJ02n7J43j08j16N8N0Q8
$$ -38 -47 -9 16 -133 -69 73 59 4 -12 57 10 -104 132 29 -93 57 13 11 113 56 199 91 -25 33 83 171
3346A71k07R7J49j91j2J01j68J14Kp2qJ31p2j04%J99m9q2P9k23K03J8j06k9J54
$$ 171 -36 61 210 19 7 108 -60 54 56 -16 -24 107 35 -69 -69 130 81 -1 78 -145 58 76 -30 -59 95
3371I5j89o2J43R4k52K04l6j73J44J90j81o4J42k3p1O0k6N1r7Mn2J42L6j06n5
$$ 95 -94 -156 -13 81 -171 33 -3 -176 -32 158 -23 -87 55 32 -39 21 -5 46 -51 -47 -99 43 79 -27 -82
3396h2J77r2l6J13j61j9J84r2q9J79M7k19j32L28j45n3L35k09k31K83n1J0Q3j51
$$ -82 95 3 -33 80 -81 -100 84 -8 -97 82 129 -90 -222 106 -39 -92 243 34 -197 86 35 45 128 -23
3420b3m4J10N7n2j56K32j45q6K81j25j32K55j19j37J55K2n3j43K30j93J10K68
$$ -23 -67 43 100 48 -108 124 -21 -107 174 49 -83 172 53 -84 71 93 40 -103 127 -66 44 312
3442C12k52j74J83j39j8J61N3p4J9m9q4R7J49j04j59Q6O1j22Q1nnj41J17r7kL8
$$ 312 60 -114 69 -70 -88 73 126 52 71 22 -62 35 184 80 -79 7 68 -54 27 22 17 -124 -7 -104 -106 -68
3468f8Q3j03N6j6j7J43j42o1Q5Q1k60K90r7k8j53L01j31r4K31j12k91L52K7j72
$$ -68 15 -88 -32 -48 -65 78 -64 -125 -40 41 -219 71 -26 -54 -207 94 -37 -131 100 -12 -303 49 76 -96
3492i6J06k4o5N5N0j0n8J23o1j75K13oj77K01nj94J29M0o1J07n9n3j0R4Q2k53
$$ -96 10 -14 -79 -24 26 16 -42 81 20 -155 58 52 -125 76 71 -123 6 46 -15 92 33 -20 -30 64 146 -107
3518a07K12n9j11J44m4n8P9p2j1O6J40o3j42O1q0j1R6O1q9n8Q0m4J08j10l5K4
$$ -107 105 46 -65 79 35 -23 56 -16 -27 39 179 116 -26 35 -45 -56 40 101 12 -46 34 -10 98 -12 -47 -23
3544b3RR5j20M8O8j48J51m4j60Q7J27q3j18J34m5p3L0Q7lm1L7N5j48LjM9J43j23
$$ -23 -14 81 -39 9 77 -71 80 36 -124 -37 90 7 -111 23 -22 -95 -65 22 19 -22 15 70 -78 -75 -76 -27 116 -7
3572gn6o7J64p8N8n2M6l6J3j36K45pq6p3N5j8Q1m2J2P3j30J58j12K2M9m6J5N4
$$ -7 -63 -130 34 -44 14 -38 8 -28 -15 -151 94 87 1 -72 -17 -35 46 4 16 89 -41 117 5 27 76 30 45 99
3600I9p0%J3l4Q4p2j9J5q1L3J05q7L9Mr6J95r1ork7J49j49J0K0j2J34j61J0J02
$$ 99 29 29 42 8 92 20 1 16 -65 -32 73 -14 25 29 -67 128 37 31 22 -5 144 -5 5 25 13 147 -14 -4 98
3629I8j77J7K01q9k6l8%J04k29N2J28p0N2j13M6J8J44k16l4J15Qp8K2Q1O7j32
$$ 98 -79 -62 139 50 24 -14 -14 90 -139 -87 41 -29 23 -90 -44 -26 118 -98 -132 -17 -9 -87 -65 16 83 -49
3655d9Mj2Q9o1r6J19p9J1J34j33N3K4p8nQ6M6j12n8K8K58k69Q5JK2J5l2J04j70
$$ -49 -45 -57 32 -29 -125 -6 -85 -74 60 -73 -20 4 -74 -79 7 53 -59 -117 -89 169 -100 -15 -14 8 23 -9 95 -75
3683g5Q0O4j1l0N1L0j11p1N1K62j42j00J48j97J5K9JL2R0n2l8k3lN8r3J76n5j10
$$ -75 5 69 58 28 79 109 -2 -73 -22 240 98 -2 146 -51 -36 -7 -6 26 116 64 26 3 0 58 -35 141 86 -24
3711b4J16j18M6lm4K9j8m8J70j35L8R1l0n7%K0j8l4p4O2j07P9mJ3m3K7j4L3j44
$$ -24 92 -26 20 17 -27 2 -16 -64 106 -29 9 100 70 13 13 33 15 -19 -93 -31 -138 -59 -63 -50 -93 -66 -80 -47 -191
3740a91J76N4j08Q3r0L3l3j4J13j97P2j8N5J6J46m6j13K2L5Jj63J16J73p6j11
$$ -191 -15 39 -69 14 -76 -43 -76 -90 23 -174 -102 -120 -65 -49 97 51 -62 -40 -5 -4 -167 -51 122 46 -65
3765f5O8l9m0%P8J24j05M3l0n9m7M6J69j50m8L0M3r2K14k09J34p1L4j6M5j69J97
$$ -65 3 -36 -76 -76 2 126 21 64 34 -25 -72 -26 143 -7 -55 -25 18 -74 140 -69 65 -6 28 12 57 -112 85
3792H5p6J12r6o5J24p5NMJ13j33q9O9J57k13O6K09j36j09J56K9q7o1M3J18j72
$$ 85 9 121 25 -40 84 9 14 18 131 -2 -91 -22 135 -78 -12 197 61 -48 108 137 50 -11 32 150 -22
3817b2n8J38j63O1L1L5Q0j11ml5j63L30j47n0Mp8J28N8o2L3p0n8K00n9q7O4p6
$$ -22 -80 58 -105 -44 -13 22 102 -9 -13 -48 -211 119 -28 -78 -74 -152 -24 34 -28 5 -65 -123 77 18 -69 -5 -81
3844h1K4m7J8m5J81j47J08l0O5o0NL5r9j1O9Q4jJ4j70J12NM1j15R3J05k86N1K52
$$ -81 -57 -104 -86 -131 50 -97 11 -19 46 -14 -9 26 -73 -84 -15 69 68 82 -88 24 29 70 -45 48 153 -133 -82 170
3872A70k10L4J14k01K38o3k9M2j6J3o8JP1n3o4R2j12P5M1k3ML7q8M5m8J36r2q0
$$ 170 -40 -6 108 -93 145 82 53 95 79 92 24 25 96 43 -21 71 -41 34 75 52 56 93 5 50 2 138 46 -34
3900c4J33j12pJ31j89OO0m6J1K2N4M7r5kN0QM5j95KK22p7j73kJ11j35Q4P0j07
$$ -34 99 -13 -20 111 -78 -72 -12 -58 -47 -25 29 76 -19 -21 29 37 82 -113 -111 111 34 -139 -141 -30 -165 -81 -11 -118
3928a18J29n3K6m4KQ5j15P3m2j36K66m6m0K1q7J13m9L0Q9j87J06J39j49o2J05
$$ -118 11 -42 -16 -60 -58 27 -88 -15 -57 -193 73 27 -13 8 -79 34 -15 15 104 -83 23 162 13 -49 56
3953E6o5K9J6k3j04J91p2o8J31O0j62N8oL4M3p5K1l0L7q8J69j32J25j37j21K43
$$ 56 -9 20 36 13 -91 100 28 -40 91 151 -11 47 41 75 118 43 64 34 71 -17 152 20 145 8 -113 130
3979A30j93O7P3r2P0l7J19o0j25P7M7n5J6k34K47j4Lj11K7M5o0K4M6o6l3J75j41
$$ 130 -63 4 77 -15 55 18 137 77 -48 29 76 21 37 -197 50 36 39 -72 -45 0 -60 -36 10 -56 -89 86 -55
4006e5MM3Q1j51J3M3m5l9J4M7Q2j85J17j16O1OJ58Jr0o9O3m5m3R6K8rp5Nk1J54
$$ -55 -51 -8 73 -78 -65 -22 -67 -106 -92 -45 37 -148 -31 -147 -86 -80 78 79 -11 -80 -17 -62 -105 -9 19 10 -65 -60 -81 73
4036G3Or6j73K76j65Q5L3l5p2L7PJ29q6lq0l6K10M3j85P1Q6j92R3L9OK9j51J54
$$ 73 79 -17 -190 86 -79 6 39 4 -68 -31 -24 105 19 16 -64 -100 110 153 -32 39 125 -67 26 65 71 100 -51 103
4064A03j51P9R4j19M7j39J57L0n7l8P5n8o3QK7Q6k36J63k2k3N6J1r2P1n7j6O7
$$ 103 -48 31 125 6 53 -86 71 101 44 6 81 23 -40 -32 -5 81 -155 8 -14 -37 19 30 -62 9 -48 -64 3
4091Cl2k0m2K3J44L3j61J00j06K8R9j58J60l2j55K3J98j90j2R4N4j61J70P9k52
$$ 3 -29 -49 -91 -68 76 109 -52 48 -58 -30 69 -89 71 39 -116 -93 105 -85 -97 -3 51 -110 60 139 -113
4116a13L6Q7j09J74j27l4J74k7q6O7j20J50j27Q7j6k1j1O8m1m0Q1Jr5M0Ljk0J62
$$ -113 -77 10 -99 75 -52 -86 88 61 -25 42 -78 72 -55 32 16 -5 -16 52 11 -29 52 53 -42 -2 1 0 -20 142
4144A42j23j9J17j04m5L5K4N7q0j46J90m0L5q8K2J12j20m0J31q2j10J96p5L7O6
$$ 142 19 0 117 13 -32 3 27 84 4 -142 48 8 43 -45 -23 89 -31 -71 60 -22 -132 64 -11 26 92
4169I2o9J02p3j20J20o0pP8p9QN1r3J45m5N6j22n2j8Q6nKl1Q8m2q1R7L7j94R9
$$ 92 23 125 52 -68 52 -8 -15 63 -16 -8 43 -50 95 50 106 -16 -68 -86 0 -5 -3 -34 54 12 -69 28 65 -129 -30
4198c0K4J08j79J38j6j83J76k7K6o9N0J7j2m1nj12J44n1O3jP7n7r5P1P3pm4j16
$$ -30 -6 102 -77 61 45 -138 38 11 37 -32 18 35 23 -18 -23 -135 9 -42 21 20 97 40 -55 16 89 82 38 -78
4226g8P3J68j42K1k7M5ML0n2qk8K2o4Q4P5k97J55M6n0J44j61L9O9k02L04k48J05
$$ -78 -5 163 21 42 15 60 64 94 42 34 6 28 -36 48 123 -174 -19 27 -23 121 -40 -1 68 -134 170 -78 27
4253B7K9j38J71J6p2L9j19R1q6Lm1R2O7mj39n6J30l5J09o2l8K4q0Q8o8J07m0n8
$$ 27 56 -82 89 105 33 72 -47 44 -42 -39 -80 12 79 75 -64 -120 10 -25 84 22 -16 8 -72 16 -52 55 15 -43
4281d3Rk5L2pk9j42K07r1J1P9k8o9J09j60J37L0o3R3r8Q0m7r5J14p6J23j32J52
$$ -43 -34 -59 -27 -34 -63 -205 2 -89 -78 1 -27 -96 13 -147 -10 20 -43 50 -48 32 -15 -110 4 -72 51 -81 71
4308G1k1j97J0J18l3O1%p3k2J10JkJ00j33R3j15L2J21np1j0J7j07J31r3J19j37
$$ 71 50 -147 -137 -19 -52 9 9 -64 -86 24 25 23 123 -10 83 -32 0 121 116 45 35 52 -55 76 -17 102 -35
4335c5R9q0M8k2r4J91n3l8N7Kj25J51j21k6J63p8j0M5j28R2J7l9k2j34J11O5l7
$$ -35 64 -16 32 10 -84 107 54 16 73 75 -50 101 -20 -46 117 39 29 74 -54 38 55 16 -6 -140 -29 36 -1
4362aj12J90m1q7p9J44l9q5M9N1N4j18O0j6M1j03J2K08j77J3K0K0m1K3L2n7j8
$$ -1 -113 77 36 -51 -130 14 -25 -110 -61 -10 44 -74 -14 -30 11 -92 -80 128 -49 -36 -16 4 -37 -14 18 -39 -57
4389e7J9j3J15j20m2M8P6P2j73K09j67K6m2K34k03N0k2n8K1J21j35Q1M6rm1J2
$$ -57 -38 -51 64 -56 -98 -50 26 98 -75 134 -33 -7 -49 185 -18 32 10 -48 -27 94 -41 40 86 77 36 48
4415D8m6Q5m9K4K7m0j31J20J23l7j31m8J29j13Pj8RM6m7J04k4J7P8j19L2O9k06
$$ 48 2 87 38 62 89 49 -82 38 161 124 -7 -55 74 -39 -32 -50 -41 5 -42 62 38 55 133 14 46 115 -91
4442i1R6M9j17Q5j04J02J7q5j7oM9L9q8n4J16jlL7P3n7o8l7L0j1K7Rn9O1J8r1
$$ -91 5 54 -63 22 -82 20 37 -48 -65 -71 -22 17 -71 -125 -9 -10 -13 24 97 40 -28 -65 -35 -46 -19 -10 -69 -8 10 -81
4472h1J0P0L9j2oj8j39J13q7N2J60k07J27k8l0P5j7j4n0N0r0J78o1o1J00q0N9
$$ -81 -71 -1 38 26 20 2 -137 -24 -111 -59 101 -106 21 -7 -37 38 21 7 -43 7 -83 95 34 -27 73 -7 52
4499E2j27RJ39l3L0L2j03l4M0j8N1l4rk3N0N1N0j11J0P8j22R1N5k50J44o2Q7p4
$$ 52 -75 -66 73 40 70 102 -1 -35 5 -13 38 4 -5 -28 22 73 123 12 22 100 -22 69 124 -126 18 -44 43 -31
4527c1O9L5j24l6O1j4J26n3l2Q4j02l5J5L5j2J0J8k3j26N2P1q1J25l7n9m2P3M6
$$ -31 38 73 -51 -87 -26 -40 86 33 1 85 -17 -52 -37 -2 -14 -4 14 -9 -135 -83 -12 -93 32 -5 -64 -106 -33 13
4555A3l7Q1o1Mn9L3k4J41l7j33j4J43M8k05J5J0J4m6R1J4J7L8j30J15k6j7M8p
$$ 13 -24 57 -4 0 -59 -26 -50 91 54 -79 -93 50 98 -107 -92 -82 -68 -114 -23 -9 8 46 -84 31 5 -12 36 29
4583B9l3MM6N3j22M9P0j83N8K08k16M9K3L6O2r5Nl5l7L0l2J10N7r1N3o2P0j14
$$ 29 -4 0 46 99 -23 26 96 -87 -29 179 -37 12 35 71 133 38 43 8 -29 1 -31 79 136 45 98 36 106 -8
4611ho6J11j33K6K07j57R3j2n5j6M4l1k7J56j28k8J6j32J10L8j01M2j12J60K4
$$ -8 -74 37 -96 -70 137 -20 73 61 6 -10 34 3 -24 132 4 -24 -8 -140 -30 8 -93 -51 -163 -3 21
4636B1j24J65j08p0J13K0j21J14j15j5J80N0j46j26J46P9l8p9J2PJ19j8m2N7p2
$$ 21 -103 62 -46 -116 -3 17 -104 10 -105 -120 60 110 -36 -162 -16 63 25 -54 -42 -35 84 66 24 81 9
4661Ik6j9P3l1L3j5K5qN4p4O9J7r3j0j8jK1J1J02j41J8L7Pq7P9m2L6Q3j46k6N8
$$ 9 -17 -36 37 6 39 24 49 41 95 21 90 107 14 4 -14 -15 6 17 119 -22 -4 33 40 -47 32 -10 26 109 -37 -63 -5
4692eM3j05K10m7m2m2K5om5p1J32K0m8m3n5P1J9k9rq4J35j74K83j08j52J96j36
$$ -5 38 -67 143 96 54 12 37 31 -14 -85 47 67 19 -24 -79 -8 11 -18 -27 -111 24 -150 133 25 -127 69 -67
4719f7l7K9Q3m5%q8J30p9J22p2m0Q7l5q6J08m8NO5j3j56R5K5k4N3K9o8L9k6k7
$$ -67 -104 -75 8 -37 -37 -125 5 -74 48 -24 -64 23 -12 -98 10 -38 -33 32 19 -137 -42 -17 -41 12 41 -27 12 -14 -41
4748d1J00j22j2O2J8l7J12j2j27O2%j8NK0m2M5P4n0l6j9N3J2J8j25O7K2M1kj81
$$ -41 59 -63 -75 -13 5 -32 80 68 -59 3 3 -15 -10 10 -32 13 87 37 1 -18 35 47 65 -60 7 29 70 68 -113
4777a13J58l0N7O7q4o1j0J21k06P6m0O1J0N3K8j61Q1j57K01n9K4J3O3j01j5j8
$$ -113 45 15 72 139 55 -6 -16 105 -101 -25 -65 -4 6 59 87 -74 7 -150 51 -8 16 29 92 -9 -24 -42
4803d2j0j0Q4o1Q4J5pm2r4O5Q8q5n0J15l9n5J79j40j5J9M4o9j20J36M0m4R1j36
$$ -42 -52 -62 22 -39 45 60 53 11 -83 -18 70 -15 -65 50 11 -44 135 -5 -20 -1 43 -26 -146 -10 30 -14 77 -59
4831e9J19j25o7P8KR2n1p6J10j10M9N1j3m7N3l5r0P9O2n4P1l6on7N5l8J64j89
$$ -59 60 -65 -132 -54 -52 40 -11 -87 23 -87 -38 13 0 -47 6 -29 -119 -40 22 -32 39 3 -3 -60 -5 -43 121 -68
4859f8O5N5pO0j00J1m7M2N3o3q9L2P7M5j8J7%j73J26j7j8j9Q6j4n8Q1L8l8r2J5
$$ -68 -3 52 45 105 5 16 -31 11 64 1 -88 -56 21 66 48 65 65 -108 18 1 -17 -36 50 36 -22 59 97 59 -33 -18
4889a8J15j04o4km0J83r5R7j51J39J9k06J28Oo5R3k28J85O1j21o7J84j33Q9j03
$$ -18 97 -7 -71 -73 -113 70 -25 72 -79 60 79 -127 1 7 -58 35 -193 -8 53 -68 -135 49 -84 5 -98
4914i8P7l0n3M4k3Q6n0m0NJ8MJ54j03n3J12m7L0n7j02J23P2n2j15J48n6Q9o9M6
$$ -98 -21 -51 -104 -60 -83 3 -47 -87 -82 -64 -60 94 -9 -62 50 3 33 -24 -126 -3 69 17 -98 50 -6 83 14 60
4942F0j93J78n8Mo7Q0j7K6N0j6l5O4l5j04N9L2j20O8N0M8q7N6pO5j5m8pq6mJ40
$$ 60 -133 45 -13 -9 -76 4 -13 13 63 47 12 76 41 -63 -4 28 -92 -24 26 74 -13 43 36 101 86 38 31 -55 -59 81
4972H1q3O5q1L0L7q4J08np0N2o7Q1m4J5R3q7o7P1O9k13J17p9O0k5k0K7q0J48j55
$$ 81 -2 63 -18 12 49 -35 73 68 -2 50 -17 64 20 35 128 41 -26 45 114 -99 18 -61 -1 -26 -46 -19 -99 49 -106
5001a06o2J79n6k3J15j16L8r1J74j8l9l9nJ77j95J02k4J2L5m8R7J6j52O1K9q8
$$ -106 -168 11 -45 -68 47 -69 -31 -122 52 34 -5 -44 -49 128 -67 35 11 23 58 10 107 123 -29 32 61 -27
5027b7K6l2Q7j73J55N3k01J43J6l0p4K02k08J87m3q8k0K9M3j5L7j37M3O8J08k34
$$ -27 -1 -33 54 -119 36 89 -112 31 47 17 -57 145 -63 124 81 -7 -27 2 45 30 67 -70 -27 41 149 -85
5053h5J62n1L6n1P8o2q3L5NMM6M2o9j01J11o6M2J17j14j7j6J8m0o0J79l3J6n5
$$ -85 77 26 62 11 89 27 -56 -21 -16 -12 34 76 7 -94 17 -49 -7 110 -4 -21 -37 -19 -59 -119 60 27 43 -12
5081a2L2nO6k0k09J15k6L5L0L1m6M7J2No3o8Pk4K60j45j46P1j15P8J43O7j26j04
$$ -12 20 15 81 61 -148 -33 -59 -24 6 37 -9 38 50 55 -8 -76 -69 -93 167 22 -124 -53 -168 -90 53 120 -6 -110
5109a10J57l1j34J30j3j03J45j05lO8O2o8o7R4Mj07O4M0o3M2Ll3Q4O3j24k8l3
$$ -110 47 16 -118 12 -1 -104 41 -64 -67 1 63 -5 -72 22 26 -81 -17 23 -40 2 5 -28 56 119 -5 -33 -66
5136f6J49o7L9k32K26L5l1p2J09J7j94J15Oo9K9N6n1j24J79l0K4J0r5o8J38j17
$$ -66 83 16 55 -177 49 84 53 -19 90 107 -87 28 34 -35 -6 50 -1 -125 54 24 48 58 -37 -105 33 -84
5162h4R2j8L1l8J00l5l0j13K21j52j2L8o1r5J98j47N8Q2l7r0M1M8J8q2M6M0r3
$$ -84 8 -10 21 -17 83 48 18 -95 126 -26 -38 0 -61 -156 42 -105 -47 35 -2 -92 -51 -3 15 -67 -21 19 -74
5189g4R6J9j4j4k0j41J18M8j17P4K4M9q9j2J02n0N2n3j16J09L6J3k6o4N2o2K14
$$ -74 22 41 27 13 -7 -148 -30 18 -99 -25 -1 48 -41 -53 49 -1 51 -2 -118 -9 27 40 14 -50 2 -60 154
5216A54j60K0j6R8p4j1J17j34Q7j07j4N7o3k0O9%R3j42J26J6j97K7J14p8P7m6
$$ 154 -6 14 -2 96 22 11 128 -6 81 -26 -40 17 -46 -66 3 3 96 -46 80 96 -101 -74 40 -38 39 -7
5242gPp0J25q1q4J93j05m4l7P1jRr8J11N5MM1m6k7l0K8r2R9m3P9l3Rp0mN0k5Q
$$ -7 0 -70 55 -26 -110 83 -22 -66 -103 -32 -33 -24 -122 -11 44 48 89 43 16 -14 14 -78 21 -22 57 24 33 -37 -41 9 -16 -8
5274hl3L3m6N3rO6j30N3J8k9J07k13N3K1O8M1J9p2O8j09K7P4j18l7J39j7M7m3
$$ -8 -41 -8 -54 -1 -10 56 -74 -21 -3 -32 75 -138 -85 -64 4 45 64 -8 60 -49 -22 52 -66 -103 36 19 66 23
5302B3J8p2j7P5jP1l0l1M4j47Q1Mj13K16j27J8k9j8O3j8J8o2j3J21r0Mk7J08p2
$$ 23 41 -31 -48 27 26 97 67 36 80 -67 14 18 -95 121 -6 12 -17 -35 28 10 28 -34 -47 74 -16 -12 -39 69 -3
5331cK3m0r5J32J8l2m7L0N5J5l9k9R7n9J02k42J18j68J88r7K3%j0J20j28K5k5
$$ -3 20 -20 -115 17 35 3 -44 -14 41 56 17 -12 85 26 128 -114 4 -164 24 -73 -50 -50 -60 60 -68 -43 -68
5358f8J42j73R9j34J34K1j08qJ06P4j15N4m1o9J73m5N3l4m4oq8O1N7n9L8L6J5
$$ -68 74 -99 0 -134 0 21 -87 -95 11 85 -30 24 -17 -86 87 42 95 61 17 11 -77 -16 41 -18 20 56 71
5385G1o0j00N6k1J14K7q7N4L4j93K34p9n7QJ49j19l9J19m3j46J17J8p4J20p7o4
$$ 71 11 -89 -33 -54 60 87 0 54 88 -105 129 50 -7 1 150 31 -8 111 68 -78 39 57 -17 103 26 -38
5411c8J57pj69J07q0P1O3q7N1M7j67k7J19j18N4l3K06j27K2m6o1J05q7K1J2l4
$$ -38 119 112 -57 50 -30 41 104 17 68 115 -52 -79 40 -78 -24 -57 149 22 44 -2 -63 42 -45 -24 -12 -46
5437d6J61q1n4o1K8j9J17j35N4M9o1O0j9j7k2P1j75J97o3j5m5kQ7J06q5m8N4j3
$$ -46 115 34 -20 -81 -53 -72 45 -90 -36 13 -48 12 -7 -24 -46 25 -150 47 -16 -31 -76 -78 9 115 30 -18 36 23
5465B3L0m4j45J94p4J09p9r9J34j81J97o6n5O3qr6N9M3J01p2j19R1m0N6J01p4
$$ 23 53 9 -136 58 -16 93 14 -85 49 -132 65 -1 -56 7 -1 -97 -38 5 106 34 -85 6 -34 22 123 49
5491D9l5K9l5j3j17J13N0l4J6r0j5Q8Q4n4n7J3j11KN1P8k6mj7o2K0J2N0J32r3
$$ 49 14 43 8 -5 -122 -9 41 7 23 -67 -82 6 90 36 -21 -8 -119 -117 -66 12 -14 -18 -35 -97 -77 -65 -15 117 24
5520B4K6l6P3q4j4J8J7r4P8k4j5j3O8j6o7L5pOO4pp0m4J35L0r6lo3J25k2Q8j80
$$ 24 50 14 87 3 -11 7 24 -70 8 -16 -31 -44 24 8 -59 -24 -31 -25 39 32 -38 -82 53 83 -13 -16 -79 46 24 112 -68
5551f8R1j9%kJ14p8N1M1j74J4JJ87j98Q8k7O0k57J66O7n6M8j04jJ14j31Q5Qo9
$$ -68 23 4 4 2 116 38 89 130 -44 -30 -29 158 -40 48 21 81 -176 -10 57 1 49 -55 -56 58 -73 12 20 -49
5579d9L2k8m1J22m6J9l5Q1P3n9j05J15j21J42J14k76J07j0q5J25j40Q8l3n6J76
$$ -49 -17 -45 -86 36 -10 9 -26 55 128 69 -36 79 -42 100 214 -62 45 35 -50 75 -65 23 -10 -66 110
5604A10j07m5p9M5J19LJ0n6m5O9p2%J13j66Q2R6j03j09P1K6M7O5o3j6j24K68j7
$$ 110 3 -42 -121 -76 43 46 56 0 -45 24 -48 -48 65 -101 -19 77 -26 -135 -64 -38 9 74 11 -5 -129 139 122
5631A22p9n1P0j57J77j41J4j5m9J81KLq9N8p6Rj67K46p5J7L8M0j22K8l7R6l0o9
$$ 122 43 -8 62 -95 82 -59 -45 -60 -109 72 74 77 -12 46 -30 -21 -188 58 -17 0 38 78 -44 -16 -53 43 13 -56
5659e6l6J03k1Q3j19J22N4j21N9p9o4O6j5N0Pp8K3K0J01l4j8J2j5m7K0j71J51
$$ -56 -92 11 -10 73 -46 76 130 9 68 -11 -75 -9 -24 26 33 -45 -22 -2 99 65 47 59 44 -3 17 -154 -3
5686cK1J3j2O4o9k3j5OL9j33N1L2o8J88r2o4O1OJ19j20L4O9k4j08M0r5J47n9j5
$$ -3 18 31 19 83 14 -9 -24 -18 21 -112 -61 -29 -97 91 -1 -65 -4 2 121 1 35 104 80 -28 12 -83 64 5 -10
5715a0k4N4R0j37j0k8l2J08k5M8j4o1k8N2J3r5J24j65J11J6l5P2p0l5L5k8O7J20
$$ -10 -34 20 110 -27 -37 -65 -97 11 -14 34 20 -41 -69 -17 -4 -99 25 -140 -29 -13 -48 24 -46 -81 -46 -74 -7 113
5743A13j09J7Kp3J0L8PN5j37J29r0Oj1M3j32J55K7Pm6J6onJ21o5l9o3%ONj2Q4
$$ 113 4 21 23 -50 -40 -2 5 60 -77 52 -38 -32 -43 0 -132 23 50 57 11 27 21 16 137 72 33 -30 -30 -24 -19 -31 53
5774E3O8j05l1M7L7n8q5J16O2o4m8O7n9M1k4o7Q8O9j63N5o6J41p6o2K5K0R1r0
$$ 53 121 16 -15 32 69 11 -74 42 104 40 -8 59 0 41 17 -50 38 107 -56 -1 -67 74 -2 -64 -39 -19 72 -18
5802a8P1j12l5J18N4j06K4j07J43K1n9R1k3n5J7n7QP9j14M5J1j3q5M4R6j36N1
$$ -18 53 -59 -94 24 78 -28 -4 -111 32 53 -6 85 62 7 24 -33 -25 54 -60 -15 -4 -17 -102 -58 38 -98 -47
5829d7m6J52j30J24j32J95j13O8j17L6pP8k6o8N1k6O4p8L2L4N5j15Q5o3o5J29
$$ -47 -93 59 -71 53 -79 116 3 71 -46 -10 -17 61 35 -33 18 -8 56 -22 10 44 99 -16 69 6 -59 70
5855G0q3P7J9q8N8Jj02P3k0K2p8K3J65j31Ql1R1o3O0j77J74r9o1J30rj03Q5m1
$$ 70 -13 64 83 -5 53 54 -48 25 5 27 -51 -28 137 6 14 -17 74 11 71 -106 68 -31 -92 38 29 -74 11 -30
5883c0M1k5p9J18L6l0l5p0R2q8M2P5j01J7O1l9M4m0J4m6P0m0j5N8q6J24R0m2r5
$$ -30 11 -14 -93 25 61 31 -4 -74 18 -70 -28 47 -54 -37 24 -15 29 -11 3 -43 27 -13 -28 30 -56 68 158 116 21
5912B1n9R0n5k2R0j56m2N2J14r0nJ18n4n4M6K4j31P7P8p7k6Q4L9k7J1l1M0l3L1
$$ 21 -38 52 -3 -25 65 -91 -133 -81 33 -57 -62 56 2 -52 -6 18 -113 -36 42 -35 -61 23 62 35 46 15 55 22 53
5941E3l7Lm9Qm7Q5q5KJ67l9p2NK2n1l0J14J5j14R6l0M3j40lQ2n2J15r4J1O3j04
$$ 53 16 19 -30 -22 -69 16 -69 -67 100 61 -11 -6 16 -35 -65 49 64 -50 46 16 59 -81 -84 -2 -54 61 -33 -22 41 -63
5971f3P9nj46P5J0o9J99r3j1J7K5L5j06J14n0Ko1K7m9K0P9n2Mj2R6k9q1P4n2M3
$$ -63 16 11 -135 -60 -50 -119 80 -13 -24 -7 18 53 -53 61 11 13 -48 -21 -70 -50 29 -23 -19 -31 65 36 -45 29 -23 20
6001B0N0j41Q7NJ0j56J39k9m0J18l9m8m5l8R1m9O2n7K13j93J49j96N5l9J40m7
$$ 20 70 -71 16 21 31 -125 14 -15 -55 63 24 -24 -69 -107 -16 -65 -3 -60 153 -40 109 -87 -32 -71 69 22
6027B2j41J60n3J73j86P5n5Q2j17O2ln7J0L6n9n2L5N7N3Oq6J2R6q2Q6j42R9N5
$$ 22 -119 41 -12 161 -25 50 -5 77 -40 22 19 -38 -28 8 -51 -103 -68 -11 42 48 -38 -26 70 -12 74 -68 31 86
6055H6o9m7mj0J05k3j33R6j5J6J37r6r9J2KK2q4j5R9K6n2k7O5QJ7pO5p2j08K39
$$ 86 17 -30 -34 -44 61 38 -95 1 -14 2 139 43 -56 -44 -42 -20 -104 -119 -20 6 -46 -73 -8 0 17 10 75 3 -105 134
6085A34j59L4r3Q4p8l3J55J2L8Kp8k2R6o2jl8J07n2l6J07m6q4o5j8J32J6n3JJ09
$$ 134 -25 9 -84 0 -78 -111 44 56 94 96 18 -4 92 30 29 -9 98 46 10 117 71 -13 -78 -96 36 52 -1 0 109
6114A09j07M4q4J2o4L0K6Q4q3J06m3M3q7M1p4P2qPk0o1J16j21M2L5N9r5J5p8O8
$$ 109 2 46 -38 -26 -90 -60 -34 50 -33 73 30 73 -14 27 -47 25 17 24 4 -57 59 -62 -20 15 74 -21 -6 -84 -16
6143a6k5M2m0N0K2L0l9K3Ro9K8N9n6m4Q8p2m6J49q3j2n1l1O9R4n9n6Q6m7l5O0
$$ -16 -41 1 -39 11 33 63 24 47 56 -13 15 74 18 -26 62 -10 -56 93 10 -2 -53 -84 -15 79 20 -36 50 3 -32 28
6173B8q8rJ23m3j04J42j18O9L1Q7q0j08j3N6k5LM6n0j05J21M6J04n9J5qj08R1
$$ 28 -60 -69 54 11 -93 49 -69 0 31 118 38 -70 -83 -27 -52 -49 -3 -53 -158 -37 9 113 54 69 61 -47 44
6200D4k44K03j2J2k4J09p3l0L2J7j10J89j03pn1Q2q4j1P5k5J51j51M2M7r4K3O3
$$ 44 -200 3 -9 3 -21 88 15 -15 17 34 -76 113 10 3 -48 34 -50 -61 14 -11 140 -11 31 78 -16 7 70
6227G0o0K4Kr2j1J23j64K38k48N7q2J04R5n5J6nJ30j17o1mJ13n8j1j26K4P5l2
$$ 70 10 34 36 -56 -67 56 -108 130 -118 -61 -143 -39 56 1 17 12 142 25 -36 -40 73 15 4 -122 -98 -23 -55
6254e5j9P3Oj6o4N1P9p2p7R3q6O7P1p2o5R0L8J6L7q8j4r6R3l4J35j00J4lM0o3
$$ -55 -74 -1 5 -11 -75 -24 55 -17 -94 -1 -87 -20 51 -21 -86 4 42 58 95 7 -7 -103 -10 -44 91 -9 5 2 42 -21
6284b1L5j3j1O5j7o0J7o3K00o2m4J05k09M4J35j11P2q6N3jq9J22j24P4ol7n1L7
$$ -21 14 1 -10 55 38 -22 -5 -68 132 70 26 131 -78 -34 101 -10 62 -24 29 28 -61 61 -63 11 5 -32 -83 -46
6312d6L6o0J7J4M9L4k9j9Q0l9K3p9J31k16N5J18Q5j53J61k29N7j2J5j2l0R1r6
$$ -46 -10 -70 -53 -39 10 44 15 -4 76 37 60 -19 112 -104 -49 69 154 1 162 -67 -10 -22 -7 -19 -49 42 -54
6339e4J06j4p3Q6p2M0m4J6r9O6M0k9O7j6J6jj44K52j92J24j57J14Rp1M1l9J91
$$ -54 52 38 -35 51 -21 19 -25 -9 -108 -42 -2 -31 36 20 36 35 -109 143 -49 75 -82 32 41 -30 11 -28 163
6366A63j15Jj02O5j17K9P8N1M9j10j34P3j1O2j2P7j05J69k27J22P1j72N6O9k7
$$ 163 48 49 -53 12 -105 -76 2 53 102 -8 -142 -69 -80 -18 -30 47 -58 111 -116 6 77 -95 -39 30 3
6391CJ0p2J27j02O4p2Q7m0j43Q7P6j2l0L4K8k8R3j49Rm1Q3n6M5L5q4q3M9J04l9
$$ 3 13 -59 68 -34 30 -42 45 5 -138 -51 25 13 -17 17 45 17 110 -39 -30 -71 12 -44 1 36 -48 -131 -82 22 -17
6420a7nL2O6o3J7j49P4K9J52j89O2M4j2l4Q5j23J22q6m6l7pO6n6P4K1p3L4L2q2
$$ -17 -22 10 76 13 30 -119 -45 -16 136 -53 9 53 41 7 92 -31 91 5 -41 -78 -85 -19 -75 -1 20 -53 -19 13 -69
6449f9O2L1j15Q4mM8k7J4k6j2j9J9Oo2Q5N1r1O2o0L5J12m5q3MJ24r4j1k3j00O8
$$ -69 -7 24 -91 -7 -11 37 10 24 -2 -14 -33 -14 -8 -70 15 66 -25 37 -23 12 124 79 -4 0 124 30 19 -4 -104 -36
6479c6N1J0j76J92m9J48j56J2Q5j2j23O8n1O4K7j02Q8M6n7m4RJ6J32j24o2J32
$$ -36 15 25 -151 41 -8 140 -16 -4 81 69 -54 14 -37 27 54 -48 40 86 29 -15 -6 10 142 18 -44 88
6505H8p6n9L2KR3q3Rk8J06m3r0O9j5j8K8O1j58J11K8m1j0m1J3l0PN5P6j04P8J7
$$ 88 12 -47 -15 -13 80 -3 6 -22 84 41 -49 20 5 -13 15 76 -82 29 57 16 6 -35 -22 -52 -45 10 86 -18 60 77
6535G7j72J66p4K9j13Q7Kn6P4l1L6p6j8L5KK1J7o5K6Q1r3Q7r9M0o7J15J0l7o9
$$ 77 -95 71 -3 26 -87 0 2 -54 20 -11 25 -51 -69 -34 -32 -11 6 -59 -33 48 -45 42 -57 -17 -84 31 41 4 -65
6564f5J11l3P0r5m3P4qLp3L1j6J6rJ62j86P9O9l2Nn2q9M7j18K94j22j22P4O4O0
$$ -65 46 13 83 -12 -55 19 11 14 -59 -28 -44 -28 -37 125 -61 18 87 55 60 8 -81 -34 -152 142 20 -102 -28 36 96
6593I6n9m8L5M6j04J6JJ9n3J13j2k6L1q0mn9J96p5N2Km1Q6j11kJ1N7Pk22J75j5
$$ 96 37 -11 24 70 -34 -18 -17 2 -51 62 50 24 55 -25 -29 -88 108 33 85 87 46 132 21 19 30 87 94 -128 47 32
6623C2n4n4M3J44j43M2q2r4J26LM1k7Pl1J4J52p9j31N9l0J12r9o4O7K2Q4n3K1
$$ 32 -22 -76 -33 111 -32 10 -72 -166 -40 -37 4 -23 -16 -47 -33 119 40 -91 -32 -62 50 -49 -113 -46 -24 60 7 28
6651B8NK7j42O6l9K9j4O9l8l0J33o5n8L5N2p6M4k4JJ00j14R6j65J42n9j5P7r2
$$ 28 33 60 -82 -16 -55 -26 -40 29 -9 -39 94 29 -29 6 58 -18 26 2 3 103 -11 85 -80 62 3 -12 65 -27
6679b7L6j6J05qJ2j31N1n9n0J39l6j6k6L7k6l2J60q8q0J37m1K4j01J59j8K1j06
$$ -27 9 -7 98 90 102 -29 22 -37 -87 52 16 0 -26 11 -15 -47 113 25 -55 82 41 65 -36 123 105 126 20
6706B0r4J9nJ33l7j63P5K7J1j8J31k42J24J26j31k6P8j12R1K4K0K8j10M7L4o8
$$ 20 -74 -55 -60 73 36 -127 -52 -25 -14 -32 99 -143 -19 107 -24 -50 28 -84 7 31 51 79 -31 16 50 -18
$$ [...]
8191B2
##END NTUPLES=NMR FID
##END=
