##TITLE=1H_Pr Bn-OH
 200.13MHz,CDCl3,
 8 sc
 
 13.3.2025
##JCAMPDX= 6.0         $$ Bruker NMR JCAMP-DX V2.0
##DATA TYPE= NMR FID
##DATA CLASS= NTUPLES
##ORIGIN= UXNMR, Bruker Analytische Messtechnik GmbH
##OWNER= pz
$$ XWIN-NMR		Version 3.5
$$ Thu Mar 13 15:44:48 2025 Russian Standard Time (UT+4h)  she@DPX200
##.OBSERVE FREQUENCY= 200.1313
##.OBSERVE NUCLEUS= ^1H
##.DELAY= (6, 6)
##.ACQUISITION MODE= SIMULTANEOUS
##.ACQUISITION SCHEME= undefined
##.AVERAGES= 8
##.DIGITISER RES= 18
##SPECTROMETER/DATA SYSTEM= spect
##.PULSE SEQUENCE= zg30
##.SOLVENT NAME= CDCl3
##.SHIFT REFERENCE= (INTERNAL, CDCl3, 0, 14.3821)
##AUDIT TRAIL= $$ (NUMBER, WHEN, WHO, WHERE, WHAT)
$$ ##TITLE= Audit trail, XWIN-NMR		Version 3.5
$$ ##JCAMPDX= 5.01
$$ ##ORIGIN= Bruker BioSpin GmbH
$$ ##OWNER= she
$$ F:/spectra/data/she/nmr/H-C/1/audita.txt
$$ ##AUDIT TRAIL=  $$ (NUMBER, WHEN, WHO, WHERE, WHAT)
(   1,<2025-03-13 15:43:30.98 +0400>,<she>,<DPX200>,
      <created by zg, POWCHK disabled, PULCHK disabled
       configuration hash MD5:
       00 E9 B6 7A A2 85 ED C7 34 08 36 98 17 FE 4E 26
       data hash MD5: 16K
       65 3C CB 9F 5F 23 6A E8 E7 C0 71 4C 21 C1 5F F4>)
$$ ##END=
$$ 
$$ hash MD5
$$ 14 5B 7E 31 E1 4B F6 AF 9F 79 D5 26 2A 7B 5B 19
##$RELAX= 
##$RELAX= 
##$RELAX= 
##$RELAX= 
##$RELAX= 
##$RELAX= 
$$ Bruker specific parameters
$$ --------------------------
##$DU= <F:/spectra>
##$EXPNO= 1
##$NAME= <H-C>
##$PROCNO= 1
##$TYPE= <nmr>
##$USER= <she>
##$AMP= (0..31)
100 100 100 100 100 100 100 100 100 100 100 100 100 100 100 100 100 100 
100 100 100 100 100 100 100 100 100 100 100 100 100 100 
##$AQSEQ= 0
##$AQ_mod= 1
##$AUNM= <au_zg>
##$AUTOPOS= <>
##$BF1= 200.13
##$BF2= 200.13
##$BF3= 200.13
##$BF4= 200.13
##$BF5= 200.13
##$BF6= 200.13
##$BF7= 200.13
##$BF8= 200.13
##$BYTORDA= 1
##$CFDGTYP= 0
##$CFRGTYP= 5
##$CHEMSTR= <none>
##$CNST= (0..31)
1 1 145 1 1 1 1 1 1 1 1 1 1 1 1 1 1 1 1 1 1 1 1 1 1 1 1 1 1 1 1 1 
##$CPDPRG= <>
##$CPDPRG1= <>
##$CPDPRG2= <>
##$CPDPRG3= <>
##$CPDPRG4= <mlev>
##$CPDPRG5= <mlev>
##$CPDPRG6= <mlev>
##$CPDPRG7= <mlev>
##$CPDPRG8= <mlev>
##$CPDPRGB= <>
##$CPDPRGT= <>
##$D= (0..31)
0 0.7 0 0 0 0 0 0 0 0 0 0.03 0 0 0 0 0 0 0 0 0 0 0 0 0 0 0 0 0 0 0 0 
##$DATE= 1741866210
##$DBL= (0..7)
120 120 120 120 120 120 120 120 
##$DBP= (0..7)
150 150 150 150 150 150 150 150 
##$DBP07= 0
##$DBPNAM0= <>
##$DBPNAM1= <>
##$DBPNAM2= <>
##$DBPNAM3= <>
##$DBPNAM4= <>
##$DBPNAM5= <>
##$DBPNAM6= <>
##$DBPNAM7= <>
##$DBPOAL= (0..7)
0.5 0.5 0.5 0.5 0.5 0.5 0.5 0.5 
##$DBPOFFS= (0..7)
0 0 0 0 0 0 0 0 
##$DE= 6
##$DECBNUC= <off>
##$DECIM= 32
##$DECNUC= <off>
##$DECSTAT= 4
##$DIGMOD= 1
##$DIGTYP= 9
##$DL= (0..7)
0 120 120 120 120 120 120 120 
##$DP= (0..7)
150 150 150 150 150 150 150 150 
##$DP07= 0
##$DPNAME0= <>
##$DPNAME1= <>
##$DPNAME2= <>
##$DPNAME3= <>
##$DPNAME4= <>
##$DPNAME5= <>
##$DPNAME6= <>
##$DPNAME7= <>
##$DPOAL= (0..7)
0.5 0.5 0.5 0.5 0.5 0.5 0.5 0.5 
##$DPOFFS= (0..7)
0 0 0 0 0 0 0 0 
##$DQDMODE= 0
##$DR= 18
##$DS= 0
##$DSLIST= <SSSSSSSSSSSSSSS>
$$ [...]
##$SUBNAM0= <"">
##$SUBNAM1= <"">
##$SUBNAM2= <"">
##$SUBNAM3= <"">
##$SUBNAM4= <"">
##$SUBNAM5= <"">
##$SUBNAM6= <"">
##$SUBNAM7= <"">
##$SUBNAM8= <"">
##$SUBNAM9= <"">
##$SW= 18.0517328524113
##$SWIBOX= (0..15)
0 0 2 0 0 0 0 0 0 0 0 0 0 0 0 0 
##$SW_h= 3612.71676300578
##$TD= 16384
##$TD0= 1
##$TE= 0
##$TE2= 300
##$TE3= 300
##$TEG= 300
##$TL= (0..7)
0 120 120 120 120 120 120 120 
##$TP= (0..7)
150 150 150 150 150 150 150 150 
##$TP07= 0
##$TPNAME0= <>
##$TPNAME1= <>
##$TPNAME2= <>
##$TPNAME3= <>
##$TPNAME4= <>
##$TPNAME5= <>
##$TPNAME6= <>
##$TPNAME7= <>
##$TPOAL= (0..7)
0.5 0.5 0.5 0.5 0.5 0.5 0.5 0.5 
##$TPOFFS= (0..7)
0 0 0 0 0 0 0 0 
##$TUNHIN= 0
##$TUNHOUT= 0
##$TUNXOUT= 0
##$USERA1= <user>
##$USERA2= <user>
##$USERA3= <user>
##$USERA4= <user>
##$USERA5= <user>
##$V9= 5
##$VALIST= <valist>
##$VCLIST= <CCCCCCCCCCCCCCC>
##$VD= 0
##$VDLIST= <DDDDDDDDDDDDDDD>
##$VPLIST= <PPPPPPPPPPPPPPP>
##$VTLIST= <TTTTTTTTTTTTTTT>
##$WBST= 1024
##$WBSW= 4
##$XGAIN= (0..3)
0 0 0 0 
##$XL= 0
##$YL= 0
##$YMAX_a= 665208
##$YMIN_a= -560355
##$ZGOPTNS= <>
##$ZL1= 120
##$ZL2= 120
##$ZL3= 120
##$ZL4= 120
##$ABSF1= 10
##$ABSF2= 0
##$ABSG= 5
##$ABSL= 3
##$ALPHA= 0
##$AQORDER= 0
##$ASSFAC= 0
##$ASSFACI= 0
##$ASSFACX= 0
##$ASSWID= 0
##$AUNMP= <proc_1d>
##$AZFE= 0.1
##$AZFW= 0.1
##$BCFW= 1
##$BC_mod= 2
##$BYTORDP= 1
##$COROFFS= 0
##$CY= -3
##$DATMOD= 1
##$DC= 2
##$DFILT= <>
##$DTYPP= 0
##$F1P= 0
##$F2P= 0
##$FCOR= 0.5
##$FTSIZE= 0
##$FT_mod= 4
##$GAMMA= 1
##$GB= 0.15
##$INTBC= 1
##$INTSCL= 1
##$ISEN= 128
##$LB= 0.25
##$LEV0= 0
##$LPBIN= 0
##$MAXI= 10000
##$MC2= 0
##$MEAN= 0
##$ME_mod= 0
##$MI= 1.114404
##$NCOEF= 0
##$NC_proc= 0
##$NLEV= 6
##$NOISF1= 3.799351
##$NOISF2= 2.8
##$NSP= 1
##$NTH_PI= 0
##$NZP= 0
##$OFFSET= 14.38212
##$PC= 1
##$PHC0= -468.3282
##$PHC1= 7.59221
##$PH_mod= 1
##$PKNL= yes
##$PPARMOD= 0
##$PSCAL= 0
##$PSIGN= 0
##$REVERSE= no
##$SF= 200.129724274929
##$SI= 16384
##$SIGF1= 3
##$SIGF2= 2
##$SINO= 400
##$SIOLD= 16384
##$SREGLST= <1H.CDCl3>
##$SSB= 0
##$STSI= 0
##$STSR= 0
##$SW_p= 3205.1282051282
##$SYMM= 0
##$S_DEV= 0
##$TDeff= 0
##$TDoff= 0
##$TI= <>
##$TILT= no
##$TM1= 0
##$TM2= 0
##$TOPLEV= 0
##$USERP1= <user>
##$USERP2= <user>
##$USERP3= <user>
##$USERP4= <user>
##$USERP5= <user>
##$WDW= 1
##$XDIM= 8192
##$YMAX_p= 0
##$YMIN_p= 0
$$ End of Bruker specific parameters
$$ ---------------------------------
##NTUPLES= NMR FID
##VAR_NAME=  TIME,          FID/REAL,        FID/IMAG
##SYMBOL=    X,             R,               I
##VAR_TYPE=  INDEPENDENT,   DEPENDENT,       DEPENDENT
##VAR_FORM=  AFFN,          ASDF,            ASDF
##VAR_DIM=   8192,          8192,            8192
##UNITS=     SECONDS,       ARBITRARY UNITS, ARBITRARY UNITS
##FACTOR=    0.0002768,     1,               1
##FIRST=     0,             0,               0
##LAST=      2.2672688,     0,               0
##MIN=       0,             -560355,         0
##MAX=       2.2672688,     665208,          0
$$ Real data points
##PAGE= N=1
##DATA TABLE= (X++(R..R)), XYDATA
$$ [...]
1668d11J558R17l73j109j157l77Q99J288Po32j756p58K40J235J090j40r48o77
1686a104l17P13J347J042O1j031j261l21J140J088L81j058j205q94J19Q35Q60
1703C95n0m67j081n57L59J333J547L9j037j163p6J174R55M18o69r09r45l55N50
1722e39Q56O02l40j560j297L64J750J737l72j213j176R7J227J056M22j30j021
1739D63j406l45P61J623P83r62k412j256Q55K071J277o82j391r77K85J006J093
1756G86R84n3j241j546k66J514J700N87j787k390o48J405J754L45q37j083r11
1773a687J21R91J298Q46l07j534j376M51K096J698o55j846j683L22J320J075l92
1790G38o85p91n23j31M31J607Q05q70j627p44R72K173O89j037j255n63O04N90
$$ y = [-411, 1147, 2064, 1691, 582, -575, -952, -53, 1235, 1242, 610, -1146, -1904, -1664, -429, 661, 521, -427, -1104, -1421, -708, 639, 1681, 1742, 711, -550, -871, 269, 1357, 1738, 680, -525, -1419, -1300, -465, 395, 345, -122, -1203, -1760, -1401, -68, 1479, 1518, 481, -682, -758, 416, 1371, 1789, 1120, 211, -734, -1089, -539, 317, 919, 579, -981, -2278, -1914, -164, 1573, 1201, -12, -1188, -1091, 136, 1192, 1614, 1484, 463, -943, -1288, -527, 1096, 1879, 917, -1495, -2751, -1896, 175, 1452, 770, -621, -1598, -1313, -307, 786, 1770, 1717, 476, -1070, -1336, 178, 1878, 2465, 678, -1712, -2360, -955, 799, 1144, 307, -776, -1687, -1566, -575, 723, 1569, 1262, -272, -1648, -1197, 899, 2597, 1942, 96, -1587, -1265, 55, 1130, 738, 53, -738, -1261, -1392, -961, 646, 1451, 581, -1046, -1790, -818, 1355, 2044, 1007, -248, -811, -207, 383]
1808C83O2P5ro91q31m29P24R77N87q58j156N6Q65J107ln50k52K60r4k46k6M81
1830D32N50n74j152m80L62J209K73p25o48qO34m2L54K44L70P0q88p11M08J460
1850A138M30q90j472p22P82J088Q2j43m30o14j99jR12J010M36r58j418m01J211
1869a59J729Pj224j309k85O76R17K43l49l78q40l00K73J211J150k06j530r43N35
1888g82J348J266m89j467o04q5N36P29K16j60q46r43k73R71J306N38q85j387n34
1907a545J227J460L44n23r77k79k03M31M71K36j34q83r06N1Q53R55K5p56p22R2
1927g83O08Q71K06k10l61k69k67n9P47K03k82p30p62J96O47M63L9m50m69r6L28
1948d30N96L43N0o2m41m15K54N40M76l19n62r38r9P69K20P9k81l45L9j39N69O40
$$ y = [383, 445, 520, 511, -180, -1011, -1440, -716, 261, 848, -10, -1166, -1110, -245, 862, 859, 309, 57, 317, 223, -23, -49, 432, 982, 408, -744, -1224, -862, 347, 620, -105, -753, -761, -127, -169, 185, 429, 799, 869, -19, -730, -322, 1138, 1568, 678, -794, -1516, -734, 354, 436, 293, -137, -751, -950, -951, -39, 971, 1407, 449, -969, -1370, -159, 1570, 1577, 353, -956, -1241, -565, 352, 595, 246, -132, -972, -1272, -999, 212, 1362, 1156, -374, -1317, -782, 566, 1832, 1343, -124, -728, -813, -277, 452, 668, 508, -338, -1281, -1554, -583, 723, 1261, 376, -1011, -1545, -318, 1142, 1486, 963, -14, -293, -496, -65, 406, 642, 508, -375, -1281, -1230, -377, 578, 603, -153, -875, -783, -175, 696, 902, 692, 331, 62, -205, -264, 483, 686, 404, -326, -1088, -892, -245, 218, 257, -193, -662, -758, -430, 166, 509, 559, 497, 56, -359, -105, 435, 911, 592, 30, -908, -1007, -238, -18, 61, -220, -565, -526, -665, -96, 544]
1970E44J59k18o52l40M43O15L97j3q40q07n2N61M44P0l09o74k70K09Q03N03R9
1991F72m14o48k35M20P64L99l75n25n72k4M80P15j20o50m22l89M69M65N58j72
2011C96l49n16r4O35O53K33l15q46l64M28M05Q1o6l39m43r8P5N07J51J59l24m18
2033d49j25M30O39K20l75n27o9K22J78M4p5n8j10k10k62K42N05K85o14j61r8L48
2055b0M82k0k02k10J89j91p2N7L48L6k50m25o26N69N42K32k47m86k45L51J44J49
2077A05L00j83k76l45K0M32P85n7o87r35o6Q31O25P1q00k95j16N47J50M92P3m28
2099B43l58o59M39P44O59l40j139n58L46R04L18l27m22l75j59L95M63M79O5n98
2119A20p34o6N55J014J65q83r46o1O15O12J9m15k24l29p0K47O33L25j40p44n00
$$ y = [544, 703, 485, -167, -507, -64, 551, 948, 935, 95, -712, -764, -203, 241, 311, 2, -672, -942, -733, 70, 573, 672, 258, -390, -625, -205, 559, 958, 583, 58, -514, -538, -58, 657, 537, -113, -535, -924, -455, 10, 568, 396, 47, -469, -563, 72, 725, 958, 643, -203, -567, -139, 266, 347, 281, -58, -501, -599, -524, -17, 134, 293, -31, -449, -574, -144, 495, 715, 340, -187, -256, -34, 144, 188, 113, 55, -55, -265, -527, -285, 220, 505, -109, -270, -368, -20, 462, 442, 240, 30, 219, 28, -44, 13, 361, 397, 147, -278, -904, -335, 207, 439, 192, -294, -539, -188, -44, 105, 405, 222, -54, -399, -379, 53, 838, 781, 94, -841, -907, -76, 549, 620, -180, -475, -591, -44, 106, 598, 671, 243, -115, -774, -335, 409, 1068, 728, -411, -969, -623, 281, 599, 272, -150, -525, -684, -289, 174, 653, 718, 120, -614, -680, -125, 889, 1054, 171, -775, -836, -221, 391, 410, -5, -229, -558, -628, -381, 252, 577, 437, -307, -807]
2140h07L49P99O48l40r04l89J91Q37j23j20k46j88j60m8M47M02J08j26p81K0M48
2161A7O52J18o20m14J71K25k1l43k1L61M5m42j98K10L07K59j38o12J52M50J63
2182C21j34k05J92L27k37m66OK94K19j83n14l21K85J81M02k24l4J26j29j90K08
2203g6L19L21N2p66l00K94N05J14l30n48k31J49L87K37KKk25k44r5M35O70L9m73
2226B38o42p5M91N60N6o93l15k1J33K60J06J01k10n05m5J79O69L65k44p40k04
2247e36M39N44K48k03n72j52p7N6N2L45P5k95n76P7L84O18J42n39m46O9M45O46
2269G44j08m44n1j47k74K08J68J92j88m36k02J30M04L10k57p3l40K08K01J17K52
2290D14o6j20k83k2J87J24R1j28l30j60M5J40K90k26r0j92K42M7J30J4L9n1j11
$$ y = [-807, -458, 341, 989, 649, -255, -644, -453, 384, 261, 141, -105, -293, -453, -501, -54, 348, 456, 330, -451, -431, 17, 669, 787, 167, -247, -76, 149, 128, -215, -236, 125, 170, -272, -470, -260, 47, 306, 168, -444, -292, 158, 321, 187, -18, 174, 501, 264, -202, -196, 98, 317, 134, -380, -701, -416, -235, 167, -57, -91, 35, -94, -284, -76, 243, 564, 616, -150, -450, -156, 349, 463, 133, -415, -646, -497, -110, 127, 129, 131, -94, -338, -433, 2, 672, 711, 238, -404, -479, 12, 572, 628, -65, -380, -401, -268, -8, 98, 199, -11, -516, -561, -382, 287, 652, 408, -332, -536, -97, 447, 695, 492, -80, -232, -309, -253, -201, 144, 219, -76, -652, -575, -191, 427, 569, 30, -416, -347, 98, 744, 636, 192, 141, -6, -280, -72, 96, 288, 100, -336, -538, -408, -4, 306, 49, -24, -364, -156, 45, 162, 414, 348, 228, -55, -77, 110, 234, 325, 197, -133, -293, -248, -108, 182, -44, -134, -326, -84, -37, 93, 107, 146, 95, -16]
2313a6o3K72M8J62k86k09r6J16r8k3L06k43l12K27n3L66K32k45j25j35J01J92
2335A18m6K03j41k85K3MK1K71k2k90r4k70K62K95PJ01j55j47l5J46J81J38Oj56
2359A35m41K19J12K83j08k07k57K14j09m0L64l0k48R0j11L0J04K05n7q6q6j2K18
2382A82J36k95j5j51n3j14K95J37k0p7l37k3R1M15L9Rk86K2j06L91qk2j50r6m5
2407h1J36r3K59Q6k47m46k5J53L76J29l47k7M7n5K71J38O4m7k82l93J20J83N94
2430E13K5o95m01Q1L75L85k77M9j50j27j14K33L48j5j5l49m89M41N82Qj99l65
2452a56j97K88K41J7j55q6q3j89J23J00M70M2n12k73R0K28M75J76m25m92K81K68
2474B31o1p0N7j56l57k5J16L66J16n6l68k06J48M35J49k08k34M0K93j06q1p0K11
$$ y = [-16, -79, 193, 241, 403, 117, -92, -188, -72, -170, -193, 113, -130, -442, -215, -268, 98, 330, 85, -40, -175, -74, 118, 72, 275, 134, -151, -128, -124, -103, 168, 146, -144, -238, -508, -246, 49, 56, 157, 2, -145, -180, -34, 147, 285, 291, 135, -306, -87, 25, 308, 200, -7, -264, -50, -159, -199, 165, 135, -113, -23, -134, -104, 0, 205, 148, 62, -24, -36, 182, 318, 23, 8, -143, -196, -310, -15, 122, 102, 25, -312, -335, -244, 171, 210, 219, -67, -45, -151, 240, 232, 210, 60, -36, -81, 55, -38, 221, 307, 60, -386, -411, -258, 118, 247, -100, -127, -80, -135, 136, 274, 338, 291, 9, -384, -264, -81, 513, 538, -157, -558, -477, -102, 283, 6, 55, -95, -222, -336, -103, 245, 230, 215, -134, -623, -182, 400, 408, 209, -156, -353, -65, 176, 193, 38, -48, -131, -320, -197, -97, 373, 415, -97, -370, -280, -52, 423, 599, 174, -318, -37, 231, 170, 100, 157, 1, -356, -381, -265, 101, 217, 161, -207, -413, -265, 170, 319, 111, -123, -83, 210, 104, 23, -47, 164]
2497A64k04j8k71j48L96J36jl97Q6K60J93j79q1NL61m0k38j21J91K34p4k80l77
2520d03J41K32P0j03j21O7j2j38j39L89J75K72l16m09J93M45L42k79m55j08L8
2541a19Q5j24K05n4o6qm98L01M66L40k98n13j43L25N40J94m21l83l9L12J5J5m7
2564H5o4k70l13J14K22N32r2j69m67j92P15L30M3k53j94k4j51K70K6K69l42k51
2586a76l62J94K57K85k00j60k97L19J81K25L0k26J20r2l3J32K05J95n61m49o3
2607d76K99K48m0m81J23j23K21M42j14N3j23J29K6j80K75K10j21j50m45j46M74
2628A01p7j9k93q8J42m8P9N2J07J86j53Kr0L89J01n4l0j71j05j68J26M3K5m24
2652c67J03q9o6J92J76Q5j27K2j43K30L09P8j22k02p1j9K34N1k46q0j47j46J8
$$ y = [164, -40, -58, -329, -477, -81, 55, 54, -343, -257, 3, 196, 17, -64, -59, 302, 262, 24, -97, 94, 328, 254, -26, -403, -262, -30, 40, -63, -184, -117, -129, -267, -406, -17, 158, 430, 114, -295, -102, 343, 685, 406, -49, -157, -119, -34, -158, 47, -7, -73, -81, -579, -278, 188, 528, 230, -283, -426, -101, 439, 633, 212, -171, -210, 102, 117, 132, 85, 21, -249, -562, -448, -226, 306, 214, 45, -422, -614, 101, 431, 474, 221, 27, 3, -148, 122, 148, 417, 75, -176, -538, -344, -87, 198, -2, -162, -459, -140, 41, 266, 296, 70, 190, 98, 65, 197, 402, 597, 36, -413, -476, -177, 71, 31, -450, -327, -450, -229, 213, 99, 152, 29, 158, 184, 4, 279, 489, 368, 218, -227, -373, 101, 24, 5, -288, -376, -234, -282, -203, -151, -44, 142, -11, -9, -99, 290, 391, 337, 307, 136, 31, -137, -11, 32, 57, -367, -264, -353, -419, -227, -51, 34, -93, -71, -214, 16, 325, 403, 281, 79, 8, -11, 223, 274, 28, -52, -199, -345, -327]
2675c27J63K93k4k29j80M4J80M98l0p8l94O1J26K83j09j00j96k15M1j5P5K29j1
2698H5j90j23j62M88K53k43j66J3P6J75q8oO8k62j56R6J24Q2j31q3j44j3J13J36
2722e8J10P3K1j06J02k4j23J73j1K4j50j74j82R7K59ol26QJ64jJ04P9O2J79k41
2747E3j41K1J42M46o5n32k12N6K28J56n1l18k47K49j15J40M74Oj14l56r9J73N12
2770D06K29k94n01j27K03L77j81n8k29l6k37mO21O0L4l67m26J22N31K45k3k40
2792A05n50K89J78L08k82j6j56r8j73K86J92K65l80l09j08L18O91Mk76m56J43
2813b5K00J31Q9k92j01q8j03lJ15J53rj95m13L43L11K17k99l27J87n9M57j66Q3
2836B06j07O6Jj29j81P6J14p2l50J02K53L9ok27N6K47K80k70m1O2J7L45k86k91
$$ y = [-327, -164, 129, 105, -124, -304, -260, -80, 418, 388, 310, -84, -23, 103, 386, 277, 177, -19, -234, -193, -208, -133, 96, 85, -105, -228, -390, 98, 351, 108, -58, -45, 31, 206, 118, 112, 180, -82, -238, -142, -18, 64, -67, -150, -294, -307, -194, -58, 52, 125, 146, 40, 142, 118, -5, 168, 157, 181, 31, -143, -325, -228, 31, 25, -301, -293, -129, -130, -26, 53, 115, 294, 53, -88, -67, 75, 521, 456, -76, -288, -232, -4, 152, 101, -217, -464, -215, -330, -190, 284, 290, 176, -180, -279, -106, 406, 635, 341, -160, -287, -84, 293, 112, 54, -175, -211, -448, -452, 169, 229, 263, -104, -530, -408, 123, 368, 345, 105, -445, -156, 22, 330, 48, 32, -124, -222, -395, -109, 83, 348, -32, -341, -449, -131, 560, 564, 288, -168, -25, 175, 306, 395, 103, 2, -86, -189, -192, -77, 76, 67, -128, -541, -198, 113, 330, 31, -296, -109, -168, 289, 123, 206, 99, 165, 166, 37, -144, -68, 46, -26, -376, -274, -21, 18, 12, -215, -159, 88, 368, 98, 57, 119, 136, 481, 195, -96]
2860i6J13j90K07m7j98J7K38j57k05K5O4N83o7k93k62K08M78J69l58l61j39K34
2882c7L71l46J15J27k39l85j59L79L89L32o86m70K84M96M01l14n2k18q0J92o2
2903C8L27j72k04j45l73J57N40J73j30o14k43M31K55L41l45J1j97J77J03O8P0
2924B68K47n23l51j37M89K41Q2n42m23K36M76M26j42l62p1P5Q3r8K11K12k48j44
2946El31J95L26K83n76k91j76L89L13J16k54k52J57J45J67k07R3L39k51l69J97
2967A8O1L46k79l95j09K63J03M1l01l1L14M5O1k14P5J71K05j73j35K1M2r5N4k15
2991a27J6J86j21k20KJ69K33M7l21j22J60K11J54k61K18j15j76J62j32K25J9k7
3013A80k37l96J44L06K04o3l24K5J47J30K78k56J12l12j21p4K03J75K56m09l90
$$ y = [-96, 17, -173, 34, -13, -211, -194, 44, -113, -318, -293, -229, 354, 287, -6, -268, -60, 418, 587, 229, -132, -271, -37, 334, -12, 103, 230, -9, -394, -553, -174, 215, 547, -139, -609, -325, 171, 572, 258, 206, -12, -92, 100, 38, 365, 193, -11, -156, -529, -372, 168, 341, 211, -403, -646, -215, 40, 381, 36, 47, -150, 27, 130, 198, 268, 515, -8, -359, -496, -7, 234, 316, -226, -649, -413, 63, 489, 347, -15, -86, -11, 72, -26, 185, 397, 149, 5, -326, -131, 195, 478, -98, -389, -565, -176, 137, 253, -1, -253, -96, 49, 216, 9, 102, 441, 190, -179, 18, 79, 425, 146, -249, -358, -95, 8, 49, -252, -283, 31, 76, 137, -77, -2, 169, 374, 201, 66, 87, 129, 34, 88, -127, -111, 75, -46, -266, -264, -95, 138, 185, -136, -258, -98, 113, 267, 6, 224, 109, -67, 95, -37, 188, 207, 180, -57, -453, -309, -3, 201, 138, -186, -161, -14, 116, 394, 138, 250, -62, -183, -257, -54, 121, 377, -32, -422]
3034d22k0L01M28j18k01k04q8O0M40m7O3j54p5j77J36L12L9k34l13j58K08L66
3056A42J65k93j88j39J03M8O5R9J81o9j39m1N5L83r1j13l76O6J80M5Q9k38k65
3079c31K17L7m1ML57j85P2j34J9M8P2J13j08k96O6J67M1j25Q6j50J3o0n5J55J48
3104A30L4k78K9m3l8L09no1j17J11j56R9R5k9j8P0j71k19L76j17N7j19j20J9J20
3129d2L6O9j5L8j9o0O9L07k19Q2k13j97Q5J05R2j34r2j4kL2K10M2j11J9k62J57
3155c7K1J30J18k48Q3j62jR5J59o2k69k58K20kQ1R7J25j65m5O7J14K28o4n7q5
3180H3L4K1l7J97p0l60M2nP3j07p4K6J09j20m7L6K09J01J51q2j43K31j70J64j38
3205A24K0j55k5j14J20k00Q6j67j55K58M5K30M8l37J45J11K6J92P9J79j12m03
$$ y = [-422, -442, -141, 287, 169, -32, -236, -324, -264, 176, 129, 192, 38, -37, -214, -78, 234, 273, 39, -274, -432, -224, 142, 307, 14, -174, -313, -210, -162, -97, 2, 183, 114, -25, -66, -11, 372, 281, 168, -208, -142, 38, 83, 172, -66, -331, -114, -77, -118, -114, 243, 58, 130, -4, 15, 63, 135, 248, 140, -156, -90, 77, 118, -7, 79, -71, -58, -118, -173, -18, 130, 164, -114, -85, -128, -166, 143, 138, 77, -40, 71, -85, 14, 109, 80, 62, 132, -39, -258, 118, 1, 58, -61, -181, -162, -42, -6, 63, 48, 86, 67, 7, 76, 383, 164, 246, 33, -164, -79, 26, 118, -16, -108, -122, -124, -92, 118, 160, 49, 68, -194, -37, -16, 114, 232, -16, 67, -95, -96, -1, 158, 96, -173, -431, -211, -213, -132, -35, 90, -75, -120, -53, 61, 289, 225, 168, 83, 117, 138, 101, 298, 228, -132, -90, -95, -22, -129, -203, -177, -68, -188, -235, -199, 10, 111, 262, 180, 37, 268, 98, 262, 124, 144, -11, -36, -150, -30, -230, -144, -311, -466, -208, -163, 67, 115, -222, -77, 34, 60, 252, 331, 510, 398, -5]
3227ek6j39J39J79p4k78j10lJ40J77kJ07m5j76L2J25K24m7M3j09j33j06K07J35
3251B55J2k99l56N0J99m5J60m7j77o8J31J37J65K47k11m1k05L03J43j71J6k57
3273e9M5j81j11J77J05j58l7j89J36Q8L04k1j0l1J71j15J31P2j55j19N1k98J34
3296g0P2j09J26j17m34J40L64O1J50j01p8n5J53LP9K32j65j74pj25P8j7l5k43
3320b72M3Q7l4J32r2l5K93j55QK88L7m8K4l42R8K30j3j87j39%k04J44q0Q5L4K3
3346g5m2N1N7K39N6J5k14J2K2J04J0j05k02m3O0j95M7k8K58j89M9L0j43L82R9
3371B55k24R7j97K89R7p0m7j4n4M2j51k91l6J84J65m67J57%K02o3J40P4M6R7k7
3396B04l21M10K9N4k35k52j09J78J23o5k94J29q3j40O7J54J55O0j31j15K02K38
$$ y = [-5, -31, -170, -31, 148, 74, -204, -314, -317, -177, 0, -2, 105, 60, -116, -84, 41, 265, 218, 261, 152, 19, -87, 120, 255, 267, -32, -388, -338, -139, -184, -24, -71, -248, -316, -185, -48, 117, 364, 153, 112, -93, 210, 353, 182, 198, -59, -14, -195, -306, -129, -24, -182, -219, -408, -272, -184, 120, 99, 89, 58, 229, 114, 245, 317, 162, 43, 94, -204, -70, 2, -107, 19, -98, -532, -392, -28, 33, 183, 82, 4, -51, 102, 105, 184, 416, 251, 77, 70, -55, 23, 6, -29, -272, -229, -142, -176, -44, -136, -171, 122, -33, -25, 263, 300, 252, 276, -66, 32, 262, 249, 62, -77, -77, -281, -137, -217, -132, -98, -75, -117, -66, -9, 230, 286, 301, 87, 99, 121, 225, 235, 130, -72, -115, -55, -250, -203, -231, 27, -162, -113, -83, -226, 156, 255, 31, 128, -69, 220, 317, 247, 200, 186, 132, 174, 23, -268, -304, -120, 45, -422, -265, -265, -63, -126, 14, 88, 134, 231, 204, -117, 293, 322, 376, 141, -111, -220, -42, 81, 16, -278, -149, -232, -372, -305, -151, 4, 64, -67, -182, 20, 258]
3418B58J51M1l40q8j24L29j94p8j5k50J9k16K31K94L00l25o4k21L11M27K7k78
3440A95k74J03J62J61p3j31L6k91j10l8K44j06K12j90l56K61L61L95j97m03m9
3461h8K50J35j27N2j11j26q7j52m1M04j38j00l90P7K31M40O4m11j5J52K43n5R7
3484C04l07K75k7l18o8R2J91j63l65l4L35J27Q5l31j79L71oK16O0j29L8o7J43
3507B43q0j78K49j68k43j59K6J40L03m20L1j15L22J13J8k17J93J2O0jK5mj57M7
3531D0k04QL61q5l20k76J08L92K5m3k75J55j10M07K7n9o0M7q7Jm3J2L29l16l79
3556c45lJ06M79j11m63q5K89J65J31j21l6J72kJ01l51L68J84k61l90l04J97N20
3578B40O2l19l92j73M92J0K84j62p8m7M1Q6J03J52m6k75k12o1L25K87p0l72k74
$$ y = [258, 409, 450, 110, 22, -102, 227, 33, -45, -60, -310, -291, -507, -276, 18, 318, -7, -71, -292, 19, 446, 473, 195, -79, 24, 186, 347, 274, 143, 179, -112, -222, -260, -16, -122, 90, -100, -456, -195, 166, 561, 364, -39, -88, 162, 297, 170, 222, 111, -15, -102, -254, -295, 109, -29, -129, -519, -442, -211, 229, 293, -118, -133, 19, 262, 207, 304, -3, 272, 245, -73, -141, -49, 142, -21, -386, -420, -85, 42, 127, -204, -383, -12, -18, 198, 258, 129, 167, 100, 243, 163, -15, 234, 66, -177, -336, -310, -170, 133, -287, -256, -371, -49, 64, 82, -135, 58, 70, 130, 129, 154, 150, -7, 40, -164, -156, 205, 120, -200, -476, -368, 24, 49, 6, -269, -114, -224, 183, 210, 151, 91, 138, 51, 52, 9, 21, 350, 34, -345, -348, -242, 237, 126, -337, -422, -133, 32, 163, 42, 6, 178, 176, 277, -74, 294, 478, 217, -173, -477, -280, 240, 302, -17, -409, -582, -90, -80, 204, 42, -36, -83, -42, 44, 147, 299, 253, -22, -234, -295, 30, 317, 247, -125, -399]
3601c99L43NJ13j23J5L3o5kL0J71K25n0m22l3K39L60j76k29l61Q6K37N5m2oj25
3626a21R1n8k1J79R9p9qk74J12L21L0o0l63j17J87J08J10m32O6N0K11J9j20J26
3650E6R2j87K1o8K02J19j85j48l9L15j30O6k73J13PJ4K0k03K54n2q7J24m2J40
3674A29j5J2m61L22K80r6J06l42J9M4M6Q9L8l07j08J25J79J4rR5j41r8K4O3M28
3699D36j87k04j76J43m6J26nk94J01N8j25J89p6R3J64m06J59Q8J99j3m2k36n2
3722a06J18J46k7k07n2J6Q8K8m9J3R1j38k7j4J17K09k6j44j51J19J42nm9R4l81
3747a95R1J80j59K4J15Rn9n3j25J67K41o0j76N9p1kj0m1J29O7j51j12K54l7l7
3772D8j26o6kJ84P1j51q4J32J30p0j0j92J97J27l10M6J57r6k2J09J1j70j08K1
$$ y = [-399, -56, -51, 62, -61, -46, -13, -78, -80, -50, 121, 346, 296, -126, -159, 80, 440, 264, 35, -326, -240, -3, 52, 10, 4, -121, -30, -88, -109, 70, 169, 90, 82, -192, -80, 241, 271, 211, -152, -269, -82, 26, 136, -296, -230, -180, 31, 50, -70, 56, 148, -39, -18, -86, 116, 235, 50, -98, -137, 178, 48, 114, -159, -46, -39, -25, -5, -208, 46, -6, -93, 31, -11, 129, 114, 126, -335, -13, 267, 171, 277, -65, -46, -2, 44, 133, 171, -136, -244, -119, 60, 74, 65, 160, 19, -79, -55, 8, 436, 249, 45, -131, 12, -34, 92, 87, -207, -106, -48, -173, 16, -60, 33, 197, -209, -50, 38, 237, 224, 182, -54, -106, 12, 158, 131, -76, -128, -112, -24, 4, -45, -32, 59, -79, -106, -120, -3, 206, 180, 36, -115, 4, 146, 141, 92, 186, -195, -104, 76, -83, -59, 56, 65, 6, -47, -172, -5, 236, 176, 0, 59, -12, -14, -24, -65, 64, 131, -20, -132, 122, 85, 48, -78, -144, -146, 38, 109, -42, -126, 6, 136, 66, 56, -136, 61, 188, -122, -76, 81, -15, -37, 72, 83, -87, -195, -174]
3796a74J45m6J53K9j01j40nJ80K3qR2j7r7p9J04o7j7j39L7R3j16J88m9Q6P9m2
3822A12l0j79K52j39q4O1p3J08j12J14J98l62r9K43LJ01m1j04p6k8P6K17k24J27
3846F1L6m2m1J6j1m5J14l9j60L9J08j59RR0J36k12K09n1o1J07m9m0j9K8l3J87
3872A78j40j13l7J29k2M6J23k48L4J9p8J21J17j05j10J20o9O5J67j84N0J96k90
3895c1j52R0J02p9R3jk62K5J30OK02Lk04J25j30O2N1J1p4J01m6J26O3j48J0k1
3921E2j11pj03J81M4j92N3J9R5m5L3R6j2k39J89O9N0r6R3j11k13N0QK3Mk6j32
3948b28J90J11n9M4J65j13j75j25K43J8o9M6n8J57j77K1O1j01N5q8j3l0J35j83
3972a73J72p6O0n3K02JP4j90r2J82j27M1p8o1P4p0j6K7M8J4p0P9mj9N8K33q4J5
$$ y = [-174, -29, -75, 78, 107, 6, -134, -139, 41, 64, 56, 148, 131, 34, -45, 59, -8, -25, -164, -127, -34, -150, 38, -11, 75, 154, 112, 82, -97, 155, 16, -68, -7, -80, 28, -84, 30, 228, -134, -233, 10, 13, 114, 73, -31, -107, -135, -59, 158, -66, 61, 97, 55, 14, 30, 19, -26, 88, 49, -111, -72, 36, -123, -114, -24, 112, -100, 109, 58, -3, 104, 55, 15, -4, 24, -9, 178, 38, -75, -112, 17, -5, 41, 164, -84, -50, -31, -109, 12, 129, 24, -86, 34, -35, 30, 197, 13, 63, 259, -31, -183, -93, 9, -70, 23, 22, -240, -215, -85, -79, 123, 126, -78, 47, -83, -21, 30, 41, -33, 68, 22, 148, 211, 63, 73, 52, -59, -66, -169, 12, 56, -136, -83, -64, 31, -14, 19, 115, 103, -136, 53, 122, 172, 76, 169, 58, -155, -105, -97, -74, -70, -96, -228, -38, 73, 14, 58, 223, 110, -65, -190, 53, 71, 2, 48, -10, 147, -30, -9, 52, -49, 6, -82, -95, -125, 10, -173, -1, -77, -17, -70, 132, 133, 207, 17, -75, 107, -20, 21, -57, -118, -44, -114, -130, -103, -55, -41, -111, -32, -36, -55, 3, 236, 152, 167]
4000A67n5j03N9j61R4R4qn6k0j53J32K61l37l8L6P8j19L37j95J7Q8j93J17M7Q9
4025A78L1o0j26o7K2j10K0K41k50RL0q9K03O2q5K09k17p5O4M3Q3k79K04pN6mj45
4052e9n4Q2k12R4J11M1o9N3J2J7P9m2j33J14p9J88l9Rj20P1N2j60N6K8n2QJ64
4079A60j52qJ2J9q0k0J71K6Q3l18m0P4p1R8J19o4q3K1j79J59K85k22rJ0K4m3K26
4106A98j15k17LK41j22pOn8K18k87O4l7K51k12P0K0k60K98k12K98j4k02P5q4o5
4131a50K07m6j7l0n4p6K6K91l01K14k92J44M0J87j53K5M0J04L1l9P1j82o1o4L5
4156e0lO1O2p7r3L0KJ90j64l7M6R0j99j3K92j95K48k32n5J31r5J24j55n7J62j34
4182a21o7J69m6n7J79p5J37j36l0J4M6l5O2j05M7l5K3R1k1p1pJ5j17P7R1J16j61
$$ y = [167, 112, 9, 68, -93, 1, 95, 87, 31, 11, -142, -10, 251, -86, -124, -88, -10, -129, 208, 13, 30, 118, -75, 42, 89, 178, 209, 149, 23, -44, -22, -132, -112, 129, -121, -112, -82, -171, 32, 94, 9, 218, 1, -74, -10, 33, 116, -163, 41, 34, 90, 86, -59, -113, -31, -243, -149, -38, 3, -66, -13, -1, 16, 95, 53, -80, 34, -45, 143, 104, 113, -7, 64, 116, -44, 12, 40, -12, -4, 160, 8, 0, 12, 31, -49, -69, 102, 128, 211, -107, -147, -73, -144, -46, 73, 9, -74, -53, -232, -73, 212, -10, -19, -9, 15, -28, 198, 83, -134, -131, 110, -12, -19, -13, -71, 147, -140, -76, -113, 138, -74, -4, 16, -244, 54, -158, 140, 126, -76, -1, -85, -150, 57, 11, -6, -36, -90, -166, -140, 151, -150, 64, -228, -84, -44, 143, -10, 15, 55, 159, 190, 151, 222, 40, -21, -85, -50, -53, 8, 70, -7, -100, -70, -68, 122, -42, -79, -33, 57, -142, -155, 137, -58, 190, -42, -97, 34, -61, 63, -92, -149, 13, -121, -188, -19, -65, -122, 57, -18, 119, -17, -47, -33, 13, -22, 40, -65, -18, -53, -30, 61, 40, -31, -38, -23, -140, -63, 28, 144, -17]
4209a7j58L19J0k14M0o6J82n8p7k6Q0Pn0P4j04n2K17k66l1o6K27P4j15J58J09
4234A97k89O6J41j31P6J78k18O0k44R4M3O6J27j81J8m8n6J98j53m5jK3LJ13o2
4259b5P6M3j64P9J24p9n5N7l25n2J05J75K26k37K11P7m34K37j59J94o1O5j93n3
4283a68J89o1j53N2J98j08q8J52j78K8K18k04J29j54K93o2j86N1p9K81n8j33p4
4306a15J15lJ31j30k2J26o2r7kJ24P1j39J12r7k2O9q8K03k65K80j64R8j52R3j05
4331d1j23N9j9l2L1N2N0O2n1m1K2M1jk01J65J48j78J4J23o8j11K29r7k2m8Mj7
4358e0mJ5P6j2L2j68OK92j81M2K3j63K21j49M6J2J12j44o5p6O6J19J26p1l2j52
4384g9OK79J74l62JN6j37j5m8J60r6K03k56Q3j6J49n2o2M7L8j65K08j36J67j98
$$ y = [-17, -175, 144, 154, -60, -20, -86, 96, 38, -39, -65, 15, 22, -28, 46, -58, -110, 107, -159, -190, -256, -29, 45, -70, 88, 197, -92, -26, 115, -16, 60, 238, 20, 80, -164, -70, -27, 39, 166, -15, 3, -45, -101, 97, -56, -101, -102, -79, -76, 37, -25, 51, 94, -70, 9, 133, 54, -1, 56, -269, -321, -216, -41, 185, -52, 159, 236, -198, 39, -120, 74, 13, 78, -115, -168, 21, -40, -193, -141, 57, -51, -139, 13, -165, -137, 81, -123, 6, -148, 145, 83, -103, -52, -131, 150, 92, -41, -115, 0, -3, 128, -2, -24, 102, 40, -57, -59, 65, 136, -3, 109, 12, -10, 59, -29, 174, -91, 189, 25, 123, -29, 64, -41, -164, -105, -124, -156, -125, -73, -23, 39, -12, -53, -31, 10, 9, -192, -27, 121, -57, -43, 80, 12, -99, 130, 33, 11, -37, -33, -50, -54, -39, 37, 25, 57, -111, -105, 187, 6, 48, 71, -92, 129, -20, 26, 38, 150, 6, -59, -135, -69, 50, 176, 105, 73, -79, -73, 206, 380, 18, 19, 75, -62, -77, -125, 35, -61, 142, -114, -31, -47, 102, 50, -12, 35, 73, -92, 116, -20, 147, -51]
4409e1J20j45o6J82l3K3n8Rj08P1O1N3m0l9L5j16l3J06m5l4J87j30r5J34K01k35
4435d6j39K26m8J23j42j0J56j45J03n2k4rQ6K6j56J33Q8k43k7J12M5K9r3j2jj
4461b1j79L15l71K21J10r0J25j61k3n7J09K1n6j0K31j89k8N8q1J25q1N6j12RJ48
4486F9q0n8l3j7N8N9j89J77J02J7j57J79j66r5J26Q2j60kJ34j58Ok3J46l1k3k3
4512f0K83j98L9M8j27P4l7j07%O7j16M5oJ66o6j98P5K6J1K24k9j49O3k1J12j82
4538f3n6K20j47j12K45N0p6j49O5R3j33NO7j2j34Q3r4J43J1N2J97j72J1k73J69
4563a0R6k8J5Rj52o4l5J71o5J41j75o8O4qK29j82K07J6k55J99q2r6J1J20j2o8
4589b2L9n1R5j29L3K7m5K0pJ38p4R5k09o6K63j18P6k2P5q9lo0j1J54m2n2J52j1
$$ y = [-51, 69, -76, -142, 40, 7, 30, -28, -19, -127, -56, 5, 58, 18, -21, 14, -102, -135, -29, -74, -108, 79, -51, -146, -12, 189, -46, -185, 41, -7, 116, -26, -36, 120, -25, 78, 26, 2, -7, 79, 105, -51, 82, 170, -73, -100, 12, 57, 86, -7, -19, -20, -21, -200, 115, -256, -35, 75, -15, 110, -51, -74, -131, -22, -1, -57, -67, 164, -25, -53, 5, -76, 49, -32, 24, -88, -79, 69, -11, -69, -102, -119, -61, -2, -191, -14, 88, 105, -52, 127, -39, -134, -8, 74, -86, -88, 46, -112, -106, -129, 17, -14, -37, -60, 223, 25, 64, 112, -15, 59, 22, -85, -85, -18, -134, -89, -95, 71, 5, -193, -118, -92, -81, 143, 114, -35, 28, 7, 119, -63, -119, 101, -46, -158, 87, 137, 61, -88, -23, 70, -63, -58, 9, -3, -137, -54, -148, -5, 6, 58, 255, 83, 94, -179, -10, 86, 58, 73, 82, -70, -134, -169, 2, -63, 78, -97, -165, -101, -109, 120, -62, 145, 161, -94, 105, 23, -73, -62, 58, 46, -22, 17, -34, 61, -68, -35, -8, -53, -33, -40, 98, 24, 119, -90, -156, 107, -11, 65, 43, 118, 29, 26, -34, -45, 109, 67, 15, 167, 156]
4617A56j66Q6q1J68n2JPk20J76L5lk36K98n2k30P4l1Q7j8j07K18l41L63j93N1
4642a0j22J68J81j23N0l55N6L62k03r9J26n5L1J8m9JQ4j31J35L6j2J64l54L8Q3
4667B0N1j45o2J78k7p5N4M2l0j27M4J61j66O7n2m2K21k38J7K16j1l6O3k53J11
4692a9O9j06r1K03j20J86N0j75J14j0m4p0j00J11p1J55j21M6J23k12J42o1j00
4715a01J39J44K3j83p5J09j1j29Q4J8m5M5kJ0M5j13K37j58j02N4jJ27k03J53m8
4740A7J01p1k5l5l0J43j45J44j20n2Q9r4J65j07k8J9L0N6j12nOj10J31j6P7RO5
4767A02pk19K31o8R8jp0r4J29k65K94o1n5l8j33P1M6N3k44K20K3L8J06r4p5K8
4793A5l0J60lP0j57o8l9P9Oj71K29o1L6j2m9k7j39K26Ok35J95n9p0O2Q8K8j37
$$ y = [156, -10, 76, -5, 163, 111, 112, 119, -101, 75, 110, 107, -129, 169, 117, -113, -39, -70, 17, -1, -108, 110, -231, 132, -61, -10, -132, 36, 217, 94, 144, -211, -155, 207, 4, -95, 31, -24, 7, 25, -24, -23, 61, -70, 65, 101, 89, 253, -101, -63, 20, 71, -74, -136, 42, 15, -60, -6, 36, 6, -121, -77, 84, -82, -15, -67, -109, 112, -126, -109, 107, 96, 60, 123, -130, -19, 50, -56, -147, 56, -64, 122, 172, -3, 111, 101, 57, -13, -113, -2, -73, 82, -39, 7, 130, -82, 60, -1, -101, 38, 182, 205, 22, -53, 56, 45, -84, 0, 18, -27, 18, 16, 26, 71, -42, 195, 37, -65, -11, -12, 115, -88, 65, 17, 118, 47, 22, -13, -43, 100, -45, 99, -21, -73, 16, -78, 87, -20, -48, -29, 1, 57, -55, -60, -54, -164, -33, -49, 28, 37, 102, 95, -124, 107, 39, 137, 136, 66, -28, 101, -164, 130, 69, 14, -24, -157, -86, -40, 13, -231, -11, 12, 50, 156, 62, -13, 15, -15, 145, 142, 212, 55, -13, -52, 27, 33, -138, 91, 30, 66, 54, 5, -22, -161, 65, 71, -164, 31, -28, -98, -36, 52, 80, -57]
4820e7P4J67j55l9Nq7K93k07J58j13l4M6N6j20K4k13L42l8q0J38k97J39Q7n5j83
4845a49N4R1j2N9n5o2J7J23r3j32J61k59K07P4Oj24oJ56Lj67J68N6q1K2L0k16
4871a29k6J97l4p0L3K1j05k4K44k13N5l0l3K16N5q0n0J02p3r7O2m2n5K3Pp6M1
4898h1J47j66R7j74L93j57j39M5JO4k88K39N3MJ8j46P5j04J24N0l3n2K44k41Q9
4923F2l81M24q8qP4j6p2j43K09J01l50K81j64K7j18K45K5j07p5J01K8j33K38k92
4947a32P7oK9L28k81J42j50m1K48m26J35P9r8J66j00N5k07L01j70n4R6k43J01
4970a51p8J60J41O5k24P5p8N9PR4j29K3J81J5j03j68p2J45K43j70Qn0j9O1j30
4995i5J00o8pJ95m5jj55%J64o6k6n6r9M5j80K07P0j2j68K66l9l3n%qN5j1J25j55
$$ y = [-57, 17, 184, 29, -10, -5, -92, 201, -6, 152, 39, 5, 51, 107, -13, 11, -202, 140, 102, 22, 160, -137, 2, 89, 34, -149, -95, -4, -16, 43, -12, -74, -57, 66, -27, -159, 2, -257, -50, 24, 30, -94, -100, 56, 59, -108, 60, 116, 35, 57, 87, -129, -155, 42, 8, -62, -29, -8, -113, -137, 107, -106, -51, -81, -114, 102, 157, 77, 27, 129, 56, -41, 21, -21, -76, -53, -46, -122, -81, 66, -100, -3, -177, 216, 59, -80, -35, -34, 30, -258, -19, 34, 38, 56, -90, -15, -119, 5, 55, 22, -30, 214, -27, 62, -319, 105, 17, 9, 83, 67, -5, -148, 61, 162, -188, 93, -71, -44, -162, 83, 108, 1, -74, 27, 55, -78, 160, -132, -55, -61, -32, 296, 15, 157, 7, -34, 214, -212, -77, 2, -96, 70, -30, 25, -182, 119, -51, -105, -9, -252, -151, -229, -69, 72, 137, -87, -12, -90, -31, -24, 70, -59, -36, 145, 160, 57, -111, -183, -38, 205, 35, 43, -7, -26, 35, -95, 5, -63, -70, 125, 80, 79, -76, -76, 88, 22, -4, -60, -159, -114, -294, -87, -17, -29, -197, 69, 30, -3, -8, -8, -16, 39, 28, 153, -2]
5024bP4L8k07J90r8l6J8J15%o8p8J67j00mK0OP7j03R2j73K35j50o8K6O0P0K5j60
5052c4j6N7j02K0J11J3K0j6j35Q0N3q5pJ55j16l0p0J80q6O2l9J47k04P6K2j5J00
5079A41j20R2j0j50J27q4j50J51j44J94j8o9N3j7o0K6O3n2k19L21j78j8K40j19
5103@J03j27NR5j4j68J68j13P6n0J2J00j04M8N7j41J50k21N4J19j00J42J19j83
5127B7J14l25J23J67o9M0Lj73J44k51K01n6J61pr4J40k41k9R3n0n1O4M8P1n2k3
5153b5J24o9J60j84knj9l8J50k36K35j77J70r3Q4m7k4j57K10K8O8l28J09R4j16
5178h8O9n0J09j3K9j02J48j14j27JJ65o8MJ94k36J29j07k8QK5J13j63K47j13j10
5203g8r7J51M0O2j17J31k07J53J13j82K91k16k7M3j20M1Q4j86K07j59J35r9P2
$$ y = [-2, 72, 110, -97, 93, -5, -41, -23, 92, 92, 24, -54, 113, 13, 9, 29, 35, 112, 9, 101, -72, 163, 13, -55, -29, 31, 101, 126, -34, -50, 7, -95, -75, 36, 49, 69, 53, -82, -2, 51, -34, -41, 114, -2, -32, -102, 78, -8, 54, 15, 162, -42, 34, 56, 41, 141, 21, 113, 103, -47, 80, -4, -154, -3, -147, 47, 29, -40, 13, -4, -64, -38, 25, -27, -246, 75, -103, -121, 119, 0, 103, -24, -19, 76, 62, -106, 62, -51, 25, -25, -13, 87, -17, 31, 88, -53, 97, -124, -70, 49, -51, 91, 210, 27, 141, -184, -61, 106, 37, 77, 80, -93, 51, -200, 1, -55, 106, 99, 5, 145, -96, -125, -32, -82, -133, -69, -21, 50, -2, -25, 99, 30, 190, 6, 4, -1, -20, -58, 92, -144, 91, -86, 84, -9, 75, 28, 4, -153, 57, 85, 153, -175, -66, 28, -88, -19, -69, 40, 27, 56, -46, 102, -12, -139, -138, 27, -41, -37, 157, -79, 50, -57, -85, -77, -52, 61, -102, 145, 32, -78, -175, -24, 16, 78, -39, 92, -115, 38, 151, -31, 260, 44, 17, 60, -60, -19, 65, -121, 86, -73, 62, -37, 35]
5226C5n8N1j02RJ28n6J0J17j35jJ37k65J38Km4J15j11J14mM5k34j7m3J98P3K1
5252A23j52N4l4j61J09o9R3L5j03J16j86J12L5O6l2Rj75P2R6K1m1j03l1J17J12
5277H3j30J60m4L7p1q0K5L21l27j4j0j79J75J42O3p7j68m6K11j06j7L2R1o7r7
5302i3J24j30J84p4q7J16k2L7Q8q3j28J13q6J63o5o2KJ0o8L6o3J02O6J12j75k1
5328dp2k24M26n1q8Q3m1L3j12J19j07k8j6N9r6j64K06J58j31J54k40Q3J26r2M9
5353C0k27J00J11j5j10J35K4n7o8N4N7o1K07k90N2L9k2p0P2J25Q3j65J2j75M05
5378B46j74j15O3O8j1j57N4N7L5j52J16p4J19rq9p6L6j83J71J73j91P2J20j59
5402f0m6P0J33q5l2L0J9Mj27K29l58N7L30j77M9P1k35K21j14kL4j9LJ66j40j28
$$ y = [35, -23, 28, -74, -65, 63, 7, 17, 134, -1, -2, 135, -130, 8, 10, -34, 81, -30, 84, 80, 125, -109, -126, -169, 29, 102, 123, -29, 25, -9, -170, -61, -130, -37, -2, -105, 11, -175, -63, -28, 38, 6, 15, -160, -88, 8, 29, -12, -115, -146, -29, 83, -47, 113, 69, 106, 35, -45, -20, 301, -26, -40, -50, -229, -54, 88, 151, 74, -94, -140, 71, -35, -52, -20, 71, 4, -93, 31, -99, 85, 11, -76, 40, 18, 55, 143, 60, -68, 45, -41, 122, 57, -5, -3, 7, -61, -25, -88, 14, 80, 192, 17, -4, -76, -300, 126, 75, -13, 70, 29, 62, -50, 69, -38, -66, -82, -23, -119, -283, -77, 81, -50, 104, -136, -53, 73, -19, 30, -197, -97, 14, -1, -111, 24, 48, -9, -77, -23, 34, -27, 180, -110, -58, -19, -41, -111, -39, 86, 169, 4, 16, -159, 246, 72, -43, 20, 88, 77, -80, -26, 31, 66, -86, 30, -44, 75, 66, -23, -99, -63, -246, -75, 98, -93, -21, 99, -60, -106, -36, 97, 12, -20, 10, 29, 33, -94, 135, -223, -166, 164, -13, 36, 107, -128, 93, -21, -23, 11, -8, -5, 161, 21, -107]
5428a07K18j75P8N8Q4j83l9L2r1J43Ll7L9q2J25j13J97Jj74J80j39j85R9R3j9
5453FM5r9P3n1j70K6K71m8l3r9N7P1j72J24J70j90N0j03J18j86J04P4jo2M8n7
5479c4J15N8l19J45k4Q3r3r5J86q8n9J18J57k08M8P4n0k32L05P5j49k69K76m1
5503b1j41R0r4J75J5m2N5J08j96n9J44j58R8O6Rm6j2j13J5Q1L07j40j50q8J24
5528B7M6P2q8j34K21k18M09l39kqPj38K70j37rJ29j96o5J62L6n2j28L14j41q0
5553d2J71o9p9n2J31j44J00j71K7J12N7M0l29K10o2j06K13k23J45N2j79K49k72
5576b21K14P0lk07N6J76nJ28j96K96l42N0N8j53R1J8l5N9q9k9K4L3%o0m0J22n3
5603c8J05p7j2j36J19m9q0J98M7q9L0j41L4R7K9k7L7l5pK15j90NP6l08J87l5L4
$$ y = [-107, 111, -64, 14, 72, 156, -27, -66, -34, -125, 18, 21, -16, 23, -59, 66, -47, 150, 151, -23, 157, 18, -167, -68, 25, 6, 51, -48, 25, -26, -196, -170, 101, 53, 20, -79, -22, 49, -123, 1, 171, -19, 31, -72, 46, -140, -36, 38, 37, -25, 23, -34, 81, 139, -180, -35, -59, 24, -69, -164, 22, -66, -125, -7, 150, -58, -10, 64, 14, -218, 87, 162, 13, -256, 20, -21, -162, -72, -166, 9, 24, -18, 37, 145, -51, -110, 34, -124, -26, 40, 49, 3, -9, -122, -107, -26, 281, 141, -9, -97, 27, 73, 145, 57, -77, 144, -74, 335, -4, -6, -14, -7, -145, 125, -12, -21, 108, -88, -153, 9, 45, -7, -135, 179, 38, -42, 129, 60, -19, -71, 60, -84, 16, -155, -128, -16, 41, 81, -248, -38, -100, -206, 7, -216, -71, -19, -198, 51, -221, -7, 63, 60, -147, -91, 85, 80, 208, 12, 308, -34, 16, 74, -79, 12, 30, -5, 54, -35, -64, -40, -7, -7, -67, -107, 15, -38, 67, -10, -22, -158, -39, -88, -168, 30, 77, -12, 18, -123, -89, 8, 37, 10, 47, 12, 5, 220, 30, 35, 111, -197, -10, -45, -11]
5630a1j33K56%k22P0oJ13l2qr1R4N6M3k68L2K09j96J23J89k05l6N7j26LJ16j10
5656h3J37j26q4L58j0k31K6J18k12K75p1m6j7q8K5p0L8M4k7J3M5p7J1P6M1j21
5682e6j86L09j8j27O6P0on6Q2j18R1p2J64j26N5n0J19Nk5k06q3J98ll6j1N2J4
5709D6k4M9j28r0R9P2l1j21J98p4q1P5j36K24j09K8K5K15j53j09Q8K8L2j07j11
5734i5q5K07R5l15K46n0R2k84K07m4n4N5l3J33N8o6o7N5J10p9r6j2m7O8J3J09
5760A21j27j89J65L7M1J00j18j84J56O9Om2n6M8l3k0J7l8O2m4R3j82J78p1J9n5
5786d7m0K2J19jJ0M3j85k7K97k64k4K01k22K13m8J3Pj11l2K1O3K9o6J19k6q1j02
5813a19J50k06K22j07J69l7k4L7lm9l2m4j7J76o7k9M7r3l4P4K3j55N3K61k44n0
$$ y = [-11, -144, 112, 112, -110, -40, -46, 67, 35, 27, -64, 30, 86, 129, -139, -107, 102, -94, 29, 218, 13, -23, 34, -92, -89, 27, -83, 54, -72, -156, 202, 192, -39, -13, 105, -107, 168, 97, 51, 34, -54, -29, -99, -61, -17, -44, -31, 14, -63, -52, 24, 65, -56, -242, 67, 49, -78, -12, 58, 52, -4, 78, -40, 51, -21, 143, 17, 72, 22, 141, 146, 121, -85, -168, 30, 27, -9, -20, 32, 46, 22, 71, -57, -147, -48, 24, -7, -128, 70, -4, -85, -10, -146, 78, -31, -3, 22, 237, 84, -25, 63, 91, 123, 16, -95, -180, 27, 122, -193, 53, 3, 95, -189, 18, -26, -80, -25, -58, 75, 133, 67, 0, 55, 165, 86, -10, -22, -69, -1, 12, 121, -6, -195, -30, 7, 48, 148, 30, -154, 2, 71, 77, 35, -21, 27, -6, -26, -9, -47, 15, -29, 64, -118, 60, -11, 8, -47, -87, -65, 54, 53, 63, 106, -79, -106, 191, -73, -97, 104, -118, 95, 47, 60, 67, -44, -76, -55, 8, 37, -29, 90, 64, -17, -119, 31, -175, 47, -60, 109, 72, 48, 85, 82, 33, 1, -43, -60, 116, 49, 20, 67, -26, -60, 14, 37, -118, -65, 196, -48, -98]
5839i8L8J05q3Q5r4r4K09R8l14Q8k9J94r6P2j38n9L06k14r0J26Q1j44J39K9j24
5864gj85K76j74J71r0J22j08J04k7J8k39J29L0K7j5j25J62j76J44n6M8j05L2q7
5888a31K26q2j9j8L2P9j67O1K77j68q5O0o8J02k22J06m6N1R3j84J74j31J57j43
5912d6k4m7J43m8Q4L5j84K05q0K8j3j11o6P0L6J07q6j11pJ43r1qP7j0Mn5J16m7
5940A4P3j40P5j9M8O0j32K6PK6kO3j04l8L6o2M0o4n3J8L08l28N5R4l6J01k1k1
5968B4J48k03n3J52k0j65J45j20n1K64o5j42j3J53j29J25p7oM9l2J71j37j00P3
5992iK2r1NL1n5J72j74K27p7L5Op7l5%j12J04p2N8P0K1K6j37R1J0M8j82J8J35
6020E8p9k1Q5j31o2J61p8j30K26j81K68k38J39p3K1L6J24jj35K03k35M6k9M6o
$$ y = [-98, -60, 45, -38, 47, -47, -141, 68, 166, -148, -60, -89, 105, 9, 81, -57, -116, 190, -24, -114, 12, 93, -51, 88, 117, -7, -192, 84, -90, 81, -9, 113, 5, 109, 82, 100, -139, -10, 20, 47, 32, -93, 69, -107, 37, -19, 29, -76, -44, -131, 95, 13, -6, -24, 8, 87, -80, -19, 258, 90, 5, 65, -3, 99, -123, -17, -63, -12, 81, -103, 71, -60, 97, -46, -70, -117, 26, -22, 62, 97, -87, 118, 38, 66, 53, -58, -124, -54, -18, 89, 3, -108, -115, 28, -63, -71, 6, -4, 0, -55, 61, 14, 87, -53, 22, 3, 51, 111, -21, 5, 12, 38, 36, 99, -5, -43, -7, -69, -29, -93, -146, -128, 180, -148, -93, 1, -35, 66, 45, 24, 172, -31, -84, 68, 48, -117, 28, -92, -143, 121, 56, -86, -99, 54, -75, 50, -27, -33, 16, -16, 155, 18, -82, -9, 13, -78, -73, -42, -97, 75, -99, 128, 51, 86, 92, 15, -20, -20, -132, -28, -100, -42, 28, 49, 75, -62, 29, 39, 87, -95, -77, 58, -21, -42, 43, -88, -150, 11, -67, -197, 29, -152, 116, -122, 17, -56, -35, 1, 125, 124, -11, 192, -43, 3, -26, 20, 14]
6045A4MN5j00J98k35R1k33R6lN9J74k24O0K0J17q8n0R0j37M1om6M0J09O4o6P6
6072A20Mj82J23P8j42J62k85K16q8m8J00q1L8L7j46QJ19q8m8M4J09K0l52J98R3
6097Im8R9l04L14NM5o5R9j70j6Pl1p1L4J78Ro7j32L55l83J38N5J9j6p9J06j49
6124e9Q3J10j14l6M6j52O3N6j63K5J84k8o3J61j11j9j19J10P7j15M3l6m7K19j32
6149a7k7j2K7P3l3L2p9J49r4j16K29j18K8p7j9J95j71R6p2j66K87o5k34R2L1m4
6175a05J73j39nJ29J06j11j42J18J2n2jN6m6j36J56j55R3J6o6m0J3J87N0k61J87
6200C7Rj8K9r9K9P5n2m1J35m7j43J34j11q1n6J07R1P7j32M1J4J56j54N3j57J47
6226D3J26r9j32P0j02J48N2k38P1P1m4K26k75K8L1j32O9L0K54j55R3j32J5R0j8
$$ y = [14, 18, 73, -27, 171, -64, 27, -206, -110, -113, -54, 120, -104, -44, -24, 93, 5, -45, 45, -92, -51, -57, -103, -63, 46, 110, 44, 120, 124, -58, 65, 143, 1, 163, -122, 94, 6, -42, 58, -23, 15, 52, -94, -86, 33, -55, -103, -59, 50, 70, -282, -84, 9, -39, 60, -244, 70, 75, 120, 55, 154, -16, -32, -25, -56, -127, -93, 85, 94, 27, -105, 250, -133, 5, 60, 79, 63, -16, 90, -59, 24, 134, 20, -16, 30, -122, -59, -3, -166, -141, 43, 15, -48, 113, 2, -17, -136, -26, 51, -64, -21, -57, -104, 115, -17, -44, -56, -29, 44, 11, 43, -36, 113, 19, -97, 132, 14, 42, -35, -54, 141, -30, 66, -6, -172, 115, 50, -184, -92, -61, -105, 68, -71, -76, 53, 159, 48, -94, 24, 36, -16, -17, 39, -7, -143, 13, -142, -49, -33, -99, -139, -126, 61, 111, -150, 37, 46, 28, 57, -42, -13, 62, 10, -31, 104, 57, -86, 48, -63, -144, -200, -93, -2, 75, -57, -16, -2, 154, 0, 53, -104, 43, 169, 70, -62, 8, -94, 54, 106, -132, -61, 10, -34, 192, -83, -55, -24, -156, -87, -57, 197, 42, 135, 3, 18, 108, 90]
6251I0k4p7N8j4n0K1Q7l3j36Q7J2nn0J4p5M7J1l7J30j31J77j69j00J09J14k67
6277b11K78N5k3j98M3j3J50j33J24L4K7j46Q7o5J2K25k64m9K10l33LK75l2J76
6301B32l36o0Q3J41N1j95RQ7l0Q7N3j60j24K00l3rk8Q7l9J79K5m62J98n1M6N0
6327AJ27j4L0j08j99J77P8l0k14J36J3J24o6r5qJ45j68J32j57J61j07N4nP2j03
6352b4q8J56M6o9j00Q8L3j20L5o6O7K0J04q3r2N6rJ22J01j68R4l45K25R4L7q6
6378B8O5j34J22q9%j0P0j47P3o6k24K12J61k50K97j66J05JK5k13M0R5j67L33J4
6403A75k37N1P1r7O6R0j63N1L9j16O8o9N8l0j52K71o0n5lj3N6p3O9j11K8Q4l2
6430c4l3J45j71J13Q9j14K1j49PJ67m7J19k06Q5l0r4J84n3m5J86j70J2J7J09j54
$$ y = [90, 66, -11, 47, 33, -17, 4, 91, 58, -78, 9, 21, 16, -34, -20, -95, -48, -37, -74, 56, -75, 102, -67, -167, -58, 56, -211, 67, 122, 99, -99, -56, -69, 81, -52, 72, 106, 133, -13, 74, 9, 21, 246, -18, -67, 143, -190, -187, 88, 56, 232, -104, -164, -81, 60, 111, -84, -75, 12, -18, 69, 122, -38, -162, 38, 5, -4, -32, 55, 16, 195, 220, -242, -44, -95, -49, 1, 128, 114, 144, 36, -163, 14, 92, 62, -152, -16, -3, 121, 55, -40, -48, 97, -71, 61, -96, 65, -42, 12, 7, 79, -24, -112, 44, 90, 21, -79, 9, 42, -78, -43, -109, -42, -22, 82, -1, -93, -37, -46, 76, 177, 9, 103, -242, -17, 77, 114, 28, 93, -41, 81, -8, -8, -18, 52, -95, -22, -88, -312, -100, 61, -189, 108, -58, 47, 48, 73, -140, -100, -5, -172, 161, 175, -62, -11, 60, -37, 29, 119, -44, 7, 46, -70, -2, -71, -13, -43, -195, 76, 16, -39, -42, -55, 1, -72, -3, -114, -86, -2, -34, -67, 78, -93, 20, 109, -5, 16, -133, -126, 41, -6, 113, -93, -8, -38, -132, 52, -1, -46, 140, -30, -18, -1, 108, -46]
6455d6L8J02Mp6q8K0M9j06J09j09K11k6j07O9J56k60J84J3j89ml5R0K8m6rj75
6481b03J64J71n4j3K6j37K3P3J29j83N9j76M7K05j76L0Q9o6O1j76nJ05N6k2K8
6506E5qj55J85j12K5r3j7J56ol1j52J61mk25L04j37L48l24Ql4j38K21m1k2N5l8
6532a9j01J94o6l9R9m5P5l7M0m2j57K06l0Q9k27k9J30n2N5q2K23q4k25M5m9J52
6558B4j37J28j01J15j70J65R1l7rMm3j74J22kj41K81q9j6q2J77j75K08j97PJ22
6583G1q7o1Q9R2L5p7M9k01K34p2l5j16K35k30J16Ml8K2j43J52n1r1J21Qk07M51
6609B70l23K12j14j65oJ58J40k14o5K1k0Q2j2J46j5n0r6K25j48M8O9%j23M0r7
6634c7J51r3r9J7kJ7j0n1l8P7J55j37L7nk9J14n9j25P2m0J2R4P5r9O7q1n6KR7
$$ y = [-46, -8, 94, 98, 22, -66, -46, 3, -103, 6, -103, 108, 82, -25, 44, 200, -60, 124, 137, -52, -56, -91, -1, 27, -19, -28, -203, -39, 132, 78, 65, 91, -46, -23, 50, 179, -4, 55, -121, -74, 131, -45, -15, 74, 8, 69, -107, -112, -7, 49, 27, 55, 47, -108, 77, -35, -10, -103, -120, 36, 30, -1, -153, 8, 4, -221, 83, -54, 294, -30, -22, -56, -194, 27, -14, -36, 19, -19, -120, 74, 8, -31, 68, 23, 98, 61, 101, 59, -98, 108, 78, 167, -60, -89, 41, -11, 44, -38, 185, 101, -124, -79, -128, 24, -113, 15, -86, 29, -141, 24, 115, 78, 69, 73, 30, -144, -22, -24, -165, 116, 27, 11, -71, 106, -69, 139, -58, -51, 71, -16, -77, 12, 104, 139, 62, 111, -90, 144, 72, 37, -79, 156, -74, 42, 46, 8, 30, -113, 39, -12, -103, 18, 26, -181, 270, -53, 159, 45, -120, -126, 32, 172, -42, -107, -86, -106, -24, -36, 110, 95, 45, -51, 174, 26, 74, 143, 143, 20, 60, -37, 114, 21, -78, -61, -63, -46, -56, -107, -145, -68, 87, -50, -13, -18, -47, 67, 8, -117, -45, -85, -73, 21, 96, -3, 64, -17, -73, -71, 26]
6663B6q2O8N0rj29J06J5n9J92j60l0LJ14j65M1J37l2k12J12K94m48J57K25l42
6687a28P7l2K46j15j7N3n7K7qJ2j07O7k9j2K9k32J16Q3l7J34j48J8N0%o9R1n2
6714d0k6K6R2P0k10J20k9j07Q8J07r9j83K48j17J23j68J38q6L6R2l4q6J08k3P8
6739A18j73j8Np7K02j26J07M3j76qJ90J0J00l34K67j21J51k37N1O9n6l9l2J67
6763H3k6o5J57q0j41Q3q2L7m2K42j65j0N3q0n8J55p4O6L4P3j6J4k10K77k68k4
6789f7R4ppm0L4j0N4L9j40N2p3M2J25p3j51J99l9r0J03Oo6LJ57j31l0l7j05J01
6817e7J38j87K10o4Kl4j4J15l9j57M9Q6r2J63j22J5j67J18J49j37J51k50P7j24
6841a71J87o0k1m0R5Q3j34J64p0K9j01P9k36K50J16j72o3J8m2r0J79K2nm3NN9
$$ y = [26, -56, 12, 62, 53, -76, 30, 45, -14, 178, 18, -12, -9, 105, -60, -19, 118, 86, -126, -14, 280, -168, -11, 214, -128, -51, -83, 163, 48, 31, 84, 27, 54, 46, 58, -49, 18, -11, -23, 6, -226, -110, -27, -64, 70, -78, -60, -10, -10, -79, 12, -40, -66, -40, 52, 122, -88, 32, 3, -104, -16, 91, -8, -191, 57, -60, 63, -105, 33, -53, -17, 75, 41, -45, 63, 40, 118, -55, -73, -68, -145, 57, -69, 38, 81, -95, -103, 87, 97, 197, -137, 130, 9, 160, -77, -26, 43, -13, -52, -84, 83, 57, -8, 149, 69, -72, 11, -71, -34, -76, 166, 1, -9, 44, -36, -94, 61, -13, 53, 87, 160, 144, 158, -52, 225, -43, -67, 27, 20, 13, -27, 7, -3, 51, 90, -50, 2, -71, -29, 96, 23, -128, 71, 32, -58, 45, 51, -15, -12, 145, 14, -16, -53, -158, -57, 81, -106, 104, 40, 42, 8, -6, 109, 70, -87, -38, 48, -44, 119, -3, 12, -155, -37, 112, -25, 126, -124, -47, -171, 16, -44, -65, -105, -10, 73, -61, 103, 33, 62, -39, 40, -196, 54, 170, -2, -65, -47, -89, -179, 0, 22, 17, -26, -21, 38]
6867C8Q7n6mj64R6N4K5j75nJ11J0r9J74m6j85J72j1n8J14l8Q5k06M1J28r8p9K14
6894A25j86O5M9J4j00j83L35k24K78k54J55j54p4R1NJ31p7J69l38K34j52J20l8
6917iR6k14O1Qo2J80M0j45MQ2m4k9J75l5j45J13k21J84Mn4L7r3K13j04k11Q8K34
6944A53L3j66j17O4K09k98J7O8J05j7Q6j56R7q6l2kJ16k6K9r5K2QO4j00L3k08
6970a99K21k8j03rmJ83j36J00Kok2R9q1ln1o7R0K8j22j7J44mo1M5qM2j67J17Q0
6999F3j37J38q0J96n0J3j71O6j11lJ19k6J1k56K88r9K63j62j47KJ01j08K62k71
7023i9J03J04j08r5O8qj13N3k2J51k03K36p7J08O5j61K8N6L1q2k1J35q2j5J02
7048A54j69j4J51j70r9K10J18k59qJ06lp5R8p0J06n9M3J11k45J99o7J10k92Q6
$$ y = [38, 125, 69, 65, -99, -3, 51, 76, -99, -104, 7, 17, -82, 92, 46, -139, 33, 22, -36, 78, 40, 125, -81, -40, 88, -10, -89, 125, -61, 4, 53, 67, -33, -216, 119, -105, 173, -81, 74, -80, -154, -63, -58, 73, -4, 165, -173, 61, -91, 29, -9, 87, -127, -66, -58, -120, 60, 100, -45, -41, 41, -3, -32, 143, 108, -37, 76, -145, 39, 43, -11, 26, -67, 146, 42, -169, -81, 153, 186, 20, -97, -33, 176, -122, -105, -37, 68, 51, 137, -19, 78, -8, -40, -42, 74, 48, 77, -18, 4, 12, 76, -24, 9, -199, 22, -6, -109, -118, -122, 61, -75, 25, 27, 21, -1, 98, 17, 14, -37, -104, -14, 14, -108, -125, 19, 15, -46, -1, -9, 33, -134, -17, 63, -74, 64, -16, 180, 130, 143, -28, 38, -73, -76, 43, 17, 28, -228, 60, -39, 224, 62, -85, -83, 18, -90, 172, -99, 4, 108, 0, -95, -27, -35, -148, -95, -117, 34, -169, 67, -10, 98, 163, 2, 30, 86, 117, 35, 14, 149, 67, 52, 154, -15, -29, 122, -48, -147, 63, 181, -78, -86, 20, 17, -58, 40, -30, 76, 17, 60, 171, -74, 125, 58, 168, -124, -38]
7072c8L5N6Q3n8j81P3Q4R5j44q1O7K2J32j01r6J98o2l8o2O7k31K84n1O5k11J15
7098B2j85J74j3Q3K2j1o7j49K48j44J49j67L8M0j16M3Q0j08%J58j88P3j52K14
7122D4j02J2J07j00J76m4j70R0J52j37KR6j12j42PN4L9p1M5L9Oj25K42o6rJ32
7148A65k62J59m8k3q2N0l6J68L0k51RO0o4M3R1j46J44o0MK6Q7k06J45J90j37J2
7174F8m3J55l05J65J34k74j13L24j54j3J50k14J05K1j42J94o4R7q3j0J69k06j43
7197a82R4K46k34J71j42Q4K24l22O4rQ4J5r6O9k8Ko4R1N6k63j1K83n6p9KP2k05
7224a34K34m7O6m2Lo0o4N5jj71J32J82q2q6j32J27m6N3K2N6Q5k69J00r9K29j46
7250c5J00j10j10J94L7j60M7m5R6r5J50n3J44l19M7J30Jj05L8J59k11m8J46Q8
$$ y = [-38, -3, 53, 136, 78, -103, -30, 54, 149, 5, -76, -9, 13, 145, 44, -52, 146, 84, 46, -16, 51, -180, 104, 53, 118, -93, 22, -163, 11, -2, 81, 103, 92, 25, -124, 124, -20, 129, -38, 0, 40, -76, -33, 47, -61, -61, 97, -91, -18, -170, 44, -58, -46, 61, -39, 137, 93, -77, 13, 165, 28, 30, 126, 14, -128, -121, -67, -28, -99, -54, -15, -9, -134, 108, 42, 33, 165, -97, 62, 14, -9, -91, -41, -77, 91, 121, -130, -121, -61, -125, -82, 9, -137, 7, -53, -49, -23, 64, -142, 3, 193, 56, 68, 25, 180, -125, 40, 174, -100, -213, 111, -43, -56, 94, -120, -15, 6, -136, 58, -6, 91, 8, -2, 167, -39, -182, -88, 158, -76, 95, -47, 37, 261, -61, 3, -6, 78, 93, -3, 66, 38, 40, -24, 67, 123, -140, -151, 132, 76, -3, -1, 71, -134, 100, 53, 119, 77, 80, 20, -44, 11, 10, -161, -29, 153, 71, -15, -147, -20, -66, -13, 9, 65, 150, -119, -19, -118, 111, -35, 65, -45, -155, 39, 76, -84, -37, -82, 14, -81, 69, 16, 160, -159, -112, 18, 19, -86, -48, 111, -100, -148, -2, 86]
7274H6j8%Q3l7l33Q6J58R2j90p3KJ51P6n0p2J6k8J47k27K64j48J40r6M5ml8J0
7301D2j35J02n9J58j96O3l3o0J00J33j64J06j94J25L4j36l7J65J9qj31K09j32
7324b9j24K03o7O6q2j22K36Q4j54M2j27J09L2j2j76M0K21j42Q2o1p7J17R2o8m
7349G9j48j2j8J87j33j8R9l9j23J29M3j8J2k4J0rK2o1RJ19q0J36j96K7r8J17j44
7376a32J97j5l08L12n6K25k24rj6J93j97K30k30K4M1j15p8N9o9M0O9J96j61m9
7400g3K10k23k13M01k2k09J51j32OQ5Q3j69O4J6N6j33K35Ok03m2J74k63L62k06
7424c9J06j13L5P8j6m6J04o9J22M8j50j07j8q9J99j03m5PJ33j8J7p4r0L18l43
7449a53K1J38Q5K0j96O9J17k18pK71j77J18p8J1j41K34j5j92J12q4P2O9q0J05
$$ y = [86, 68, 68, 151, 114, -219, -133, 25, 117, -73, -146, -144, 7, 83, 33, -39, -23, -51, 96, -131, 133, -15, 125, 29, 74, 70, 32, 42, -93, 9, -50, 108, -88, -25, -58, -118, -18, 115, -49, 57, -137, -12, 22, -114, -151, 14, 33, 25, -106, 103, -29, -153, 50, -17, 49, -33, -155, 81, 165, 11, 53, -74, 35, 67, 55, -121, -81, 140, -2, 80, 19, -58, 59, 151, 83, 79, -69, -81, -99, 88, -45, -63, 36, -3, -126, 3, 46, 28, 40, 16, 26, 17, 39, -22, -13, 106, 26, 162, -34, -7, -105, 12, -132, 65, 50, -258, 54, -2, 223, -1, -10, -26, 167, -30, 200, -30, -6, 35, -80, -158, -99, -168, -128, -59, 137, -24, -73, 137, -86, -299, 102, 80, -129, 22, -110, -104, -19, 64, -105, -41, -25, 31, -102, 133, 139, -64, -106, 68, -195, 167, -39, 67, -46, -11, 67, 51, 5, 109, 40, 162, 210, 60, -47, -65, -154, 45, -58, -103, -96, 37, 19, 36, -38, -128, 190, -153, -132, 6, 91, 111, -85, -16, 101, -117, -124, 147, -30, 88, 10, 21, -120, 114, 99, -93, 19, -65, 7, 76, -4, 101]
7473A01o0p1K7N3l5j78j04K20lP9R1L6j59j06J45mp6J17k20K17P0l4k9j69O0K2
7499a0J27M8l07K93j74K2j37J82q4j92M08j78q4J73n5mj20J77p1j22K5L9k0R2
7523B8q9P6J8k63J62K23m3j05mO6j14O2J07j92J31l8L5Mj2j39K9J49j85P1j11
7548a34J32j49J52o9J02o4o1Q5J14J4j07q9r9K12J20q4j87J81k1l16M86l00K21
7571A39k59P2K2K13j7j95%J64j58j73L29j52%p5R1j5kJ25j51L13j93k19L25l29
7595a45J31p1J61j41O4J49j18l1PK9N8p5l8r8N3Q4O4l75L28j32K03K8j91N3K6
7620B3p3O9J43j90J16r7q2J72j39j9J44J52k13jj19K24j6k67K79j49K29o8r5p5
7644e2j27L02j14J4j12Q9J00k3q0k8l6m6J99n4N7j40J08J0j1p6m5N7K7K3N4p5
$$ y = [101, 41, -30, -3, 50, 15, -163, -267, -47, -50, 29, 120, 156, -3, -109, 36, 32, -44, 73, -147, 70, 140, 106, 77, -92, -32, -10, 117, 165, -142, 151, -23, -1, -138, 44, -40, -232, 176, -2, -86, 87, 32, 28, -92, 85, 14, -108, -83, -44, -64, 28, -61, 15, 33, -230, -68, 155, 112, 7, 3, 69, -45, 17, 124, -68, 63, 25, 60, 64, 52, -87, -58, 91, -94, -23, -134, -2, -151, 1, -68, 34, -30, -91, -6, 108, 122, 15, -74, -173, 39, 159, 75, -112, 69, 48, -268, 218, -82, 139, -120, -48, -26, 187, 170, -25, -25, 139, -19, -192, 137, -15, -15, -90, 1, -14, -16, 109, -42, 271, 78, -141, 184, -145, -14, -85, 76, -65, -1, 148, 30, -1, 6, 35, 93, 18, -20, -118, -65, 19, 83, -292, 36, -96, 107, 135, -56, -3, 23, -50, 19, 162, -28, 88, -9, -91, 81, -58, -77, 67, 219, 6, 5, -114, 110, 94, -173, 106, -43, 186, 118, 23, -52, -179, 123, 9, 23, -89, 0, 100, 77, -3, -31, -67, -113, 86, 32, 89, -51, 57, 67, 56, -20, -65, -8, 19, 42, 96, 21]
7670B1j67R7k3J01p0nN3l4nK8O0N8q5k3k1l0K26j91j62J70j00J14J29k14J70j42
7696d5L7pj78P2J93o5K4j34N2l3J5L6j59J49Q8o7J38j45J61k42M7mJ34j14KJ59
7722A14k77P0Q9j1Q6j44r5K37j67j0J17m0J18k60Q6J24k4q3P0j64K51j09J34j22
7746a0j43Q7K22r4j51J35PN3j63Q0j5k10K54j59J43L8N1j53k7kj8J43Lj51K8p3
7772a25Q7J23j63J34k0j86K27M1p0q9P9j16P2P6m0p8K6K60k42P6Mj4k5j19J18
7797C6r9K1n6r1nP3J59oj68R1N8p3Q9K7j8Nl14K82j58J69q4J21M7l6Q9j22O8k5
7825H0j92O3O5k1j09L13k01J77j84%M3j09K63l10J55j9j69o8K19L1j9r8K27j34
7849CR6j13J38k15m5QJ90j4l2j69J09o2J55J39l17J95j13J86k22J61j92J06K88
$$ y = [21, -146, -49, -72, 29, -41, -46, 7, -27, -32, -4, 56, 114, 29, 6, -15, -45, 181, -10, -172, -2, -102, 12, 141, -73, 97, -45, -8, -15, -193, -121, 72, 7, 31, -103, -51, -84, -69, -33, -192, -43, 45, -22, 116, -29, 132, -110, -63, -67, 67, -47, -45, 114, -163, -93, -4, -15, 71, -73, -168, 69, -98, -108, 9, -31, 87, -173, -87, 37, 13, -70, 0, -164, 87, -22, 112, -10, -153, -66, 156, 62, -89, 46, 53, 106, -57, 23, 8, -202, 52, -107, 36, 74, 125, -28, -55, -57, -75, 68, 71, -80, -52, -125, -38, 85, -78, 56, 36, -150, 77, 118, 48, -41, 38, -78, -6, 70, 30, -48, -22, 238, -4, 72, 76, 62, 37, -82, 36, -63, -42, -98, -189, -194, -121, 38, 32, -136, -45, 13, -60, 29, 56, 38, 43, -271, 11, -147, 22, -62, 59, 106, 70, 159, 37, 105, 80, -112, -49, 16, -5, -114, 199, -2, 175, -9, -9, 34, -75, 188, -122, 33, 14, -155, -223, -4, 27, 8, -90, 137, 3, 99, -14, 124, -91, -136, -128, 62, 48, 16, -153, -44, -106, 49, 188, -129, 66, -47, 139, -83, 78, -114, -8, 280]
7872B80l01K25j78r8N5R5k04J66R6L9k40J29J0p6Q4M6RJ6j15r2k0J73o3o4j31
7897a59L9M2P5J57l34J60o9K8km9K30j36J02j04Rl6M1N7J30n6j11o5J08J11j63
7922EQ4%j65Q5Q4j47N6r5R6M6p4m6M4mP6j03P6N4j9o1K8j75J85J62k32o4K16n7
7950E5j36R1k52M34j29L1nj66Q7j38Q0K4J23M2k03J81k5j51J28J5p3k3P0M2o8
7975C4R9j40J24k44K18j44Q1%l8r6j43J31J79k11K3O4Q1J28j16J62j57j04J8L4
7999a7q1j5K56p5q7N1p7J44qj82P6q5J05j43K88j14J71j97j61J26J37j41O5m2
8023fP8p7N5j52N8J9K2m4P4j90J18j8L1J75o9M4j66J15o4O5j76k1J05K19k73J24
8049D6j7j3lK2j32q6K52q3k9J25j27M2o0O1k67K19J57j29J53K1k44Q1O7j22j47
$$ y = [280, -21, 204, 26, -72, -17, 78, -126, 40, 136, 175, -65, 64, 74, -2, 82, 128, 137, 153, 38, -54, -74, 99, 36, -28, -159, -120, -78, -3, 154, -180, -20, -89, -61, -63, -112, 118, -18, 84, -20, -11, -47, -6, 51, 181, 125, 14, -51, 57, 168, 5, 89, 89, -76, 9, 93, -54, 2, -93, 3, 49, -25, -71, -27, -31, 45, -58, 18, 72, 53, -8, 20, -155, 30, 192, -40, -104, 112, 55, -81, 10, -242, 192, 63, 94, 89, -77, 10, -128, -48, -24, 99, 141, -62, 119, 94, -57, 71, 86, 13, -10, 60, 102, 34, 133, -7, 117, -127, 91, -53, 28, 28, -10, -106, -249, -118, 61, -150, -127, -63, 18, 146, 30, 192, 35, -69, -51, -17, -98, -113, 143, 68, -19, 32, -45, 99, 91, -91, -15, -100, 5, -138, 150, 36, 207, 10, -151, -25, 112, -29, 36, -6, 72, -5, 50, -102, -44, -25, -3, -47, 27, -163, -45, -63, -32, 143, 74, 118, -48, 67, 3, 68, -108, -129, -24, 195, -78, 46, 29, 16, 13, 35, -97, -183, 69, -14, -43, 82, -45, -3, -63, -2, -269, -50, 107, -22, 131, 152, -92, -11, 56, -66, -213]
8074b13P7J20q9k0L2J85j29n0K10r8K84l22l2N2J31l29J55J63j88J10k26J06%
8097g1K7M6J33l2k51N2J23j04l8K01j79rjO4j3J12j34J7L0j73L5J03M0n0J47P8
8123A53j77k0J88o7l6o5L8r9J08P7k48O9M6P2j47J15lj32L03j75j2P2J28l23J19
8148a6j31l7J37N0M9p5r7K6O2j39J65q3N1J9m7K11p3r8p2K07m7r5m2K6j06J64
8174IL1l3pK6J7J1j32O5P9K8j11R5j13R5P8n4j00
$$ y = [-213, -136, -16, -105, -125, -93, 92, -37, -87, 123, 25, 309, -13, -45, 7, 138, -191, -36, 127, -61, 49, -177, -71, -71, -44, 2, 135, 103, -148, -96, 27, -77, -115, 86, -93, -102, -103, -39, -52, 60, -74, -57, -27, -200, -165, -62, -22, -72, 75, 153, -24, -44, 144, 77, 41, -24, 14, -85, 23, 100, -148, -79, -33, 39, -108, 7, 4, -128, 175, 0, -12, 60, 188, -135, -16, -147, -184, -47, 3, 52, -23, -120, -94, -32, -171, -6, -89, -38, -19, -66, 145, 72, -26, -98, 109, 62, -33, -75, -49, -155, 9, 40, 7, 0, 26, 43, 54, -78, -13, 66, 94, -17, 78, -35, 60, 138, 84, -16]
8191a6
$$ Imaginary data points
##PAGE= N=2
##DATA TABLE= (X++(I..I)), XYDATA
0@%%%%%%%%%qJ6j6K4l2M0n6O5q1J04j21J45j76K08k46K91l38L92m54N24o03O92
31C70p90Q99j021J153j300J462j639J836k053K286k540K818l122L457l822M221
47B215m656N132n653O227o861P562q342R212j0191J1300j2569J4036j5755J7804
61I461k0300K3412k7418L2806m0481N2374p3490J22355m49583j89491O81161O7106
73A87912k61704l34034J36425L44177K86785j2123o2342l0472M891j10492q8848
84F0175L4384J42856k1650k58059l25737p6886J81356K11922m230j59007j20350
95c35226N6970J69656J90723J40409O3229n1987j11962m2420J19524J66027k610
106C62333k40299k73593p3077J19159Q1305r2330j55727l6570Q9177P4552m575
$$ y = [0, 0, 0, 0, 0, 0, 0, 0, 0, 0, -8, 8, -8, 16, -16, 24, -32, 33, -48, 56, -65, 80, -96, 112, -134, 157, -181, 211, -243, 281, -322, 370, -420, 479, -542, 611, -689, 773, -866, 970, -1083, 1203, -1337, 1481, -1641, 1816, -2006, 2215, -2441, 2691, -2962, 3265, -3596, 3966, -4376, 4836, -5355, 5945, -6624, 7412, -8343, 9461, -10839, 12573, -14845, 17961, -22520, 29854, -43636, 78719, -370864, -560355, 120806, 187912, -73792, -407826, -271401, 72776, 359561, 347438, 285096, 254624, 259515, 149023, 60175, 94559, 237415, 215765, -42294, -368031, -444917, -263561, -51639, -55869, -214876, -335226, -278256, -108600, 82123, 222532, 285761, 233774, 121812, 79392, 198916, 364943, 362333, 122034, -151559, -224636, -105477, -24172, -116502, -272229, -308799, -219622, -145070, -149645]
117a49645K1900J36207J55761J5853j02703l0403J39061J60231k3204j95529j55256
128b7727J9841Q2546m1941j66351j15892L5397Q5325o746p8451o318J21847J40378
140D1908L9989l1743J2822Q3859O2443k1390m6736M457K0323o0753j40356r6172
152a31349L1518P8497k0133j33049j03266M2038J33539Q9927M449r257L3994M7242
164F4150J8982K0865P0154P5365l0676j55286j39307J6261J27666N2139j24853
175d540j95529q0654Q3492J28373N0749k4349k4787N562J7859L6844Q9529J17169
187A99718M2822r6396j51494m5517J08051J25659k1823j71296j65593l0587P9869
198a26587P9259J5808k8695l5169k6340K473O9880J32694J05551j9788j22889
$$ y = [-149645, -127745, 8462, 164223, 180076, 77373, 46970, 186031, 346262, 323058, 127529, -27727, -7886, 74660, 32719, -133632, -249524, -214127, -128802, -135548, -213999, -220317, -98470, 41908, 81897, 50154, 62976, 146835, 209278, 187888, 141152, 145609, 165932, 105179, -35177, -131349, -99831, -21334, -41467, -174516, -277782, -235744, -102205, -12278, -7829, -17086, 16908, 64150, 83132, 103997, 174151, 249516, 218840, 63554, -75753, -59492, 68174, 120313, -4540, -200069, -280723, -197231, -68858, -18109, -42458, -67245, -61683, -43824, -6980, 82549, 199718, 242540, 146144, -5350, -50867, 57184, 182843, 161020, -10276, -175869, -206456, -126587, -47328, -31520, -60215, -95384, -121724, -119251, -49371, 83323, 188874, 169086, 46197]
209D6197q6100N3937J35767O3608q3443j51676r0445J0151M9707K5349p322k5843
221f0113m2509m5587K704Q7515J25184N7334n7441r4211p311R9654J04793N989
233A76001q5074q7581l1048P920O914l114n696j9433m9292n2002N201P8271Q6416
246B7483J6776n0191l7850L3691P8169N0048q132l3689k1862j3479k2368k1482
258b886J535J2598j5834n6759n3919M79N1451M6326K265k1793j396K8558L2932
271B3557K1100J8365K1684O496k8029m4360j7449K4047K6735j8940o2149n5546
283h4489r202K7266K8172R027m216m975k812O252K9062N2403M4375j629m5577
296D3657m0796P186M4401K9075k2966o1477n4390j6942J5235K5537J5796n854
$$ y = [46197, -39903, 14034, 149801, 213409, 129966, -21710, -112155, -102004, -52297, -26948, -34270, -60113, -102622, -148209, -145505, -57990, 67194, 124528, 67087, -27124, -34435, 65219, 170012, 176001, 90927, 3346, -27702, -19782, -12868, -15982, -21678, -41111, -90403, -142405, -137204, -58933, 27483, 44259, -5932, -43782, -10091, 68078, 118126, 109994, 76305, 54443, 40964, 18596, -2886, -1351, 11247, -4587, -61346, -115265, -114786, -63335, -17009, -14744, -36537, -37933, -9375, 23557, 44657, 63022, 84706, 91202, 63173, 18813, 1364, 25411, 52146, 33206, -28943, -84489, -93691, -66425, -38253, -29226, -33442, -38417, -41229, -34977, -5915, 46488, 90863, 89234, 43657, 2861, 10047, 54448, 83523, 60557, -920, -55310, -72252, -57017, -31480, -15684, -21538]
308b1538k7745k8678K510M7488O6404L6388j7538m5231k0783K7992N0389K6015
320I5673k1079n3727n0368j9839J4536K8099J2284k0771m5149l4487R629N2901
332c2298N7027J9100k4347l4064l509L6409M9276K4655j6758m3817m1747j4186
344b4259J6878K5891M368l1500m8750l0521J1240M2638L9686Q113k0614k3317
356c0147J775L2765M5070K8193p621l3448l2889q115J6926K1903R53k8633m3420
369c6688l0412J005K7566L0323Q643j7632k3778l033K7660M3091L1341J717k3735
382C6068k6276o594J6727K2777O745k1650m1248l5177p596K1446K8247P759k1351
395b0123l0051r278K5347M2788L2025L954j9133k1231l799J9374K8703J4254j6700
$$ y = [-21538, -49283, -77961, -75451, -27963, 38441, 74829, 57291, 12060, -8723, 19269, 69658, 95673, 74594, 20867, -29501, -49340, -34804, -6705, 5579, -15192, -60341, -94828, -85199, -32298, 24729, 43829, 19482, -14582, -18091, 18318, 67594, 92249, 75491, 31674, -10073, -24259, -7381, 18510, 22878, -8622, -57372, -87893, -76653, -34015, 5671, 13784, -6830, -30147, -28372, 4393, 49463, 77656, 70035, 36587, 3698, -4417, 12509, 34412, 35365, 6732, -36688, -67100, -66095, -38529, -8206, 437, -17195, -40973, -44006, -16346, 26745, 58086, 59803, 36068, 9792, 3198, 19925, 42702, 49447, 27797, -13451, -48628, -56224, -34778, -6531, 1228, -20123, -50174, -59452, -34105, 8683, 40708, 44662, 25529, 4298, 499, 19873, 48576, 62830, 46130]
408D6130m1974l8699q189K3030K6315M90k8847l4341j0789K1935L9030K9794M749
421B8634j7029k0093j652K4943L6388J9125j6277m1490l4823l165K4913K2404
433B1878o003l3007l5369j2372J6550L2222K5698L917j7032j9771N22K8948M0203
446D6384K0824j5428l5883k5455L485K2390J6113q687k9868l2788j5826Q518K4723
459b1498K1895J289j8828j9680K838K9966L8020J9372j0442k6029j7429N029J9803
472B4306J5253m648k5446l2287k0287L269K0438J8438j300k1267k1341Q88K7310
485a6674L5309J9861m936k0074j4502N431K1001J9697J214k2034l2352k2260J018
498b9301J8302J4526n180k3059k2969l194K2054L2367K0710k383j7023j2083P451
$$ y = [46130, 4156, -34543, -42732, -19702, 6613, 7103, -21744, -56085, -66874, -44939, -5909, 23885, 28634, 11605, -8488, -10140, 14803, 51191, 70316, 54039, 12549, -22274, -25439, -526, 21878, 15875, -17132, -52501, -64873, -48323, -16101, 9597, 13514, -3518, -23289, -22767, 6181, 46384, 67208, 51780, 15897, -9558, -6073, 16317, 32430, 23743, -6125, -38913, -54739, -46221, -21498, 397, 1686, -17142, -36822, -33984, -4018, 34002, 53374, 42932, 16903, -526, 4503, 24306, 39559, 34911, 9465, -22822, -43109, -39840, -19402, -964, -2264, -23531, -44872, -43984, -16674, 18635, 38496, 33560, 13486, -1016, 4415, 25416, 45113, 46327, 24293, -8059, -30319, -29301, -10999, 3527, -1653, -24712, -47681, -50875, -28821, 3546, 24256, 21873, 4850, -7233, 218]
511B18K3579K2608L379j8648k7952j9142R2J4210J1651n694k3645k5371p115J7834
525c3996K8652J8044l432j5754q701R481K3602K2171O677j2122k1755j7500j516
538f149J2536J2106l933k4411k8690j0682J3806K4448J4376m281j3257p236P499
551a3868J9281K2215J3629k924j8333j9613l752J4875J6986k189k5505l0165j2242
564d1605R910J8243J0089k496r775r498K52J4850K5602K1808J539k0177k1639
577b897k91K1402K0116l265k6323k8835j2507O151J3657R933q68j2184j7202o871
591c9984J6688L3859K6590l199k6475j9661R123K9589K0873o709k6753k5891j1459
604b3409L606J2419J1694o38j9306k6608q931K3457L9487K1247j3854k8659j0172
$$ y = [218, 23797, 46405, 49784, 31136, 3184, -15958, -15866, -1656, 9995, 4301, -19344, -44715, -51830, -33996, -5344, 12700, 9268, -6486, -15187, -5706, 17896, 40067, 46744, 34622, 12867, -4633, -6149, 6387, 18493, 14560, -9851, -38541, -49223, -35417, -10969, 3407, -874, -14131, -21367, -13868, 5413, 27628, 41257, 38333, 20000, 387, -3365, 11510, 28496, 26307, 802, -29363, -41605, -31695, -13452, -3363, -5859, -15634, -25132, -24880, -10030, 15572, 37380, 38919, 18742, -2897, -3188, 18214, 38330, 35065, 8742, -20093, -32600, -26449, -12792, -2859, -3727, -15911, -33113, -39984, -23296, 10563, 37153, 33954, 7479, -12182, -3059, 26530, 47403, 40694, 13941, -11950, -23409, -19803, -7384, 4310, 3672, -15634, -42242, -51173, -27716, 11771, 33018, 19164, -9495, -19667]
617a9667K0456L0634J4761q598k0600j9023j0249J591J2391J2350n088k7929k9333
630d8304k273K9638L3077N937k1425j9941N162K4838K2436O462n720j0307j2196
643G384r960J572J3854J0602j2191l2015k3695O933K7426J6935r085j9132m694
656b6066J3137J6774R199N413N694N2j1032j1781L850J6595P307j6876k8137j2530
670b8401J0062J3257j721j1939m430P318O518j594J217J3900J8225K994j3495
683A1911j0820P647J6761L654j4850j6150l344J993n289r658q33J0091M112j2380
697a7155j4845N981K6776K1617l605j8038n954J3257J6048L138o767n451m461
710A0541j1423j4325m12J5923J1289j4619l0669j3299K0002L2959J3023j4286
$$ y = [-19667, 789, 31423, 46184, 37586, 16986, -2037, -12286, -10695, 1696, 14046, 8958, -18971, -48304, -50577, -20939, 12138, 18075, -3350, -23291, -18129, 6709, 29145, 35607, 29887, 19580, 7384, -2576, -1004, 12850, 23452, 11261, -20754, -44449, -37516, -10090, 6845, -2240, -21372, -26066, -12929, 3845, 13044, 18457, 24151, 24203, 13171, 1390, 5240, 21835, 29142, 12266, -15871, -28401, -18339, -5082, -6803, -18742, -23172, -15854, -9336, -10930, -9713, 4187, 22412, 25406, 11911, 1091, 8738, 25499, 29153, 14303, -1847, -5191, -3198, -8487, -18145, -18978, -8887, -4775, -17155, -32000, -26019, 757, 22374, 18769, 731, -5223, 8034, 24082, 27220, 20453, 15002, 10541, -882, -15207, -15619, 304, 11593, -3026, -33695, -46994, -26992, 5967, 18990, 4704]
722D704j7647N14J4712J4382P754M627j337j4474k1335p612J7503K3465k316l3286
736a0346l3504k76K8764K5232j369j8463j1954L825J2600J4035J4115R517n972
749B6204k1955j7346R263K8672J4796k0423l8748j9810J3657K5373Q824j2331
761c824j5718n530L639Q744J4915J7673O962j3841k1417k516K3969K6435j553
774C7938k9556k7299j681J6854J1059n518j2678p875k633j198M845J4781J5979
787A3018R04j5100j1564J0323K4361J3257j1104k0688q285O789O481m440q513
800d561l449l81n433q275J000J3182J2101k183j0979j893J3371J5005J967p668
814A1804l669M387K053p307r554k13P074l03j3305j3979J87J2421Q990k457o118
$$ y = [4704, -12943, -12429, 2283, 16665, 24419, 29046, 27709, 13235, -8100, -15712, 1791, 25256, 22940, -10346, -43850, -44126, -15362, 9870, 8501, -9962, -21916, -18091, -5491, 8544, 22659, 32176, 26204, 4249, -13097, -3834, 24838, 39634, 19211, -19537, -39347, -25690, -317, 8507, -3824, -19542, -25072, -21433, -12689, 2226, 19899, 26861, 13020, -8397, -10913, 13056, 39491, 37938, 8382, -18917, -20598, -3744, 7315, 1797, -10881, -18756, -21389, -22587, -17742, -2961, 13018, 13922, -1178, -12742, -2419, 21942, 35199, 24095, 3407, -4878, 1911, 8392, 3952, -4561, -8010, -8391, -13824, -22099, -21099, -7917, 4184, 2001, -8978, -10871, 2500, 17505, 19472, 11804, 8135, 12522, 14575, 7268, -2286, -2499, 4575, 4272, -9033, -23012, -22825, -10404, -1414, -3871, -9989]
829i989J233P189M873J082M757R291L770r653j4344k711J2482J0915o851k0114
843h070j4847J962J1488O882j511l799j970j403K55Q375J5592J1351n178j6958
857B169j0283R318J8828O641j3823k1114j0317L915R085M553j029m863p429o560
871b0909K730J5505J8701M889j2841j5660J26J7421J6755l95j5577j6341n509
884a1105L433N803L373q94p213j1930p095O871J8302J4183k389j4288q302P880
898c371J6760J0681k722j0678r355m300N42L500L926p42r734j3599n796Q332J5073
913a483P610m758r545k102Q162J1908O959N31m069n920n380j595M009M820j620
928G527j0795j2512m664O258R827L568l711n360o77M907P877Q022N089p23n693
$$ y = [-9989, -8756, -1567, 3306, 4388, 9145, 18436, 22206, 12553, -1791, -4502, 7980, 18895, 12044, -8070, -22917, -20955, -9467, -2585, -4096, -7895, -9865, -11268, -11013, -2638, 12954, 24305, 19127, 2169, -8114, 1204, 20032, 26673, 12850, -8264, -18581, -14666, -5581, -1028, -2057, -6920, -14349, -20909, -18179, -2674, 16027, 20916, 8075, -7585, -7459, 9962, 26717, 26322, 10745, -5596, -11105, -7672, -1869, 1504, 610, -6603, -18533, -25628, -18757, -455, 13728, 11339, -2949, -11251, -3371, 13389, 24070, 21348, 10670, 1315, -2985, -2443, 1057, 4983, 4241, -5493, -19092, -24888, -16556, -1483, 6127, 1369, -8176, -10278, -2116, 9792, 16751, 17282, 13213, 7293, 1913, 318, 4327, 9147, 7527, -3268, -15780, -20444, -14186, -4359, -791, -4502, -9862, -10539, -5632, 2245, 10267, 15356, 14633, 8940]
943H940n943p17N937N650k149j0516j1513n079L109O145L067k123m945l853J492
958a2498P695J0663P262n98o059n021K023P496O284j509r049j1309o426J219N523
973d304L425k742p823o396R44Q378J0670O020j122n175k436L871Q011O652j36
988A7837p774r945n812J531N176J685m899r301o473J023O892P428M039r10k759
1003b262r61L795P896P376J775n676q229m066J880M137r2n721p697n342j207K565
1019a1829M614L897J341k679k384K233Q000R145L005l854n828k357J597K752J78
1034G831k952n276o429n170j302M233N939J278m897n190J235Q903R581M161k560
1049I385l866j583P68K759K880P62m380r321q485j131O635O351j436r000o787
$$ y = [8940, 2997, 2280, 8217, 13867, 11718, 1202, -10311, -15390, -12281, -6136, -3069, -5192, -10137, -13990, -12498, -4803, 5860, 13122, 12524, 6465, 1444, 3467, 10963, 17247, 15738, 6689, -4620, -11046, -9827, -4304, -879, -3621, -11444, -17840, -16896, -8518, 2152, 8172, 7050, 1875, -561, 3310, 11321, 17973, 17837, 10063, 118, -5694, -4163, 1013, 2698, -2201, -11502, -17975, -16952, -10060, -2632, 1407, 497, -2262, -3223, 572, 8468, 15844, 17619, 11943, 3714, -352, 1528, 5665, 5573, -148, -7845, -13187, -14394, -11829, -7215, -3318, -1977, -4656, -7040, -4807, 3193, 12338, 15343, 11489, 5661, 3304, 4901, 7653, 7831, 4879, -397, -6826, -11996, -13298, -9065, -3126, -1848, -6745, -11935, -10700, -1797, 7784, 11945, 9385, 5519, 3936, 4704, 7463, 10343, 11105, 6725, -2596, -11081, -12212, -5577, 774, -662, -9662, -16449]
1064a6449K277R420Q872L516j568l144j882R26N229O980K464o440j2292p936K778
1079g249Q842M191o378j0994o266L395Q571P145K350j457l458k539K551Q494R152
1094A6350J489r031j1584l425O545P841n31r008r652l400K966N322M531J698j666
1109a555m133j837M378J0131P883j282q766o871J860O997M013l943p625n845j912
1124h507N12K251K384J440k231m326j511N636R189N061k356n486j639L820M360
1139H597L42k919l071k988l275k679Q0K951J688k510n079j337M151O531L399q39
1155C042j383R03J703O37M67J381J341k452n876m796L52L911J909l273n539k379
1171a0052K128M511K818J817P93k90j587l06L749N666K081m005p656m148K445
$$ y = [-16449, -14172, -4752, 4120, 7636, 6068, 2924, 1042, 1968, 7197, 14177, 16641, 10201, -2091, -10027, -7249, 1593, 5784, -594, -11588, -17854, -14459, -5888, 1257, 3607, 2150, -1308, -3847, -1296, 7198, 16350, 17839, 8808, -2776, -6201, 344, 8185, 7654, -1354, -11006, -14406, -11440, -6118, -1587, 111, -1555, -5688, -7525, -3147, 6984, 14867, 13585, 4819, -2052, -192, 6805, 10818, 6875, -750, -6595, -8507, -7995, -5744, -3360, -1920, -4151, -8477, -9988, -4352, 4837, 9898, 7542, 2056, 417, 4237, 8597, 8939, 6020, 2949, -39, -3314, -5993, -5913, -2962, -1274, -3784, -8863, -10200, -6049, 482, 3881, 3042, 1659, 2562, 4265, 4902, 5369, 6750, 8091, 5639, -237, -5033, -4681, -770, 1139, -2134, -7673, -10052, -7924, -3413, -595, 1222, 2015, 1725, 138, -168, 3581, 9247, 11328, 7323, -333, -4481, -2036]
1186b036N152J174m415o014l586P87L300M360K891k22l473l054J575P057P217
1201A0713P47o138p109j144M388M907J87n019o039l663N5L197M537K149k666m881
1217e779k422L693P997N983j025o029m346R96M980L626n99m418n090l631O0K984
1233c020L667N67l795n035j046M523O716L595j621m178k205J860L941L108ol106
1249C965m351l546m4K880K796n27l899m535q57L435M846L200q57k636j556Q85
1265h01L147L446J326j846l795l630n81K336K719l8l509m353k138K067M118L446
1281A914J45k522k297J54L224M063K211j040l489l504r65K357L539N02l823n385
1297d916k772J619M709L327n10l360k803O17L605M228K612o40l642l514q36L641
$$ y = [-2036, 3116, 4290, -125, -6139, -9725, -8938, -5638, -1278, 1613, 1391, -2082, -5136, -3561, 3496, 10713, 11460, 5322, -1787, -2931, 1457, 6364, 6551, 1532, -4507, -8170, -8115, -4918, -381, 1768, -898, -5779, -8201, -4508, 3489, 9472, 8447, 2418, -1928, -932, 4048, 7674, 7075, 2657, -2433, -6064, -6004, -3020, 647, 1214, -2581, -7616, -8662, -4139, 2577, 6172, 4551, 373, -1832, 28, 3969, 7077, 7071, 3965, -386, -3932, -3976, -1096, 1700, 1173, -2726, -7261, -8118, -4683, 163, 3363, 2506, -130, -1686, -801, 2346, 5792, 7118, 5272, 1477, -2153, -2734, -398, 2321, 2283, -1226, -5579, -7717, -5650, -1532, 1914, 2059, -463, -2760, -2606, 618, 4681, 6892, 5852, 2363, -1141, -2106, 251, 3790, 4292, 469, -4916, -7688, -6069, -1360, 1967, 1457, -1903, -4706, -4089, -484, 3744, 6356, 5716, 2074, -1440, -2276, 1365]
1313A365M311O18m583o214k766K664M568K206j890l527k054P50K834L951K909
1328E142k53l449l743O56M507M198m34n376m877r56K579K930j68j903k051j295
1344d493k84J578L674L069o0l405k718J731M461L046j713l733k440M65Q91K5m07
1361c13on88k289k166P79L864L192l51l333j464K086L331J434q23r98l27r25j788
1379f85r61J740K284o76m229l940J078M257L327j050k663j171J344J638J251J604
1395C148J443o80l486l443J100M779K956k923o197l424K272M525K034j388k265
1410a549j320R3O15K736L745J500l104n212j758M199O056J016n329n945j505L103
1426b659L598J193j413j923k208j278J465M564M178k61n251m906J233O190M803
$$ y = [1365, 5676, 6294, 1711, -4503, -7269, -4605, -37, 2169, 279, -3248, -5302, -4552, -1718, 2233, 5142, 4889, 1440, -2303, -1647, 2860, 7058, 6624, 1248, -3629, -4585, -2006, 924, 756, -1147, -3198, -4493, -4777, -3199, 475, 3544, 3484, 79, -2639, -908, 3553, 6599, 4886, 1153, -1287, -822, 69, 94, -313, -319, -907, -3196, -5362, -4583, -719, 2473, 2122, -1211, -2675, -589, 2742, 4176, 3353, 2355, 2028, 1103, -685, -1646, 94, 2378, 1702, -2527, -6467, -5389, -1132, 2195, 1145, -1518, -2689, -1345, 293, 1544, 3148, 4591, 3911, 425, -3018, -1918, 2861, 5817, 2894, -3303, -6727, -4455, 70, 2104, 716, -1549, -2869, -2776, -2161, 575, 4320, 5820, 2716, -2496, -4254, -55, 6001, 7017, 1688, -4257, -5762, -2659, 939, 2132, 719, -1204, -3412, -4690, -3225, 1339, 5517, 5256, 5, -4901, -3668, 2522, 7325]
1441G325j607n697m123N06K998K274L37r99k129k895j231K557N149K744k848n283
1457b922k046L693N611J558l089l872j247J239J612M81N06l47k088k977m85L181
1473a192L977N58l645l388N89L996K635m58k523q58L81K20m20K11J119N58k121
1490c61k940pK729K386n27k731q38J736J627r1o91K38J322J9j971j579J168K377
1508A866M29k300k441%J647J135n27l51L21N06j084p83J227K692J451k228l295
1525a735q02K672K854j07k608k172k44P66P59Q49P00j44j817k193N40L384L314
1542D016m74l614k733Q45L406K303r04k798j747n35M88J244J703P78j953l112
1558c087j366K510M412J713k178l715j375K108L144J297j010j964j701o47L65
$$ y = [7325, 5718, 21, -4102, -3596, -598, 1676, 2013, 1014, -1115, -4010, -5241, -2684, 2465, 5209, 2361, -2922, -4968, -1275, 4336, 5894, 2805, -1067, -2314, -1075, 537, 1018, 1524, 1177, -911, -3888, -4373, -1192, 2785, 3343, -302, -3690, -3101, 895, 3530, 3072, 549, -309, 72, 292, -128, 83, 1202, 1760, -361, -3301, -3308, -579, 1807, 1280, -1451, -2289, -553, 1074, 983, 292, 530, 1852, 1871, -100, -1679, -511, 1866, 2295, -5, -2446, -2446, -799, 336, -191, -542, -221, 285, -799, -1582, -355, 2337, 3788, 1560, -1735, -2537, 135, 2989, 2882, 274, -1898, -2142, -1376, -617, 232, 932, 788, -1029, -3222, -2682, 702, 4016, 3542, -72, -2805, -1960, 1446, 3749, 2845, 47, -1700, -2235, -1747, -503, 1200, 1978, 25, -3087, -4453, -1943, 2469, 4182, 2004, -1711, -3086, -978, 2166, 3463, 2453, 489, -1212, -1859, -1494]
1573a494J765K031l47k756l160Q2L290L070L14k873k298M91J954J862N76l73j367
1590G67j655q79P98K154J411j290k982j927J134K862J302p16j723j233K93J287
1606c97J428R73m6r24j729m73J157J880N70j400k491q59Q29J460Q17m86q63q15
1624a369o9K50J259J260N32j236j227l17J173J625K96r83j536r98K56O81P98L7
1642D32n31j138q08K39J398J616J64j143j152M6R03J350M77k73j206j032l70P36
1660b92J095M26r01j434q74K2J367J266J12p71j023l41Q89J472J002j6j416j156
1678e73k82J003J131K40j012j296j017L40Q54J114O9o03j187n75O77J674J218
1695A775l12j092j098J84Q61J163On47r97r10m05P29R03O26p45j463q90Q58J711
$$ y = [-1494, 271, 2302, 1955, -801, -3961, -3879, -589, 2481, 2795, -78, -2376, -1885, 69, 1931, 2507, 2134, 767, -888, -1767, -969, 1185, 2596, 1306, -1676, -3603, -2469, 393, 1695, 979, -744, -1977, -1684, -397, 1031, 2004, 1958, 1034, -695, -1168, -11, 1869, 2439, 1039, -1452, -2311, -1482, -22, 795, 309, -554, -1369, -1438, -1188, 71, 1331, 1863, 627, -600, -917, 256, 1881, 2177, 1194, -342, -1340, -1084, -403, 395, 432, -99, -1237, -2045, -1806, -408, 1208, 1372, 229, -923, -877, 26, 1376, 1853, 1580, 374, -658, -1028, -292, 803, 1229, 328, -1106, -1980, -1958, -591, 675, 787, 16, -1007, -1348, -459, 1013, 2015, 1999, 583, -573, -855, 148, 1279, 1519, 507, -789, -1806, -1466, -612, 502, 571, -32, -1219, -1794, -1117, 557, 1775, 1463, 371, -727, -543, 318, 1481, 1487, 940, -57, -967, -1372, -643, 260, 886, 141, -1322, -2212, -1354, 357]
1714C57R62j55j037q80lQ91Q05O87J53j336j513m12Q76J597M27j154j890q91R64
1733a552J644J009k06p24r98l33N93J353J461Kj731j790k92J640J813M9j629j914
1751a605k81N66J469O31np95j284o97R28K135J512o88k331j453P52K118J195n28
1769A639j646j173j81P08P02P70p5j065j327m01J189J994Q42j269j719o94J442
1786b64J683P04q29j401m90p1K47P54O59k89j310j338R3J391J692O5j371j265
1804a340L88J135Q61m8j86l29l41l16j82O63Q26m39j171r44J23J185Q44n22q32
1823f25j05M07L95m0k0P03J71n70p70r6J037P06j29j290o65P1O36J87j22j0L2
1844i7k17n54L2P28J191L26j074j291K7J279J038l41q92n78o5j42K76N38N43m87
$$ y = [357, 1319, 1164, 127, -753, -756, 135, 940, 1627, 1780, 444, -1069, -1481, -605, 992, 1419, 265, -1625, -2516, -1552, 92, 1101, 895, 171, -827, -1160, -567, 786, 2247, 2249, 518, -1272, -1564, 76, 1889, 1938, 309, -1605, -1886, -1320, 149, 780, 775, -20, -1304, -2001, -1073, 1062, 2574, 1886, -445, -1898, -1146, 972, 2167, 1639, -7, -1180, -1361, -653, 49, 819, 744, -321, -1648, -2049, -860, 1134, 1976, 707, -1012, -1706, -264, 1419, 2123, 1294, -107, -597, -668, -421, 333, 992, 703, -607, -1945, -1852, -461, 1231, 1296, -75, -1340, -952, 183, 1044, 996, 810, 481, 140, -176, -358, 305, 1131, 692, -479, -1423, -1300, -115, 729, 207, -625, -730, -323, 72, 32, 12, 715, 886, 316, -454, -550, 487, 1193, 1064, -226, -891, -820, -184, 3, -119, -129, -97, -314, -868, -836, -108, 1083, 1409, 335, -956, -929, 350, 1388, 1047, 155, -423, -488, -630, -354, 184, 727, 240]
1864B40j081p38N76J476J311n96j744o07O17J078Q55l32m61j004m27jQ05R32J08
1883A007r17j480n06J239J759L34r05j334l77Q38R93N08j06o03r18m48K07J065
1901C56P01l53j279j203K90J340J127k04q95o60J60P73M79M29j37m87q30m04M34
1920c63R28N55o85j019q82M52J159L17j79m31n08P5M45M73N66n2k40p40l02N59
1940A28N72J83o55p29m38L94L78J69p1n1j54l34K12L65P96J91n40n00k31L46O92
1961G23J17l68m55o76l1K76M60K37j85o79k47M8N26Q39K55n27m37m23M21P51L94
1982A019k92p34n34r4N52K97K02k16p38m39K40M46J045J05p99n57k35P03O78K98
2002I47m16p57l31mO45K23J73n41n22j94N3N43Q28k36n43m89J59N65Q06j82n50
$$ y = [240, -841, -1579, -1003, 473, 1784, 1188, -556, -1163, -546, 532, 1387, 1055, 594, -410, -837, -838, -33, 899, 1007, 90, -1390, -1896, -657, 1102, 1436, 531, -803, -1180, -342, 651, 1159, 1053, 450, -468, -916, -709, 356, 1057, 704, -575, -1778, -1488, -148, 979, 775, -120, -780, -620, 153, 632, 1061, 924, 437, -393, -797, -363, 565, 1120, 435, -584, -1466, -1014, 145, 462, 283, -148, -656, -581, -136, 337, 903, 851, 611, -129, -431, 128, 700, 883, 228, -501, -939, -545, -167, 2, -69, -120, -274, -608, -396, -31, 765, 956, 416, -84, -315, 31, 723, 840, 472, 17, -659, -690, -414, 46, 283, 98, -581, -828, -780, -254, 585, 840, 313, -124, -547, -126, 625, 1019, 727, -7, -541, -635, -83, 214, 416, 200, -538, -977, -737, -291, 754, 859, 60, -497, -732, -29, 649, 947, 531, -226, -557, -561, 84, 307, 480, -61, -583, -777, -724, -181, 647, 411, -132, -621, -462, 103, 909, 727, 177]
2023A77k91j33K09K58Q7K09l44o68n7n8N06M54q8n18m79M22L06L21J52j91j69
2044A05P0n66K64K58L48j45n02n27J66O08K28j64l33l34K35K98j91L26J85r8j31
2065A00m85K2N79L61k24o10m79J92M66L04L5k27j80k05j36K29P16L42m19p12n26
2086h57P08P37L10m23q30j14j80N67L93N0M9n88n54J72N17P87L49j047o32p0O48
2107hR13o4o14p84K8J78L99J42J38j13p69j95Q5R82P52m52p84m70M63P31K28k95
2129D91n68m96L18J1J04L82K21o00p06M3O38Q14J08n88r05R4P87L29Jl18j21k12
2151a73M8j46J98K91r9l68n11J84M96O31k83n77nK31M53j33o0j79K51N5l76j90
2173b62K63K21j51m61j28L15J48J24k52q3L84J34o2k76J9L63J65k74m59J66J40
$$ y = [177, -114, -247, -38, 220, 307, 516, 172, -496, -553, -611, -105, 349, 261, -257, -736, -314, -8, 313, 465, 274, 105, 175, -391, -127, 131, 479, 334, -168, -695, -529, 79, 307, 143, -190, -524, -289, 9, -182, 144, 329, 231, 100, -385, -363, 216, 577, 353, -257, -736, -544, -78, 226, 261, 34, -146, -351, -487, -258, 458, 800, 381, -331, -857, -149, 588, 898, 475, -355, -469, -649, -82, 311, 361, 410, -178, -732, -560, -43, 744, 1093, 46, -586, -656, -8, 905, 841, 227, -557, -529, -351, 48, 190, 328, 215, -554, -749, -664, 318, 1070, 618, -166, -636, -173, 558, 786, 491, -77, -573, -255, -244, -140, 242, 463, -137, -843, -800, -162, 652, 760, 172, -733, -639, 148, 477, 478, 160, 39, -173, -125, -271, -73, 218, 119, -249, -760, -576, -80, 551, 268, -309, -314, -83, 370, 237, 177, -2, 249, 304, -72, -262, 1, 222, 71, -390, -518, -203, -55, 69, -183, -266, 118, 252, 190, -86, -67, 296, 461, 187, -272, -106, 34]
2194C4K93j35l94p9J59k22k2K00L10K33k47m95JM63O31n9n75j68k93N08K21m7
2216C17j33l46j03k31L29K29M10l57p05l10O66N85L60k44n25j12J42M14K10j58
2236D38l26l99j47j29O27L52j15l43o88OO69N59J04m23n13p3M27K56K05pl55j10
2258A5m39P6M36L77k42n96l52L53M18J32j00l25K6jK21L19O3n3m8m99L2J38L53
2281C04K9k48m71p9K47J68J66l17J39q5L5m9J75M01j26j46j33j49J49L52q9k82
2303ij01j11J17J18o9Q6j43j92k4jL28K77R1l31r0Q1K09j37J04kj35k00j04J38
2327a00J96J01j40j80j83K02K65K32j83k82l5n9O9M54j15j1j48j86j8L19n3Q4
2349B29k22m06J73k5J90K43o6l03J11r0P4K54J94r9j93l9p8K82M0K1k94j50j78
$$ y = [34, 327, 192, -202, -281, -122, -344, -366, -166, 144, 377, 130, -365, -364, 99, 730, 671, 96, -72, -365, 143, 364, 317, 184, -162, -265, -496, -167, 62, 472, 115, -590, -900, -234, 351, 711, 467, -58, -170, -28, 386, 596, 438, 112, -287, -434, -563, 64, 416, 301, -42, -730, -724, -55, 504, 608, 185, -328, -401, 26, 282, 487, 480, 125, 15, -424, -348, 88, 465, 223, -373, -725, -372, 46, 178, 78, -247, -221, -222, -1, 318, 381, 328, 280, -219, -187, -49, 304, 333, 85, -386, -465, -218, -50, 116, -201, -62, -147, -112, -161, 14, 415, 289, 143, 10, -139, 10, 362, 273, -9, -110, -221, -104, 14, -55, 31, -112, -304, -328, -329, -1, 276, 367, 36, -54, 27, 236, 99, 203, 201, 66, -134, -238, -100, 96, 197, 57, -123, -306, -104, 161, 393, 210, -72, -107, -166, -97, 357, 242, 231, 83, -103, -121, 198, 145, 229, 7, -399, -226, -251, -61, 182, 116, -187, -76, -166, -92, 162, 356, 257, 64, 25, -53, 229, 269, 290, -4, -154, -332]
2372c32O1K58J60k81L8l71K10K79L47j16q4k59M4L2K01J1n7j37P2j69j81J99J78
2395A03J74l25k93K4L0M78j06R7j53m17M97k53L29J50o3m07q3K7K96L36k63k56
2417g8j95l4K29K38q5M9o9k39j47J75N97N1k76m13k64M06L34J08k62m24J2N1J56
2440h0M6K94j52r9n04J07M02M87k20k40n09L3M50K28J85j81l58j4j02N2L21K88
2462D34k06o44k40J77N80K65k91l75K6K87K09R1ok75J1j4j31J13K33M4k51n45
2484e08P4K87L61O6m62j83Q6L67J12j29R9O8o3j90j05K40K19l3l34j87K3J80j9
2507c1n0m24L19K54ok51K0L50J98L9l83j46J31K97k0l49j9q1k0r2n4K12J86j7
2531F3l59k41N5P18J96j34l88j8J96R1J01n7j19J44n69o6K99M32k00k71m07j94
$$ y = [-332, -271, -13, 147, -134, -96, -467, -257, 22, 369, 253, 169, -90, -46, -14, 187, 198, 141, 4, 76, -93, -274, -75, 103, 277, -48, -341, -317, -287, 191, 85, 182, 29, -388, 109, -144, 185, 335, 272, -135, -218, -191, 105, 441, 178, -78, -273, -307, -78, 160, 75, 124, 55, -184, -331, -156, 441, 492, 216, -197, -461, -55, 279, 387, 125, -299, -287, -236, -80, -34, 260, 108, 9, -495, -388, 14, 501, 281, 41, -468, -435, 15, 243, 428, 247, -111, -125, -227, -175, 146, 434, 228, -416, -656, -479, 101, 366, 75, -300, -274, 13, 222, 313, 307, 32, 43, 29, -102, 11, 244, 288, 37, -508, -434, -147, 214, 280, -182, -365, -279, 88, 200, 71, 170, 238, 175, -15, -120, 120, 339, 306, -28, -215, -192, -12, -31, -81, -505, -186, 68, 62, -189, -169, 181, 379, 418, 35, -111, 20, 317, 297, -52, -71, -152, -172, -264, -318, -106, 80, 63, -296, -537, -482, 236, 432, 298, -90, -108, 88, 179, 280, 223, 104, 248, -321, -387, -88, 344, 144, -127, -534, -728]
2553g28O27M81Qm40k63K35J51J45L4J19r8k16l41R4M28K20j33p02k67J67N86p9
2575B8O5k25l13L51K65J62J57j44qm12j23K95M84O3p17n60J11M29L61j98j32m26
2597d87K6J50J62J90L30j52k76j40J24M26J79k52k92l43J31L15j53k7j12O5k17
2618c53R2m7L39K71l16r6J5Q1L84p4O4l46o9Pq9J8m8J73k4p5l20P8K53J25J77
2643B20k36j71K58J20J79o6Lk63n8p6K65j19j71J68m23j38J72L74K11J4l51P9
2665ik03M81kJ69Rm34N6j49l2L65j4l39j40k26K29L12J4j82k01K3J0M24R2nJ14
2690C62l07n5L7J86J83l45Jl42K6J13j50M02k74L4o3J2K14J74Q7r2m1j54lJ12
2714A17O6J3l40J7j45K04OJ03j64j05j44J24K19Q0pK44r8k21q3K30J89N8j73l58
$$ y = [-728, -101, 380, 388, -52, -315, -80, 71, 216, 250, 369, 271, 55, -286, -192, 236, 456, 323, -379, -646, -479, 107, 28, 93, -132, -445, -94, 171, 333, 490, 346, 338, -74, -197, 98, 582, 645, -72, -632, -521, -92, 269, 71, -61, -487, -461, -311, -149, 41, 371, 219, -57, -197, -73, 353, 532, 280, -12, -355, -224, 91, -62, -89, -201, -136, -353, -261, -308, 31, 302, -14, -110, -95, -14, 370, 296, 360, 14, -55, -48, -137, -119, -167, 6, -18, -93, -413, -335, -82, 43, 220, -16, -187, 71, 191, 370, 304, 307, 44, -14, -90, 175, 56, -115, 53, -370, -508, -336, 38, 249, 263, -88, -9, -212, 269, 267, 436, 445, 11, 67, -82, -114, 251, 237, -102, -242, -468, -239, 73, 87, -95, -296, -273, -263, 161, 253, 248, 362, 55, 0, 37, 223, 406, 61, 62, -280, -254, -141, -291, 111, -163, -129, -192, -180, 34, 208, 295, 203, 162, 8, 5, 117, 183, 196, -144, -127, -272, -68, -62, 41, -123, -228, -372, -248, -29, 51, 44, 288, 190, -31, -114, 116, 305, 363, 190, -168]
2738a68P8o3j37L53j78j51K30j80L2M8K42L69l27o9l17K71N07j25j56m24k7Q2
2760a10q5K51J44m31o9r2M0N18J05K25n56k96J90L11M39j71l23l25N4K15K7J07
2782A68N9l02k71j76j73Q96K12m86k62o4L53O12P9k85m22N8Q0J23q1K72j20l64
2804i4n45R2M81L08J23q79k5K55M91m0J05k36q8J29J18k04K94N2r4m58k34Q9M84
2827A24J11m42k01J6K53K35j15l1K47j18J10p5j91K54K26k65l02%L14Q8l10k74
2849c46rK67K71k44m55K10K23M60l10m8L9Q2J28j01j47N3P3j79k2k38J97L56m09
2872a49m25J79L65K51O7k78j27J30J00N7K09r9q1p4l98J21L32K75m3p18l10K04
2894d12N80J20k79m55J8K60K70K95l2r1j82k57q5L51M13J12o26o87J65N07M52
$$ y = [-168, -90, -153, -290, 63, -115, -266, -36, -216, -184, -136, 106, 475, 148, 79, -238, 33, 540, 415, 259, -165, -192, -110, -195, 56, 200, -231, -300, -392, -352, 166, 271, 496, -60, -356, -166, 145, 584, 413, 90, -235, -181, 34, 61, 168, 227, -75, -346, -522, -695, 201, 413, -73, -335, -399, -46, 566, 645, 360, -62, -4, 76, 199, 118, 390, 270, -94, -639, -547, -66, 242, 365, -514, -539, -284, 207, 167, 272, 36, -52, 77, 195, -9, 285, 337, 243, -215, -449, -360, 124, 235, -207, -408, -392, -139, 96, -19, -50, 197, 79, 189, 114, -77, 177, 403, 138, -164, -164, 150, 238, -72, -346, -355, -88, 183, -61, -516, -306, -83, 377, 67, 19, 58, 140, 268, 167, 20, 73, 146, -33, -55, -293, -96, 260, -149, -574, -395, -30, 221, 288, 10, -117, 13, 113, 170, 379, 280, 199, 125, -273, -152, 180, 455, 412, -306, -616, -412, 168, 288, 9, -446, -428, -168, 102, 397, 365, 274, 92, -165, -250, 101, 514, 626, 0, -687, -522, -15, 437]
2915D37j90m86j32J96K96N5L3K9r6l19k52M49K60J75l10l09l20J63N85k3k64k63
2937b86k02L28N8J65J05K10l37j04j27L52L56M7n10l51o2N50J32k91k18r6P3J46
2959f2O4q7m3J44P4m29M07L20l1j2l37j07J65K24k29k55j33K23K98m15j86L18
2981h9J62J36l86Q9QL11p1q7j26K43O1k44q8j81J99K96j53k83m0J83R6j52R5J15
3005I4m7k33J52P2Q2J87j75m64O0K10L33q1k32k72q3L61J92j69k12J07l9J1n6
3028b02M05K80j87k36j80J1L65J77k37l88j84L31J6O4KO9j49l16q8M71K01J8m9
3051A94m64J60J20M02J5k53l60q2K27K9K57k71M0l0m8k12L21M9K48l40k44R1M17
3074B66M7j03j76k6J02j52R4Q5m6j20j02k4J17J60j6Pk6j88j86M96k5k10k4J13
$$ y = [437, 247, -239, -371, -175, 121, 176, 209, 238, 142, -177, -429, 20, 280, 455, 145, -164, -484, -321, 264, 241, -23, -286, -488, -160, -102, 63, 168, 378, 41, -63, -190, 162, 518, 565, 55, -296, -358, 192, 324, 33, -185, -281, -208, -62, 2, -85, -128, 16, 90, -339, 68, 388, 357, 345, 8, -99, 66, 290, 61, -194, -327, -104, 194, -221, -407, -89, 73, 209, -177, -88, -80, 231, 160, 73, -53, 190, 251, 7, -81, -262, -63, 233, 80, -203, -243, -60, 36, -116, -21, 94, 47, -186, -34, 38, 120, 307, 132, -332, -272, -62, 271, 190, -42, -314, -397, -36, 156, -13, -225, -118, -157, -146, -202, 203, 483, 296, 60, -120, -109, 256, 433, 196, -192, -376, -45, -29, 35, 37, 106, -43, -359, -447, 24, 225, 243, 194, -270, -110, 10, 412, 427, 174, -186, -268, -41, -12, 245, -26, 14, -16, -64, -276, 45, 94, 342, 2, -242, -151, 266, 313, 210, 34, 8, 110, -42, 52, 137, 91, -29, -131, -155, -38, 122, 106, 113, 87, -101, -287, 209, 184, -26, -50, 63]
3098F3K5j73P3M0J13p3k18j62K25k2L22%k43n8PL9K44j24J39k31J06j22J50J86
3122C06l10J45j93j02N9l8K51q4p3l9j45Q8J66l6J49q1N1l46L00J86J5j82k4j65
3146a02P4oJ24j37p2J2j67K96n0J69Q5l82o4l3L50M8M9J07k40j87K43Q7L8j73
3170F9j49j57n0%L05Jj65J74k71R4J58J70K41m12j0J69k05L44j36N6k05j87j16
3193b82K55L0K9j12k07o4J94K03j52K16j9j01J24j6N4p4J28M1k01j33P7qj25O2
3217h1k25Q5J14j49%K64%QN6j02Q1K83P5j25j40k88n2J52J54j92k25Q8o3Q3M6
3242a53J90k12Q2j51O3L13J68N6J3k66n6J55j5m2nk59q3n6P2o5J61J73k86j40
3266c43K23J26J76nM9j68M7P8K9P1o7l63j22J18Q5J4k7n6j27l1Q9P8L0J94J5L
$$ y = [63, 88, -85, -12, 28, 141, 68, -150, -312, -87, -109, 213, 213, -30, -88, -81, -42, 202, 78, 217, -14, 92, -30, 120, 306, -4, 141, -52, -154, -95, -133, 118, 34, -39, -78, -223, -135, 31, -5, 144, 63, 114, -232, 68, 254, 269, 87, 63, -102, -28, -34, 90, -47, -119, -107, -274, 22, -28, 141, 226, -156, -220, -253, 97, 145, 194, 301, 61, -126, 117, 204, 242, 69, -80, -237, -287, -287, 18, 19, -146, 28, -243, -149, 9, 179, 420, 8, -2, 167, -38, 306, 170, 226, 21, -166, -282, -27, 3, 32, -80, -287, -351, -157, 46, -106, 110, 91, -10, 114, 98, 152, 78, 206, 247, 46, -87, -10, -18, -143, -81, -306, -221, -107, -256, -256, 8, 8, 16, 72, -30, 51, 334, 409, 284, 144, -144, -196, -44, 110, -82, -307, -219, -282, -199, -153, 37, -175, -93, -244, -181, 132, 300, 356, 369, 103, 47, 202, 187, 145, 140, -119, -202, -258, -186, -251, -90, 83, -203, -343, -120, 6, 182, 177, 226, 58, 105, 183, 212, 283, 216, -147, -269, -151, -66, -52, -79, -135, -262, -293, -204, -126, -96, 98, 113, 116]
3292A16r9P7J20R5o0j45j53j32K66j93J32j95j19rQ6oK30J5kQ1k31J98J16J26
3316C14P0k30j88O2K3k6n6N6l56jm3L92j92J44P2k38O3M4L05M8j35J31l25qL29
3341B55j05P0j60j46q8L4m9Q6K07o0j57k04L86K32r0n3k4R9J22k69L4k45Q8n3
3365i0j90NJ69J00j58j48N5R0K63J00k69oJ66J02m4O5j18K41q0j25m7j77K4R9
3389B7j85n9p3J18J43j13NJ91J18O7k50j15J11N14k12n8j40m1N3j74Q1po5n6r0
3414b10l10K66L38N6Pl36J9M22O7L1p6j88P3k30J52j38J54j32l5m09P6K03M93
3437B93j02n21q1L07L33J44m7j52k25J64K4J6K31k43k25l09O1P4M26j0k55m09
3459e06J70L34J83J05k50N5n9N7Q7j72M66k05l22k38J0L54J34k33l58n1J63L96
$$ y = [116, 17, 94, 214, 309, 249, 104, -49, -181, 85, -108, 24, -171, -290, -299, -213, -219, 11, 26, 24, 105, -126, 72, 188, 314, 384, 154, -34, 28, 51, 25, -31, 25, -331, -332, -375, 17, -175, -31, 41, -197, -134, -90, 215, 263, 128, 259, -66, -74, 255, 150, 220, 60, -86, -174, -140, -189, -103, 104, 44, -113, -317, 69, 301, 211, 158, 134, 233, 355, 86, 120, -125, -37, -90, -280, -275, -106, -6, -164, -312, -257, -167, 96, 196, -73, -79, 87, 189, 145, 210, 92, 333, 253, 128, 81, -96, -72, 27, -158, -217, -290, -172, -29, -142, -137, 54, 172, 239, -11, -126, -15, 499, 287, 229, 89, 48, 101, -73, 8, 1, -64, -120, -210, -520, -254, 84, 140, 147, -189, -170, 252, 319, 350, 274, 86, 159, -71, 81, -57, 97, -35, -70, -479, -403, -200, 293, 191, -330, -411, -104, 229, 373, 326, 174, -51, 113, 137, 153, 384, 141, -84, -393, -332, -258, 168, 158, -97, -506, -336, -2, 181, 286, 36, 91, 32, 89, 176, 4, 470, 265, -57, -295, -285, 69, 203, -30, -388, -439, -276, 120]
3481A20M5k08N6N7J62o1k0J57jj18m64J71K01N7j11k79j26K03K45j03k13j3J93
3504e0K45j28M1M4K12k6k21q7K95j42j8k31k14J76J84Jl10r7J07K65n2j11K12
3527I5r2J06J23k26P2J80J21k53l60J02L05J91l53k77j72L66K0M6r9K9N2J23M9
3550A48j7J23O5j05l60K05J09J21j39m20j02K82J93j6l44j7J02M9o9J34L01j43
3572A00K3k82j4L99K05n6m05l13J25L07o9M5l71j75K65m2J91K62k0j0j63j19M4
3595g3L68J82k67l65j21L12K14k66p5O3j12P0r3R6N1J32j23j13Q1J70K07p4l17
3618e3j91K22L30j74j11j21ON0l2j08J47J16j12l1j63J55K69j74k8q0J48K64k19
3641A10k40L32j15J19k77Mj35L76k22k51J38N4J40j64K19k07P2K82o2j19j84L5
$$ y = [120, 165, -43, 13, 70, 232, 171, 151, 308, 307, 189, -275, -104, 97, 154, 43, -236, -362, -159, 86, -17, -230, -243, -50, 195, 67, 108, 152, 364, 338, 117, 30, 325, 183, 165, -66, -280, -104, 80, 81, -229, -326, -219, 46, -6, -117, 95, 3, 109, 232, 6, 78, 258, 379, 126, -234, -132, 173, 364, 11, -266, -438, -72, -52, -6, -105, -76, -24, 99, 148, 131, 254, 319, 214, -146, 59, 168, 289, 150, -270, -372, -90, 103, 87, -257, -274, -172, -123, -192, -58, 243, 100, 123, -159, -173, 226, 431, 375, -30, -343, -218, 89, 20, 65, -306, -481, -216, -258, -67, 195, 175, 165, 2, -117, -73, 295, 477, 210, -155, -276, 36, 250, -16, -91, -28, -140, -70, -163, -67, -16, 116, -7, -120, -39, 131, 338, 264, -53, -244, -22, 308, 134, 23, -98, -92, -42, -74, -182, -35, 81, -31, -62, -225, -70, 199, 25, -3, -83, 65, 329, 110, -130, 202, 87, 206, -71, -67, -202, 174, -48, -299, -161, -107, 33, -131, 88, -119, -47, 235, 173, 54, -130, -95]
3663i5J90Pj24K6k11J20J97k74J61J42k66mj61J64J62K68k48j38o8K96Q1J24k96
3686E3j74J2K8K14l68K02M5j59J16L5o4L14k38k34j34K99L34r9n4l2j36J93j88
3709c5j08K44j33q4J41j05l7J41J18j49q2o0K02J63J04j90k61L7M4K10j02k3r9
3732f4m6j74K06k4K86l1j93o9J26N2L1m2m3J64j40P3k24K98j52J7k04K1Q3Q2k3
3757A0l5j55J01J30j40J69j42N6L3n3J53r6Q5j88J31j17k0j0j6K8j25K11k12R5
3781a07J0K54k36j8J33L2mq8J38M2n6j03j23K00n4r5kj3J42j44N6j37K40p1r5
3806i9m8K88oL5m6p9M0j16nJ15j01Pp4o2Q7j08K04q3N1Q9j04M3m8J03n8p4J4J1
3834b4J77q0j42k0J64k67J36J77n8p5J6r7PP6RK64j58j43J43q1L3J4N4n6j74J07
$$ y = [-95, 95, 102, -22, 4, -207, -87, 110, -164, -3, 139, -127, -131, -292, -128, 34, 302, 54, -84, -152, 144, 225, 349, 53, -121, -109, -81, 133, -235, -33, 12, -147, -31, 4, -60, 254, 16, -218, -352, -53, 281, 182, 128, 96, -40, 153, -35, -143, 101, -32, -116, 25, -80, -117, 24, 142, -7, -89, -149, 53, 216, 320, 130, -131, -94, -50, 160, 58, 35, -64, -110, -284, -78, -102, 184, 153, -40, -109, 17, 69, 100, 58, 15, 179, 39, 112, -112, 186, 34, 51, -153, -132, -49, 33, 10, -25, -180, -79, 51, -89, 80, -62, -6, 27, -26, 127, 31, 116, -72, 59, -58, -78, -88, -104, -76, -201, 10, -202, -107, -97, 157, -79, -97, 36, 68, 64, -24, 114, 156, 100, -3, -126, 74, 20, -75, -77, -90, 52, -92, -36, -173, 67, -4, -99, -147, 141, 135, 170, 124, 45, 85, -31, -36, 79, -22, -15, -89, -151, -64, -172, 32, -51, 0, 89, -15, 28, -20, 83, 25, -49, -35, -24, 153, 73, -69, -89, 75, -192, -56, 121, 63, -12, 4, -93, -86, -10, -1, 263, 105, -38, 105, 24, 57, 71, 125, 69, -105, 2]
3860Bp5j9J3K8Q1j33J72k38K13J61l42L38j04l9L0j59J70L7p0J4Kj71K48j33N7
3885H3q1Q7j04M8o7J01k8J7j01K08j0j90P4M6q8r6R9K5P5K6j17k21J66j33K46
3910F5L7j57M7j01J37KjR7P1j55q1J22l5Q0j14k4q6R2j8N7N3o1k39J0N6K43j44
3937d7J12J12j89M2j31K49r3j5m5n1j50L02k5k32K02k18j6J17P7L9N1j74J24j17
3961g6J70l2Rq7Q6K4l20L78k21Lk06K47l0r2OK9K19q7R8o8J5j13R2j15K72q2r2
3988B7p4M8n1j36J12P9p0k3K4nJ78k9p7k00J53J22M5p2o2J39j19KQ2qj23P3L1
4015F6j4j54Lj29K06%j33L09j31K24j08k08O8o5K02o6k58K89j14j46J53l4Oj40
4039a74Q5K9p5J74N0O2k70k3L21q7PJ2j50J08j15O2p7mN9Jl5q8J69k71K67P6j43
$$ y = [2, -73, -92, -79, -51, 30, -103, 69, -169, 44, 205, -137, 201, 97, 58, 88, -71, 99, 136, 66, 80, 82, -89, 159, 26, 83, 2, 89, -15, 33, -34, 67, 39, 56, -45, 163, 153, -37, 37, 83, -5, -101, -2, 23, 98, 124, 7, -214, -48, -181, 65, 102, -55, -8, -109, 28, 30, 29, 126, 197, 42, -39, 83, 48, 128, 14, -10, -96, -4, -22, 35, 88, 27, -212, -202, -146, 97, -47, 65, 177, -12, 30, -101, 148, 55, 40, -5, -56, -206, 96, 71, -161, 41, -177, -193, -76, 1, 40, 91, -83, 41, -76, 94, 62, 71, -16, 70, 94, -226, 152, -69, -66, -272, -25, -55, -147, -141, -112, 107, 20, 118, 50, 65, -48, 44, -71, 201, 119, 27, -47, 1, -50, -186, -74, 5, -65, -88, -64, -69, 109, 80, 3, -197, -44, 78, 123, 51, -11, 128, 9, 11, 93, 85, -38, 35, 66, 52, -102, -99, -228, -22, -22, -155, 154, 23, 247, 139, -69, -1, -66, 136, 70, -188, 101, -13, -159, -6, -40, -34, -174, -89, -60, -135, 39, 89, 151, -119, -142, 179, 92, 99, 111, -39, 69, -46, 16, -61, -65, -6, -5, -40, -128, 41, -230, 37, 113, -30]
4066c0J10P5j96M41m37J14J2p5J40j92O4m8K5q0j4MR3j18n5J75O3j37J69o4J68
4091B07j9j06k31L57k57J06q0j6J40j93P3j35K07j55J11K7j02n3M8N4j39N7L5
4114f4L7OL0j05K32q5n1o6N9J19j48Mj25l0K86q1k23K77L1mk52N5J68m3J65l78
4140a86K6J36P9R5j87R5r3p1M8q2J86K8Q0k17o8J33K00r0j09n7m0P9Q4P7j82L3
4166cj70Q5Q3r3K44j20J5o7J40j82K59m5q8P6k59K91q5l7M4j01o8j34J69Q0k02
4191a68R2N6o0m9J22P4L6k03K82j34L7k71N3LJ92k4q5j09p3K06m7o8N4J55j6j47
4217i2J73j63Q5L40l48j61J94P5j05J15j79K27j76m8R8n7J14n0j76J09J38l0L9
4240A22p1k59l3K41P0p3k32J81R4M9j29N5J6l7J4o4M5l0mP1m5J1KJ01ML2k36o5
$$ y = [-30, 80, 155, -41, 400, -37, 77, 89, 14, 154, -38, 26, -22, 3, -77, -91, -87, 6, -112, -167, 8, 71, -66, 103, 39, 207, 188, 82, -149, 208, -49, 57, -23, -39, 101, -92, -19, -154, 53, -102, 9, 36, -66, -119, -71, -17, -156, -99, -64, -27, -21, 9, -96, 136, 51, 0, -66, -7, 112, -36, -32, -157, -187, 99, 18, -205, 72, 103, 99, -153, -98, 70, 27, 192, -186, -160, -24, 55, 150, -37, 58, -35, -106, -58, -140, 46, 74, 154, -63, -131, 2, 202, 112, 3, -54, -94, -15, 69, 146, -36, -3, -173, -88, -5, -98, 146, 26, 41, -26, 114, -68, 191, 146, 58, 134, -125, 166, 81, 44, 88, -13, -81, -215, -46, 34, -168, -76, -20, -80, -129, -7, 67, 103, -100, 182, 48, 85, -186, -133, -130, 62, 38, -47, -156, -229, -23, -70, -138, -84, 71, 55, -92, 81, -82, 3, 343, -5, -166, 28, 103, -2, 113, -66, 161, -15, -63, 35, -22, 92, 42, -134, -25, 113, 83, 122, 51, -208, -241, 0, 70, -3, -235, -54, 40, 89, -40, 15, 31, -6, 8, -56, -11, -41, -45, 26, -19, -8, -6, 95, 99, 131, -105, -170]
4268a70K03Mp5pp9K11k25K11m5R3Rk1j44Q3M8Q7j63Q7j62j1P5q8J99j23r5LR4
4295al8J33l2l0k30P9K62k21j5P2qJ36j69J08j17P2j24J15j26J12o0K63k01k6
4319d6K40j57k5o5L6P7l5j52J33j32K16j33J3M1p4J05kj66J89j86J20M3k1j55
4343a36J34P0K7j89K04p5o2R5K5j34J72k16J33l8j26J11n2j26L07j39m2P2M2o0
4367clr4J9J57n0N4q0k8K2K59j95k62L44r4j97R7O9j6j52K82R6l59J09J30j64
4392e9K30j01j00o9K53k54J02J4r5J80k01J50j02O3l8J33q3r3J76k2n4Q7j3O2
4416A66j96q7J13Pm5n7K14j94N8j07K34k63J09Q3q9K22k40J91k50J96k26K2K13
4439G4q3J1o1J1N1m7j0J9j38J79J7L9K3k31J50J26j20O6j96N4Q0O2j5p1LK9m2
$$ y = [-170, 33, 37, -38, -45, -124, 87, -138, 73, 28, 121, 130, 109, -35, 48, 96, 183, 20, 107, -55, -66, 9, -79, 120, -3, -98, -95, -1, -39, 94, 62, 32, -198, -119, 143, -78, -93, -21, -29, 107, -62, 46, -71, 1, -123, -8, -134, -22, -82, 181, -20, -46, 194, 37, 12, -53, -17, 60, 25, -127, 6, -126, 90, -43, -30, 11, -63, 42, 40, -126, 63, -123, -3, 40, 19, -136, -2, 68, 95, -94, 110, 35, -27, 68, 93, -41, 131, -85, 48, 10, -116, -5, -57, -183, 124, -15, -57, 15, 57, -3, -6, -100, -81, 76, 26, 80, 0, -28, -6, 253, 58, -204, 140, 46, -151, -54, 15, -1, -153, 129, 225, -134, -25, 105, -59, 171, 70, -30, -99, 154, -100, 2, 16, -79, 101, -100, 50, -52, 11, -27, 106, 23, -70, 106, 84, 30, 117, 104, 166, -30, -117, -4, 3, -42, -99, 115, -79, -21, -128, 106, -157, -48, 35, -54, 168, -72, 119, -131, 65, -161, -139, 74, -9, 2, -59, -48, 3, -44, -54, -35, -173, 6, 23, 62, 85, -146, 4, 130, 10, 76, -120, -66, 14, 76, 61, -10, -7, 22, -20]
4466b0r1J89j91oJ1M2N1k1J42j26P6k4k58J52J36m6n6Q9l3J40j57q1K8L8l0JJ83
4493A38o4nj12p9J60m2q8m4L03l6j42j06J00J7j08OP9m1J06k4q7j33K15q6J86
4518A13l0o0l5j9j1O1J07m5j41N3L8m4l4jL5J36o9O7k86J24J43j28J29j91J96
4543A08M0Kj62L8L2K4k07K07k37J10m3M3N5J53j80k5J26q2K9nk69K14M2j7o4P5
4569Gq1K14j87j04K01j78K05o3j42P8q5J30Pk5Lo3J81oj48Q2K40j68j27j28QK16
4595F7k6j21l1J30J02j30j8j56K79m6m3N6J2q1J7O9r7Q6r3n0R0J4K7K7j07N6m
4622B9o4P9m7J08r8j83P3K02j65m8P8q6J15O7k0Q5q7k2j55K3K2Q0P2q1rk5P1J1
4650B5k5J42q2m1L8o6q4J56k6n4j18M7l0J41q6r2J19k1J41k15M6J30Q6n5j09j24
$$ y = [-20, -111, 78, -113, -119, -108, -66, -15, -36, 106, -20, 56, 32, -226, -74, 62, 16, -40, 49, 16, 156, -1, -82, -54, -16, -46, -45, 138, 74, 69, -43, -122, 38, -4, -92, -136, 167, 131, -11, -117, -17, 0, -108, -102, -23, -64, 42, 18, -69, -202, 13, -73, 113, 83, 23, -12, -31, -42, 19, 126, 81, -60, -7, 31, -13, -47, -48, -13, 123, 54, 121, -165, -41, 102, -26, 103, -88, 108, 148, 150, -12, 26, 58, 82, -125, 82, -155, -45, -88, -45, 10, 163, -17, -42, 84, 2, 31, 26, -243, -29, 13, -4, -68, 7, -74, 140, -47, -151, 50, -128, 77, 14, -128, -50, -135, -5, 2, -23, -20, -83, 98, 92, -56, 26, 266, 98, -29, -157, -149, 67, 41, -80, -111, 19, 121, -9, -27, -183, 96, 50, 7, 63, 75, -6, 11, 80, -17, 69, -24, -74, 16, 30, 57, 84, -23, 33, 29, -35, 44, -3, 105, 7, -176, -103, 99, -66, -114, -36, -122, -7, 60, 40, 125, 38, 16, -139, -116, -94, -14, 58, -23, -32, -57, 14, 25, 0, 142, 60, 19, 57, -9, -93, 63, 37, -17, -135, -88, -118, 23, -63, -155, -36, -57, 84, -131, -85, 45, 131, 76, -33, -157]
4676a57K58n3k9O4j44pM6p7k8J88j60Q7r9K28o4J32k08m4K32j11n7j07J35j4j4
4701cJ54n4m6M1k3r5nL0M4j90J51J22j92J01j40K03j37Q6p7K29k37J47q0n9K6
4726dr9J89j12J41k37K46j20Op9K48j72j92K99j68L8j6J13j51J40j13q4n4O2J50
4750C1j39J41J74k39J8N1LL5Om4L0j21L9R0j85Q6M1l0Q0o8jJ68j79n7K25j76L9
4777A8J16j18j20j38L07p2m0R1J3J5J1j83JJ06N8L8o2q9nL7m6J80p0l1P5k3kj71
4805a04J43J0j11P7p7J15l7l0J40j56J42q5n7k4J20k10K43K3j39L7j62J09Q4j53
4829a02L0R4J3p5Q6j7j0J6M1q3m1M7J61l05K35j66M8J49N2l10K47mk52K15j39
4854g0j8K00k15K20j63J12N2l3p6j15J43j10R0j65J51l0r3J06JJ01j45N3R1k1
$$ y = [-157, 101, 48, 19, 83, -61, -68, -22, -99, -127, 61, -99, -12, -111, 117, 53, 185, -23, -67, 165, 54, -3, -110, 25, 11, -3, 151, 97, 51, 92, 69, -26, -31, -1, 43, -147, 4, 126, -66, 35, -105, 98, -39, 47, -30, 199, -38, 109, 29, -30, -4, -103, 86, -26, 115, -122, 124, 4, 10, -69, 179, 7, -185, 114, -54, -16, -32, 81, -70, 70, -43, -127, -181, -119, 31, -108, 33, 207, -32, -14, 37, 40, 75, 81, 37, 67, -54, -15, 75, -110, -24, 17, -13, 67, -1, -2, 166, -13, -70, 155, -21, 18, 134, 16, -104, -242, 65, -7, -47, 44, 57, 72, 83, -100, -99, 7, 65, 103, 41, -48, -53, -16, -62, 118, 48, 17, 92, 69, 67, -104, 39, 49, -62, 15, -62, 53, 16, -14, 126, -30, 112, 27, -30, -54, 66, -144, 99, 122, -17, 20, -142, -33, 51, -102, -72, 22, 35, -40, 46, 29, 19, 35, 76, -7, -48, -1, 160, -145, 90, -76, -28, 121, 173, -137, 110, 106, -146, 69, -70, -88, 112, -103, 117, -46, 66, 118, 85, 9, -106, 37, -73, 17, -148, 3, -27, -120, -14, -13, 88, -57, -4, 87, 66]
4878F6K3r4m3J44j27J83k06J49j36J01K2o2j87L9K51j20N9o6J02j11j3k9K07k87
4902a35J91j41k1P0P6M1L5j72j24K4L4J18LQ5k04J12PL2J29p1j20j7J29j14j09
4927a42J54k4M1K3J7K8m9l4J76l07O8J56n1j4Q0k50J98n3o3r5Q7K8K48l10J9K02
4953A33j76Pk06K57j22J07K4j66L7N8o8J49l3L3j71O3L8O4r8R1N0r9R1J48j35
4978G6k41Q3L2P9n7j60K33k0j20k9J88j89R0L4J17j80m6J70Mj01j74L02j62J47
5002G6R8k21R5l7M1j33O2j23ROJ03R4J10j11oq2J08m2N6p9N7O9k29K89K3k80r8
5029a45L27j86j3q7J33r0N8k4l3J98q0p7K16j43j45oP2K30k16P7m6q9j36J94j67
5054a78J99Q4j71J74l9j31J66j17j4OPj3qO8K0J0j67J29J4j29J44j30O2j06q3
$$ y = [66, 89, -5, -48, 96, -31, 152, -54, 95, -41, 60, 82, 20, -167, -128, 123, 3, 62, -4, 98, -13, -26, -55, 152, -135, 56, -85, -106, -36, 40, 81, 116, -56, -180, -156, -122, -4, -1, 84, -120, -8, -1, 31, 160, 89, -31, -48, 81, -33, -142, 12, -12, 29, 52, 69, 97, 48, 14, 190, -117, -49, 107, 56, 42, 122, -128, 70, 17, -46, -141, -54, -26, 222, -88, -69, 133, -43, -36, -242, 15, -107, 0, 24, -142, -105, -47, -115, 34, 1, 34, -137, -74, -36, 28, -70, 21, 71, -28, 63, 211, 76, -165, -82, -50, 29, -28, -188, 45, 25, -95, -124, 64, -125, -35, -1, 116, -64, -110, 60, 64, -37, -211, 91, -71, 76, 174, -47, 48, 11, 52, -81, -19, -142, -133, -127, -24, 70, 180, 69, 63, -19, 89, 47, 103, 24, 81, 150, -79, 210, 233, -47, -145, 182, -4, -17, -104, 29, -61, -3, -27, -60, 138, 58, -19, 197, 54, -91, -97, -25, 205, -11, 66, 20, -69, -205, -11, -178, 21, 105, -66, 108, 69, -62, 104, -13, -27, -21, -14, -27, -35, 33, 53, 63, -104, 25, 39, -90, 54, -76, -14, -120, -203]
5079b03K39j46jN9j4M8m1K0K66k67op4J06m4M6J24j07l7r5on9K08n3o2J44m9k36
5106b40L06L7l3j58K5J92k71J68j16R0j6J03nj06q3n5J94L42k98j1j70P9K6kJ09
5131A07p1j21K74k35J46L2J08j77j11K1qO5j22O0J16j49M2M2q2j0J95o2j14P9
5155B5j18J26J9Kp2J57m2j06J28j47j45R9Kr9J44j25J54k20J85O3P4j11J06m2
5179E7l8l3J66k83J02j6l1J00j78J33j36J32k6L9m6J75o2k3j58J62Pj30J85l4
5203F4N5k4r4K4M6j8j54j3O3p3J56J00k52KJ19K21k61J53p6j3K6PJ7r1J80k06
5229d2J18q5q6J10J06l07J42R9n1j3j75K74L9k16k8J37M7k00R4k6J99k28J22J18
5253A48k94L3J26n5n5Q5J45k96J48J94k80K18k01J28j7j30K0P7j6L1j32O0l7K63
$$ y = [-203, 36, -110, -111, -52, -66, -18, -59, -39, 227, -40, -46, -120, -14, -58, -12, 112, 5, -32, -127, -133, -192, 16, -37, -99, 45, -4, -240, 66, 103, 70, -88, -63, 129, -142, 26, -90, 0, -16, 87, 82, -24, -107, -162, 32, 374, 76, 65, -105, -26, 0, -2, 107, 36, -85, 189, -46, 100, 132, 240, 63, -48, -27, -35, 30, -92, -32, 84, -65, -23, 19, -63, -73, 122, 60, -54, 25, -93, 33, 52, 54, -18, 139, 97, -9, 119, -28, -173, -74, -72, -171, -27, -152, 2, -218, -33, 30, 104, -7, 99, 57, 19, -14, 152, -131, -29, -45, -76, 24, -154, -21, -157, -25, -51, -12, -58, 117, 55, 32, -126, 36, 43, -87, 98, 64, 119, 95, 1, 25, 71, 53, -101, -114, -51, -124, 32, 132, -120, -118, 1, 222, -39, 114, 38, 25, 51, 58, 75, -16, 164, -42, 76, -9, -95, 15, 121, -186, -44, 55, 4, -9, -184, 90, 129, -87, -115, 22, 69, -131, -37, -63, 136, -92, 30, 148, -146, -113, 13, -42, -97, -12, 133, -163, -15, 179, -101, 117, -84, 44, 27, -103, -83, -6, -22, 9, -123, -63, -100, 163]
5277A63j87j4j09K74j14q7O3r0M9l5J37j90J93j05j02J25k9j63K38o2L0P6j6r
5301C6k35K18J47k73K0%L8P7n4q2ll9K90j50M7Q7j41lJ4j49K27oj5J52k93r9K46
5328E7Pr2p9J2K59l8j37j88J69l8K09q8p2J22j43J33lP5j93qK02k95NJ85j17O8
5354A2J30k14K5j06R0J9M9J7jM3j29O6o3j5m5J68N7K6Lj25K7o2J79j63n1M7j5
5381c1PlJ17m3n5n7J95j79PL9q9K01o4Q2k22J20K3k1j75N2J64j60J16j81L17k7
5407A33l2l5q3L8O7q8m0k9J53j79O5l7P1l1P7q1N5n5J27q9j11J12o5o6J16k5j21
5434a53Q8k2K43j92M7r1J53J27j65j54J77j0j18J27J30j72j71K30Oj90J65j58
5456a03j8j8J06K42o0j24j45j08K52m3O2J68j53r2Q5K2j22J73j47J58k7j72J89
$$ y = [163, -24, -38, -147, 127, 13, -74, -11, -101, -52, -87, 50, -140, 53, -52, -154, -29, -58, -221, 17, -45, -15, 61, 45, 36, -199, 19, 166, -107, -87, -87, -49, 28, -26, -108, -111, -150, 140, -10, 37, 124, -17, -20, -6, -155, 72, 66, 51, 203, -90, -189, 57, 64, -28, -107, -95, 164, 126, -11, -199, -30, -68, 141, 53, -19, 103, -40, 93, 90, 165, -28, -36, 166, -129, -124, 61, -56, 12, 142, -72, -47, -153, -63, -44, 5, 22, 21, 64, -65, 1, -62, -77, -122, 46, 103, 129, 132, 7, 34, -28, 151, -12, -63, -16, -31, -24, -27, 90, 47, -8, -65, 130, -49, -42, -3, -92, 109, 45, 127, -95, 25, 48, 27, -148, -96, 68, -92, 24, -157, 160, 133, 101, 66, -17, 21, 88, 0, -40, -69, 84, -95, -30, -67, 4, -27, 50, -31, 24, -31, 96, 7, -104, 8, -57, -123, -7, -32, -153, -65, -87, 156, -36, 11, -80, 73, 200, 35, -119, 58, 48, -70, 57, 187, 15, -156, 74, 80, -110, 55, -103, -121, -139, -33, 209, 149, 25, -120, -228, 24, -19, 43, 211, 58, -34, 51, 73, -49, 124, -23, 135, 108, -64, 125]
5479A25j37No2J89n3q4K5j12O9J24p5P8o4n1M1l06L23p0J09n3O0n6j0j7N6N6k3
5506H7M9k32J73L2l7j53J60n0O5j1j12m3j28K68j93j9K37k8j09N2Qj9K64l08k3
5531g0J65n7q4N4j92J66Q3opq2K3J0N6p8r0K38k71J13J69j01j58J26Q9j39J90
5556A47j52M1k5Nm4J05L0j00J38k34J14J47l42L19k34J55j01p0J23o4J18p5j81
5579a80J18J45O8k25k9J35j56J92q3J35Q4k12n6Ll1M1n7pJ82M1Q9j05k26K13J3
5604I2k9J9k8l6L0k81J21J63k02J10Q5j08r6K45j23M2J35l05J25N6k8k3M5p3j
5629f5J46j05J39o8p9mj2q3rP5N7j93K14q7l9J05j05N0J01l4jN4P5j22k5J30j80
5656f5J17j1r8q2J50j32J01K3J1J5r9PJ34j11m6J71l0j09j9L9Q6p7j48J72M7j17
$$ y = [125, -12, -7, -69, 120, 67, -17, 8, -104, -35, 89, 14, 92, 28, -23, 18, -288, 35, -35, 74, 21, 81, 25, 15, -2, 54, 110, 87, 136, -96, 77, 109, 72, -81, 79, 29, 94, 83, -29, -72, -200, 68, -125, -144, 93, 65, -44, 8, 16, -3, 261, -47, -70, 95, 38, -46, 8, -184, -18, 65, 59, 52, -30, -7, 3, 59, -19, -109, 129, -142, -29, 140, 39, -119, 7, 96, -43, 147, -5, 36, 11, 16, -28, 77, 107, 7, 145, -89, 25, 172, -170, 149, -85, 70, -31, -101, 22, -42, 76, 1, -180, -62, 83, 151, -74, -103, 32, -124, 68, -15, 120, 204, -8, -64, -61, -92, -51, -108, -115, 67, 108, 197, 92, -134, 79, 92, 63, 82, 54, 18, 48, -233, -112, 51, -151, -41, 44, -64, -160, 85, -38, 4, 139, -166, -41, 15, -13, -36, 9, -64, -65, 81, -24, 115, 47, -32, -36, -48, -131, -140, -65, -8, -201, 13, -74, -113, -8, -113, -63, 38, 4, 3, 57, 132, 10, -15, 115, -65, 52, 41, -57, -139, 11, -121, -20, 3, 14, 29, -70, -63, 71, -40, -86, 85, 55, -54, -73, -34, 52, -25, -173, -1, 46, -71]
$$ [...]
8191F6
##END NTUPLES=NMR FID
##END=
