##TITLE=1H_Pr Bn Pip
 CDCl3, 8 sc, 
 26.11.2020
##JCAMPDX= 6.0         $$ Bruker NMR JCAMP-DX V2.0
##DATA TYPE= NMR FID
##DATA CLASS= NTUPLES
##ORIGIN= UXNMR, Bruker Analytische Messtechnik GmbH
##OWNER= root
$$ XWIN-NMR		Version 3.5
$$ Thu Nov 26 10:26:05 2020 Russian Standard Time (UT+4h)  she@DPX200
##.OBSERVE FREQUENCY= 200.1315066352
##.OBSERVE NUCLEUS= ^1H
##.DELAY= (6, 6)
##.ACQUISITION MODE= SIMULTANEOUS
##.ACQUISITION SCHEME= undefined
##.AVERAGES= 8
##.DIGITISER RES= 18
##SPECTROMETER/DATA SYSTEM= spect
##.PULSE SEQUENCE= zg30
##.SOLVENT NAME= CDCl3
##.SHIFT REFERENCE= (INTERNAL, CDCl3, 0, 15.7039)
##AUDIT TRAIL= $$ (NUMBER, WHEN, WHO, WHERE, WHAT)
$$ ##TITLE= Audit trail, XWIN-NMR		Version 3.5
$$ ##JCAMPDX= 5.01
$$ ##ORIGIN= Bruker BioSpin GmbH
$$ ##OWNER= she
$$ F:/spectra/data/she/nmr/H-F/1/audita.txt
$$ ##AUDIT TRAIL=  $$ (NUMBER, WHEN, WHO, WHERE, WHAT)
(   1,<2020-11-26 10:24:58.32 +0400>,<she>,<DPX200>,
      <created by zg, POWCHK disabled, PULCHK disabled
       configuration hash MD5:
       00 E9 B6 7A A2 85 ED C7 34 08 36 98 17 FE 4E 26
       data hash MD5: 16K
       43 19 D8 5E 8B 13 D8 EA DE 45 2C B7 51 FB 26 02>)
$$ ##END=
$$ 
$$ hash MD5
$$ D4 F7 AA 63 52 B0 61 CC A4 38 47 4C 09 4C B9 F3
##$RELAX= 
##$RELAX= 
##$RELAX= 
##$RELAX= 
##$RELAX= 
##$RELAX= 
$$ Bruker specific parameters
$$ --------------------------
##$DU= <F:/spectra>
##$EXPNO= 1
##$NAME= <H-F>
##$PROCNO= 1
##$TYPE= <nmr>
##$USER= <she>
##$AMP= (0..31)
100 100 100 100 100 100 100 100 100 100 100 100 100 100 100 100 100 100 
100 100 100 100 100 100 100 100 100 100 100 100 100 100 
##$AQSEQ= 0
##$AQ_mod= 1
##$AUNM= <au_zg>
##$AUTOPOS= <>
##$BF1= 200.13
##$BF2= 200.13
##$BF3= 200.13
##$BF4= 200.13
##$BF5= 200.13
##$BF6= 200.13
##$BF7= 200.13
##$BF8= 200.13
##$BYTORDA= 1
##$CFDGTYP= 0
##$CFRGTYP= 5
##$CHEMSTR= <none>
##$CNST= (0..31)
1 1 145 1 1 1 1 1 1 1 1 1 1 1 1 1 1 1 1 1 1 1 1 1 1 1 1 1 1 1 1 1 
##$CPDPRG= <>
##$CPDPRG1= <>
##$CPDPRG2= <>
##$CPDPRG3= <>
##$CPDPRG4= <mlev>
##$CPDPRG5= <mlev>
##$CPDPRG6= <mlev>
##$CPDPRG7= <mlev>
##$CPDPRG8= <mlev>
##$CPDPRGB= <>
##$CPDPRGT= <>
##$D= (0..31)
0 1.2 0 0 0 0 0 0 0 0.06 0 0.03 0 0 0 0 0.0002 0 0 0 0 0 0 0 0 0 0 0 0 
0 0 0 
##$DATE= 1606371897
##$DBL= (0..7)
120 120 120 120 120 120 120 120 
##$DBP= (0..7)
150 150 150 150 150 150 150 150 
##$DBP07= 0
##$DBPNAM0= <>
##$DBPNAM1= <>
##$DBPNAM2= <>
##$DBPNAM3= <>
##$DBPNAM4= <>
##$DBPNAM5= <>
##$DBPNAM6= <>
##$DBPNAM7= <>
##$DBPOAL= (0..7)
0.5 0.5 0.5 0.5 0.5 0.5 0.5 0.5 
##$DBPOFFS= (0..7)
0 0 0 0 0 0 0 0 
##$DE= 6
##$DECBNUC= <off>
##$DECIM= 32
##$DECNUC= <off>
##$DECSTAT= 4
##$DIGMOD= 1
##$DIGTYP= 9
##$DL= (0..7)
0 120 120 120 120 120 120 120 
##$DP= (0..7)
150 150 150 150 150 150 150 150 
##$DP07= 0
##$DPNAME0= <>
##$DPNAME1= <>
##$DPNAME2= <>
##$DPNAME3= <>
##$DPNAME4= <>
##$DPNAME5= <>
##$DPNAME6= <>
##$DPNAME7= <>
##$DPOAL= (0..7)
0.5 0.5 0.5 0.5 0.5 0.5 0.5 0.5 
##$DPOFFS= (0..7)
0 0 0 0 0 0 0 0 
##$DQDMODE= 0
##$DR= 18
##$DS= 0
##$DSLIST= <SSSSSSSSSSSSSSS>
$$ [...]
##$SUBNAM2= <"">
##$SUBNAM3= <"">
##$SUBNAM4= <"">
##$SUBNAM5= <"">
##$SUBNAM6= <"">
##$SUBNAM7= <"">
##$SUBNAM8= <"">
##$SUBNAM9= <"">
##$SW= 16.9725356469052
##$SWIBOX= (0..15)
0 0 2 0 0 0 0 0 0 0 0 0 0 0 0 0 
##$SW_h= 3396.73913043478
##$TD= 16384
##$TD0= 1
##$TE= 0
##$TE2= 300
##$TE3= 300
##$TEG= 300
##$TL= (0..7)
0 120 120 120 120 120 120 120 
##$TP= (0..7)
150 150 150 150 150 150 150 150 
##$TP07= 0
##$TPNAME0= <>
##$TPNAME1= <>
##$TPNAME2= <>
##$TPNAME3= <>
##$TPNAME4= <>
##$TPNAME5= <>
##$TPNAME6= <>
##$TPNAME7= <>
##$TPOAL= (0..7)
0.5 0.5 0.5 0.5 0.5 0.5 0.5 0.5 
##$TPOFFS= (0..7)
0 0 0 0 0 0 0 0 
##$TUNHIN= 0
##$TUNHOUT= 0
##$TUNXOUT= 0
##$USERA1= <user>
##$USERA2= <user>
##$USERA3= <user>
##$USERA4= <user>
##$USERA5= <user>
##$V9= 5
##$VALIST= <valist>
##$VCLIST= <CCCCCCCCCCCCCCC>
##$VD= 0
##$VDLIST= <DDDDDDDDDDDDDDD>
##$VPLIST= <PPPPPPPPPPPPPPP>
##$VTLIST= <TTTTTTTTTTTTTTT>
##$WBST= 1024
##$WBSW= 4
##$XGAIN= (0..3)
0 0 0 0 
##$XL= 0
##$YL= 0
##$YMAX_a= 367826
##$YMIN_a= -284933
##$ZGOPTNS= <>
##$ZL1= 120
##$ZL2= 120
##$ZL3= 120
##$ZL4= 120
##$ABSF1= 10
##$ABSF2= 0
##$ABSG= 5
##$ABSL= 3
##$ALPHA= 0
##$AQORDER= 0
##$ASSFAC= 0
##$ASSFACI= 0
##$ASSFACX= 0
##$ASSWID= 0
##$AUNMP= <proc_1d>
##$AZFE= 0.1
##$AZFW= 0.1
##$BCFW= 1
##$BC_mod= 2
##$BYTORDP= 1
##$COROFFS= 0
##$CY= 11.3945322036743
##$DATMOD= 1
##$DC= 2
##$DFILT= <>
##$DTYPP= 0
##$F1P= 15.9154993809931
##$F2P= -4.1035820241983
##$FCOR= 0.5
##$FTSIZE= 0
##$FT_mod= 4
##$GAMMA= 1
##$GB= 0.15
##$INTBC= 1
##$INTSCL= 1
##$ISEN= 128
##$LB= 0.24
##$LEV0= 0
##$LPBIN= 0
##$MAXI= 10000
##$MC2= 0
##$MEAN= 0
##$ME_mod= 0
##$MI= 1.114404
##$NCOEF= 0
##$NC_proc= 0
##$NLEV= 6
##$NOISF1= 3.799351
##$NOISF2= 2.8
##$NSP= 1
##$NTH_PI= 0
##$NZP= 0
##$OFFSET= 15.70392
##$PC= 1
##$PHC0= -11047.69
##$PHC1= 9.600881
##$PH_mod= 1
##$PKNL= yes
##$PPARMOD= 0
##$PSCAL= 0
##$PSIGN= 0
##$REVERSE= no
##$SF= 200.130013532006
##$SI= 16384
##$SIGF1= 3
##$SIGF2= 2
##$SINO= 400
##$SIOLD= 16384
##$SREGLST= <1H.CDCl3>
##$SSB= 0
##$STSI= 0
##$STSR= 0
##$SW_p= 3612.71676300578
##$SYMM= 0
##$S_DEV= 0
##$TDeff= 0
##$TDoff= 0
##$TI= <>
##$TILT= no
##$TM1= 0
##$TM2= 0
##$TOPLEV= 0
##$USERP1= <user>
##$USERP2= <user>
##$USERP3= <user>
##$USERP4= <user>
##$USERP5= <user>
##$WDW= 1
##$XDIM= 8192
##$YMAX_p= 0
##$YMIN_p= 0
$$ End of Bruker specific parameters
$$ ---------------------------------
##NTUPLES= NMR FID
##VAR_NAME=  TIME,          FID/REAL,        FID/IMAG
##SYMBOL=    X,             R,               I
##VAR_TYPE=  INDEPENDENT,   DEPENDENT,       DEPENDENT
##VAR_FORM=  AFFN,          ASDF,            ASDF
##VAR_DIM=   8192,          8192,            8192
##UNITS=     SECONDS,       ARBITRARY UNITS, ARBITRARY UNITS
##FACTOR=    0.0002944,     1,               1
##FIRST=     0,             0,               0
##LAST=      2.4114304,     0,               0
##MIN=       0,             -284933,         0
##MAX=       2.4114304,     367826,          0
$$ Real data points
##PAGE= N=1
##DATA TABLE= (X++(R..R)), XYDATA
$$ [...]
2025g24J204p3m92R20o7l95j3M00j4j53P33o5o24K26J67q8m99Q71K88j173P23
2046A152K18p60J32P87j008N83n75J05K94p99O66l1o27K35N03j215L19P82j151
2065c90K26l8j60K18j53j84K5M15r39J325j148o17M40p60O12J86N1q27J413j318
2085a623J42R06o69K36k23j2o6Q1O7L46j12l16Q79p86K35N58j31Q8L62R8n32Q44
2107C72m69M95j38L73K46K48j35R3N74j017J325m5p44P79R0n92J7Q61r13L70M0
2128A830m55Q0m24K87j29m73LM96j224L50M50r29K3j16Op40L61l00m51L04m67
2149a518L65m52m0n4N8m8L15N0n38R21m22K9M20K4j69M61J71j33M00%J6J22k17
2172b39Q51k62k55K99N05q97N47L03k02K57l03j0j34L81j19j15k49k72N29p62
$$ y = [-724, 480, 407, -85, 835, 768, 373, 360, 760, 746, 593, 1326, 1261, 637, 863, 1030, 942, 443, 1314, 1602, 429, 1152, 1370, 610, 742, 1529, 521, 1104, 529, 634, 928, 129, 795, 764, 137, 372, 875, -340, -21, 761, -390, -164, -202, -362, -144, -297, -481, -456, -41, -980, 345, -803, -1420, -980, -1740, -1128, -942, -891, -1718, -305, -1623, -1481, -575, -1244, -1008, -1231, -1243, -1309, -1228, -1161, -815, -927, -1243, -364, -1150, -915, -357, -488, -400, -38, 60, -472, 372, -97, 398, 260, 633, 879, 1127, 992, 1085, 1659, 642, 1967, 1922, 1178, 1957, 2047, 1455, 1472, 2333, 1420, 1790, 1830, 1375, 1455, 1031, 1318, 1189, 716, 719, 1215, -9, 341, 791, -138, -115, -231, -225, -965, -604, -904, -1355, -1051, -1518, -1153, -1605, -1645, -1699, -1641, -1689, -1374, -1324, -1862, -941, -1363, -1334, -914, -890, -1059, -598, -427, -560, -160, -160, -144, -22, -239, 612, 350, 95, 394, 899, 2, 549, 852, 650, 907, 604, 594, 460, 841, 722, 607, 358, 86, 615, -147]
2192a47O20l22l41J70J07m37k58Q36p57K10o5J25l57K83o7O1J65k56O68n97J99
2213a60P10j87p8qK30l11Q99o01K59J58l91J47j73L32l46L82l56J74L9m48N49
2234H20p08J90m01N31q53R0L76n29M38n62K46n02L04l20P7J3k60L48o26O11q1
2255g98m01K07J80k32o7P38m46J70M36k44K02J99j09J92L5K57J32k67m41J195
2275I38n20j76K62O58r15J172k83m18K59m19J25l37J95P0k19o6j53J43m45L30
2295B01n9k99L37j40l24k5N22o46K45j08PM4L1j04j53J84O7K99n19L29J64k05
2317a52k53N56j85m51P33j95k33M02k57L40l38J28r0K25l08L50j94n16P66m52
2337a24mJ97k51j88N9J79j72K03j77M28l40N4L18m53J72O0K85n94O01l54J24K23
$$ y = [-147, 473, 151, -190, -20, 87, -350, -608, 228, -529, -319, -384, -259, -616, -333, -400, -339, -174, -430, 238, -359, -160, 550, 363, 285, 277, 507, 196, 1095, 494, 753, 911, 520, 667, 494, 826, 480, 862, 506, 680, 719, 271, 820, 112, 302, -99, 432, -421, -331, 45, -484, -46, -608, -362, -864, -560, -880, -803, -790, -1050, -702, -1328, -717, -798, -1199, -992, -812, -1044, -1111, -373, -819, -649, -213, -457, -255, -56, -165, 27, 62, 319, 451, 184, -257, 938, 418, 242, 504, 1162, 247, 1419, 1136, 718, 977, 558, 683, 346, 541, 611, 392, 326, 173, 316, -129, 201, 142, -157, 180, 40, -284, -309, 213, -433, -188, -296, -289, -245, -214, -318, -471, -287, -220, 79, -440, -111, 53, -152, -405, 151, -34, -485, 248, 53, -180, 222, -35, 305, -33, 95, 5, 230, -78, 272, 78, -438, 328, -124, -128, 69, -182, -370, -311, -132, -304, -101, -278, 150, -190, -136, 182, -271, -99, -39, 246, -348, 253, -101, 23, 246]
2359B46j93J77k38M51m64J37K40l34L20n78R01l49j33J30N52j137Q02j33m14J97
2379A80k73N06k94Q2m31M65l08j382R02n93J233p36P24o50j35O33l50K59p70L27
2399f11J14k78n5M81J75q83O48j14J36n6j48M33j04J83j74L38O8J00j49K76J67
2420E47l02q5L31J59m90M23L94o94J4J95L39n75K88J94o6k86J28L97r41M30rO7
2442D58l35m8K55l18K61l88L30k36J3k58K8L88m49j13n4M90n71J3L89j79m27J91
2464e60N38p19P4M17k26o2k37Q86o59K09L4rK4qK93l82O52n11L54l27M2J72j56
2487a61K28m18N36k50K99ok85M8J50J99m16N06l75L29k91Q4K36m58L24j47j8l0
2509H4M71k23K33l9k90O2r3M03n01J3J37P9P8o83Q78k22k82K60r0K20m98K13P4
$$ y = [246, 53, 230, -8, 443, -21, 116, 356, 22, 342, -236, 665, 316, 183, 313, 865, -272, 530, 397, -17, 180, -93, 413, 119, 201, -230, 235, -73, -1455, -553, -1146, 87, -649, 75, -575, -710, -77, -427, -168, -938, -611, -497, -775, -830, -349, -174, -1057, -409, -523, -387, -443, -591, -158, -262, -79, -253, 85, 153, 253, 104, 380, 547, 245, 160, 491, 650, 160, 583, 977, 283, 297, 492, 831, 256, 544, 738, 672, 386, 514, 911, -30, 400, 391, 458, 123, 75, 330, 12, 273, -115, 215, -21, -8, -266, -238, 150, -299, -412, -466, 24, -547, -534, -145, -324, -751, -560, -22, -741, -667, -250, -476, -538, -775, 111, -548, -339, -305, -314, -290, -298, -5, -387, 265, -246, 108, -219, -177, -5, -161, 67, -351, 185, -65, 234, 228, -57, -9, 141, 340, -76, 430, 55, 384, 93, 177, 413, -45, 279, 132, 114, 84, 555, 332, 565, 526, 236, 298, 205, 608, 107, 120, 257, 336, 414, -269, 609, 387, 105, 365, 275, 495, -3, 210, 284]
2532B84j22o3j4r0pK29n08L40k85L34p56M15j8k52K21P0j55k21K85l2m08L04l5
2555d84k78R6o3O46q59J06P10l20n21M17l14L87j06K34J66j03k08O03k61j79L37
2576FN52o9N04n73r9Q6P69q72M33L07m78K00J25k53J91K23k22K59q22N63J32p97
2598A65N49k89j94J12k2j34l60L33j23k07j73J46n7j41o2j81L53p27Q10n76n0
2619h28J50j73l39O75Om98M84o60M56J38j89N35m94m4L62K40n72P85j1k75N55
2640C03n04M76l00K15j78J88M33n21N71m34J85P4J45k92K70N3J03L60q55N72p3
2661G91l99L4J92or9k1l45N32n68O9L73m73m0J4o7O8m9m72N57l07l25K15k28K98
2685b56o31O88k64l23L50l34L55k59K28k96J41l96L73K27l90N37l86L13J20K8
$$ y = [284, 162, 99, 85, -5, -12, 217, -291, 49, -236, 98, -658, -243, -261, -513, -292, -222, -377, -598, -313, -345, -753, -449, -484, -762, -666, -729, -83, -942, -836, -126, -446, -967, -550, -864, -477, -583, -349, -183, -286, -494, 109, -152, -331, 6, 558, 489, 993, 420, 321, 407, 1176, 304, 737, 1044, 566, 766, 891, 638, 829, 1052, 830, 1089, 267, 830, 962, 165, 714, 425, 231, 343, 321, 187, -173, 160, 37, -170, -343, -197, -254, -395, -457, -638, -285, -1012, -202, -778, -828, -678, -851, -1190, -515, -509, -1007, -523, -1183, -727, -589, -778, -243, -737, -781, -419, -179, -751, 34, 23, -252, 303, -201, 275, -25, 190, 12, 200, 633, 112, 683, 249, 434, 508, 653, 361, 631, 684, 787, 1147, 292, 864, 791, 392, 426, 618, 612, 513, 492, 147, 679, 111, 180, 553, 80, 40, 54, -13, 55, 6, -466, 91, -216, -541, -326, -554, -256, -887, -199, -463, -786, -436, -770, -415, -674, -446, -742, -601, -997, -624, -397, -787, -250, -636, -323, -203, -175]
2705a75j7R9j16nR0N0J27Oj2M78o15J64M48k85l64P28k1j23K02j44K04j15M92
2728A096o81N08k10k45K03j74J16l34J76J2L26q07N22j68m60L76j24j54k69J86
2748a05m0J4l1n12P67n12j4K32j69j64J09J40m77P69o55J44M08o63N59k20N9j86
2770e47J93J04J6K3j89L56l33L52lJ28m76N27q8LJ62l71J85J3LJ11K68j73m1N31
2794G54l99Q3p8o1K65j55k24K17K51n11K19k2j07J62M0j46j60K02l18K45k02R1
2816A46m7o8P3J09m06K00K1l37J45K70n92J28O7mj62P8K2k36K7j6N07o31J36o1
2840f31j42M13j78J71l60M88k40J28Q2P8j61J46L71k70O4o6K58j77j17P27o04
2861b0J24M21K13p35M45L33j91k16J03K79n94M82O8J91j35l73J45l62M04p3j36
$$ y = [-175, -192, -93, -209, -214, -124, -74, 53, 59, 47, 525, -90, 74, 522, 237, -127, 601, 580, 457, 659, 515, 719, 604, 1096, 415, 923, 713, 468, 671, 497, 613, 279, 455, 467, 793, -14, 508, 340, -120, 256, 132, -22, -291, -105, -145, -131, -162, -674, 93, -419, -433, -201, -370, -534, -425, -285, -762, 7, -648, -504, -96, -759, -200, -420, -361, -547, -354, -250, -234, -211, -400, -44, -377, -25, -28, 100, -376, 151, 63, 66, 228, -143, 42, 55, 58, 169, 437, 264, 223, 754, 355, 438, 360, 299, 564, 409, 185, 402, 653, 142, 361, 339, 232, 394, 434, 288, 128, 330, 12, 257, 55, 146, 99, 31, 104, 213, -193, 7, 28, -309, -164, 106, -486, -358, -291, -295, -457, -379, -357, -593, -566, -582, -75, -706, -570, -631, -773, -360, -538, -367, -727, -239, -479, -351, -269, -191, -352, -206, 165, -105, -41, -107, 151, -26, -143, 584, -20, 104, 525, 738, 3, 448, 781, 590, 374, 477, 756, 162, 644, 712, 903, 768, 395, 540, 178, 582, 509, 373]
2882C73p0M06o06K87R7n67J75J16o0k0m22K07q1j15j55L91l06j03K85m89O8j13
2904g02Qj04L58m1J93n7p5J44m59K41J05o1J4J24N7l36L75k63M59k05K46nJ5J21
2928A52l6K37m50N61l67JL44o8j05J86Q0l14K72j00kJ43k56J35j35n1L54K0m08
2951A93k7M82q50M25r7J28k7r6Mk47L06n99M49J6l7j19j52k81L30R0j14K49n82
2974e56R8O3K6J26j86J08j49J60k27K07R8m01M98k48J54j9L73n15K64j68O9K42
2996A7j90L28l14K74j29K56Nl68M53m58N67j54rJ33Q0k16r1M47p15N72l23K11
3018C76k57m2K40j67J9M9L31m89L6l2J13jk96L41l75K87k53K12J22o18J55J89
3040f0J6l61K14k38P9Q8k59L54k31J72o2m5j9P1J50l36K39j65M58j68J13k15J57
$$ y = [373, 303, 709, 103, 390, 487, -80, 95, 211, 151, 131, -291, -84, -165, -280, -435, -44, -350, -453, -168, -657, -589, -702, -694, -798, -440, -481, -288, -345, -420, -276, -735, -494, -389, -450, -436, -312, -255, -591, -216, -479, -20, -225, 21, 16, 31, 152, 116, 353, -97, 464, 97, 98, 442, 374, 269, 455, 535, 221, 493, 393, 391, 534, 278, 413, 278, 227, 581, 601, 193, 166, 648, -202, 223, 126, 254, 227, 131, 135, -112, 194, -405, 44, 60, 23, -96, -248, -529, -199, -109, -223, 26, -556, -458, -395, -369, -243, -429, -321, -470, -310, -537, -330, -232, -633, -135, -383, -229, -248, 125, -390, -126, -294, -225, 17, -173, 155, -159, 115, -14, 242, 247, -121, 332, -126, 441, 287, 278, 411, 491, 275, 184, 631, -84, 488, 165, 376, 119, 77, 317, 150, 169, 218, 549, 60, 96, 64, 177, 176, -120, 221, -154, 133, -120, 92, 214, -404, -249, -60, -44, -405, -191, -429, -350, -262, -521, -167, -398, -226, -288, -333, -352, -281, -131, -467, -228, -393, 65, -103, 10, -205, -48]
3063d8K10l61O23n33R8MJ79j6j70M09l07N17k99p2L20k29k5j00J01j39K33k63
3085A32M17n01K99M1m29K47j90R9r6j08K8J39j08k48M25k59N2j56R2M8j31o7n3
3108c27M23m49p1O2Q5J35m3J45l27L17j02j29K06q9J67l94M49j66K54j15m1J43
3130A33m0K75K9m25J77L0J98j69j18j37J73k58L25K09j57k55K78j25k77L28k7
3151A67k30j11K53n2q4O7j01j8j82K71r8q7J02l8K57k46J00p0N2O0o6K37k54K47
3175A76l15K60k94K25N7j57L90n80L89j26J32k17l8O8K11k6j88K06j73K19j68
3196E1K6k35J56lJ1J40Rl59p3M44k03m7J76j07J52l40O0j16J50m7J30m6k09J44
3220a36r7K91j54l94L32j35J74k26K25Kk88L3K17K15k64K18k26K99k09J70k32
$$ y = [-48, 162, -199, 424, -109, -11, -7, 172, 156, -14, 395, 88, 605, 306, 234, 554, 325, 300, 200, 301, 162, 395, 132, 549, 48, 347, 388, -41, 206, 16, 115, 19, -89, -61, 78, -30, -278, 147, -112, -60, -216, -124, -76, -207, -274, -327, 96, -353, -424, -362, -277, -142, -185, -40, -367, -50, -152, -281, -75, -164, 3, -391, 58, -108, 146, 31, -10, 133, 93, 368, 397, -28, 149, 179, 377, 208, 90, -47, 126, -132, 193, 402, 245, -10, 268, 143, -134, 194, 167, -63, -174, 79, 27, -57, 10, -91, -109, -291, -20, -118, -205, -103, -141, 116, -130, -30, -100, -48, 12, -54, 183, -71, 176, -139, 121, -173, 52, 109, -48, 342, -238, 151, 25, 157, -60, -98, -30, 181, 155, -33, 173, 0, 219, 51, 77, -158, -2, -5, 6, 146, 155, -204, -277, 167, -36, -83, 93, -14, 138, -202, -142, -258, -108, -155, -25, -71, -280, -136, -233, 58, -96, -490, -158, -293, -119, -345, -120, -118, -406, -373, -156, 59, -205, 13, -213, 86, -123, 47, -185]
3241a85n7L35k69J86j10J80j76K22jk31L18k87K13J08L3k00j4RK49kj29N2j80
3264F4k9m1K74p4m65O06k01J62m54K62J41k06K10j65J98k83K70j9m01K90M0L20
3286D99m44k11M0K57m63N0L91m13K22n9K27ql59L09j21j28k07L91j49J67k9k05
3308b43J2k31Q7L37k6m08L07P8k75J9O2L69j24j55O2lL13k76L1j50K21j33J20
3331fo7M08k68k6M28k83L06j99j3j46n7R5k2K83k55L83k07j74Q0Jo8j89K74k55
3355B3O2N3M6Q8m13L57qP0o74K84R3q1L5K0J25r8q9k96K48J6r8J36j06J38l37
3380d06M44k11l5R1o1j62L7N1J77j24m6J12J29k98K46j33L67m14M08j82j18J42
3402A4N3Q1j14O5l79N01k13k7Q3r7K20j77K88J5j15q9J96k17m4L87l27J20q0j03
$$ y = [-185, -242, 93, -176, 10, -100, 80, -96, 126, 125, -106, 212, -75, 138, 246, 279, 79, 65, 74, 323, 321, 192, 244, 64, 35, -6, 268, 194, -271, 335, 134, 296, -158, 104, 245, 39, 249, 84, 282, -1, 269, 250, -151, 139, 179, 499, 55, -156, -116, 141, -322, -272, 119, -294, -72, -131, 96, 88, -271, 38, -83, -211, -418, -27, -176, -9, -38, -243, -231, -462, -375, -38, -64, -472, -165, -87, -362, -343, -281, 88, -36, -191, -129, -132, 181, -95, -64, -214, 7, -126, -6, -73, 335, 67, 41, 469, 186, 492, 293, 280, 134, 77, 172, 150, 433, 178, 561, 354, 180, 260, 261, 193, 4, 278, 23, 85, 138, 184, 272, -141, 216, 208, 278, -396, -112, -19, -100, -65, -45, 80, -18, -107, -403, -155, -139, -237, -101, -207, -69, -406, 38, -173, -208, -117, -178, -340, -303, -252, -75, -199, -245, -133, -4, -302, -56, -189, 178, -236, 172, -10, -128, 14, 67, 148, 34, 99, -280, 221, 8, -19, 64, -33, 187, 10, 298, 313, 198, 109, 305, 88, 44, 431, 104, 224, 144, 41]
3426D1K52l22J79j59K07j90J38m2j33O3L9l0j07M1j91K72K0k19n9k3R5P7j08P2
3450h7l15M61p0k74L83l29K09p7l48J98O1Q5K73m41M93l13Q3k13K40j65K01K84
3472C39m66L50j61J08r6mm1O3J93k56L62m54q9M30o7l0mN5l10J90J88k23Lj29
3496d9J4n0L9J9J19n5j76L16m08M06n11J95k8N8m03L45J22j77Q7j77K23R0k05
3519b06p4m3q5K25l4J68J62m87J03L88l80K76j88M48q7k2k03J35j49KJ52Q4K9
3542B14j76J86l10J36m9J66kj70J44j05%m1N8L30m75J92j85J99K0k3j76K37K1
3565A91m14L79pq5j59J24j86P7J94k37K83k46J58j25k41L29k19L87m24L11k83
3586a93K19o4%n6K15k70J72O9l77L90j33k34J52J36Q4r1k12K23J55k20p0P5n7
$$ y = [41, 293, -29, 150, -9, 198, 8, 146, 104, -29, 34, 73, 43, -64, -23, -214, 58, 78, -141, -200, -223, -128, -51, -159, -87, -402, 59, -11, -285, 98, -231, -22, -99, -447, -249, -188, -103, 170, -271, 222, -91, -8, -221, 19, -146, 55, 339, -127, 223, 62, 170, 74, 70, 29, 92, 285, 29, 391, -63, -152, 278, 211, 181, 177, 232, -78, 112, 300, 77, 80, -49, -35, -85, -46, -27, 92, 37, -139, 177, -231, 175, -336, -141, -169, -111, -514, -169, -47, -224, -137, -314, -91, -1, -206, -280, -323, -408, -183, -217, -49, 113, -374, -271, 117, -263, 13, -175, 273, 186, 164, -39, 96, -53, -51, 101, 185, 214, 38, 224, -86, 50, 1, 167, 165, -5, 139, 34, 34, -7, 51, 381, -94, 98, -87, 112, 132, 109, -67, 170, 191, -223, 156, 149, 64, -95, 29, -157, -80, 114, -123, 160, -86, 72, -53, -294, 35, -184, 203, -221, 90, -193, 26, -38, -38, -94, 121, -149, 23, 92, -285, 105, -28, -262, -110, 26, 110, 19, -193, 30, 185, -35, -105, -30, -87]
3609h7J32j79K80L5k00J80l92N25m70K62K65k67LJ50l52K05J68l02K65k45J53
3630A29j08J0j57N86l35l08L21j84J59l1j91KRK98l01K70l40L20K05m82K14l20
3652b34K94k07J72k8q5M4k58J06P2j73L25k81L0J15p0J04J40j09n1j00K80Qm00
3675c06K10j12R6j69L77l1J08o7j57J19M3K68k92J04k03J25J41o3Kk34K73m58
3697b26M34k11J98J59k17r9J01j49n0K9m6P4J6o8Q7k98J79J6R6j27L5k5k70N04
3721A42m02m2J06J69l3j99L5K39j64q1R4P2k69L89Mj55N7o7J9j93L16l7Q8l69
3745b81M40r4q2K97j44k48J31M01l42L07k61J20k45J85J20qp7J49n3j21M6k85
3767d5K56r1L9R6k15j20K53L2k03k48M62j27K1r6O4M6k80J48j47K34o6J60o7k15
$$ y = [-87, 45, -134, 146, 181, -19, 161, -231, 294, -176, 86, 351, 84, 87, 237, -115, 90, 258, -44, 221, -24, 129, 21, 31, -126, 460, 125, -183, 138, -46, 113, 82, -109, -107, -98, 200, -101, 169, -171, 149, 354, -128, 86, -234, 60, -147, 25, -3, -88, -44, -302, -196, -124, -297, 28, -253, -223, -108, -178, -74, 66, -43, -94, -194, 86, 94, -306, -96, -208, -112, -281, 96, 65, 173, 106, -51, 68, 111, 379, 87, 191, -12, 113, 254, 191, 193, -41, 232, -226, 208, -3, 195, 354, 137, 38, 139, -10, -60, -31, -77, -3, 13, -55, 32, -266, -87, -71, 25, -102, -67, -92, -362, 142, -260, -302, -196, -27, -60, -259, -224, 15, -149, -230, -136, -64, -333, 56, 60, -95, -38, -105, -86, -279, 37, 0, 88, -281, 159, 65, -17, 280, 136, -112, 19, 420, 78, 385, 124, 244, -1, 184, 304, 296, 219, 368, 315, 194, 240, -45, 211, 120, 159, 255, 40, -80, 173, 205, 2, -246, 216, 89, 110, 14, 78, 124, -156, -8, -155, 79, 13, 173, 106, -109]
3791a09Pj9J8J1j0M8J74j87j77j13Q0O9k9K56l34J7k8J73K28n01L53j82N7J2m9
3816b35N4K27l82N6M06l0m5j37K34j32j60K78j09J27j92L73l07J81mm03M51j63
3838H8L43m28R2R2P7n4p9N6p5J63j34J6J01m9j56J66n9K7o4j87J44j16j13O0k3
3863a12o1K1N7j34r6K08N1O3j94J58j34J04%k33J06k34L31l10L60k4j87J09rj64
3887c24L9M10k42K08N5l19J13j6K16q4K6k29K94q8J54J24j75M5j27J71M5r3r4
3910A09K3o6j8K18n7l01J03L39l44k61L39j17N1k36P6J31N1j92J47J04k05L46
3932B40m97L34k95K98q8k34K27j72M54m79R6M1r5J66n9J13l6J90j61j22R5N2j46
3955g8k01J15n9n5L66p4r1N6K54k40l28M19j21l08M35L5j71K12l56Q9k8J42j61
$$ y = [-109, -102, -121, -103, -92, -102, -54, 120, -67, -244, -357, -277, -208, -237, 19, -315, -298, -326, -153, 75, -426, -73, -255, -198, -186, -235, -181, 46, -336, -280, 126, 96, 51, -86, 148, 16, -144, 134, 25, 152, -40, 333, 26, 207, 203, -200, 251, 88, 431, 3, 95, 187, 264, 210, 131, 187, 112, 275, 141, 157, 258, 209, 53, 219, 160, 187, 123, -64, 80, -36, -149, -89, -112, -173, -152, -95, -229, -325, -117, -66, -3, -197, -39, -173, -69, -69, -302, -196, -430, -99, -409, -49, -73, -260, -151, -160, -324, -285, 125, -117, 91, 146, -173, -60, -76, 140, 56, 82, -147, 147, 59, 213, 337, 162, 207, 80, 251, 296, 203, 109, 132, 66, 48, 266, 209, -92, 11, 350, 6, -255, 84, -33, 18, -218, -142, -11, 40, -152, -5, 99, -106, 240, -257, 77, -218, 80, -8, -242, -15, -187, 267, -212, -116, -75, -170, -4, -63, 50, 14, 204, 43, -79, 16, 68, -78, -279, -164, -223, -278, 88, 14, -77, -21, 233, -7, -335, 84, -37, -345, 90, 125, -46, 166, -190, -101, -129, 13, -148]
3978a48J72m7j18J83j6j08M5L6J94l46J98n2L7l22K27PL0K73l69N97m46K7K80
4001C34k32j47Q8J13k60K24o6L8j71R9K9p3N07m78K06k96J32P8j51N9Jj07L1J20
4025G8k20l6M5K8J97l5k27M1K28M6l09k3n0J21j94J2L97j50m01N12j06k8J36k17
4049a55k8K62J7k13j50J28K9K9J17j16Q4j15K12j63j67L62o6M0rl5J38j32o1J49
4073A57k80N1J60K8Q8j71Q5k7J04j34J36j4k5j31R4k1k25O0J05MP6p7k30K06J8
4098C7l25L06K7j95LL59j67m40M69k21L6rR0l3O6j03m00N83k11kK66l33NM2L73
4123B23l07J11j43n8K4J85j53J49J5K0m8j09K73r2P1k79J71r5k7J4J44Q5q8o0
4147B6j33K49J63k43L0k2NM9P0j71n4N9K13l4k20r2K13QJ59l2k03qM2oQ0m33P6
$$ y = [-148, 24, -23, -141, 42, 26, -82, -37, -1, 193, -153, 45, -7, 30, -292, -65, -58, -28, 245, -124, 473, 27, 54, 334, 102, -45, 43, 156, -104, 120, 54, 92, -79, 20, 49, -24, 483, 5, 211, -85, 47, 125, -26, 33, 34, -73, -42, 78, -142, -178, -133, -105, 92, 57, -170, -129, 99, 145, -164, -187, -237, -116, -310, -298, 99, -51, -452, 60, -46, -74, 62, -155, -183, 79, 96, -117, -267, -139, -110, -81, 36, -80, 4, -111, 101, -62, -229, 133, 67, 107, 98, 63, 201, 69, 8, 157, -123, -72, 88, 116, 204, 33, 118, 91, 195, 61, 197, 183, 158, 27, 121, 100, -125, -65, 40, 44, 120, 43, -187, 19, 37, -288, 18, 45, -150, -147, 212, 45, -395, 74, -147, -111, -120, -30, -63, 3, -100, -500, 83, -128, -130, 136, -197, -192, -150, 223, -84, 27, -116, -174, -150, 35, -118, 31, 46, 66, 18, -91, 182, 90, 161, -118, 53, -42, -69, -55, 89, 174, 86, 26, -107, 142, 305, 62, 92, 70, 75, 124, 194, 23, -31, 28, 241, 207, -13, -105, 108, 116, 275, 243, 40, 32, 74, 68, 148, -285, -209]
4174b09K27l41L22J81q6m05L23J60n9j31l94O43l72j26K43l23J48k07O03p16P51
4195B32k47n58O50q30J003o59J97l41M84j52Q8J12j62J86p6Q7l7o1j52J54j2l6
4217a30L45l24O91n76J57r3J69j03k38M38l00M16k65J82k26JK53jk02r1K1J48
4239B72k56l5j71K48M8j45j7L40j9j92K27l89q6L89J75o53K40Rj9j51j25K81Q
4262b1l29P5j99J46Q7N3o7J55j75L04j69J35J26l32J90j98k8j94K94j41K44p3
4284a17L0K26k28J35l37K65K00j11N9j04K71j94M2j61J33j45J41J78k33J56o8
4305A38O2j40K29j30j46L18k42J46j15K53k2k44k63K83j8k80J32J3L3j95J95l6
4327b9j37K72j52j37n9L9l8L39j76q2J43j87K39n29K20J19J65k86k4L38j75ML8
$$ y = [-209, 18, -323, -1, 180, 94, -311, 12, 172, 113, -18, -412, 231, -141, -267, -24, -347, -199, -406, 197, -519, 232, -15, -573, 77, -753, 250, -409, -212, -553, -69, -221, -133, -21, -183, 3, -73, 14, -23, -84, -236, -82, -94, -130, 215, -109, 582, 6, 163, 70, 239, 136, -102, 336, 36, 452, 187, 369, 143, 144, 397, 396, 194, 103, 124, 272, 16, -19, -190, 58, 106, -39, -56, 284, 265, 73, 300, -89, -175, 214, 389, -264, -24, -15, -34, -185, -310, -29, -21, -350, -275, -474, -328, -241, -188, -255, -100, -275, 29, -140, -5, 121, -211, -21, -219, -247, -441, -147, -288, -44, -117, -87, 139, -89, 46, -291, -26, 174, 63, 122, 18, 289, 95, 137, -24, 109, -36, 105, 283, 50, 206, 138, 200, 60, 289, 159, 13, 331, 89, 235, 120, 373, 351, 107, -156, 127, 109, -171, -39, -26, 7, -188, 7, -29, -166, 106, -46, -183, -242, -203, -241, 98, -78, -160, -17, -204, 35, -494, -274, -155, 10, -276, -300, 38, -137, -133, -95]
4350i5n8l2L9J73k13J88j44j17K80m5k35pM73l30QJ41l1l4K14N1j06r6K8J10J11
4375B73k61J23k60L70m48M92j62K48k86K1jnj44JM2j64L13k31K82l60P4J68O9
4398A54k75o7K08N4m28L68k91J65J58k27j10J76p0L46j80j83K3qL18l30N6J23
4420b0k5j55q0J70Q9J55r7n6j69M0L63k98J3j22L02j41L19k09k18P5M7o2j98L99
4444A22j25L0N9k34J60L2R9j96L5J92J93k37K1r1j85J46j16pq4L36J36k46J91
4467B31l20J91K0m53L70m6k67n3K49J83j31N7j94K58k65L43k11J20j95k03K71
4488d5K7M8l41K66L7j17Q4j94J85o0L3k9J05j15K66l30o8J68J24k5k79L55j75
4511h0J07L2l1K4o8p7J30K20l50K22r0k28L21j58L12m93K08Q6M7q6n6J90j87J23
$$ y = [-95, -153, -185, -146, 27, -186, 2, -142, -259, 21, -24, -259, -266, 207, -123, -115, 26, -5, -39, 175, 226, 120, 24, 52, 162, 273, 12, 135, -125, 245, -203, 289, 127, 375, 89, 110, 109, 104, -40, -39, 3, -161, 152, -79, 203, -157, -83, 85, 154, -121, -188, 20, 74, -354, 14, -277, -112, 46, -181, -291, -115, -185, 161, -19, -202, -179, -187, 131, -199, -143, -20, -45, -200, -280, -110, -21, 134, 37, -19, -188, -148, 215, -83, -70, -192, 110, -31, 288, 79, -139, -64, -17, -79, -277, 122, -3, 27, 86, -148, 12, 44, 143, -53, -18, 174, 367, 130, 151, 60, -125, 21, -95, -102, -186, 150, 286, 40, 231, -89, 102, 122, -331, 39, -7, -274, -327, -78, 105, -26, 31, -163, 95, -170, 173, -38, 82, -113, -316, -45, -18, 30, -311, -45, -8, -125, -41, -235, -50, -110, -77, -106, -1, -116, 150, -180, -248, -80, 44, 19, -260, 95, -80, 27, 59, 28, 52, -16, -93, 37, 257, -93, 129, 39, -189, 132, -26, 286, -207, 1, 87, 134, 48, -8, 182, -5, 118]
4535A18j67L78k82k91L15l80K49q0L3J67J34k5O0q6k34M0L9O2K1l23K52O1k24
4558a63R5M5J1n5P6j07M6JK7l68J63J29%K06q5j13O1O2o9M2O5J70l42j44M23j06
4584G0k13J33J21j58L1K36k80Q0j54n1K44J80k42r4J55J04j98J30J46k37L9k0
4606B2l6J93m11L91j95Q1J07J20o4l06K53k53L24r0j44P9k00J22j40M55m91K81
4628I8j2j70R3p2J21l68K41j17P0K4J45j87K06j88n8J80j56J85k59M8o3K62K59
4651B82j19k23J29j05j3r7K54O6kJ8m41J36O6L46j78k10MJ69j18L6j51L18m7j43
4675b3Rl02L04%J44j61J89n0j50jK57l58J41J4J27j66M6J12n9J8k70L60j95k73
4699b87K17k2k38J80M2K40l01o9K06P7nk96M08k09k8k4J09j72L1J71q1l7J16k13
$$ y = [118, -49, 329, 47, -244, 71, -309, -60, -140, -107, 60, 194, 169, 229, 143, -91, -51, -12, 50, 71, -252, 0, 61, -163, -68, -23, -12, -67, 9, -98, -52, -51, -24, -392, -229, -100, -100, 106, 21, -92, -31, 31, -38, 4, 69, 239, -103, -247, 176, 70, -143, -10, 111, -47, -16, 220, -60, 20, -134, -185, 59, 239, -3, -97, 58, 162, -36, 94, 240, 3, 42, 22, -14, 179, -232, 159, -36, 45, 152, 272, 208, -98, 155, -98, 226, 136, -8, 71, -129, -7, -147, 308, -183, 98, 86, -84, 9, -63, 58, -310, -69, -186, -116, -92, 53, -134, 72, -116, -174, 6, -150, 35, -224, -176, -239, 23, 282, 163, -60, 69, -36, -49, -146, 108, 174, 172, 190, -251, -115, -49, 297, 119, -91, -87, 82, -36, 0, -151, 167, 120, -23, -14, -316, -12, -12, 132, -29, 160, 110, -40, -41, 216, -142, -1, 13, 140, -26, 20, 132, 73, 91, -179, 181, -14, -287, -70, -92, -330, -150, -108, 132, -169, -238, -32, 45, 40, -256, 152, -57, -85, -109, 0, -172, -141, 30, -51, -88, 28, -185]
4723a85k3K22J09l79K70j46L22k24P7J33q7K89n60L09j69K73j16j12k4R9o8M0
4745E0R7k87L05K6k99J7J95J4n8%nm5J07j51k07K51j14J6m5J64m7m1qJ45j08J91
4771A63qn9k69L23l42J89O5p9J63q8R1l90K12M9k19M04k14Q3m4o0Q4k6J25j95
4795d2P0J42j49p2q4Q3pOj53K50K1j22k17L43l51K66M8O1o2J0k65P8Q0j6o7K36
4821H7j59J24K7M7k94M6J42M0k80J95J87l57J28P0p1K87k35J11J2M8P0k71K30
4844A84j31j11j20K96j79j3j8K06K17k39j28J62l0j62q9M08l23J02j40J79j49
4865g8J01L2j34K74l31LJR7J72l7o2j12m1K31Q9m53L11R1r3j36K1J30K7j01J35
4890A37P0j97N5M1l35K29k03J11K37r2M6j42k17J59L11m8Jn8K74l82j13M03k69
$$ y = [-185, -208, 14, 123, -256, 14, -132, 190, -34, 43, 176, 89, 378, -182, 127, -42, 231, 115, 3, -21, 78, 10, 50, 147, -140, 165, 191, -108, -91, 104, 118, 60, 60, 55, 10, 117, -34, -241, 10, -104, -88, -133, 31, -16, -57, -65, 80, -28, 163, 155, 96, -173, 150, -192, -3, 62, -17, 146, 58, 149, -241, -29, 20, -199, 205, -9, 74, 30, -30, 54, 28, 153, -42, 28, 170, 21, -51, -135, -52, -59, -53, -206, 44, 65, -57, -274, 69, -282, -16, 32, 93, 31, 41, -224, -146, -66, -82, -149, 87, -72, 52, 79, 126, -168, -122, 20, 60, -220, -25, 162, -195, -67, 3, -68, 219, -16, 95, 107, 155, 225, -46, 184, 53, -58, -178, 118, -61, -74, -92, 114, 331, 92, -36, 126, 96, -66, -155, 253, -70, 32, -108, 71, -78, 23, 55, -79, 195, -136, -133, -132, -35, 137, 100, 38, -74, -115, 116, 205, -248, 63, 154, 61, -75, -54, 76, 103, 2, 137, 207, 10, 65, 106, -229, 0, -203, -92, 145, 53, 99, -43, -260, -101, 210, 162, 163, 105, 379, -3, -116, 287, 18]
4913A8j07J37o6n4O5K16l40j6N5K48p2j47k03K39K9j64K33l21K54k43J70%J62
4936I3j30j23K29j90J92j97J01j86J99J0k07K87j69J28k13J70k9j7J23j49J81
4957A03j79o3o6P6J30R0K0j87J03j99J02J84J1q9J50O2l90Q6NNO3N1K4Q5k4j94
4983d1K53p1k3j21J38j68J30j65n7n6K51j51Pj95L36L9k52M9p7J60K1J08l48K14
5007a9j44K39k80K7J00k8p7J46K76k66J35j22M9j39J60j09j62K14P5k14J09k74
5029c04O09k49n4L80n38M12L1k25K14L8j19O2n05N12j34J00k54p96R66o12J397
5050I31p17J22J9j120J186K08Q1k93L07m09p44K00K94m05L37o33N60O23o54l2
5070a39M44k62N2N4R29n13r0n00K27k11Q49l74l29m8K61N0o15k77Q02j83K76k35
$$ y = [18, -89, 48, -18, -72, -7, 209, -131, -147, -92, 156, 84, -63, -266, -27, 2, -162, 71, -250, 4, -239, -69, -69, 93, -37, -160, 69, -121, 71, -126, -25, -211, -12, -2, -209, 78, -91, 37, -176, -6, -35, -52, 71, -78, 103, -76, -139, -205, -129, 1, 91, 111, -76, 27, -172, -70, 114, 125, 36, 186, 248, -142, -56, -51, -46, 17, 68, 92, 177, 153, -41, 212, 141, 118, -3, 135, -33, 97, -68, -125, -181, 70, -81, -74, -269, 67, 106, -146, -97, -174, -14, 7, 115, -233, -19, -163, 76, -204, -177, -77, -105, -182, -36, 240, -26, 109, -13, 36, -103, 57, -52, -214, 0, 75, -139, -30, -304, 305, 56, 2, 382, -156, 256, 287, 62, 276, 314, 195, 257, -248, 264, 130, 230, -24, -820, 146, -466, 931, 214, 336, 355, -765, 421, 629, 710, 417, 724, 315, -429, -229, 65, -340, -3, -636, -76, 547, -107, -139, 305, 43, 95, 149, 1078, 565, 475, -25, 202, -9, 840, 466, 137, 89, 350, 400, -215, -492, 310, 127, 403, 168]
5092A68J05q89K74O96p72M26L02o58l03N68mP29j121J147j069N4R00q84J044j143
5112d30J25N65l85r4l70J007o78m49P42L2O8j86N2j25Q2p9l19M01K71j35J28k2
5134B01j42k53J55j69J75J23M9J0O7j07J37j00r3K7o6K21m46L39k70J89r6K8N6
5157C5q1J62l5P5l74K83j13J9J0n72O10J71J29p12J192n88o07N33mK54n57n2m2
5180b64K28j71K89K2l20K5J77q4k0p8J58j17J45M2o4J27N9j76k7j19M03Q8k11
5203A12K5j92r9K56k23J02M00j66m02K20L35k50n5J5M3M6k81J4J40l34M13J54
5225B73k2k45r8K03k22K62m3j43J21j90N6p2J26P6r9Q0L0k72L10j50R3j43j38
5248b07J20Mn3J86k03J25qn1K03j26N3K7k26j2n5J52O1k5J15k83L23j38J1j42
$$ y = [168, 273, -616, -342, 354, -418, 8, 310, -348, -651, -83, -87, 642, -479, 668, -401, -347, 553, -331, 713, -430, -305, 260, -125, -219, -589, 418, -260, -709, 33, 65, 133, -53, -1, -126, -44, -123, -442, -41, 230, 95, 223, 201, 59, -194, -39, -208, -33, 90, 139, 149, 216, 109, 246, 146, 53, 80, 14, 235, -211, 128, -142, 47, -49, -21, 35, -46, 116, 81, 156, -218, 65, -48, -29, -19, -591, 19, 190, 319, -393, 799, 211, -396, 137, 133, 387, -170, -222, -264, -36, -207, 82, 104, -216, -191, -14, -98, -118, -196, -38, -155, -10, 32, -32, 95, 154, -22, -49, -168, 235, 323, 112, 137, -55, -154, 102, -121, -19, 381, 215, -187, 33, 368, 118, 63, 78, 121, 167, -114, -100, 40, -294, 119, 273, 251, 6, -92, 111, -111, 151, 108, -35, 86, -104, -48, -120, 6, 82, -17, 63, 93, -179, 131, -19, 74, -69, -207, -87, -83, -136, 50, -153, -28, -36, -87, 116, -10, 43, 70, -156, -168, -223, -71, -10, -35, 80, -203, 120, -18, -7, -149]
5272a49K41k34L07j89M4k07M64l40r8J20l5J06j53J32l00N87k07R1j34j52Jm7
5294a52J40j07K89L7k87l9J51J15M2k36r1R3p5rM24j83k37j1j05R2O4O2k0K45
5318B02k45q2Q0J18j40K26j15j87J94q5M4M8k19nJ23J27n2j83J19q9N2J49k64
5341a84K02N3l52J59J60J06l9k7q3K1J39k67J55j58J6K83l56L15k61K19l59L44
5363H6p8J53j90P3mq8M2J93l47L0k82P75k05K07n39K46n69K59M19j97j4l93J97
5386b26J96l79K49M50J98l53l38J60p26J86O31q3R2j76L29m73M86k42k80J06J88
5407eMj49L30m74J55l7K40l5j5J0R9j31K40j93p9K02l0n0k04J41l9%j15K73k5
5432A13j42o5L39J0l84J75j9n2j4N7K25m12J6P1R8j50n7M45K14m10k05K07J75
$$ y = [-149, 92, -142, 165, -24, 20, -187, 277, -63, -161, -41, -76, 30, -123, 9, -291, 296, 89, 180, 46, -106, -105, -152, -12, -119, 170, 207, -80, -119, 32, 147, 189, -47, -138, -45, -120, -129, 295, 112, -125, -136, -241, -149, -85, -23, -43, 202, -43, -125, -45, 73, -67, 159, 44, -143, 51, -34, 10, 58, -161, -166, -43, 84, 32, -151, -32, -121, -69, 80, -184, 18, 71, -281, -122, 38, 144, 105, 78, -5, 16, 155, -112, 43, -115, -99, 184, -172, 143, -118, 101, -258, 86, 8, 161, -29, 44, 40, -48, -6, 187, -160, -130, -412, 363, 158, 365, -174, 72, -497, -238, 181, -16, -30, -423, -226, -30, -409, -160, 290, 488, 135, -203, -43, -769, -583, 48, -35, 57, -119, 210, -263, 223, -19, -299, -193, -5, -1, -150, 180, -294, -139, -176, 64, 29, 14, 24, 123, -8, 232, 39, -40, 162, 132, 82, -122, 19, -20, -20, -135, 138, 113, -29, -94, 245, 255, -129, 46, 27, -25, -39, 18, 243, -169, -153, -82, 16, -134, -191, 254, 468, 58, -147, 60, 235]
5455B35j44j10m92J97N1L64lq0n32L9M71j50M32k79K11l0J54o08L88J23m32K50
5477E5p41M94K94L3j12q6J19l84J22J77k48j37K36l01N42K28k64K22m25j74M25
5498G5k9o2J80j53O5%l21O32m86R1L01l91l8Q5K5K44j61n71P05n01L50J79l13
5521i4J70l03K65M15k39j13k03L60M29l39j57l6k18m58Q96l91j07J31j5K20L68
5542E81j026P46k41l26P13m53m58L00J81j1P2l27P12n93p12N22J47P89j095O42
5562A63j5J49n4K40p31j83K48m36M17M53n2O22j242J125o11m67N51PJ33k81K45
5583B81n11M7K79k01j47J42J01j02K44l08J1L98k25O6J52j76o2j11lJ03N4k52
5605b20J87J89j91j0J19L6j15P6j12L6j6n3J69k25p6M07j76ok3q2J02n9j52P9
$$ y = [235, 91, -19, -511, -314, -263, 101, 98, 18, -514, -475, -4, -154, 278, -1, 210, 180, 334, -274, 114, 237, -195, 55, -686, -192, 102, 135, 23, -63, 56, -328, -206, -29, -277, -414, -178, -479, 63, 291, 27, 249, -176, -350, 75, 46, -16, 164, 11, 76, 76, -245, 387, -99, -8, 293, -98, -136, -51, -26, 218, 57, -514, 191, -310, 40, 219, -94, 76, -227, 38, 453, 214, 101, -102, 258, 687, 348, 191, 155, -63, -521, 375, -16, -123, 8, -7, 213, 581, -445, 301, 60, -266, 447, -6, -464, -164, 17, 6, 78, -249, 463, -130, -842, -320, -173, 616, -479, 163, 148, 297, 243, 483, -248, -431, -183, -619, -202, 251, 199, 821, -421, 704, 93, -374, 177, 184, 317, 36, 281, -230, -183, 96, -105, -252, -110, -9, -111, 133, -175, -164, 234, 9, 75, 227, 51, -11, -122, -125, -22, 32, -220, -33, 156, -35, -45, 74, 110, -5, 71, -41, -5, -21, -74, 95, -130, -206, 201, 25, 19, -4, -86, 16, -43, -195, -116]
5629a16R1J19j71R4k29K93k6j56Q0L18k40j81J59j18M1J14QMl50L08P5j73J61
5652A05J43j81Lk61L71l46J85q3N2J03j81L2q6Q0O5k11K31p3J53j7j26J48j10
5675dj97L61lp3j83J84j58M0K67k63j9k20L22j65M6J93j99m2J61r1K66k26J53
5698A50Rp8j39qN6k1J29k17J65K8M4k17J49K6k62J63K01l19L47l09J30l74L08
5721c9K58j83O0l4j04k29K20N2M5N0oQ4l41J61R8P86j157N2l59R51j38m50j27
5744c50J20Rl70L73M30p7m2jK20l94j40m73O85J69n26N18q0l97O44m98J23K14
5766A57R2k82k05M14Q9k84l41N21J48o80N46J34l15R5J11l61Q7M47o36O32q0n31
5788b42L02J23k34l80k72O25N65q56Q40o02Q37m24m31J53K44q3k01p60R27o40
$$ y = [-116, -25, 94, -77, 17, -212, 81, 55, -101, -21, 297, 57, -124, 35, -83, -42, 72, 80, 84, -266, 42, 117, -56, 105, 248, 67, 70, -191, 180, -166, 19, -64, -12, 91, -90, -58, -144, -64, 1, -210, 21, -52, 101, 84, -42, 106, -4, -201, 160, 157, 84, -99, 85, -73, -33, 234, -29, -48, -268, 54, -111, -65, 128, -71, -113, 48, -43, 223, -3, 150, 159, 81, -58, -66, -10, -31, 98, -119, 46, 74, 118, -99, 50, 76, -186, -23, 178, -141, 206, -103, 27, -347, -39, 219, 36, 96, 62, -42, -271, -51, 1, 46, 96, 90, 174, -167, -6, 92, 878, -279, -227, -586, 365, 227, -223, -350, -230, -221, -591, -218, 212, 135, 93, 92, 312, -82, -222, -695, -10, 159, -367, 151, 71, -326, 318, -180, -57, 157, 249, -33, -238, 176, 265, -19, -360, 161, 309, -371, 175, 309, -6, 89, 200, -161, -74, 373, -263, 369, 289, -242, 60, 183, -51, -431, -703, -78, 487, -369, 471, -131, 706, 282, -149, 4, 248, 165, -36, -796, 131, -509]
5808e09N24N44j20j26p52P43k95J78k71j80L03l09p49O26O92n61N28J44k69q5
5828E6l30k44K94k26O49m47N75p41k07J122p87M20L25j08K37o57N7K37o63K90
5848a48M04j33k08J20J68m1j13k40R7j82K58J10k69L76K8j60k3j67L65k61J24
5869A05k03J29M4K44m71M5o8K08L2m2O5p6J1K09j75j44J5M80n30l2N9K23J61m70
5893a81L55m97L83o29Q14K62o41M34j33K36n73lK01K62j15J88n61K31K94l97J60
5914I0k23L07m19M9L56j11j16m3o9m4L40k09l2j2k15P65l52k55K62k36J70L85
5936C88m57J93j30m6J95n0j56N1P6oj19M6q0J02k1J2M3k3j19r7L94j83k0N5K2
5961G0l58N28j84j1m0J80j7l50R4J10j0J97m1k45K08O7k35l3mp6K17j1J4N8q3
$$ y = [-509, 15, 559, 439, 313, -439, 304, 9, 187, -84, -264, 39, -270, -1019, -393, 299, -262, 266, 410, 141, 56, -274, -518, -224, -450, 199, -248, 327, -414, -621, 501, -286, 134, 459, 351, 588, -69, -12, 225, -438, -148, 256, 123, -85, 35, 203, 162, 49, -191, -94, -276, -18, 92, -177, 199, 227, 67, 44, -123, 242, -19, 105, -98, 31, 75, 319, -152, -107, -175, 33, 65, 23, 88, 12, 23, 232, 57, -87, -72, 408, -122, -154, -95, 128, 289, -181, 174, -323, 60, -569, 245, 507, -134, 300, 167, 403, -170, -173, 28, 290, 175, 363, -198, 33, 327, -70, 90, -133, 174, -245, -196, 160, 49, -67, -110, -179, -223, 117, -92, -124, -136, -351, 414, 62, -193, 69, -167, 3, 388, -69, 124, -6, -52, 143, 93, -63, -12, 64, 58, -61, -15, -95, 7, -14, -2, 41, 18, -101, -198, 196, 13, -7, 48, 70, -288, 240, 56, 45, 5, 185, 168, -182, -88, 22, 12, 209, 168, -77, 131, 198, -37, -70, -74, -150, 67, 56, 70, 128, 45]
5986D5k67J28P0j54J86j5oJ90l72K62O2m22L15J30rj04r2J30k49L18l37j47J86
6009a52J12L11m13K6J65k06P6J08r6j08J26m2K1J51k65N6N3J46j06J32k15K06
6031H6l2m9M3J34Q6j06j54R7j78l0M9p2O8oJ65k02O5J87l3J05k65m6O9K24k70
6056f5mK10p4k65K02K17k41J12j20L36m68K99l20K40K8j21n5j2Q4J91l65L42k98
6079a47J59K5M4J00j68K91m92L28k7m5j72J39j02J39K0n7k16L23j89K47m17J54
6101f3L8j22m9J87J01m0j34L5J44M4Q4j16L0k72O8K4r6J80K65l97M0J9J41k62
6125a51K96l04M75m13r0L73j75M3j2M2j81j00l3J19M0M3o8J48J26k78K38n2k36
6148a50j24J74J13j49J31J98p0k93l02L95K07j89J56k51K13m7j09K26j39j67L43
$$ y = [45, -222, -94, -24, -178, 8, -7, -13, 177, -195, 67, 129, -293, 22, 152, 143, 39, -53, 77, -172, 146, -191, -338, -152, -40, 271, -142, -116, 49, -157, -81, 27, -69, -177, -51, -93, -72, 79, -186, -130, -77, 69, -37, 95, -120, 86, 54, 5, 48, 182, 268, 162, 8, 105, -73, -103, -54, -126, -58, -64, 101, -101, -36, 151, 118, 223, -42, -88, -19, 205, -65, -69, 141, 67, -198, 4, 221, -20, 92, -28, 308, -160, 139, -181, 59, 87, -34, -89, -101, -17, 174, -191, 151, -147, 12, 37, 81, 181, 13, 304, -188, 140, 113, 68, -104, 35, -67, 72, 92, 35, -181, 142, -47, 200, -217, -63, -25, -147, -196, -9, 92, 52, -82, -47, 97, 141, 225, 109, 139, -133, -65, -41, -137, 43, 308, -89, -49, -30, 111, -151, 145, -159, 316, -97, -187, 186, 11, 54, 42, 84, -97, -197, -230, -111, -71, -28, -96, 52, 178, -100, 138, 86, -150, -274, -100, 13, -136, -5, 193, 123, -170, -472, -77, 130, -59, 97, -154, 59, 12, -97, 129, -10, -177, 166]
6169A66q3q6Kj38J72j39n9j93J15J93L5J57o4K3J24r6l78J85j80M48j9j26Nk34
6193a70K34l7j84K88j70n2K37k17J03p8k0j58K82p2M9j79M3j55M7K43J84k49J05
6216G4r2Qj12Q1j7J03j02kJ08j56P6J19k08J08j0J35j78j7M76l89K99m23L00k95
6240a14RL22m10KL50k82Q8R5k10J62K31l32J53l4j30L26j66k41J36j28J30m3J41
6263E5j64K59m31K32n7J71l93K36K46k11NJ19m4n9J28rj28OLk8J44P1k77K11N7
6288A42j85J50R4j11k16K35q9Q0j98j1j77L73Rm6k19P7N2j17K03O8j91J20o8j9
6312d4p2L0L9J46l1j18QK35j42j6Mj65K15N4l61L73j33J33j46p1mK27rl90J72
6337f6j27K15k06k30J57R6J35J97J93m85M71k27q02R10O6M4n26K13J64l57L68
$$ y = [166, 83, -3, -1, -139, 33, -106, -165, -358, -243, -50, -15, 142, 78, 101, 225, 129, -249, -64, -244, 204, 185, 59, 64, -170, 64, 27, -157, 131, -39, -91, 146, -71, 32, -46, -66, -224, 58, -14, 35, -144, -101, -256, -209, 34, 218, -31, 74, -18, -10, -122, -41, -58, 45, -57, -59, 49, -107, -31, 88, -120, -12, -22, 113, -65, -82, 394, 5, 304, -119, 181, -114, -105, 217, -193, -191, 159, -123, -35, 60, -150, 12, 243, -89, 64, 30, -100, 226, 60, -181, -45, -173, -43, -86, 55, -109, 150, -281, -49, -106, 65, -328, -92, 154, -57, -52, 67, 23, -36, 92, 83, -45, -39, -36, -64, 80, 151, -126, 85, 142, -43, 107, 201, 90, -126, 109, 20, 100, -98, -109, -286, 87, 96, 50, -169, -92, -40, -157, 46, 114, -77, 43, -25, -44, -116, -86, -47, 99, 68, -50, -42, 193, 51, 35, 39, -126, 89, 143, -218, 155, 22, 155, 9, -62, -66, 161, 152, -238, -66, -193, 22, -184, -414, -257, -161, -26, 171, 364, -121, 350, 123, -679, 231, 297, 341, -185, 28, 192, -165, 203]
6358B03k7l84O4J43n3o8l5J37J6L7L2J3k69J52K9j50Q6J28L4p8q4J22k19R8qj43
6384b24M98k77l7J67l2r3l5J5m8J39P0k07J42k07p4K00k5n3R1p8M8J6k3k2l09
6409c58M56k82M4L53j03j28L6n5P4J84r2j14j89K25k3J3j53M0o2j70K94K0m1j08
6433a39L57k41k1J24j7N6j80o3pL6Q4M5j68J06O9p0P4j87J09J43j65j82r3L84
6457E4mj20P7N8j49J12j62K22k8j7jJ75k36J04P5p27Q27j5l62j58N74j18M5l77
6481a51N42p5j75o36R7Q10o69R87m09p87O27NP5rn55J82Q0J12p3O9m0p2j04K7
6505a42J12k2m8J89N9j65J53K16q24N26k4K04m03j02K36P5k53M52l64J24m8J46
6527I7j27K6k58K37p9O9r2J5M05l63p3K30l8k3k77K68J85l02kK28l11Q2J59j71
$$ y = [203, 176, -208, -144, -1, -54, -122, -157, -20, -4, 33, 65, 78, -191, -39, -10, -160, -74, 54, 88, 10, -74, 48, -171, -73, -81, -224, 274, -3, -40, 127, 95, 2, -33, -18, -66, 73, 143, -64, 78, -129, -203, -3, -28, -81, 10, -68, -20, -4, -27, -49, -358, 98, -184, -140, 213, 110, -18, 18, -37, 37, 221, 129, 15, -174, 51, 28, 41, -112, -72, -134, -304, -10, 10, -31, -139, 218, -23, -44, 80, 63, 119, -61, -124, -131, -95, -11, 34, -134, -28, 41, -29, 45, -142, -33, 110, -55, -237, -330, 54, 50, -70, 7, 65, -84, 28, -134, 88, 60, 43, 42, 217, -19, 85, 160, -567, 260, 245, -117, -275, 299, 181, 226, -151, 391, 316, 141, -495, -398, 412, -257, 730, 321, -466, 161, 166, 241, 232, -323, -141, -61, 51, -22, 47, 7, -65, -169, -142, -30, -52, -100, 89, 148, -17, 136, 352, -472, 54, 30, 234, -169, -271, -35, 40, -213, 239, -125, -1, -49, 97, -30, -4, -262, -25, -104, -35, -127, -112, 293, -70, -143, 87, 49, 26, -251, 17, 202, -100, -102, 126, -185, -103, 56, -115]
6551a15P5J84p0N4k63J88P5J77k08k05K33j86K81j85n6J37l68K52m5n1R3n9K67
6574B05j24j67Q4J79l73J18K1K46N9k03q7j8R7M8N6j03j64J2L84m0l92J28J75
6597A41j47j46k0L49k70l3M1K64m9r2m7m6Noj73L46q7kJ37j23j62j0J10M8J1j81
6623a42J15K7K02k07J49k30j80J42l5l1K91j23j73J00M5J94j19j22K79l80J85
6644a3j7l7L80N5k76J8K4o3J33rj86J62k60Q9J0j43Q0O3j47K67k46P7j7J74j58
6669d0l14L18L90p43J02K38R4j31M41m00l17M81M19l90o06M76k37K39K2j34k00
6690b92N01l41J22J01j07m6j21J09J73j12Q6j67j66L95n6j33Q8q4k1L91k96N7
6712H1r7j40L6KL12l47j9J33LJ6Q4j03r3j96L26j37M45m53K23j9j36j80K11K8
$$ y = [-115, -40, 144, 74, 128, -135, 53, 128, 305, 97, -108, 125, -61, 220, 35, -21, 116, -252, 0, -45, -96, -3, -62, 205, 81, -86, -2, 177, -196, -78, -57, 189, 248, 45, -42, -60, 37, 85, 141, 38, -126, -114, 270, 230, -162, -34, 141, -6, -152, -172, 177, -93, -126, -85, 179, 130, 38, -9, -55, -50, -56, -229, 117, 30, 28, 165, 42, -120, -130, -20, 28, 39, -142, -27, 0, 202, -5, 144, -86, -266, -124, -159, -190, 101, -22, -195, -95, -50, 144, 25, -97, 182, -198, -13, -30, -67, 313, 368, 92, 110, 134, 71, 204, 195, 9, 171, -89, 0, 10, -133, -53, 10, -137, 130, -116, -39, -56, 118, -40, -354, -36, 354, -389, -287, -49, 45, -86, 355, -45, -362, 119, 538, 148, -458, 18, -219, 20, 42, -92, -292, 209, -132, -10, 91, -16, -62, -183, -74, 99, -13, 73, -94, -260, 135, 79, -54, 34, -50, -71, 320, 24, 81, -16, -156, -120, -118, 194, -153, -172, -39, -36, -20, 64, -39, -132, -328, -2, -139, 306, -147, 76, 57, -79, -259, -48, -20]
6736b0N5P0j1j17j57K41J37J78m20R2J05k28L7J00j49J86J7J27L4l43O2p9O9k2
6760c6n0R5k8J09k79J61n5nJ7J70K24l20L5Oj50J73k18J32Q7k07J12j86L9J96
6784B2M5n8P5l4j47N6J71N6j24n9J25n1K44l33R8l0j17j38J99J29o4R1L4j14j35
6809e9k8p9K73K10l37Q4l19K02J55l3j63O3O4j77J22p2J68j38K7m7m3L54j23k92
6833a88J86r2j30QK10k10J39Q7K3k4K09j61J62l71J57m0j88K36m5j9l6J46K88
6856C47k67m1k98K92J34j57j49J53k8K26j69O3j29J82k22J03o6Ok22K06j2j1J19
6879F0l73L57R9j69K82k21j6J83Nj79j85K40O7k50K5j07J50q0L48m16L67k81o2
6902a56O3P6k35R4n3K86J9N2q3j8n6r9J85o2K18o7j57r5K8j36K98k92J96P4o7
$$ y = [-20, 35, 105, 94, -23, -180, 61, 198, 376, -44, 48, 153, -75, -38, 62, -87, 99, 116, 243, 277, -66, -4, -83, -14, -36, -86, 9, -19, 90, -189, -28, -83, -88, -71, 99, 323, 3, 38, 44, -106, 67, -151, -19, 68, -139, -27, -213, -174, 22, 67, 9, 84, 50, -97, -41, 130, 186, 62, 3, 128, 77, 321, -12, 86, 56, -61, -199, 0, 129, 65, 156, 190, 76, -59, -87, -166, 107, 317, -20, 64, -255, -53, 102, 69, -94, -31, 33, -144, -22, -94, 74, -64, -37, -84, -127, 227, 104, -188, -2, -94, -224, -216, -6, -216, -77, 10, 33, 9, 218, 57, 219, -152, 5, -35, -223, 13, -32, -51, -87, 59, 347, 80, 39, -259, 33, 167, 10, -139, 14, -14, 212, 43, 106, -23, 159, -63, 40, -26, -20, -242, -36, -48, -59, 60, -313, 44, 143, -26, 256, 35, 19, 202, 207, 28, -157, 83, 150, -100, -75, -182, -32, -112, 236, -180, 187, -94, -156, -93, -17, -252, -158, -211, 75, 94, 146, 63, 45, -11, -110, 75, 13, 231, 164, 7, -88, -60, -196, 102, -190, 6, 80, 13]
6927A3k41J91j32K18q7j47K17J48q1J6j88R5k41L17l4qN0Rm3j98MN0k6J08M5m26
6953c71K55N21m39J4K45j14Mj26n2oJ35r3j0q1R9Q8Q5j39L5j79J43j35n3M12j23
6978A15l12J23Q4r8p2K06P9j96j15j03L48j22J1K15k89m2J5j0R6Q8j67R6q5n6
7002a91M83l28k4j07O5o4l7N6L94l37L16k80K38n8j27K2P3j50M7M5j89N5J57J14
7026A73k68J59k0K13m40N3Q7j30O9M0n2J59K67m28P9LQ1p4K5N5k07L62k01J09
7050A14l41L51k4k4Q7n75K34M52o24k8O4O99l07K25r50K28K21l59M78J93m0pP9
7073A46j97J11j76J34q3n6M02m10J23k32n0Q6Q7P4j58K65r5o2L3J29k01L27k02
7096el3Q4j35K71k23O1M1q2o6K67j10p1k4J64j11Q3Q6l22L64j65j38M5l4o0J2
$$ y = [13, -228, -37, -169, 49, -38, -185, 32, 180, 99, 115, -73, 22, -219, 98, 64, 56, 106, 115, 72, -126, -122, -72, -98, 10, 55, -371, -116, 405, -34, -20, 225, 111, 115, -11, -63, -69, 66, -27, -37, -118, -19, 69, 154, 15, 50, -129, 14, -121, -174, 238, 115, -197, -74, 10, -88, -160, 46, 125, -71, -186, -289, 59, -63, -52, 163, -126, -168, -153, -163, -67, 21, -146, -50, -135, -191, 292, -36, -60, -167, -102, -166, -203, -147, 247, -90, 226, -54, 184, 126, -1, 21, 94, -56, -9, 36, -153, -98, 59, 173, -95, 64, 44, 257, -183, -130, -43, -173, -104, -64, -116, 43, 310, -118, -39, -36, 45, -29, -4, 51, -156, 206, 5, 114, -227, 124, 100, 76, 163, -412, -178, 274, -350, -378, -314, 385, 78, 303, -647, -419, -198, -557, -79, 114, 74, 67, 146, -51, 60, -116, 18, -65, -121, 281, -129, -6, -238, -288, -202, -115, -41, -199, 66, -29, -91, -58, 71, -130, 197, -5, -38, 46, -89, 182, -41, 20, 61, -21, -87, 180, 70, -1, -25, 139, 28, 111, 197, -125, 239, 74, -64, -19, -53, -113, -101]
7121a01J01l2j42J63n1k36M65p0q7j65L37l14K11k13N8J52j84K2J79k5j02j68
7143b02L3L76j63k01Q5K9k44J67L18l84k2L63r6J54k48R6k33K79j18N4m5K42j88
7166E2K46k34N6j78K06k18Nk81K70J11j54J92j20l5L8j47J78K6r0J2J54L8J35
7189B62k22m9r0k27L97k01K25r7N1p9O5j42J61K8j84K26n0N7j32O6K5j00R0j28
7213d8M0K79m36K10n5n4K02m24M26J36k28J38k71J93j96k34L25k6m2J26L4j52
7235e7M8Oj36L5M46l29K06j03j75K49k46K03k5l29J65JJ70j18j5J58k92K58p7
7258D3j67J8K59k26j17j22K84o6K75j02l39M04j59j8K08k14J65j40q9J73J0j82
7280a02r5J13P5Q8k74kR2J44Q4m4R1Ro7L1Pm4j47l7l1J09n7L2R5r3J6K2N7Q8r1
$$ y = [-101, 0, -32, -174, -11, -62, -298, 167, 97, 10, -155, 182, -132, 79, -134, -76, 76, -108, -86, 93, 68, -34, -202, -169, 207, 44, -157, -72, -43, -287, -120, 198, -186, -208, 155, 59, 213, -35, 61, -172, 107, -11, 43, -2, 240, 52, 298, 64, 120, -58, 148, -70, -65, -346, -76, 35, -119, 73, -47, -82, -44, -191, -13, 13, -77, -65, 89, 127, 262, 40, -9, -99, -326, 71, -130, 95, -2, 49, -30, 35, -107, 54, 82, -102, 124, 74, 131, -1, 65, 90, -10, 80, -48, -8, 271, -165, 45, -10, -64, 138, -286, 140, 276, 48, 186, -85, 108, -88, -322, 3, -23, -65, 61, 95, -57, -9, -3, -139, -104, 342, 13, 219, 116, -59, 190, -56, 147, 122, -207, -42, -41, 129, 11, -4, 154, -138, 120, 43, -124, -106, 153, -73, -190, -312, -28, -94, 181, 79, -260, 144, -15, -33, 175, -39, 126, -14, -103, 70, 80, -102, -197, -84, -9, 79, -195, -197, -105, 39, 123, 79, 170, 179, 112, 143, 150, 106, -41, -78, -109, 0, -57, -25, 70, -23, -7, 15, 72, 160, 69]
7309F9k13L28n8k27k15L41r8N0J4L2p5L25k02M3o4l6N2p1N5j06k48K91oj6r4M6
7335h3L13k79k1r0J32J94q8j54P8KK7j15K17j01m2m7J51p9J48j85n1J8P6J12j42
7360ij94N4K22j01P6j49L25p1j29L6K5M2mm42J92J34k05R0J27q7J87j60J8K13
7384A90j82j24j20K08L53k85J40n14L18P7j35K07k92K62k7r9o9K38Q2j85Qj77
7406a26J94o7J41k19R0M3K7K26l11l3M5M3j27K62l11K50j2j79K6J17j91j86P00
7429D02o75P9K66p4k27M89j56l33J40R8K43l53K49j93K79k07p6kK0n3J26j3j31
7452a02J85n1Rj59l4J90j23o4J8R1j47K34j86L38r4O4m6q1K11j66k89J39J49j47
7476f1J27n7J51k03j35M64m68Q7R2K80k61P9M6k43J45r9K38k11p9M3K7J21M5l40
$$ y = [69, -144, 184, 126, -101, -316, 25, -73, -23, -9, 23, -52, 273, 71, 114, 50, 14, 66, -5, 50, -56, -304, -13, -19, -35, -129, -83, 230, -49, -70, -160, -28, 166, 78, -76, 2, 4, 31, -84, 133, 32, -10, -57, 94, 15, 163, -22, -73, -55, 21, 133, -9, -203, -149, 73, -28, 48, -101, 224, 153, 24, 60, 85, 127, 123, -319, -127, 7, -198, -108, 19, -68, 119, -41, -23, 190, 8, -116, -236, -28, 325, 40, 180, -334, -16, 61, -74, 133, -159, 103, 76, -23, -92, 146, 228, 43, 51, -126, 68, 1, 142, -77, 13, 56, 83, 309, -2, -35, 10, 53, -74, 188, -123, 127, 115, -64, -38, 79, -112, -298, 402, -273, -194, 72, -2, -229, 260, 104, -229, -89, 9, 252, -101, 148, -45, 234, 27, -49, -51, -31, -84, 42, 29, -102, 83, 32, 41, -118, -152, 38, -85, -149, -131, -40, -187, 47, -139, 199, 105, 169, 123, 42, 253, 87, -202, -63, 86, -61, 66, 9, 160, -43, -178, 286, -182, -95, -3, 277, 16, 95, 141, -102, 43, -56, 182, -29, -108, -65, -38, 83, 128, -212]
7500b12K36j67J65J20j87K24k63J31j85K68J8m1j55K94l66J00R0j36J82p4J5j6
7522D1N2q1k24j6J89k5J37p4j8p0K35j65j5OJ1l5J55O9m65L02n0j1mK18k82k7
7548a47K7R7k54L44R3q9l35M54j53j55L38k30J11j94J75j02J59l71J92K05p7k79
7570a91J62J26k31L54q9k29j36L14j56R9R1m1j08%M20k57j98j62J69K16q7j95
7592a29J36O7K98m86J58q3o9L71j26l04j10K73J13k14K70j32jR1l11J55K25j05
7614H7j73n5K12o4j80J07Q9K95n20K60OK73j48j94J8j18L71k81J32j02K8k20K76
7637I9j14n2J41J5Qj88O4K39l7m02L73Q3r1l05N5K48L5k11J18k89L97j19o3p5
7661g1o5K24l19L17k55K71j11J30l75J07J76N9Q8j05m1r9L74n01K20j08M3j6l7
$$ y = [-212, 24, -143, 22, 142, -45, 179, -84, 47, -138, 130, 148, 107, -48, 246, -120, -20, 70, -66, 116, 42, 57, 41, 93, 12, -212, -228, -39, -64, 73, -1, -19, -89, 146, -19, -34, -28, -17, -52, 103, 172, -293, 9, -41, -52, -56, 162, -120, -147, -120, -23, -277, 67, 160, 71, -264, 190, 37, -118, 220, -10, 101, -93, 82, -20, 139, -232, -40, 165, 88, -191, -29, 97, -134, 220, 131, -98, -234, 80, -76, 23, 114, 73, -35, -35, 385, 128, -70, -232, -63, 153, 66, -129, 7, 74, 372, -114, 44, -39, -108, 263, 137, -167, -277, -4, 109, -105, 165, 33, 32, 123, -188, -33, 192, 87, -86, -141, 71, 7, -173, -66, 23, 318, -202, 58, 64, 337, 189, -5, 13, -105, 266, -15, 117, 15, 43, -177, 99, -15, -67, 74, 89, 97, -91, -27, 212, 175, -227, 146, 229, 138, -167, -112, 136, 171, -40, 78, -211, 186, 67, 4, -71, -136, 88, -231, 86, -169, 102, -9, 121, -254, -147, 29, 88, 176, 71, 30, -69, 305, -196, 24, -84, -41, -57, -94]
7684i4n6J13K10k29k09J94oj41L42J21k11j80K13k66M23k05J24l85L77k3j38K64
7706B38L4j15r8K12m21K44j78L74l35L1P9J28k92J76q7n9o4K50q8oJ22K9j28j0
7730C6P3J03J24j64j29j36m4J62j09j76K26J67j97J42j20k5l0PM5L9j64K60K0
7753A10j55O0J29k04K9J93P5m35Q25o4p03L17k91M2L8J10R3j20k27J62R4K6j15
7776a1l01K81K27l06K45n6K39l86l7K64M5j24j47J62l12J72K57m43L67q7M9k07
7798a09J32N2p6J15p7k2k23K70J28j85n9K70P3m24o1K33m4k5J49K64k14k18K47
7821A96m5k66J70l1J49k47j6R1k56K00nK76k31J10q8j34J76j97K02j58J91m2j5
7844C0K14l65J89n1j34k6K65j28r6J59M3L5j15O7k43Q6K6K37m5j53J5j5o7L06
$$ y = [-94, -150, -37, 173, -56, -265, -71, -77, -218, 124, 245, 34, -146, 67, -199, 224, 19, 143, -242, 135, 112, -26, 238, 272, 157, 59, 271, -150, 94, -84, 290, -45, -14, 65, 193, -99, 77, -10, -69, -133, 117, 29, 23, 145, 174, 46, 36, 109, 212, 336, 172, 43, -93, -137, 25, -84, -260, -34, 133, -64, 78, -42, -67, -97, -90, -45, -6, -170, 90, 110, -45, 15, 144, -60, -31, 162, 237, -198, 627, 563, -140, 177, -114, -72, -34, 76, 169, 49, -178, -16, 78, 104, -11, -312, -31, 196, -110, 135, 79, 318, -68, -105, 159, 204, 80, -67, 95, -217, -45, 212, -231, 136, 49, 98, -109, 23, 75, -1, 114, 37, 15, -208, 62, 190, 5, -54, 216, 289, -135, -196, 37, -7, -32, 117, 381, 167, -51, 196, 151, -115, 55, 24, 173, -74, -90, 1, -255, -55, -60, 216, -15, 95, 7, -127, 49, -148, 54, -104, 87, 45, 30, 244, -121, 68, 17, -117, -143, 122, -6, -102, 57, 100, 135, 20, 87, -156, -70, -44, 193, 148, -5, 10, -5, -72, 234]
7868B34j08n2n4p3L4K54J19j64j13k12L44k07o4K58k60M37n73K03K40l47K18k47
7890a33QJ19p8O5k35J89M87l17j23J54j54N0q3q8K9J06l83M16L7m5j02J47n9k6
7914a9m3K18l98L77j69J08K08k44J01j10q3O7n9K22l20J35K12m04J13J49m1J27
7936A47l36Q6J36l8j04J73q0K1O8r4J11m07K96j57J72k15J43KJ01j12k1L3m5P6
7960d4jK39l21J58q3J22k26Q5O8L0j23J79O9p8j74mj8n5J22J49k09L1nM3J82o2
7986G4R0k65J62n6J17k48K99n3k78J94m4L2q1L5j9Q6k7j04J41k16M5p9J74j6J91
8011A54j63j31jj13M20o7r0n6O4Q8j49K18m31L03j27J26m0J31k63j7K45r6O8o7
8035FJ16j42o4J6m2M2J53J62j70k53L15n4k08J68KJ36j90PK3l38O42j89j36J04
$$ y = [234, 126, 74, 20, -53, -19, 235, 354, 190, 77, -135, 209, 2, -62, 196, -64, 373, -200, 3, 243, -104, 114, -133, -125, -6, -84, -19, -254, -65, 422, 105, -18, 136, -18, 32, -51, -139, -110, -4, -387, 29, 66, 21, -81, 66, 7, -19, -62, 156, -242, 135, -34, 74, 282, 38, 139, 29, -54, 13, -46, 176, -144, -9, 203, -201, -88, 61, 20, 147, -189, -103, 33, -5, -109, 64, -16, 5, 73, -21, 90, -317, -21, -178, -6, -221, -78, -76, 25, -87, -108, -75, -120, -44, -45, 194, -127, 31, -52, 70, -156, -71, -3, 27, -96, 83, 152, 74, -100, -104, -122, -177, -55, 94, -115, -84, -89, -46, 136, 74, 164, -101, 61, 5, 122, -126, 173, 120, -158, 36, -8, 24, -57, -22, -41, 45, 18, -86, 55, -161, -116, -195, -21, -37, 154, -9, -140, -141, -254, 166, 99, 9, -47, 17, 105, -44, 174, -257, 46, -81, 45, 5, 136, -127, -144, 101, 5, 73, 6, 122, -20, -84, -68, -110, -68, 85, 247, 77, -176, 139, 85, -123, 45, 47, 183, -7, 0, 23, -315, 327, 138, 2, 106]
8059A06m7P6j9j72K4m0R4O6k9r8j13K16m0q0M33m10O1r3K5M5n0r7K78J35m2l79
8085a50J64j96J85M4j88J14o4J81j91K69k15J14J07k01K7P7N0j88JJ78j53j0R8
8108E3k27J97M8k08R1J46l69K05J06n0Q3j0j04O6j41oL26j2k65L56l44J80Nk47
8132a21K88m69Q3J72O8Nl5m8J13O6j11j61J52m4N1j88K15j60J70%Lp6j01O1M3
8157b4J74M0j69r8R5J5j7J0J42j15l2o8K22K9j56l31M00k16j28J42K91l30J17
8180gO7M7oj86K29l14J23r4J39j13J15
$$ y = [106, 59, 135, 116, -56, -32, -72, 22, 88, 59, -39, -152, 64, 24, -56, 377, -33, 28, -65, -40, 5, -45, -142, 136, 271, 229, -150, 14, -182, 3, 47, -141, -27, -91, 90, -101, 168, -47, 67, 174, -27, 0, 77, 127, -61, -60, 118, -35, -45, 53, -174, 23, 71, -137, -46, 100, -269, -64, 42, -8, 75, 65, -39, 27, -114, -120, 206, 194, -71, 285, -59, 121, 126, -121, 167, -302, -219, -47, 21, 26, -9, -57, 56, 122, 11, -150, 2, -42, 9, -179, 36, -124, 46, 46, 49, -27, -128, -67, -24, 150, 190, 21, -77, 18, 33, 16, 26, 168, 53, 21, -47, 175, 204, 48, -283, 117, -99, -227, -85, 206, -124, -7, 60, 107, 101, -85, 144, -170, -47, -141, -2, -115, 0]
8191@
$$ Imaginary data points
##PAGE= N=2
##DATA TABLE= (X++(I..I)), XYDATA
0@%%%%%%%%qJ6j6J6k4L2m0M8n6P2q8J04j21J45j76K08k40K80l28L78m35M99n71
31c05O51p40Q39r46J066j198J342j502J675j864K074k300K546k815L111l435L786
48A985m173M597n065N582o150O783p492Q290r196J0234j1439J2854j4544J6604
62H870j9179K2505k6984L3361m3204O0467r9153L30744j4566m67984N82949j34681
74B33145k20310J71560k5272K1372l5156j43106K48598j17682j86419K33269n8722
85A21277j90290J72170j3174j99531J44028P2322k93072J40300J71727l17893
95a92136M8956K14469k02304o341L8188J9080P3242k54972J44879K54519m22513
106b84933R2494L59072l52773p859K75200j71711k336P4891l3699O3547n4866
$$ y = [0, 0, 0, 0, 0, 0, 0, 0, 0, -8, 8, -8, 8, -16, 16, -24, 24, -32, 40, -48, 56, -65, 80, -96, 112, -128, 152, -176, 202, -233, 266, -305, 346, -394, 445, -501, 565, -633, 709, -793, 882, -982, 1092, -1208, 1338, -1477, 1634, -1801, 1985, -2188, 2409, -2656, 2926, -3224, 3559, -3933, 4357, -4839, 5395, -6044, 6810, -7734, 8870, -10309, 12196, -14788, 18573, -24631, 35836, -63317, 267427, 252861, -215123, 367826, 233145, 12835, 184395, 159123, 180495, 145339, 2233, 250831, 133149, -53270, 179999, 121277, -69013, 103157, 89983, -109548, 34480, 106802, -186270, -45970, 125757, -192136, -143180, 71289, -131015, -137356, -99168, -80088, -6846, -261818, -116939, 137580, -284933, -192439, 166633, -186140, -193999, 81201, -90510, -92846, -17955, -51654, 11893, -42973]
117d2973J918R9301p8812k960J06006r4454m559J39264j19727n9298K08004r2147
129E9563j67776K32841j2325j98496J34442M3966q3249r683m363Q9820n6741j36529
141a08530J93902n487k17655J74599M6986j79114R2578N0595r8789M6314J8256
152A3655m4603L7241r314n663J6095k3069L3750P263o4964O3995M8497j27112
164e4229N5713J05893j33356l246J22500p0248n2012P4042m687k7249j4142J8867
176A7846L5706o8727k920P5992o2274l9778Q4384m0735n1678P0188k5149m3066
188e0211M3836m218l7794K2289Q305j9130j580K889K0085k3287j4180M7744j3580
201a8832m3388N2611J7290o3032L9083L6641m7881O478M0915j5671j8188K6293
$$ y = [-42973, -41055, 58246, -20566, -23526, 82480, -11974, -16533, 122731, 3004, -56294, 151710, 59563, -108213, 124628, 112303, -86193, 48249, 92215, 8966, -717, -5080, 84740, 27999, -108530, 85372, 79885, -137770, 36829, 83815, -95299, -2721, 47874, -50915, -4601, 13655, -30948, 6293, -3021, -8684, 7411, -15658, 18092, 25355, -39609, 24386, 72883, -54229, 1484, 107377, -25979, -29225, 93275, 23027, -28985, 45057, 40370, 13121, -1021, 17846, 53552, -15175, -18095, 57897, -4377, -44155, 40229, -506, -52184, 18004, -7145, -50211, -6375, -10593, -48387, -26098, -17793, -36923, -38503, -35614, -15529, -38816, -52996, -5252, -18832, -62220, -9609, 7681, -55351, -16268, 20373, -27508, -21030, 19885, 4214, -13974, 12319]
213A2319J0958j3512r338K9534M615l5116K2690K6313l4871p070M3084k2103k5453
226B050L4202l168k6755J2641J2172k4907L673J0989j4999n060O883Q13j7434
239h900J531J5277j2458k5271K9794J1055n4061K5145L7020m9534q131M8037j7351
252g847k8686K1934J5100r767k3399K5018J9892l6752M764L4412j8745j8409L2500
265A0015m895j8456K1365J919k1878K3026Q984l6625K7021J3692k8341N832R153
278A0812R983j5177k4929N0323j95p3600O0481L0030q0292K8753L6460l2385j1666
291a1402J2199J6383j4131k4938L1483O401l8099J9847J3447k0505j401J7763
303G047j2505j3683L5166k3452k2849N1824k0611l7172M7675l240k5868J0075
$$ y = [12319, 23277, 9765, 427, 29961, 34576, -540, 22150, 48463, 13592, 6522, 49606, 27503, 2050, 36252, 33084, 6329, 18970, 31142, 6235, 9908, 20897, 5898, 838, 7721, 8534, -8900, -7369, 7908, -4550, -29821, -27, 11028, -43033, -17888, 19132, -30402, -38533, 9504, -7847, -36533, -14599, 501, -9266, -32665, -7647, 12245, -24507, -19743, 14669, -4076, -22485, 10015, 5120, -13336, 8029, 9948, -11930, 11096, 20080, -16545, 10476, 24168, -4173, 1659, 10812, 20795, 5618, -19311, 31012, 30817, -42783, 17698, 47728, -32564, -3811, 32649, 264, -11402, 797, 17180, 3049, -21889, 9594, 15995, -22104, -2257, 11190, -9315, -10716, 7047, -5458, -19141, 16025, -7427, -30276, 21548, 937, -36235, 11440, 8200, -17668, -7593]
315g593LK9495l7551j9409P9278m5019m7295P9415j2882n0335L8768Q012j2858
328B029q065M412K5127k6304m293K6164j2296j0312J3400J917j5030J0075J1703
341A8527k8510Q898L3616m8883L305M8050m5275m324K5915q820k703j9649J9260
354e93K3552n6734J4940N2526o0492j322M5188k7380j0019J2967M160m211q365
367a5783Q154Q719j3304K652J1833q947l4J0624l395j1037K2696l131k5533L2967
381A6481J622k9670K1960J0278j7993M951L25J0115k804k4985L2083J629l6952
394a2960K4598J3258k8929M942J3875j1593k030j960M962n98j2369O776M797j1713
408h944j681J3024j2832l673J5680j3243m005J5780p868r116J5221l565m329M048
$$ y = [-7593, -7590, 21905, -15646, -35055, 44223, -796, -48091, 31324, 18442, -31893, 6875, 14887, 2029, -6036, -1624, 23503, -2801, -7094, 19070, 6774, -3538, 9862, 11779, -3251, 6824, 18527, -9983, -1085, 32531, -16352, -13047, 35003, -10272, -14596, 11319, 2499, -204, -19853, -593, 22959, -33775, -18835, 33691, -26801, -28123, 17065, -10315, -20334, -7367, -3207, -7418, -15783, -7629, 1090, -12214, -9562, 2271, -6676, -6710, 3914, 519, -10518, 12178, 9047, -16486, 16481, 18103, -11567, 10393, 20671, 2678, 7629, 7954, 18069, 15265, -9720, 22363, 23992, -12960, 11638, 24896, -4033, 909, 14784, 3191, 1161, -799, 4163, 3565, -8804, -2028, 2769, -8944, -10625, 2399, -10433, -14106, 1574, -11669, -15674, 106, -7762, -16878, -1657, -5222, -9551, -5503]
422e503k02R267j0912j370K0271j0210j4049K5231j099k1102J8050N537j1988
435A921L82P871J198q431m77J0376l795j5202J5991J683k0564J0927R158j9106
449h068o7J6321j5401n656J1061k751q892k47R690o131r939J0122Q657k0623M398
464a7526K1891k0324m209K2641o007j4723J7662N904j2756L912J1105R63j2265
477c732J1304J2096j5549L4K1202r691j4784K4631j566j8996J2619J0393j6272
490A1689k290J5199p598j0634O468P481j4755o386J7202q891j6925J4012O353
503A0925k5582O632J5144k0288m944J5066n009j4808R282O527j2107l946J3323
516i785j068j7109J4223Q649j8568M325J8483j3422p462K1343m608j1529J0867
$$ y = [-5503, -5705, 3562, -7350, -8720, 11551, 1341, -12708, 12523, 11424, -9678, 8372, 13909, 1921, 2303, 10174, 11372, 2941, 2464, 12840, 9045, -6157, 9834, 11517, -9047, 1880, 11038, -8068, -8135, 8186, -7215, -12871, -1810, -4561, -13453, -13700, -4010, -10141, -20080, -9958, -1301, -21924, -17526, 4365, -15959, -20168, 2473, -3534, -18257, -595, 5309, -7447, -3535, 7570, 8533, -3732, 7572, 19668, 4119, 4153, 25355, 15664, 880, 25511, 23945, 4949, 17568, 27961, 11689, 9399, 24598, 17000, 6366, 12834, 20315, 5560, -826, 16376, 7485, -9440, 4572, 10925, -14657, -8025, 7119, -13169, -18113, -3047, -8056, -22864, -13582, -7055, -19162, -23108, -9785, -10853, -27962, -13739, -5090, -23658, -19333, -850, -14272, -21734, -391, -4999, -16528, -5661]
529e661R919j1189j929J5866l006j0392Q703J2428j6214q9J8913j0556r662J6025
543A3156K109j7152J0152Q561j3381r92J1322m149j1157J0283L764j1454j148
556h6J3231o442j4037J7509J420j9203R199J3499j7589j898J5815o744q712N711
570A673R633j1953m412J5772n896j1380J1993M007j5446O194Q535j0348m549J1852
584E675j875j5172J3278L544j6113M373R913q340q650R718L836j2917k215J8988
598D043j3252j2135K1447n101j3761J0498O275r724j950R495J567j1394P484J0434
612C926j5680O099J1822r665j800J0167K385j1285O135J2615j2110l503J9190
625A8296p947j1141J4986Q83q315j752J1420j259j5575J1801P981j8267L139J3357
$$ y = [-5661, 4258, -6931, -8860, 7006, 4000, -6392, 2311, 14739, -1475, -1564, 17349, 6793, -2869, 13156, 15265, -1887, 8265, 16826, 3445, 2453, 13775, 9626, -1531, 8752, 12516, 1062, -86, 13145, 6703, -7334, 10175, 11595, -7608, 1591, 15090, -2499, -4397, 11418, 4674, -4038, 1673, 11306, -647, -5059, 10713, 4817, -6563, 5430, 9437, -6009, 185, 8720, -1628, -6177, 5675, 3800, -11372, 1906, 5450, -10663, -6290, 3623, -4717, -13367, -3649, 187, -12730, -14945, 4043, -9209, -21344, 103, -4998, -18759, -8261, -1986, -11710, -13660, -4165, -2598, -13992, -6508, 3926, -11754, -5655, 6167, -3498, -5298, 4869, 7254, -4031, 2104, 14719, 2609, -894, 18296, 10349, -792, 14194, 15077, 6762, 5010, 16430, 15171, -404, 11397, 19378, 1111, 4250, 17607]
639A7607j3973l328Q649k855o548n53Q440r250n290J1729o999r515J0322P53j1400
654a2211M518O066o379p165J0576L889j6792Q706R525j0912k616J1456o06r314
668a1259N469R007o550o656J5189k814r659J0432L230p446Q10Q389m019m401O797
683F519K673r017L265Q900j0527o13Q464k536q078N648N105r715n16Q028l458
698D142q892P974K898j0350J842O662m544o694P983O19q437L413M716m853m016
713g537Q294k555n297M312L277n318j038P691l880l930N183L158p365J966P164
728D125o437o89N105L61n528L296M104m439j099M147J117o691N073K892n962P47
744A22M494k485m263N983j000l431J319K785k121l096M551o98l195M11M005l859
$$ y = [17607, 3634, 306, 8955, 6100, -448, -1001, 7439, -1811, -7101, 4628, -2371, -11886, -1564, -811, -12211, -7693, -1627, -8006, -15171, -4595, -706, -17498, -8792, 733, -10179, -12795, -1339, -1945, -11259, -5790, 3217, -3333, -9989, 5200, 2386, -7273, 3159, 6389, -1057, -247, 8142, 4123, -278, 6519, 9192, 175, 3440, 12340, 1813, 1200, 9664, 7128, -950, 4698, 9803, 88, -428, 7600, 4142, -4750, 3224, 6122, -4228, -2386, 4276, -268, -6962, 1021, 1640, -6797, -3384, 1332, -3521, -7537, 757, -1798, -7095, -2783, 494, -4824, -5862, 1829, -2051, -5981, -798, 2360, -5005, -3039, 4125, -2312, -3001, 2104, 2465, -3063, 233, 4337, -102, -1201, 2946, 4063, -2628, 2445, 5337, -625, 122, 4616, 2131, -2132, 3851, 2851, -580, 739, 3524, 1403, -1693, 2858, 2160, -1035, -624, 3381, -478]
760d78k269N950l198k948L367J471n155K324K213k951K66O99J248k531M71K260
776G39j346k227L025J102m991M163J063l600J514J834j950l08K511j715P32q99
792c53J261K42j878J563Q83j772k80L078l860L30L053l040N46N54q36j80J530
809H41j978N97O98l045L564k483O09J597k279l16K248p24j364L122k085k41J040
826a99J10m51J135N72j622L439l714Q65K873l350J408K058k031L39J532k624M348
843D688k708o16M436n286Q22K361j082j448O30N39j065j074N9P37k615J770j851
860a703J23n92r51J941l290K371l93l564L218J733p229L610M373o827K862J222
876c096O31j427j898N559o57m663N126K570n994L349L382k354o4J698J750l243
$$ y = [-478, -2747, 3203, 5, -2943, 424, 1895, -3260, -936, 1277, -1674, -1408, -709, 539, -1992, -1521, 739, -607, -2834, 191, 1293, -3698, 465, 1528, -2072, -558, 1276, -674, -982, 1529, -186, 546, -353, 908, 1150, -728, 835, 1718, -54, -334, 2744, -1116, -786, 2267, -773, -227, 327, -509, -689, 841, -1137, -540, 158, -2887, 677, -1806, -1197, 400, -1879, -2195, 53, -671, -2035, 1087, -998, -1239, -199, -89, -540, 595, 1167, -455, 2984, -730, 135, 3008, -342, 1066, 3124, 1093, 1432, 2964, 340, 4688, 1980, 1364, 5800, 514, 1336, 3697, 2615, 1167, 1797, 2336, 1271, 197, 256, 993, -1622, 148, -1703, -1580, -2172, -3123, -1182, -4472, -2101, -2494, -6058, -2840, -1107, -8336, -4726, -353, -7180, -4318, -3096, -2465, -3892, -5790, -231, -888, -5551, -425, 2145, -3849, -500, 2882, 528, 464, 2162, 3912, 669]
892F69L457J006l180L553Q6k489J741J838q92j360j471O685n886n039J0952m976
908D694p000P300K89o740J412K667j622l385l37O337p100k178O482l447m208M064
924b772J431o234K872L011m930M09M674l405k457O086j912k198J076L878r38n646
940g055P175L204r074K841R530q541k547J0018l309m022L231L536l251j891L934
955C779J318m834Q76N944o649o5N620m133l239O313j130o495N758J204n297j76
971a206N006j890n207M296K902n293k579P929j908p574O455K958p352O77P371
986D585n621k159M587K59l285l69N179l342k497M679k30m995L312L455o715J728
1002a429M246k991l972M768J788o852K474M647m070l664O245k87o089L246L281
$$ y = [669, 4126, 5132, 1952, 5505, 5591, 3102, 4843, 6681, 5789, 4429, 2958, 9643, 3757, -1282, 9670, 4694, -2306, 4994, 5283, -1457, -45, 2622, 1000, -2385, -2722, 3615, -3485, -5663, 819, -2628, -6836, -2772, -1341, -7575, -4703, -1692, -6622, -6213, -1539, -4944, -7401, -1315, -3227, -5425, -4349, -471, -1409, -7055, 120, 3324, -5750, -2909, 6621, -1920, -4467, 5551, 2242, -1780, 1451, 4987, 1736, -155, 3779, 5097, 263, 1139, 7083, 434, 369, 5989, 1856, -1383, 4930, 3800, -2695, 3063, 4267, -1030, -1206, 3800, 1910, -3297, 999, 3901, -1392, -3971, 3958, 2050, -5524, 931, 3889, -3463, -2786, 4585, -1036, -3195, 1392, 1651, -1634, -2003, 3176, -166, -2663, 2016, 1786, -3209, 103, 3558, -3157, -1429, 2817, -174, -4146, 622, 2410, -4442, -1968, 2679, -1391, -5055, 1190, 903, -5186, -1940, 1341]
1017A341l434l098O234j174m938L563L020m297j565O661l201l528N249J105n399
1032c461K079N261n292M38K992M74l721J643M293m099j249N018l94n885N517K097
1048E711o426K450M304m097k592N777j474l874K189K106j810l962N260J97o183
1063b424K190N334p018j440P454n101k550M095M6l665P63K362k184j664J815K367
1079C80n502K101M148n528k08N582k772n221P130P2o075L444L874l566k751N516
1095F24M72m178K76O045l629m011P711r64n765M540L231n977J898M252l763o35
1111A27K358J491m144J278M340m193k150N970j114p610P122K297p403J161O280
1126E810l940n558O691J172o157K08O279l797n303O971m5o302K235M895n914j135
$$ y = [1341, -2093, -5191, 1043, -131, -5069, -1506, 1514, -2783, -4348, 2313, -888, -4416, 833, 1938, -3461, -1382, 3879, -1413, -975, 2017, 2491, -1230, 413, 4706, 607, -642, 4376, 3982, -1903, 3614, 5711, -715, 1735, 6039, 1942, -650, 5127, 3653, -221, 1968, 4074, 2264, -1698, 3562, 3759, -2424, -234, 5100, -1918, -3358, 4096, -1005, -3555, 540, 586, -3079, -2316, 46, -2138, -3802, -1987, 380, -5122, -3021, 1127, -4401, -4609, 973, -1799, -7020, 110, 182, -5893, -2449, 1425, -2141, -4892, 624, 1096, -3082, -2806, 3239, -390, -4401, 3310, 2346, -3419, 1121, 4352, -1625, 273, 4525, 762, 127, 2485, 3976, -168, 1110, 5450, 1257, -893, 5077, 3963, -3647, 3475, 5772, -1631, -470, 5810, 1870, -3688, 3003, 4175, -1982, -1774, 4505, 708, -4595, 2376, 2331, -3971, -1736, 3159, -2755, -3890]
1142c890O478l543l590M656J264n832K199M681m584k660O015J065q467M767O017
1157D576q027r89Q288k589o848O486K525n604q91O744j917o032N717K700o653
1172b514Q97O914n805k507O846j987m694L212L520o274L7N926l381m179M689L175
1188C875p852J119P217n009n029P664J136r055M915M460n666j943O238q18n379
1203d127L644L295m053k544P051k168n195O310J267o188K170N698n758j228O023
1218D197j977l118K176L671n426o89N128o99n393L982L998p398J130N349l491
1233A440l857N235K17n391K585K232k616k355L820k34m083J697K702l408j944
1248c960N663k953l734M905m1l851J521K884l380j30K302R8k169J76L268k097
$$ y = [-3890, 2588, -955, -4545, 111, 1375, -4457, -2258, 2423, -2161, -4821, 1194, 2259, -6208, -1441, 4576, -3451, -4440, 3848, 1259, -5589, 897, 3422, -2182, -3073, 3671, 1754, -4278, 1439, 4139, -2514, -1617, 5297, -508, -3015, 3831, 1844, -2850, 362, 3882, -2392, -2355, 3571, 190, -3989, 700, 3875, -3977, -2858, 4359, -650, -5679, 1985, 3121, -5934, -1019, 3441, -2225, -4168, 2070, 1252, -4127, -483, 2812, -1241, -3785, 3266, 1098, -4097, 2213, 3480, -2708, -538, 5160, -598, -1826, 4197, 2220, -898, 1278, 4949, -477, -1166, 3962, 3263, -2130, 1852, 5850, -1548, -418, 4931, 1440, -2417, 2818, 3035, -2356, 229, 2461, -155, -2510, 1310, 1076, -3007, -1310, 1392, -2016, -3960, 1703, -1250, -4984, -79, -120, -3971, -2450, 434, -2946, -3076, -774, -676, -2845, -2669, 599, -1498]
1264a498j349L071O36m081K925K268m229J726K204j638q70K549m12j262O50P56
1280A446L43k176K303M15k481J263J544j865j074L402k468p07J739o16q96N30
1296G02K52p27J44p01J301j199j134K460j782n57J701l66j742K072q06o78J381
1313C21j088O97r6l48M37M57n50M75N40j457J394m3n72Q36j52n57M86M30j500
1332b90J783j096k49P51l83m11N26l53q65J411j760M65N78j628Q38L37j415M73
1350a288M15j561Q53K91j101J239o29K15k7j03j40P21n44J45J247j374J151K8
1368d62J05L8J044j47l28J066n04R48j32N8N90Lk43N15Q78j698J730o40j235J456
1388C042q08j4k21k06n0Q6r65M74j98j714J584j212p65K35J7o38o29Q31j162O6
$$ y = [-1498, -2847, 224, 860, -3221, -296, 1972, -2257, -531, 1673, 35, -835, 1714, 1302, 40, 690, 1446, 1789, -387, 1916, 2331, -150, 1113, 2657, 792, -282, 3120, 652, -55, 1684, 1068, 172, 702, 954, 227, 371, -330, 971, -228, -1362, 1098, -684, -1241, 460, 94, -1648, 424, -382, -1060, 321, -767, -70, -166, -514, -77, 380, -170, 305, 845, -612, 782, 739, 167, 1003, 851, 294, 780, 1210, -290, 1493, 397, 148, 899, 516, 105, 631, 278, -587, 824, -936, -471, 107, -1521, -683, -346, -1761, -1288, -873, -2434, -1581, -1290, -2391, -1152, -1781, -1566, -1593, -1696, -1836, -1115, -1659, -1514, -267, -1641, -490, -462, -357, -319, 725, 578, 250, 1316, 812, 1760, 1628, 1686, 2276, 2279, 2036, 2551, 3429, 1731, 3461, 2821, 1586, 3042, 2234, 2220, 1999, 1793, 1743, 1829, 864, 1338, 1140, -574, 1010, -202, -967, -732, -715, -1353, -1982, -1151, -2313, -2247]
1408b247m38O63j033r3O08j30k60K1J484j615L63J426n97n38J406M26j420J853
1426a21k77Q28n07O43J273j680J095J250q86l38J866q32q03J436l27J13q65J305
1444C173o24j226J066M5j013m03J425j372p99N46K88j791K37J303k285J23P18
1461e89o77n87K58O25j074m76J163K82j981J582O30j943J276O41m06o87J247J73
1479e43n07j52J506j38j335K330q89n18O24J032o26o32J650m97o50N45M37q05
1497H32L1O95p59L56q05J062j072o47J213q95m89Q95l07j157Q91n00M18o40k71
1516a149J550j928N50O99l83o68P85K85o61K68K73N78j141R86L83o42L21L65M94
1535I65p55P56O14j041J04J300j001m97J563r93P0p0L16J75j638J652P8j686K08
$$ y = [-2247, -2685, -2022, -3055, -3148, -2540, -2670, -2930, -2909, -1425, -3040, -2677, -1251, -1848, -2386, -980, -554, -1974, -121, -398, 430, -77, 566, 1839, 159, 1254, 2504, 1618, 1280, 3146, 2314, 1511, 2947, 2620, 2733, 1868, 3173, 2549, 1323, 2389, 2434, 1421, 1018, 2443, 1071, 272, 818, 1106, -685, -448, 855, -1430, -1307, -589, -1266, -1853, -1595, -970, -2044, -2520, -1357, -1075, -3056, -1474, -844, -2787, -1511, -870, -1276, -1963, -716, -543, -1050, -1202, 304, 166, -1169, 1161, 272, -246, 378, 1410, 784, 152, 1802, 1305, 655, 1200, 1637, 832, 863, 1558, 799, 1155, 350, 1412, 340, -307, 906, 11, -478, 417, 110, -1047, -156, -656, -238, -878, -1149, 401, -1527, -977, -278, -661, -1329, -544, -259, -920, -652, -379, 199, -942, 44, 427, -215, 106, 471, 965, 210, 966, 1580, 539, 643, 1943, 942, 445, 2008, 1015, 1085, 1015, 1331, 1506, -132, 1520, 1598, -88, 120]
1554A20J420j933l44J436p48q28k62J673j570o62J305n82r23L88R13j434Q6Q09
1572a136j60j092R75R92k381J701M85o24o65J690k14j122J259P74q01r66K560
1589A275o23j259J874M25j178k62J883r17j062J464L68j280j65J720j393l97J342
1606A815k19j334L59J429k103PJ035l34j545J157M25j940P27R13o07j226J129
1623c12M03j442N43P69r61p20J903n60j086J350L68r18j26J449q56j85O44Q08
1641A071j259L13J509j266K36O25No79M72M98o72j68N45j15j347J587m21j273
1659c39R91k34o85m36R25l43q35M30K37r97l84J451j592K98J95J20m11m00J192
1678h17j133L24M59p5n31J042m23m28J308n60M32k36P20R7q36J366j4o63N7J257
$$ y = [120, 1540, -393, -737, 699, -49, -877, -1139, 534, -1036, -1698, -393, -975, -1898, -1510, -597, -2031, -1945, -1136, -1296, -2388, -1413, -421, -2802, -1101, -616, -1240, -1905, -215, -429, -1551, -292, 482, -319, -1285, 1275, 652, -607, 1267, 1692, 514, 252, 2135, 1218, 156, 1620, 1988, 708, 543, 2263, 870, 473, 1815, 1596, 262, 621, 2050, -53, -46, 989, 655, -890, 267, 692, -1248, -521, 392, -215, -1441, -312, 91, -1351, -808, -39, -1000, -1720, 183, -377, -1463, -113, 255, -663, -789, 660, -196, -381, 263, 1071, -188, 125, 1634, 368, 604, 1229, 1234, 555, 1027, 1525, 853, 685, 1230, 1115, -232, 1355, 934, -339, 652, 418, -267, -703, 222, -121, -956, -526, -289, -1286, -1670, -219, -1811, -1513, -1318, -1198, -1609, -2009, -817, -1950, -1626, -1167, -1242, -1773, -731, -1154, -1582, -274, -834, -402, -638, 82, 179, -657, 709, 695, 32, 89, 1346]
1698A346j144M12R83o92k85K98J266j584J26R92l27n61K62M83p67K04k3j50q01
1717C8J237k27j414J709m83j490J044P03j235j87J093l27o63n10K594j848r25
1734h91J763j76j035L24P50j354N39L40K76j129P84M77j478J007k14p29K31j28
1752f43K81j144N65N47j380o67K150j438j223J954m86j007O5J221o84j288J371
1769a806P78j514J40J696j203L74M83O74o20J71J303r82Q80P51m91j59J310Pk95
1788A497O72LN45j319K024Q2j682J555M28j110m02J329r21p5k40M19j74k063J501
1807B069o28m24m19M6m60m51N84j082m12N4L59r36M23n49j055J318m36m7k48n75
1827b869J164q90l01J301O4j622J717k99j152J489l63J286p85P47j0K20j8N65
$$ y = [1346, 202, 614, 1597, 905, 620, 918, 2184, 600, 726, 1718, 1391, 830, 1092, 1575, 808, 1012, 989, 839, 38, 1275, 1048, -366, 1343, 860, -630, 414, 1117, -118, -305, 788, 461, -202, -712, 1882, 34, -891, 872, 696, -339, -15, 735, -619, -80, 260, 536, -593, 191, 668, -810, 197, -17, -746, -515, -643, -362, -1506, -941, -394, -1774, -2441, -291, -1729, -2952, -998, -1484, -2491, -2426, -1205, -1889, -3177, -1806, -1028, -2542, -2402, -706, -1909, -1535, -1052, -378, -998, -827, 476, -506, 374, 1125, 634, 475, 1785, 1792, 1497, 2169, 2172, 2717, 1398, 3422, 3504, 1822, 3377, 3805, 2695, 2293, 3622, 2701, 2626, 2386, 2805, 2631, 568, 2069, 1441, 1017, 598, 644, 184, -267, 317, -765, -1177, -1123, -764, -1700, -1277, -1826, -2881, -1563, -1999, -2046, -2294, -2869, -1705, -2595, -2896, -1595, -1531, -3153, -1436, -1735, -2887, -1398, -1761, -475, -1260, -513, -523, -303, -321, 244]
1845B44L0n00O36K08Q9k87O73K26k59Q39j021L57P82m66j333Q76ok47j58R3J009
1866A785j101P81l8j007K38L37j29m19O06j144N25K51m58M0m32K30m12O09o09
1885c47M85l48J88q1m00N01k17j48l81O68l05o11O31l78K36k93M39o55L33J02
1905e81j92L40o07O96k87k14K73J21p27N32R12m91k92M82J87l18j85O20l17J91
1925A43P10q31M71k34k57R09p76O94k43l33J073l33j270J411J46j277N57l68L67
1944E59l02L76O01j92j141Q33n16l59j99J074l81k36N59j504P49k42J127j292
1962d86K94j42m58K19L75P4K90k85P65r49o31J145l26j409K356r01n19O98q37
1981g27K37n03N82j15M38j339J490q34k10J107q70K42R1J65k91j80N90nl22r8
$$ y = [244, 274, -226, 410, 618, 707, 420, 1093, 1319, 1060, 1899, 878, 1235, 2017, 1551, 218, 1094, 1088, 841, 683, 776, 1785, 684, 1465, 1427, 420, 658, 995, 866, 447, 1053, -91, 434, 685, 227, 267, -165, 65, -347, 262, -347, 138, -210, -22, -103, -503, -2, -219, -367, -748, -80, -385, -996, -365, -743, -507, -800, -361, -1016, -683, -581, -773, -433, -1040, -344, -631, -845, -572, -451, -1178, -646, 266, -225, -517, -35, 152, -166, -351, 269, -48, 143, 853, 22, 493, 259, 2, 911, 135, 829, 586, 253, 1326, 993, -277, 1134, 1280, 3, 560, 192, 559, 257, 633, 1234, 1042, -99, 734, 218, -141, -340, 734, 353, 117, 676, -828, -79, -321, 806, -486, -192, -334, -792, -573, -198, -124, 166, -119, 646, -303, -934, 211, -115, -1524, 832, -69, -588, 110, -727, -490, -993, -411, -526, -88, -1427, 63, -771, -981, 126, -744, -502, -411, -246, -537, -717, -127, -132, -454, -552]
2001e52Q50r20Q17j67k17n49J027J78j197J342k40l6K07l37M87NJ08j67K50o98
2021A91J110k05k62N51m35N03l40J83r35K28R90p57L86n70L87m85p8K78j03n60
2041G7j47R71j434M69M29p55r5M79n62l64M07l12L23o45K53M33p72K60M73p21
2061a233m15J076p82J68N15p65K79L47k94j4J18l57Q05l88k14J109j36k73N2P2
2081c30o86J339l14r57J451p13N2L32J20K03j8m5J83M57j020J306j80n35R60k68
2101A337l68M84L16n30L08J04l76J69j40M85j57k50m22O12p01k63O75p94M18n93
2121C14j73q0K26n97n29P25p00m1m62J62j05l90L7J77l28o1P38r28M8N48k57l35
2143b011K70M32m12Q24k87L46k74J25P50j41K54k0Q52r76P34K49m92Q65l87o3
$$ y = [-552, 298, -622, 195, 28, -189, -738, 289, 467, -730, 612, 372, 336, 543, 206, 693, 698, 806, 639, 889, 191, 1301, 1096, 834, 1385, 950, 1453, 1113, 1296, 361, 589, 1579, 822, 1208, 638, 1025, 540, 462, 740, 637, 77, -70, 901, -533, -64, 365, -390, -485, -6, -568, -932, -525, -837, -514, -1159, -906, -473, -1245, -985, -512, -1233, -1648, -572, -1354, -1186, -671, -1436, -1157, -810, -1104, -1118, -1000, -1357, -552, -940, -1154, -45, -181, -454, -402, -330, -1016, 323, 9, -948, 503, -210, -158, 174, 294, 497, 479, 434, 617, 1074, 54, 1360, 1180, 645, 1605, 1337, 969, 1453, 1769, 1239, 1547, 1651, 1275, 1444, 1304, 1789, 1632, 1382, 960, 1572, 871, 608, 1283, 489, 907, 314, 141, 61, 287, -310, -839, -114, -814, -855, -1317, -1155, -1260, -1650, -1613, -1436, -1764, -1825, -1087, -2015, -1967, -1419, -1676, -2011, -1741, -1309, -1721, -897, -1184, -838, -1112, -987, -237, -378, -124, -144, 708, -268, 466, 715, 223, 1088, 701, 638]
2163F38M57K40m37J10J31j09N85q85P62l68n05L52P8k73m40P68n10l41m6k81O2
2184a2J4n6j24L38q77N90l23j34K71k49K25K12P4q38J156m51n8L12J90m11J09
2205d2N59j83L0j0M64l53m74P61O0j54j96L77n96J00K32q10R38o33l14J67J14
2226C7l24j0ok19L75q05P47n45m37N79j76l3m45P90p97K51J97L0K48m78M13j11
2248g19M09l24M44R3j32N75n64N28K36j45j59P74n05j47Q97o52J12O2K84ql26
2269G33j0J77J53p45P25o06L8J02k79J1M09k38q02L73n4m76K80J72k65k03K69
2290b36k32K87o84N71L9m44K06J17j0j93O67n68n1N65j24K07o44P00o0j25q7P5
2312b4K9j33L69o38N28j3J2p7R9K87n15K17l6l00L9J06j2n0j00n6O79r38Q60k79
$$ y = [638, 1095, 1335, 898, 1008, 1139, 1030, 1615, 730, 1492, 1124, 619, 971, 1049, 776, 336, 1104, 594, 253, 207, -74, -12, 2, -54, -178, 160, -717, -127, -450, -584, -313, -562, -337, -125, -51, -889, 267, -184, -242, 70, 260, -151, -42, 517, 334, 364, 354, 818, 465, -9, 752, 812, 658, 462, 839, 243, 343, 575, -235, 703, 70, -244, -77, 37, -287, -297, -303, -522, -147, -952, -205, -750, -1187, -608, -784, -817, -1262, -472, -1269, -1018, -821, -791, -543, -1021, -608, -719, -310, -634, -190, -97, -229, 346, -218, 310, 546, 401, 242, 1016, 511, 364, 1261, 609, 721, 783, 1067, 1059, 733, 723, 900, 1053, 308, 1033, 427, 465, 567, 288, 299, 708, 470, -332, 41, -13, -489, -209, -37, -302, -505, -236, -468, -181, -865, -294, -255, -699, -493, -376, -386, -579, 88, -480, -531, 34, -90, 117, -527, 173, 113, -12, -99, -24, 5, -128, 241, -397, 131, 118, 130, 53, 152, 439, -76, 141, 105, -195, -156, -50, -62, -112, -212, -268, 411, -527, 333, 54]
2336E4j95L57m51J45j80L95m76L06K3K53j78l79O80j18k54J80M16k75k15L08j85
2357B11J42l14Q9Q6r5P6k26M08n07L24l10L62j58k79j49K78j04k48K89k70n1l30
2379g76P32l45l63L67o74J141j294K07J217j493L78N83p2J4O7K73j14L69o57R29
2399D89l78l7J73Q2r0J06K02k84J97j59K92o8r6QK49k98J5J93j91K22l51K09k05
2422B80J10j21q4K65m41K43k97J99j92j19M97l44m08j0M81k66k56M88o91J41J04
2443d21K28l07R5N7j23J19k37K41n11L63qj9J94OJ8j58L74l48K48j62J27K13j39
2466a50K89R3k80RL71j28k37N46m86L27k91L90o4j82j99J49J94L7K3j86kl7O2
2489B48K09m21O1R6l6K12q1k06J89K09n58K80k58P6l6K97j30j20k2k83M48l85
$$ y = [54, -141, 216, -235, -90, -270, 125, -351, -45, -22, 231, 53, -326, 354, 236, -18, 162, 578, 303, 88, 396, 211, 353, 39, 128, 214, 119, 195, -31, 377, -130, 194, -116, 246, 88, -191, -340, -62, -166, -414, -125, -395, -446, -776, -44, -389, -752, -385, -1059, 82, -1212, -1005, 212, -1281, -903, -320, -392, -378, -311, -38, -152, 217, -440, 489, 111, 74, 247, 329, 239, 345, 547, 263, 460, 301, 593, 525, 429, 437, 686, 388, 403, 596, 405, 627, 276, 485, 280, 390, 269, 185, 450, 9, 252, -45, 154, -38, -157, 340, -4, -412, -422, 59, -207, -463, 25, -666, -525, -421, -193, -500, -405, -348, -471, -352, -589, -348, -859, -496, -504, -523, -329, -323, -305, -463, -89, -437, -189, -351, -224, -11, -150, 139, 232, -48, -39, 332, 204, -33, 513, 27, 354, 63, 453, 389, 207, 8, 157, 351, 388, 411, 225, 223, 186, 248, 457, 36, 97, 193, 157, 369, 288, 82, 271, 480, -78, 202, -56, 20, -16, 281, 151, 31, 9, -274, 174, -211]
2511b11M36k86k8J70k53L95n19L76l00N06n66K26r2k83N63m66J03l9J47k88q7
2532d96L02l50J06l05M81j62j76L60m0j25m44O67n53K04L83O1m51J67K95m72N99
2553E1L6Ko0l01M96j02j72M60K38r32P12K85k31K00p2M07o82K74J56J12j82q2
2575F13J25K42J69p47K95k52L71o68L8O69q25L06k06N2j22n3J66l57l48P3N56
2596I7j140M32K20l77j27K41m9l89L86j71J14o2j53M39m71M64m30M20j44L13r4
2617d81k02L86J22l00O63N2k50K18J60j74J67j54L22P6m01N12M8l58K75K46n81
2638C46O10k18q5L0J6J1Rl51M7L50j03k97J21j19P4m41M06k62K50m54L3O0m24
2661c91j19L24k69N0J43l67J87m8l06N95o57R8L5L42%k86q6J81K37n41J79L68
$$ y = [-211, 225, -61, -89, 81, -172, 223, -296, 80, -220, 286, -280, -54, -146, -429, 134, -332, -229, -268, -121, -409, -496, -194, -544, -438, -743, -262, -424, -600, -240, -280, -405, -849, -182, -735, -531, -148, -87, -538, -371, -76, -548, 51, 87, 89, 29, -272, 224, 122, -50, 410, 648, -284, 428, 713, 482, 682, 610, 1017, 335, 609, 765, 877, 695, 613, 738, 980, 1149, 402, 697, 445, 816, 148, 186, 855, 30, 336, 130, 182, 60, 7, 173, -184, -532, -459, 97, -1043, -611, -391, -768, -895, -654, -703, -1092, -706, -877, -763, -825, -978, -539, -1010, -546, -976, -556, -700, -387, -481, -683, -297, -175, -475, 188, 240, -10, 208, 368, 194, 361, 207, 529, 605, 204, 716, 764, 406, 681, 927, 346, 956, 738, 653, 683, 699, 710, 719, 368, 415, 765, 662, 365, 486, 367, 441, 0, 406, 144, 394, -60, -27, 33, -391, -510, -186, -455, -405, -262, -629, -442, -490, -796, -201, -858, -760, -725, -383, -383, -669, -755, -574, -337, -878, -699, -331]
2683c31j78qL52j83l67N77k56K71r9M6M70j83j61J37K83n94Q03k91R5L41k61p7
2705C86K94J40n06N37j22q8J30m50L33l45K54J66k09k31J53k1j46J3J63l87j2
2726E2M33m51o1J04l88L8J8l23M13k80J13n5j85k85O07m09K62P2l23K85r6k9k12
2749g00M31k57J63M5l39O55k78O4nJ34j32M31k46N8K70k06j0J31P2k80M87k58
2771B30J37K07l86N55j57j82O0J12j50r5J32k97N96l98p1K69l31J56mN2l33L23
2793D25k01M7J16n37N60l73J64k64J34k30J28j35l42M53l02J91l40N24k41Jr6
2814c18l30J80o8J76k1k81N37k34k45q2O98o69N20j70k00J01J64J6k72Q5K06O6
2836a41n1J16N36m68O2J19j68K9M10J6l96L79J51j49n1K47j07j81K76K3mk86L72
$$ y = [-331, -509, -517, -165, -348, -715, -138, -394, -123, -222, -176, 294, 111, -50, 87, 370, -224, 579, 288, 383, 724, 463, 386, 680, 820, 314, 851, 729, 641, 771, 321, 654, 309, 563, 729, 520, 289, 442, 421, 275, 288, 451, 64, 52, 485, 34, -27, 77, -311, -273, -255, -578, -165, -445, -332, -387, -572, -857, -250, -659, -397, -325, -648, -363, -459, -488, -700, -269, -526, -363, -318, -657, -2, -280, -216, -221, -87, -219, 212, -34, 24, 294, 88, 78, 209, 281, 1, 488, 230, 367, 574, 188, 743, 586, 404, 464, 576, 426, 331, 463, 166, 762, 364, 293, 562, 231, 387, 383, 435, 102, 425, 224, 271, 387, -150, 410, 37, 201, -63, 71, -159, -31, -166, -508, -55, -357, -166, -506, 18, -223, -222, -318, -648, -468, -536, -360, -381, -662, -125, -359, -604, -686, 12, -657, -137, -307, -507, -406, -242, -226, -498, -413, -207, -141, -192, -76, 460, -8, 54, 173, 5, 34, 444, 460, 64, 443, 594, 445, 394, 641, 534, 353, 629, 652, 648, 362, 734]
2859G34k43l41K81J26j46k20O46p09L34n1K00n42K4J15o16L08n5J16l56J4K93
2880h8m55J57K72k54m31M81j03j29j2k8L32n51J90q8J49l6O9k19O5O11l87K37
2902b18J93l60o6K46J69J04q6MO87q99K22K55q2J55P9J01l16M48J29l85M47j39
2924F88k9J00k66k24M47m44K49J50n85L84j53j15J69O5m64J67R3k98kL2J84l56
2946b08K82m78L8K74m80M40k64p5K04j53J68k78O1K1J49l40M76n3l22J33K5J70
2968b10o5J17j20J1J25j07J23l27M75LR5m67L69ql1L13n06K37J97J68l32J51P7
2991B88M9J43l60L64l74K47K24j07j46M7k4l06O52l13j73j74R0Q7j56K03p6j00
3013H5l0p1R1q3K51n59K96k85J92l29M65j03m13K74l39N15l20Q6j10P2K15l30
$$ y = [734, 491, 150, 431, 557, 411, 191, 837, 128, 462, 411, 611, 69, 93, 208, -408, -100, -155, -39, -395, -381, -88, -543, -386, -114, -368, -799, -318, -421, -550, -562, -590, -258, -809, -619, -707, -558, -594, -525, -744, -679, -68, -455, -218, -25, -385, -451, -205, -36, 68, -18, -14, 673, -226, -4, 251, 169, 324, 403, 504, 188, 636, 765, 380, 827, 688, 659, 759, 493, 269, 716, 272, 521, 671, 86, 470, 317, 202, 371, 436, -28, 139, 232, -66, -68, -36, 148, -208, 74, -404, -366, -92, -572, -132, -396, -471, -267, -420, -252, -530, -469, -448, -299, -639, -163, -216, -538, -405, -380, -210, -275, -158, -278, -267, -142, -249, -126, -453, 22, 25, 120, -347, 22, 14, -17, 296, -210, 27, 224, 392, 60, 211, 288, 337, 480, 120, 484, 110, 357, 581, 474, 328, 375, 351, 45, 697, 384, 211, 37, 127, 214, 58, 261, 185, 85, 55, -16, 75, -8, 243, -316, -20, -305, -113, -442, 23, -80, -493, -219, -558, -43, -363, -277, -387, -315, -100, -430]
3035d30J63k21L33j6j31Q0K17J25l23K92m00L52m17K59K20j89L17j21J02k70J50
3056I2Q3K37J38k75J6q2J62j36J09l1l54K79L0K80l89J42k94L26j75l77L64j19
3078B6m5j14K86k44j17K73j71P8l65L55k77J72k53j16K50j46J65n5M3J36M5j74
3100b48K9r2j38L55j79K26Qo7K3K93l92J1L17n92O12j5j56J3O2K08l49K38j3J97
3124C51k69Q0P1j42M46l41k32J38N2j20R2j81J65K3l21j05J40k8M19r4m16J85
3146h7J83n65N12k38J4K16j85P5k10Q6l3P1K2K07K60l82K75p4l3r3oJ93m6j18
3170D4p5L8K1J16J96j21j64j13K69l01L17l85K22n6j6r0J90r9l04L99k59J47n5
3193g9m6R2k03M10k30K91n26J51L59m82K32J5j65J12r8k42K27O9j36L53l9N3j76
$$ y = [-430, -267, -488, -155, -171, -302, -222, -5, 120, -203, 89, -311, 41, -376, -117, 103, -86, 231, 110, 212, -58, 92, 175, 412, 550, 275, 291, 209, 371, 235, 344, 313, -41, 238, 268, 548, 159, 301, 7, 333, 158, -219, 145, 26, -19, -133, 153, -91, -208, 65, -106, -28, -393, -38, -315, -143, -396, -512, -262, -408, -243, -298, -255, -119, -74, -248, -219, -311, -449, -94, -273, -47, -39, -106, -83, 210, -182, -171, 146, -446, 166, 151, -5, 8, 70, 278, -71, 167, 154, 351, 82, 162, 233, 91, 537, 196, -36, 102, 154, 34, 126, -55, 110, 133, -188, -293, -153, -181, 238, 144, -272, -87, 96, -469, 43, -195, -181, 35, -150, -75, -285, -199, -232, -161, -139, 68, 328, -54, 221, 147, 114, 21, 15, 208, 162, 44, -31, 7, 28, 144, 340, 219, 55, -58, 211, -90, 227, -158, 64, 8, -8, -98, 92, -7, -311, 88, -171, -24, -79, -125, -33, -236, 174, -56, 235, -291, -140, 219, -263, -31, -16, -181, -69, -167, -409, -182, -113, -249, 104, 65, 118, -58]
3216e8M5k01K66l0j47pO4K23k38J24k5J46J79k12j73p1L66k12K05N4m88L07k16
3239i9O60n91L14qj8n7n6L39l87Q1R1p9k83K39k13K47o0J1M8n6n4J64j65L06l77
3264cJ42q9J53k02J8L62m69O4q5%r5K11l9j02J00j36K24k96L37j24k10K06k45
3287b78J02m06R4M0K32M7O4rj80J34j33J09J07N0k47k1M10l57M31j94K89n36L49
3310I7k2J43Q7j73O0k07J48k27N64o3r2L4k12K73k25o9L18j37J56j42Q2l43J88
3333B38j9l11K76o7J55j15L6l29J80R9j87l8J22q6j54J99j62L8KJ6J26j03j42
3356b26O2k25j7J43J9Q3m3j15K32j43N5j63L11m6J05m63K33K23l22N43m93K30
3378a7k59J58K03n05N14J03k75K8Q5o6K61N7k19K42k27K43j85m4K25j21N3k88
$$ y = [-58, -13, -214, 52, 22, -125, -132, -68, 155, -83, 41, 16, 162, 341, 129, -44, -115, 251, 39, 244, 298, -190, 117, -99, 561, -30, 284, 276, 258, 201, 145, 484, 97, 178, 269, 190, -93, 146, -67, 180, 120, 131, 179, 123, 69, 233, 68, 374, -3, 139, 50, 203, 1, 19, 381, -88, -24, -109, -109, -204, 7, -32, -134, -34, -170, 54, -242, 95, -29, -239, -33, -278, -176, -582, -488, -448, -216, -169, -105, -114, -294, -160, -293, -184, -77, -27, -274, -295, 115, -242, 189, -5, 284, -252, 97, 75, 218, 305, 132, 192, -15, 133, -94, 470, 407, 315, 349, 137, 410, 185, 116, 434, 297, 453, 311, 393, 50, 238, 219, -92, 184, 117, 272, 157, 193, -136, 44, 143, -44, -82, 40, -46, -200, -1, -163, -125, -123, -107, 19, -84, -226, -164, -389, -406, -263, -244, -161, -204, -319, -87, -230, -175, -338, -27, -73, 32, -431, -198, 25, -297, 246, -247, -17, -276, -118, 85, -420, 94, 197, -78, -50, 35, -31, 230, 287, 68, 310, 83, 326, 141, 97, 322, 201, 254, -34]
3400c4K06k09L51j09l66K83R8J0l25KN7K50l96K29J20o6Q5k3k06%L9J32k60j05
3424b37J55m4j27J92o3N7j72M33m81K76k8j25K63n65N76k93j79K58k36J54KK2
3446a62J56K70k03j49K22j92L31l09o2r8K91p5J31k08J16J14j33l3K74j68N4l21
3468a54N46m94L55j39l0O7J6J3j50J0j22N8m5L25k98NR5k67J70j55K42l27K77
3491bo0j93J74m29O62k77P9j24P2r0o5K10j97L08k77j7nk24M72l32L77N7q9q3
3515e3Q1J28P9l97J42K5j22N03r2m26M12n38L71m2J19j58J98j2n2j99Q3L3j7J91
3539B57l70J42P7J20j77L5J27j90J0n6Kn3P2n4K0q9j19L11m27n2J97R1Q5m9J61
3564G1j82q6K37k72P0k11M26j28j08K04J6j90O8J7l00N26nr0m9Q7j55p5L00k27
$$ y = [-34, 172, -37, 314, 205, -161, 122, 220, 230, -95, -93, -36, 214, -182, 47, 167, 101, 186, 163, -43, -43, -4, 128, -132, -237, -82, -126, -253, -61, -124, -67, -239, 194, -287, -11, -39, -164, 99, -466, 110, -183, -362, -104, -340, -186, -184, -162, -6, 264, 61, -88, 134, -58, 273, -36, -98, -196, 95, 20, 151, -57, 59, 173, 40, 7, 281, 113, 167, -154, 392, -102, 253, 114, 84, 151, 167, 180, 30, 40, -82, -24, -69, 256, -42, -37, 58, -209, -39, -194, 48, -279, -2, -62, -255, -81, -510, 152, -125, -46, -170, -98, -188, -253, -43, -240, 68, -209, -226, -231, -455, 17, -315, 62, 119, 30, -53, 28, 156, 235, -162, -20, 5, -117, 386, 294, -132, 280, -258, 113, 71, 190, 32, 230, 218, 166, -33, 50, 83, 66, 257, -113, 29, 106, 226, 49, 84, 211, 21, 31, -25, -23, -76, -4, -58, -38, -127, -246, 65, -362, -414, -217, -126, -41, -90, 71, -111, -197, 40, -232, -162, -373, 53, -75, -183, 21, 37, -153, -85, -68, -368, 158, 153, 63, 14, 101, -54, -129, 171, -56]
3588e6R1j7P2J92q7k12K2N5j98N91l31j60K93J96l96k7J42j19J32k87K62k1R3
3611B30k70j41L45j32J01j0j28o5J9Q6N2J57j82P0l72J64r2J17M1k9k04L6K45
3634C8j40P5o5k98M97j54j0j34n1J11L8P8k87M64l11k8K40j91l4j14L37j79R4
3657b4P8Q8j42J61K0k94J56k21J87l04K14K20j69L28n0Pk93J76j63R0j2%J06J7
3681A76J63l46J47j88J3J41O2K2r3j30J63j41k41l8K58k55m1L66K3j68r5O7N6
3704g9N7j44J07j90r3L43k08J76k86J18NK43r5j29J77l05K11k09L87l41K61j11
3726a05K18K9o3j6N0K04j84k12K05J22j14K0Q8k28L37m81K51K40k29J32llk15
3749D3J34m50L68J40j61L28m25J56K0K9l14N1J80n3O5j21M5j18J24p5n6j22K9
$$ y = [-56, 35, 18, 90, 282, 195, -17, 5, 60, -138, 453, 122, -38, 255, 451, 55, 28, 170, 51, 183, -104, 158, 137, 230, -40, -181, 164, 32, 133, 123, -5, -70, -51, 35, 87, 244, 62, 132, -240, -76, -168, -51, -10, -39, -243, -207, 38, -102, -27, -92, -390, 107, -47, -57, -191, -242, -131, -93, -15, -302, 162, -149, -177, 63, -128, -162, -276, 61, -118, -24, 54, 142, 0, 161, 181, -113, 43, -178, 9, -295, -81, 139, -30, 298, 248, 255, -38, 138, -25, 65, 53, 53, 159, 176, 339, -7, 140, -48, -35, 106, 168, 190, 97, -33, 130, -11, -252, -290, -32, -287, -328, 38, 61, -107, -202, -135, -79, -22, -166, -59, -249, -342, 1, -207, -31, -317, -199, -194, 49, -46, -175, 2, -303, -92, -301, 86, -255, 6, -105, 113, 142, 79, 63, 113, 317, 133, -79, 126, 248, 134, 154, 242, 14, 351, -130, 121, 361, 132, 264, 261, 258, 43, 177, -273, 95, 235, 74, 402, -23, 133, 153, 182, -132, -81, 99, 46, 111, -10, 35, -83, 41, -34, -90, -212, -183]
3772a83K15l32L75l37K18M7o4j09j54J5J10m7l1J46J14n3Q0n1p4R7j95J7J73j82
3796b05n2L81j56J6j57J19j54K25J95k53K79m02O33n05j90K69q0L27k98M43l68
3817F7J69l03L35m2k27J34K24j07l36L07l0j06L67l26j15J18P0J39j76J06q3O9
3839B54m19J91n3J30J85j73j41j11j08n7K15j17j58P3R5R8l42N66k18O9l15K34
3861a02J7k8j22P5p8L2j73J76J62l1q0k8J44r4j7Q7R0M02m73P6K85m70J65J63
3885A78j3N5K59j05l86J40j75J89j35J21K8L4l55M68r3k02O9k61L40P3Oj48K63
3908C50k95J72j00j78K70k43n5M5k3PJ61k57J12p6J70q1k4l7L2j42n0NK56j75
3932a56J74n1j62J41l4R9k75J57N7k53K83j2J55j61Q8j81J53j54O6L49n42L36
$$ y = [-183, 32, -300, 75, -262, -44, 3, -61, -170, -324, -309, -199, -246, -277, -131, -17, -70, 10, -41, -115, -18, -213, -196, -23, -205, -257, 124, -32, -16, -173, -54, -208, 17, 212, -41, 238, -164, 469, -36, -226, 43, -37, 290, -8, 435, 67, 236, -67, 268, 226, -1, 133, 357, 250, -86, 221, 191, 85, 452, 126, 11, 129, 199, 338, 162, 268, 185, 254, -165, 26, -27, 103, 288, 115, -26, -137, -245, -302, -87, -204, -362, -289, -194, -96, -438, 128, -90, -21, -336, -102, -85, -113, -235, -160, -238, -206, -379, -203, -41, -72, -152, -180, -36, -130, -147, -60, 30, 432, -41, 35, 320, -150, 15, 178, 165, 220, 479, 374, -12, 128, -47, 142, 7, 128, 156, 190, -165, 303, 210, 8, 77, -184, 156, 229, 235, 87, 350, 55, 227, 127, -51, 219, -24, -79, -34, -57, -50, 111, -146, -34, -110, 60, -21, -45, -82, -50, -192, -242, -237, 19, -156, 18, -33, -195, -54, -88, 11, -264, -107, -50, -303, -20, -32, 123, -38, 50, -131, 22, -132, -66, 283, -259, 77]
3954G7p7L18l16l09N39k77J63j46J08k20K38o5j88J31J90L6m50M5J31J01k23J32
3976f2K19k53M02l84K69k06J60j48KJ88r8j20O9J11q3O7k83K94k33k81O21q0k79
3999a08K97p3J24k94J75l03M92l10J26P1l13k9k77M32k35L42k95L18j63j00K34
4020A11j75n7J52P8l93L6P3K19q0M7R1n8k3n5Pk4J5q1J45p0J51k59K0J97O3o0
4046G0J9j8Q0o7N8J81j75n2M7L2k61R7N7N7M0j18J84K5L3j90j8p1J13K19o15L23
4072E0o4N0k10Q8K41OM1k75J69M6j14j12k73L68M4J0k05N6Q2k27J84j87M9J03
4096h0j05k87O26l69JJ72j54K53l21L1J3J58N5q3L67l09j47K5Q0j22J47K24r0
4119H5k48K90j25K16j7q8l4J65j5L3J27m51K19rJ56j69J54m02J03J40N4j3J4r4
$$ y = [77, 0, 318, 2, -307, 232, -45, 118, -28, 80, -140, 98, 33, -155, -24, 166, 202, -248, -203, -72, 29, -194, -62, 157, -96, 306, -78, 191, -15, 145, -3, -1, 187, 89, -31, 38, 149, 66, 133, -150, 144, -89, -370, 251, 171, -108, 189, 116, 240, -54, 121, -182, 310, 0, 126, 197, -116, -145, -422, 10, -225, 117, -178, 140, -23, -123, 111, -64, -121, 31, 109, -284, -248, -175, 44, -36, 11, 102, 44, 21, -34, -27, -51, -36, -117, 28, -42, 109, -150, -130, 67, 130, 70, 89, 71, 151, 84, 142, 323, 148, 96, 143, 175, -86, 11, 68, 125, 165, 47, 231, 256, 289, 99, 81, 10, 123, 342, -273, 50, -14, 36, -174, -86, 155, 161, 202, -73, 96, 142, 28, -84, -357, 11, 55, 65, -140, -84, -2, -229, -45, -232, -183, -80, -185, -472, 154, -215, -214, -42, -196, 57, -264, -233, -220, -62, -7, -90, 277, -32, -179, -154, -74, -196, -49, 175, 85, -163, 127, 2, 218, 201, 113, 79, 244, 229, 262, 389, -62, 157, 148, 304, 135, 289, -113, -10, 130, 184, 171, 185, 91]
4143I1k34L57L21j58k83J37k29q6k4L89k75j84K20k58K49O9k76J6J08KR5j18J54
4166H3k68J33j67L40k66K03k88M9J5Q3Q6l09R2K04k04K28k30o0O8k63J55K98N19
4189E01n74J87k79O71j81j39j01j92O47k63q2j10J19k10K74j14L7j29J22j71K77
4210B90l96J59J73k57K33l51L67m4j03l3p0K11r6R8r6J74j26Q1l47K09j62RK09
4233A32j32M6oj93J09j18J44j50J55j19J77l84R2RO8l2m8J20J1J88j90j93J19
4256a95J10k03o6K41q8J46k5m1J19k1Q3j56J01j71K63L5l51L57j28k6J95n6L0
4279A53j00J66j85K23k0o8j12J35P6j19K34l90K07k26K62k1Q9l48J57OJ4J63k06
4302I0k0l12M56j07o3L5r8Q9k01K2K07j58n9J81k21J45q7k79J40L2k2J02p7O6
$$ y = [91, -143, 214, 535, 377, 94, 231, 2, -84, -108, 281, 6, -178, 42, -216, 33, 102, -174, -158, -50, -48, 47, -71, 83, -185, -52, -219, 121, -145, 58, -230, -181, -166, -83, 3, -306, -214, -10, -214, 14, -216, -276, -208, -471, -316, -18, 501, -73, 114, -165, 506, 325, 186, 85, -107, 540, 277, 195, 85, 204, -6, 268, 154, 191, 62, 184, 13, 290, -106, 53, 226, -31, 202, -149, 218, 174, 71, 38, -32, 179, 83, 181, 85, 259, 133, 214, -133, 76, -86, -77, 132, 0, 46, 40, -153, -44, -162, -18, -168, -13, -132, 45, -339, -247, -238, -170, -202, -250, -130, -119, 69, -121, -314, -195, -85, -288, -354, -113, -201, -55, -80, -121, -2, -23, 60, -96, 5, -166, 97, 132, -219, 138, 10, -16, 179, 123, 153, 53, 219, 34, 257, 237, 169, 57, 192, 268, 149, 383, -7, 200, -26, 236, 215, 304, -44, 113, 119, 133, 296, 90, 70, -242, 214, 107, 44, 79, -19, 70, -131, -109, 98, -60, -119, 62, -159, -14, -101, -380, -240, -208, -230, -128, -205, -139]
4326a39Kj55J59Q5J78l45k33L76M4N1j40M9mp8j44L67k45M20l67K67k26n5J17
4349a6K33j44k03L23J00r2j71r8K54j10P8q6L84j42k74J80j33J20k95K02k58L86
4371B38j65P7Q8j48p5N7j05m2O6o7j73K64k06L42k94J76pQ6j57k95N22n13L65
4394C4m58L41k35J75k26PJ32j03M06j27l43J52J14m6J04J33j05n5L1m2K17J53
4416B59k47J22K6M6l68j3MM65j29P3l15K71l33K55m7K3J38j75j4RJ11k83M01r9
4440A80M1N1n14K49J7m2n4J23K06l52P0p7M8L4k9R3k72J83J37q3K84m88J29q3
4464a49j1J39P2k69r5L83k80j13K7L6PJ34r2K19J04k63j36n1K88j79K73j48L63
4487B59l26K31Q0k69l9J58pk14L69q0M0k72n9K92J85l43J8J67Jj85j06j18K91
$$ y = [-139, -137, -292, -133, -48, 130, -215, -448, -72, -28, 23, -117, -68, -72, -150, -294, 73, -172, 248, -119, 148, -78, -133, -16, 217, 73, -130, 193, 293, 201, 30, -68, 186, 76, 154, 68, 452, 310, 36, 216, 83, 203, -92, 110, -148, 238, 73, 150, 238, 90, 15, 72, -33, -75, -9, -76, -249, 15, -191, 151, -143, 33, 26, 112, -45, -340, 182, -331, 34, -424, -83, -318, -143, -369, -362, -230, -333, 73, -54, -397, -245, -131, -177, -73, 60, -45, -100, -69, -111, 106, 259, 12, 134, 160, 206, -162, -175, -171, 294, 165, 238, -77, 194, -139, 116, 69, 92, 230, 55, 41, 50, 161, -122, 279, 180, 221, 272, -242, 7, 24, -18, -72, 51, 257, -95, -25, -102, -54, -20, -49, 44, -228, -45, 92, 9, 293, -195, -66, -149, -160, -21, 51, -218, -313, 70, -210, -323, -296, -260, -253, -119, -211, 8, 112, -151, -287, -338, -50, -229, 44, -104, 259, -67, 164, 244, -25, -64, 94, 87, -127, 242, 162, 202, -70, -129, 163, 348, 5, 23, 190, 191, 6, -100, -218, 73]
4510G3k0L9j40J36j84L12k69K2j01J55k2R1j47J39J29j35j54m9K17k9j93l2J0
4533a52J98M6l33J57oK33k81K26j46J5j26j19P8J11N8O1Q3j99r8K33O3K87l83
4556Fj38o8j35L87k40J58k18L07L9m1Q8j58J84k40K34o7M3k03J47J69k14P7j56
4579c9r0J18J2l7J58p6Q7k04r2L53k47J44J9j40j05J65J52n8j47P8O4j51J79n3
4603I0j31k12K00Lk85K8L41k74N05j54L7q6n2j40K3R1J88l54J03qK27j23k31K1
4627a93L03m10O5O0J78J37q8j76R7K9k3l5J3J81j57l1J22J88l93J09P5k5R5j72
4651e1J47k8K7K09j12J3l34N0J48j48K60k39K90l15k09K01kP1M2m8j5j62L09j06
4675bj74R8J4J00N6m4j21n6J93o7KJ48K6j65n2k36L02K48j00l51J43J5J53j00
$$ y = [73, 53, 92, -48, 88, -96, 216, -53, -31, -132, 23, 1, 92, -55, 84, 213, 78, -76, -125, 92, 63, -130, -162, -152, 46, 92, -241, -84, -90, 143, -138, 88, -58, -43, -169, -288, -210, -99, -41, 20, 103, -96, -194, 39, 102, 389, 6, -132, -200, -335, 52, -188, -30, -248, 59, 98, 57, 145, -13, 171, -69, 165, 98, 141, -62, 85, 254, 40, 117, -39, -129, -11, 1, -36, 122, 46, 133, -71, -163, 190, -57, 87, 106, -34, -139, 26, 178, 120, -27, 51, 115, -36, 143, 90, -41, -253, -53, -50, -335, -307, 34, -240, 265, 111, 148, 62, 10, -130, -107, -16, 172, -182, -79, -87, 140, 17, -214, -193, 110, -300, -235, -175, 3, 140, 52, -124, -27, 2, -21, -56, -43, 138, -19, -50, 72, 260, -133, -24, 51, 26, 121, -51, 96, 68, 95, 304, 192, 205, -129, -79, 69, -79, 181, -58, 232, -83, -292, -91, -93, -22, 20, -28, -43, -205, 104, -2, -176, -78, -64, 36, 92, 48, -73, -129, 64, -3, -1, 147, 173, 8, -44, -280, 22, 270, 170, -181, -38, -23, 130, 30]
4699C0M8j01Q9J8Q1M3k45K45r1J55j88l04J97j93J26j94L17n0O7l24L20j8J73
4722B01j44j01j5K57j92p7n6J53P6k09J58or9o4N0M04n06K2J23J09m3j74J01J47
4746A15J59k84p8m8P2P8P7Q0l9P6l41Q8J01n1l3k2K69k13O3k2K3P3j51j9J15O0
4772A48p6n1oj33M5K6q3J45k10J78K31l67J54Q0l11K46j60J3J36Q6j6p1j6J34
4796A22r7J3j01J95M8j82n4p5Q8k31L11J2J73k92K43j76Oj18K05R5j24n7L6K88
4820C28j70J8r3l7k99K29K6Q3j98j16K49o2j10P9j6N1Q0J05j39j17J9k1K76k58
4844i3K95j91p0J7m8K6j75J24K99j06p5j7Q7j15K22q9j39j4n8q0L58k04J80k8
4868A06k0r6j3j4k00L74QK66l93O9l09K36K24q2k87L23l96M18q6k08J11O3J24
$$ y = [30, 78, -23, 66, 84, 165, 208, -37, 208, 117, 272, 84, -220, -23, -216, -90, -284, 33, -17, 50, -274, 46, 28, 201, 57, -44, -59, 198, 6, -71, -127, 26, 102, -107, 51, 45, -54, -118, -68, 336, -170, -148, -25, 84, 41, -133, -32, 115, 274, -10, -88, -136, -64, 14, 91, 171, 132, 208, -133, -45, 56, 5, -28, -50, 219, 6, 69, 47, 70, 143, -8, -27, 88, 148, 72, 21, 15, -118, -73, -47, -130, 15, -195, -17, 214, -153, 1, 81, -230, 16, -144, -131, 5, 91, 75, 4, -12, 122, 25, 38, -63, 132, 180, -2, -56, -131, -43, -274, 37, 49, 222, -70, 173, -3, 3, -115, 90, 185, 61, 4, 40, 328, 158, 176, 83, 46, -253, -24, 2, 85, -113, -229, 20, -42, -152, -73, -89, -38, 42, 147, 8, -109, -90, -111, 165, -93, 202, 11, -59, -42, -90, -64, -239, -115, 184, 78, 3, -14, 73, -42, 180, 91, -48, -62, -120, -200, 158, -46, 134, 106, 86, -10, -23, -37, -237, 137, 145, 411, 18, 87, -222, 14, 238, 156, -131, 192, -204, 214, 128, -80, 31, 94, 218]
4891B18j44j38J98k99n9KK84qN3K6J64l36N6P3j42n6N8J93o8j50K7L5J43k24j27
4916b21J8K01j7q0q0J09p7J7L63l53nq8K82j73l1j59K72k5Q5k53K09m8K6l66K69
4941a25R5j22K26R0l04J35k49J83r7J58J33M7j77l61N20qJ55n34J15K59L5r1J36
4964B19pj57l57L09M4J23Rm8k61J16P7k05K69l6J53k49Q9j14K80m18K45j12n0
4987h1K3Q3k2k12J26p0K8L5j71J88l2J67r8j9K4o9J51k40L04l07L86m12Q4J81
5011D7q4J25j60o8R0j77J81l2K60j21n0K34j65j72Q1N31n99R08j758P23R04j143
5033d45N09J94l35O37n97l85Q37q66L25N87j97Q0J35N1M45r41J67K24m8n74l23
5054e20P56K59o3j37Q00j422p8K75K09l28M77m03J092m44o60K06k58K08l2M9j50
$$ y = [218, 74, -64, 134, -165, -224, -222, 62, 54, 107, 133, 297, -39, 17, 90, -52, -108, -50, 143, 75, -75, -48, -13, 130, -94, -221, -203, -2, -19, -99, -179, -70, -147, -130, 233, -120, -125, -213, 69, -104, -135, -294, -22, -47, 38, -215, -6, -54, -28, -394, -125, -30, -152, 74, 164, -140, -5, -254, -71, -168, -10, 123, 170, -7, -368, 152, 144, 299, -235, -120, 139, 174, 83, 219, 212, 55, -302, 7, 51, 174, 183, 135, -126, -10, 67, -138, 131, 95, 248, -1, 88, -26, 254, -164, 81, -31, -81, -58, 25, 3, -209, -83, -153, -125, -90, -261, -73, -105, 62, -36, -55, -31, -100, 51, -189, 115, -192, 194, -218, -134, 47, -37, 88, -72, -140, -50, -227, -46, -78, 182, 61, 11, 245, 80, -92, -11, 520, -79, 829, -929, -206, 698, -445, 64, 258, -77, 560, -37, -422, 415, -451, -126, 461, 264, 344, 479, 530, 975, 34, 201, 425, 377, -197, -520, 236, 495, 432, 295, 1095, -327, -405, -130, 79, -249, 228, -175, 917, 473, -187, 19, -239, -31, -63, -14, -164]
5075a64J87Ro45J065r4j106R88m50R9k55K38K09k82m93N60j16L21M68q57K70k43
5096b91R48n44L63k32m77M47k5o73O12m76N64K82j82o30N85l32L18l84N92o03
5116a38O86j170O32M07p96N86k43j07K10m77L04Q1r1L44l93k20K44J14L7L2j21
5137g9J0j05L63l47O0r2K7Q7J70k52j6j43L37p1q6L79l67L29k38p9M3j71K70J8
5161D7J50j99l9J38k92k13J72O8j88N73j60N25k06k02J63P8p73J067q80K98m9
5182G8M0k25K67K13m35k7P7J40J07k73K66n4L31m16J38j48m8J0l13K99L9l7J25
5205A54j33nL02k47J28j25l9J62l7n3j16j10q3K2K89pk77J97J10j51J24o3k85
5228b43m4J23J64O9j8l03L00j66K70k11j9Q6m71L48J18J06k20J38Q5m42L10o4
$$ y = [-164, 23, 32, -613, 452, 358, -748, 240, -210, -111, -366, -128, 81, -201, -694, -134, -250, 71, 539, -318, -48, -291, 657, 113, 476, 244, -233, 214, 189, -484, 128, -348, 216, 498, 316, -314, 271, -61, 257, -127, 465, -138, 548, -622, 10, 417, -379, 207, -36, -143, 67, -410, -106, -25, -116, 228, -165, -385, -141, -27, 10, 42, -79, -69, -174, 189, -158, -98, -190, -163, -76, 94, -158, -174, -317, 20, -51, -137, 242, -125, 204, -34, -113, -70, -241, 29, 47, 197, -2, -41, 97, -195, -408, -236, -168, -356, 217, 57, 582, 376, 174, 337, 415, -358, 709, -171, 127, 78, 118, -107, 160, 373, -62, -89, -12, 128, 235, -38, 228, 174, 505, 89, 227, 79, 31, 41, -272, 27, 66, 29, 154, 21, 16, 318, 71, 199, 74, 35, 197, 160, 107, -9, -119, -202, -180, 109, 102, -175, 22, 132, -19, 105, 42, -243, -287, -164, 0, 69, 51, -252, 48, -118, 152, -59, -78, 8, -463, -115, 3, 109, -111, 27, 112, -330, -20, -84]
5250h4M5m7K88M35n98j9K82l33J25j05j47J53J9k19L66j64M2J34j62K84k33k18
5272a56P8K69j63p2J93L1j91Qn6o4M2q8J25K38r2k31M0j03L09k81M5Q6J4J59j92
5297e2k61J29J56p2L4L24l89J83j6k4J82l66L1m6j1J89j08J36k51K92o4N2M6K1
5321A15J31k23p8j8K89j67L01om59J18m2j61K14N3r3k05K29L5R8n1Q9j86J76k23
5345f4q4o7L46j7j10K79m4j2j98j60L20j29o5n2K51j93QR2j52j7L36o48K33N0
5369i7pN0J84qK20o16l93J008k73J52m00jm42J72M30L40m35K0J33k00R69j499
5391f93N64O51l50l37l06N82K08o6n47K95J51K98l33l94K90j74L78j69K85k80
5411E3K54l31J15j17J32k27L6j04M14K1n41O67m10j20j09L19J17j48m3r7K72l09
$$ y = [-84, -39, -86, 202, 637, 39, 20, 302, -31, 94, -11, -158, -5, 14, -205, 161, -3, 39, 173, 11, 295, 62, -156, -78, 191, 28, -44, 149, 180, -11, -3, -59, -123, -81, -169, -44, 194, 102, -129, -89, -192, 117, -164, -119, -33, -19, 140, -52, -313, -184, -28, -100, -66, 258, -131, 52, 36, 12, 194, -172, -141, -187, -198, -9, -117, 19, -232, 60, -4, 48, 94, 115, 246, 23, -55, -73, 216, 49, 350, 344, -115, 3, -39, -200, 14, 67, -26, -231, -2, 33, 131, 80, 169, -17, 159, -64, -148, -215, 131, 114, 4, 283, 239, 227, 29, -131, 189, 60, -5, -57, 194, 1, 9, 101, -51, -68, 268, -380, -147, -97, -104, -54, 130, 122, 342, -274, -667, 341, 68, 220, -180, -181, -623, -451, -21, 319, -116, -96, 37, -163, 806, -693, -129, 522, 172, -165, -471, 111, 319, 253, -294, 1, 152, 450, 117, -277, 13, -161, 217, 48, 333, 53, 307, -24, 91, -26, 106, -121, -85, -189, 225, 246, -295, 372, -38, -158, -267, 52, 169, 21, -22, -119, 153, -156]
5433a56K61o1j6k76j27J24L84l25j85K30K38j37J60o9J1M8j42k21K27J46l79j15
5455c80q2N19j78J70r6o7p3O0o01L50P41k88r2J43j4N3l08l56N17M3nl58O11o41
5479c32L93nk93L09J96l20j98Q0L03k20l44M52J18K69k80j13j1k57N52j57k05
5500f3k57Q7L22Q4j87j45R9K11m23M9P01l92k03K11l60o1J38O8K66L6m5L41p45
5523b68k38M00K78J60Q62j420O40k31m94L90j31n01L93n10O25m17Q23j81j13j75
5543a08M17j9k14M03l26l73k01L41M43m73q7NM8K42k20O94n59l36N78j48j29r5
5565a17l87J134o70J91K5j04j79K05j90O19n27P5j34K96j15K37j04P9l62N9j8
5586A3j67K21Q8j21k08K67m04K21O5%j20o2M84m07J09j29L0K39j19j30jK85m5
$$ y = [-156, 105, 44, 28, -248, -375, -251, 133, -192, -377, -147, 91, -46, 114, 45, 56, 104, -38, -259, -32, 114, -265, -380, -462, 57, -121, 49, -47, -114, -187, -127, -728, -378, 363, 75, -17, 126, 112, 165, -143, -499, 18, 61, 56, -302, 309, -332, 61, 56, -237, 72, 268, -52, -250, -170, 133, -87, -431, 21, 139, 408, 128, 15, 4, -253, 299, 142, -63, -320, -233, 89, 173, -14, -159, -60, 151, -272, -223, 478, 86, -117, 94, -266, -327, -189, -121, 145, 181, 136, 477, -268, -506, -106, 172, 332, 1194, -226, 414, 183, -311, 79, -52, -553, -160, -670, -45, -462, 361, 180, 67, -108, 309, 290, 76, 479, 153, -220, -421, -80, 363, -110, -197, -192, -144, 98, -122, 572, 13, -323, 255, 107, -22, -117, -504, 630, -40, 151, 176, 72, -107, 98, -92, 527, 0, 75, -59, 237, 122, 359, 255, 334, -28, 31, 13, -154, 67, 155, 34, -174, 93, -311, -90, -25, -25, -145, -207, 277, -130, -21, -150, -120, 119, 0, -130, -131, 154, 109]
5609A09R8j55J60k86L92n00L7K19k38P3J2J48M8k4j99J75Q8n9N7J19j04k86J47
5632C1K11m26J33J08o2r4J22j82J63j73K41j31j22L56p9k42J15K20j23P1k07J91
$$ y = [109, 207, 52, 212, -74, 318, -182, -145, 74, -164, -91, -79, 69, 117, 93, -106, 69, 157, 98, 155, 274, 170, -116, 31, 242, -184, -51, 57, -5, -99, 23, -159, 4, -169, 72, -59, -181, 175, 96, -146, -31, 189, 66, 137, -70, 121]
$$ [...]
8191B02
##END NTUPLES=NMR FID
##END=
