##TITLE=1H_Pr Ben
 200.13MHz, CCl4,
 8 sc
 
 29.1.2025
##JCAMPDX= 6.0         $$ Bruker NMR JCAMP-DX V2.0
##DATA TYPE= NMR FID
##DATA CLASS= NTUPLES
##ORIGIN= UXNMR, Bruker Analytische Messtechnik GmbH
##OWNER= pz
$$ XWIN-NMR		Version 3.5
$$ Wed Jan 29 15:07:30 2025 Russian Standard Time (UT+4h)  she@DPX200
##.OBSERVE FREQUENCY= 200.1311
##.OBSERVE NUCLEUS= ^1H
##.DELAY= (6, 6)
##.ACQUISITION MODE= SIMULTANEOUS
##.ACQUISITION SCHEME= undefined
##.AVERAGES= 8
##.DIGITISER RES= 18
##SPECTROMETER/DATA SYSTEM= spect
##.PULSE SEQUENCE= zg30
##.SOLVENT NAME= MeOD
##.SHIFT REFERENCE= (INTERNAL, MeOD, 0, 14.3821)
##AUDIT TRAIL= $$ (NUMBER, WHEN, WHO, WHERE, WHAT)
$$ ##TITLE= Audit trail, XWIN-NMR		Version 3.5
$$ ##JCAMPDX= 5.01
$$ ##ORIGIN= Bruker BioSpin GmbH
$$ ##OWNER= she
$$ F:/spectra/data/she/nmr/H-C/1/audita.txt
$$ ##AUDIT TRAIL=  $$ (NUMBER, WHEN, WHO, WHERE, WHAT)
(   1,<2025-01-29 15:05:42.26 +0400>,<she>,<DPX200>,
      <created by zg, POWCHK disabled, PULCHK disabled
       configuration hash MD5:
       00 E9 B6 7A A2 85 ED C7 34 08 36 98 17 FE 4E 26
       data hash MD5: 16K
       5E D7 90 90 38 8A F1 24 E5 78 53 74 D2 6B 7A D2>)
$$ ##END=
$$ 
$$ hash MD5
$$ FB 91 53 61 2A 25 B1 B0 8D CC 4B 3A 72 AB 91 6F
##$RELAX= 
##$RELAX= 
##$RELAX= 
##$RELAX= 
##$RELAX= 
##$RELAX= 
$$ Bruker specific parameters
$$ --------------------------
##$DU= <F:/spectra>
##$EXPNO= 1
##$NAME= <H-C>
##$PROCNO= 1
##$TYPE= <nmr>
##$USER= <she>
##$AMP= (0..31)
100 100 100 100 100 100 100 100 100 100 100 100 100 100 100 100 100 100 
100 100 100 100 100 100 100 100 100 100 100 100 100 100 
##$AQSEQ= 0
##$AQ_mod= 1
##$AUNM= <au_zg>
##$AUTOPOS= <>
##$BF1= 200.13
##$BF2= 200.13
##$BF3= 200.13
##$BF4= 200.13
##$BF5= 200.13
##$BF6= 200.13
##$BF7= 200.13
##$BF8= 200.13
##$BYTORDA= 1
##$CFDGTYP= 0
##$CFRGTYP= 5
##$CHEMSTR= <none>
##$CNST= (0..31)
1 1 145 1 1 1 1 1 1 1 1 1 1 1 1 1 1 1 1 1 1 1 1 1 1 1 1 1 1 1 1 1 
##$CPDPRG= <>
##$CPDPRG1= <>
##$CPDPRG2= <>
##$CPDPRG3= <>
##$CPDPRG4= <mlev>
##$CPDPRG5= <mlev>
##$CPDPRG6= <mlev>
##$CPDPRG7= <mlev>
##$CPDPRG8= <mlev>
##$CPDPRGB= <>
##$CPDPRGT= <>
##$D= (0..31)
0 0.7 0 0 0 0 0 0 0 0 0 0.03 0 0 0 0 0 0 0 0 0 0 0 0 0 0 0 0 0 0 0 0 
##$DATE= 1738148741
##$DBL= (0..7)
120 120 120 120 120 120 120 120 
##$DBP= (0..7)
150 150 150 150 150 150 150 150 
##$DBP07= 0
##$DBPNAM0= <>
##$DBPNAM1= <>
##$DBPNAM2= <>
##$DBPNAM3= <>
##$DBPNAM4= <>
##$DBPNAM5= <>
##$DBPNAM6= <>
##$DBPNAM7= <>
##$DBPOAL= (0..7)
0.5 0.5 0.5 0.5 0.5 0.5 0.5 0.5 
##$DBPOFFS= (0..7)
0 0 0 0 0 0 0 0 
##$DE= 6
##$DECBNUC= <off>
##$DECIM= 32
##$DECNUC= <off>
##$DECSTAT= 4
##$DIGMOD= 1
##$DIGTYP= 9
##$DL= (0..7)
0 120 120 120 120 120 120 120 
##$DP= (0..7)
150 150 150 150 150 150 150 150 
##$DP07= 0
##$DPNAME0= <>
##$DPNAME1= <>
##$DPNAME2= <>
##$DPNAME3= <>
##$DPNAME4= <>
##$DPNAME5= <>
##$DPNAME6= <>
##$DPNAME7= <>
##$DPOAL= (0..7)
0.5 0.5 0.5 0.5 0.5 0.5 0.5 0.5 
##$DPOFFS= (0..7)
0 0 0 0 0 0 0 0 
##$DQDMODE= 0
##$DR= 18
##$DS= 0
##$DSLIST= <SSSSSSSSSSSSSSS>
##$DSPFIRM= 0
$$ [...]
##$SUBNAM0= <"">
##$SUBNAM1= <"">
##$SUBNAM2= <"">
##$SUBNAM3= <"">
##$SUBNAM4= <"">
##$SUBNAM5= <"">
##$SUBNAM6= <"">
##$SUBNAM7= <"">
##$SUBNAM8= <"">
##$SUBNAM9= <"">
##$SW= 18.051750892319
##$SWIBOX= (0..15)
0 0 2 0 0 0 0 0 0 0 0 0 0 0 0 0 
##$SW_h= 3612.71676300578
##$TD= 16384
##$TD0= 1
##$TE= 0
##$TE2= 300
##$TE3= 300
##$TEG= 300
##$TL= (0..7)
0 120 120 120 120 120 120 120 
##$TP= (0..7)
150 150 150 150 150 150 150 150 
##$TP07= 0
##$TPNAME0= <>
##$TPNAME1= <>
##$TPNAME2= <>
##$TPNAME3= <>
##$TPNAME4= <>
##$TPNAME5= <>
##$TPNAME6= <>
##$TPNAME7= <>
##$TPOAL= (0..7)
0.5 0.5 0.5 0.5 0.5 0.5 0.5 0.5 
##$TPOFFS= (0..7)
0 0 0 0 0 0 0 0 
##$TUNHIN= 0
##$TUNHOUT= 0
##$TUNXOUT= 0
##$USERA1= <user>
##$USERA2= <user>
##$USERA3= <user>
##$USERA4= <user>
##$USERA5= <user>
##$V9= 5
##$VALIST= <valist>
##$VCLIST= <CCCCCCCCCCCCCCC>
##$VD= 0
##$VDLIST= <DDDDDDDDDDDDDDD>
##$VPLIST= <PPPPPPPPPPPPPPP>
##$VTLIST= <TTTTTTTTTTTTTTT>
##$WBST= 1024
##$WBSW= 4
##$XGAIN= (0..3)
0 0 0 0 
##$XL= 0
##$YL= 0
##$YMAX_a= 638851
##$YMIN_a= -681201
##$ZGOPTNS= <>
##$ZL1= 120
##$ZL2= 120
##$ZL3= 120
##$ZL4= 120
##$ABSF1= 10
##$ABSF2= 0
##$ABSG= 5
##$ABSL= 3
##$ALPHA= 0
##$AQORDER= 0
##$ASSFAC= 0
##$ASSFACI= 0
##$ASSFACX= 0
##$ASSWID= 0
##$AUNMP= <proc_1d>
##$AZFE= 0.1
##$AZFW= 0.1
##$BCFW= 1
##$BC_mod= 2
##$BYTORDP= 1
##$COROFFS= 0
##$CY= -3
##$DATMOD= 1
##$DC= 2
##$DFILT= <>
##$DTYPP= 0
##$F1P= 0
##$F2P= 0
##$FCOR= 0.5
##$FTSIZE= 0
##$FT_mod= 4
##$GAMMA= 1
##$GB= 0.15
##$INTBC= 1
##$INTSCL= 1
##$ISEN= 128
##$LB= 0.25
##$LEV0= 0
##$LPBIN= 0
##$MAXI= 10000
##$MC2= 0
##$MEAN= 0
##$ME_mod= 0
##$MI= 1.114404
##$NCOEF= 0
##$NC_proc= 0
##$NLEV= 6
##$NOISF1= 3.799351
##$NOISF2= 2.8
##$NSP= 1
##$NTH_PI= 0
##$NZP= 0
##$OFFSET= 14.38212
##$PC= 1
##$PHC0= 258.6261
##$PHC1= 1.992229
##$PH_mod= 1
##$PKNL= yes
##$PPARMOD= 0
##$PSCAL= 0
##$PSIGN= 0
##$REVERSE= no
##$SF= 200.129724274929
##$SI= 16384
##$SIGF1= 3
##$SIGF2= 2
##$SINO= 400
##$SIOLD= 16384
##$SREGLST= <1H.CDCl3>
##$SSB= 0
##$STSI= 0
##$STSR= 0
##$SW_p= 3205.1282051282
##$SYMM= 0
##$S_DEV= 0
##$TDeff= 0
##$TDoff= 0
##$TI= <>
##$TILT= no
##$TM1= 0
##$TM2= 0
##$TOPLEV= 0
##$USERP1= <user>
##$USERP2= <user>
##$USERP3= <user>
##$USERP4= <user>
##$USERP5= <user>
##$WDW= 1
##$XDIM= 8192
##$YMAX_p= 0
##$YMIN_p= 0
$$ End of Bruker specific parameters
$$ ---------------------------------
##NTUPLES= NMR FID
##VAR_NAME=  TIME,          FID/REAL,        FID/IMAG
##SYMBOL=    X,             R,               I
##VAR_TYPE=  INDEPENDENT,   DEPENDENT,       DEPENDENT
##VAR_FORM=  AFFN,          ASDF,            ASDF
##VAR_DIM=   8192,          8192,            8192
##UNITS=     SECONDS,       ARBITRARY UNITS, ARBITRARY UNITS
##FACTOR=    0.0002768,     1,               1
##FIRST=     0,             0,               0
##LAST=      2.2672688,     0,               0
##MIN=       0,             -681201,         0
##MAX=       2.2672688,     638851,          0
$$ Real data points
##PAGE= N=1
##DATA TABLE= (X++(R..R)), XYDATA
$$ [...]
2709g243K211K575K763K577K585K063J779J254O00m9o91j317j912k156k382k652
2725Ek638k492k292j702j432l88K2M65J210J741K125K441K634K591K470K411J740
2742H911J270P44Km20j127j632k283k504k568k602k319k423j670j459p06j21M04
2759a0503J172J540J990K438K497K700K530K115K270J068R14K72l46r81j696j905
2775F075k349k487k698k374k627j781j385j121k09L85R75J438J833K310K600K646
2791A231K545K258K039J347J115J80j37q77j368j747k185k477k575k756k457j909
2807g773j444j166l05M7Q09J450J523K268K423K677K471K421K016J660J140N50
2823A0767k43p49j089j622k238k304k663k509k374k158j577j253o64q8Q03J026
$$ y = [-7243, -5032, -2457, 306, 2883, 5468, 7531, 9310, 10564, 11164, 11115, 10424, 9107, 7195, 5039, 2657, 5, -2633, -5125, -7417, -9119, -10551, -10939, -10917, -10452, -9242, -7501, -5376, -2935, -301, 2290, 4760, 7171, 8911, 10181, 10925, 10927, 10507, 9380, 7748, 5465, 2961, 393, -2209, -4528, -6951, -8621, -10080, -10786, -10907, -10503, -9331, -7791, -5801, -3363, -866, 1834, 4364, 6479, 8749, 9817, 10731, 11003, 10657, 9676, 7980, 6075, 3726, 1239, -1459, -3833, -6460, -8241, -9626, -10747, -10956, -10571, -9596, -8158, -6325, -4015, -1415, 1231, 3776, 6034, 8073, 9420, 10535, 10715, 10578, 9701, 8333, 6586, 4401, 1924, -651, -3407, -5864, -7773, -9217, -10383, -10688, -10641, -9832, -8382, -6859, -4591, -2168, 509, 2980, 5401, 7417, 9077, 10217, 10767, 10524, 9775, 8686, 7064, 4826, 2522, -141, -2650, -5024, -7182, -8759, -10012, -10676, -10764, -9961, -8935]
2839h935J670K147K223K520K737K394K144J426J235J196j37m16j189j638j867
2854E510k294k579k532k179k406j758j347p65l79M15J152J334K013K209K638K467
2870A499K219K242J903J486R79J32j30j000j394j800k123k309k711k370k494j710
2886g581j557q28m99L16P11J412J785K065K411K458K160K403J818J679J060N93
2902A0406k87o84j204j635k052k345k564k224k183k117j484j205o21o3N99J260
2918h403J672J976K040K597K208K336K104J667J054N84K23n97j033j465j887k095
2934B981k485k277k242k005j828j252l95m02L23J130J179J844K269K252K352K203
2950C647J961J745J277R13M10n35q62j252j821j978k175k423k051k028k095j050
$$ y = [-8935, -7265, -5118, -2895, -375, 2362, 4756, 6900, 8326, 9561, 10757, 10620, 10204, 9015, 7377, 5510, 3216, 637, -1895, -4074, -6480, -8238, -9585, -10350, -10729, -10314, -9162, -7828, -5815, -3606, -968, 1499, 3718, 5960, 7863, 9349, 10328, 10460, 10330, 9330, 7936, 6136, 4013, 1704, -1007, -3377, -5871, -7581, -9138, -9966, -10465, -10149, -9438, -8026, -6241, -4176, -1765, 693, 2853, 5256, 7074, 8753, 9813, 10406, 10119, 9435, 8231, 6596, 4544, 2199, -365, -2589, -4772, -6889, -8373, -9578, -10199, -10262, -9663, -8403, -6731, -4755, -2715, -118, 2090, 4426, 6530, 8197, 9251, 9835, 10058, 9461, 8428, 6963, 5076, 2981, 496, -1781, -4023, -6028, -7856, -9108, -9503, -9905, -9582, -8452, -7273, -5429, -3160, -908, 1444, 3647, 5608, 7353, 8630, 9543, 9953, 9418, 8556, 7304, 5483, 3505, 1330, -1093, -3144, -5172, -7267, -8317]
2966h317r92l51K28Q26J336J669J761K343K200K316K048J580J408Q92N25k2q21
2983H629j278j459k002k181k025k296k090j789j123j234m04J4M65J127J582K013
2999d051J830K373K215J983J804J476R37O71k37k96j197j506j632k088j955k264
3015a937k031j923j257j077o23l16P88Q71J312J679K057J899K120K083J870J462
3031F977J172N41J90n42o11j516j612j732k286j995k049j776j529j036q10n9J97
3048h476P55J249J697J820K020K097J946J641J666J302O83K44k79p93j000j738
3064D834j726k050j984j936j934j656j014p57l31K76O89J087J580J505K183J928
3080F94J982J857J630J160P26K49j93m00j077j544j430k208j930j949j702j523
$$ y = [-8317, -9309, -9660, -9432, -8606, -7270, -5601, -3840, -1497, 703, 3019, 5067, 6647, 8055, 8947, 9472, 9450, 8629, 7351, 5892, 3890, 1709, -316, -2612, -4702, -6491, -7614, -8848, -9252, -9238, -8773, -7646, -6064, -4051, -2221, 152, 2367, 4350, 6154, 7630, 8567, 9238, 9001, 8705, 7508, 6002, 4370, 2282, 327, -1937, -3968, -5891, -7148, -8225, -8848, -9164, -8376, -7505, -6193, -4514, -2457, -558, 1562, 3645, 5515, 6977, 8149, 8690, 8880, 8338, 7727, 6211, 4599, 2867, 581, -1414, -3463, -5239, -6768, -7804, -8614, -8673, -8476, -7721, -6472, -4775, -2955, -935, 1162, 3108, 4749, 6415, 7717, 8400, 8644, 8365, 7572, 6572, 4834, 3108, 1058, -926, -2862, -4796, -6452, -7466, -8223, -8554, -8278, -7589, -6502, -4922, -3417, -1234, 694, 2676, 4533, 6163, 7323, 8049, 8298, 8105, 7705, 6628, 5084, 3654, 1446, -484, -2433, -4135, -5658]
3096e658j514p03m63K07M30J048J407J666K003J868J819K006J557J023R86M78
3112H160j09l22j054j367j366k023j767k177j759j566j355r41m66j55M79J045
3128f743J231J561J838J958J947J669J831J200J105M73J17m81r45r80j525j778
3144B478j921j919j948j555j447q40q42n4K51N53J360J514J652K049J940J890
3160C161J664J400Q94O54K68k47n94j133j401j725j891j893j961j507j699j078
3176g088o85k45J20P21J063J571J333K029J852J698J931J421J188O83M28j36m40
3193G444j041j334j771j619j999j954j826j452j108r32k85m6N63R11J171J547
3209c731J998J704K089J696J306J639P13N99j26l49r30j131j687j675j699j947
$$ y = [-5658, -7172, -7875, -8338, -8131, -7701, -6653, -5246, -3580, -1577, 291, 2110, 4116, 5673, 6696, 7682, 8160, 8051, 7729, 6675, 5308, 3942, 1919, 152, -2025, -3784, -5350, -6705, -7646, -8112, -8267, -7788, -6743, -5512, -3951, -2113, -155, 1792, 3461, 5292, 6492, 7597, 8070, 8187, 7706, 6761, 5781, 4256, 2478, 557, -1362, -3310, -4865, -6312, -7152, -7994, -8048, -7797, -7244, -5884, -4370, -2718, -669, 1271, 3161, 4825, 6225, 7119, 7773, 8041, 7794, 7200, 6067, 4666, 2941, 1050, -843, -2804, -4311, -6010, -7088, -7773, -8018, -7898, -7177, -6114, -4543, -3210, -1181, 671, 2369, 4300, 5721, 6909, 7592, 8020, 7884, 7444, 6403, 5069, 3298, 1679, -320, -2274, -4100, -5552, -6660, -7592, -7877, -7923, -7360, -6449, -5278, -3731, -1733, -29, 2060, 3756, 5062, 6701, 7414, 8013, 7887, 7538, 6608, 5477, 3790, 2115, 416, -1531]
3225a531j899j588j421r14l56j79L59P89J009J621J670J733K083J684J625J406
3241F091R38O31K61k37r87r67j323j694j867j933j705j662j430r08o93l18K02
3258g601O05J139J178J893J668J905J697J651J481R13Q87M83l05n88p87j475j502
3275C242j793j887j696j644j463j223q33n01K72N29Q55J121J528J947J683J723
3291A860J818J351J072J072M80j91l34r57q91j498j726j758j781j737j375j438
3307f033p88o31m6L89O69J083J478J548J807J887J732J258J326R20P65J41l05
3324G200o53j130j344j518j799j482j893j456j377q88n19n08K38N52R64J398J398
3341b817J662J835J611J528J250J207O82J54r2l74r08j147j460j753j780j642
$$ y = [-1531, -3430, -5018, -6439, -7353, -7709, -7888, -7529, -6740, -5731, -4110, -2440, -707, 1376, 3060, 4685, 6091, 7029, 7660, 7921, 7684, 6697, 5730, 4407, 2713, 846, -1087, -2792, -4454, -5884, -6792, -7485, -7803, -7601, -6996, -5857, -4679, -2786, -1118, 787, 2484, 4135, 5616, 6529, 7416, 7899, 7594, 7006, 6219, 4744, 3242, 1449, -438, -2134, -3778, -5241, -6464, -7297, -7798, -7526, -6997, -6142, -5021, -3493, -1546, 137, 1860, 3678, 5029, 6101, 7173, 7653, 7462, 7128, 6171, 5280, 3782, 2056, 298, -1483, -3220, -4595, -6033, -6821, -7452, -7498, -7109, -6440, -5357, -3879, -2331, -524, 1363, 3095, 4353, 5679, 6599, 7364, 7505, 7200, 6547, 5417, 4073, 2555, 756, -726, -2619, -4075, -5452, -6340, -6859, -7367, -7129, -6577, -5613, -4215, -2817, -1155, 680, 2291, 3819, 5069, 6276, 6958, 7112, 7020, 6646, 5738, 4591, 3131, 1378, -402, -2044]
3357b044j597j143j395m48m62J69L52Q92J295J289J629J674J596J561J365J151
3373E884P04L08M9l66r72r40j273j701j615j450j789j306j145o83n41O2K49Q23
3391e702J154J086J432J604J676J577J306J307O26M97J66k90n17j215j010j556
3407B141j551j723j222j479j249r69l83k72K56O80P16J218J597J516J707J239
3423B222J609J093N47R72O2r0m67p80j246j388j403j676j360j470j307r24p14
3440f320j25M1M56R30R14J497J415J469J567J349J298P22P46L13Q8n15p58j007
3458D080j337j409j359j583j599j062j178n03k01N5L32O73Q32J321J669J154J643
3475A528J233J355Q91P41L73K29l13r20q19j240j201j678j390j351j504r38o84
$$ y = [-2044, -3641, -4784, -6179, -6627, -7089, -6920, -6568, -5676, -4381, -3092, -1463, 211, 1807, 3368, 4733, 5884, 6588, 6896, 6945, 6579, 5607, 4667, 3394, 1693, 78, -1372, -3161, -4467, -5612, -6295, -6836, -6774, -6525, -5702, -4548, -3462, -2030, -426, 1250, 2827, 4133, 5440, 6066, 6563, 6729, 6439, 5922, 4707, 3697, 2141, 590, -1133, -2355, -3834, -5083, -6052, -6435, -6707, -6451, -5771, -5055, -3837, -2240, -724, 983, 2222, 3831, 4924, 5471, 6443, 6505, 6415, 5948, 5168, 3922, 2534, 1131, -545, -1905, -3375, -4682, -5606, -6320, -6445, -6404, -5948, -5018, -4104, -2607, -1192, 277, 1844, 3193, 4491, 5213, 5959, 6272, 6360, 5845, 5087, 4080, 2743, 1334, -25, -1608, -3207, -4269, -5447, -5950, -6151, -6096, -5764, -5091, -4259, -2938, -1269, -115, 1528, 2761, 4116, 5007, 5748, 6121, 6350, 6037, 5117, 4298, 3058, 1857, 179, -1211, -2562, -4066, -5004, -5688]
3492e688m43k60N08N19R11J164J277J562J439J405J380Q02J029M95j12j18n50
3509E320p83j302j200j424j626j349j127j223p37n13j86L87L49Q70J070J298J460
3526g16J422J465J171J004R89M86L64m00l34q46j103j149j450j303j569j075j100
3543d144r37o84l09J87L91Q89Q83J094J510J472J330J250J226J184L90K94k77
3560E749k60p11j014j231j048j608j298j243j236j031o27l85K8K42O98R29J026
3577c020J385J432J648J069J245Q73P58L98M4j97n12r11j043j445j359j333j361
3594b329j385r78n88m99LK05M52Q78J177J265J354J258J411J171R81Q47O46q0
3612E789j30l84j015r95j070j364j415j247j356r63q06n75k55J8M01P83J052J163
$$ y = [-5688, -6131, -6391, -5883, -5364, -4453, -3289, -2012, -450, 989, 2394, 3774, 4576, 5605, 6100, 5988, 5870, 5320, 4537, 3235, 2035, 611, -1015, -2364, -3491, -4714, -5451, -5964, -6150, -5763, -5414, -4544, -3474, -2176, -716, 706, 2171, 3342, 4346, 5335, 5821, 6185, 5785, 5451, 4605, 3502, 2353, 903, -400, -1969, -3044, -4144, -5081, -5765, -6074, -5887, -5496, -4607, -3724, -2630, -1120, 352, 1682, 2932, 4158, 5342, 5732, 6026, 5749, 5489, 4778, 3764, 2533, 1485, -123, -1421, -2664, -3900, -4931, -5558, -5943, -5915, -5673, -4975, -4046, -3020, -1635, -203, 1445, 2514, 3759, 4632, 5390, 5788, 5832, 5635, 5123, 4212, 3169, 1724, 365, -968, -2329, -3714, -4692, -5280, -5779, -5776, -5571, -5119, -4241, -3064, -1799, -445, 813, 2224, 3395, 4376, 5223, 5869, 5789, 5659, 5275, 4260, 3265, 2195, 831, -584, -1831, -3187, -4150, -4956, -5531, -5786, -5768, -5367, -4584, -3532, -2369]
3630b369J362J217J478J359Q48J020N75K61l8l97n47q62j283j392j329j374j190
3647b661j209r43n87k90N8L47N40R74J023J176J398J414J289J073R88M94M60N3
3665E597j80n09j105r50j104j248j620j129j166r50o77m11k02K34N84Q19Q95J067
3683b055J456J323J334J030J064P14M64J84j70l13p79r83j223r80j468j265j220
3700b887j018p67p06j11L00K46N14J110J215R48J344J174J368J111P16O20J27
3717E304J64m35p83q09j068j209j112j275j280r31q22p75k38m7K98M76Q71J099
3735b572J159J158J310J099J026R92O97K41K9j12n11q88r94j003j291j062j299
3752b021j189p15o62m64j55J71M04P69Q69J158J221J261J162J029J052N51M51
$$ y = [-2369, -1007, 210, 1688, 3047, 3895, 4915, 5490, 5751, 5713, 5316, 4769, 3907, 2624, 1232, -97, -1471, -2661, -3870, -4813, -5400, -5690, -5632, -5285, -4745, -3771, -2748, -1572, -174, 1240, 2529, 3602, 4590, 5084, 5544, 5597, 5417, 4908, 3803, 2853, 1749, 501, -1119, -2248, -3414, -4364, -5041, -5452, -5654, -5420, -4836, -4017, -3122, -2055, -599, 724, 2058, 3088, 4152, 4866, 5330, 5514, 5344, 5031, 4252, 3269, 2046, 1066, -402, -1667, -2887, -3905, -4672, -5378, -5489, -5189, -4943, -4429, -3319, -2104, -1156, 188, 1362, 2730, 3841, 4557, 5177, 5304, 5468, 5033, 4250, 3441, 2373, 1164, 52, -1223, -2503, -3434, -4256, -5031, -5269, -5316, -5018, -4542, -3671, -2572, -1413, -255, 1055, 2154, 3180, 4172, 4869, 5110, 5139, 5027, 4516, 3628, 2634, 1631, 340, -722, -2021, -3210, -3925, -4587, -5051, -5206, -5035, -4631, -3862, -2993, -1835, -614, 647, 1809, 2838, 3890, 4441, 4892]
3769D892K77j11n17n76q42j043j176j368j035j084q23r46l65k81K29J15O56P32
3787c266R19J311J142J145J318P94O23O33K24M7l96n12p93q85j301j180q82j161
3805b220q44j025k38m39j6J82M80P58R82J104J024J038J126R43Q64M06N12M5L7
3824D719n06o78r12j071j054j438q33r17q02q19j24j32K9M28P11P73J026R69J207
3843E76J168P93P04Q90L65J12j45l40n88p44r00j193j018r86j187o69p74m85j32
3862d553J84L62K70J011R06Q69J149J030R13Q21O90O42O7P2k91n32p45r84r33
3881I48j043j072q72q09p66m70j14N1R5L16R73P50R27Q87J212R27R38N69M69L48
3901D264J13l04m30n14r18r61q88j231r29o91q46n24m01m0K20M48M10R73J046
$$ y = [4892, 5169, 5058, 4541, 3965, 3123, 2080, 904, -464, -1499, -2583, -3406, -4352, -4717, -4998, -4769, -4654, -3998, -3266, -2347, -1036, 106, 1251, 2569, 3363, 3986, 4619, 4843, 4890, 4494, 3982, 3189, 2304, 1003, -177, -1059, -2220, -3064, -4089, -4327, -4766, -4782, -4600, -4120, -3362, -2380, -1276, -252, 786, 1912, 2855, 3719, 4125, 4637, 4682, 4719, 4213, 3535, 2623, 1552, 498, -940, -1773, -2690, -3492, -4311, -4435, -4567, -4538, -4110, -3399, -2626, -1600, -631, 576, 1744, 2537, 3241, 4131, 4496, 4608, 4463, 4123, 3535, 2791, 1891, 698, -320, -1306, -2493, -3162, -3936, -4421, -4553, -4369, -4007, -3737, -2726, -1820, -951, 198, 1228, 2141, 2962, 3652, 4294, 4361, 4433, 4142, 3610, 2865, 1881, 948, -95, -1167, -2039, -2848, -3614, -4084, -4198, -4147, -4052, -3736, -2763, -2013, -1086, -199, 1013, 1940, 2878, 3447, 3916, 4264, 4377, 4073, 3643, 3129, 2211, 1250, 362, -869, -1798, -2489, -3335, -3859, -4260, -4300, -4080, -3632, -3222, -2249, -1203]
3920a203O98J178R80P90O72O23L10K85k47l10n23q52q91q92j059j046p95r46k95
3939c523m21j28J18J36N72P84Q39J008R68J014Q78P83M34M25L55j31j85o41p29
3958B556p76j057q37j118q29p95o22n04q0j72M23M58N59J024P70R27J236Q29O14
3977B606P64L22L97j17k80j99o94q24p98j197q07q63r83o17l44k58k14L14L89
3996c403P37N88Q41J066P63R22J076N32M92L12M8j13l34n58q46r10q59q10r16
4015a372q89p40o82j44j22P6K70O72N89P99J005R00Q17J109N42M60M81K23%l92
4035C602m25q36o43j035r24p15q22r61o84l12p8r5K14M87P76O83Q82J079Q26O86
4055A705R42N55L89L58n5p6n60n32q50o20r77j068o77q57p60m84k58o6K21L67
$$ y = [-1203, -505, 673, 1653, 2443, 3115, 3738, 4048, 4333, 4086, 3776, 3253, 2401, 1510, 618, -441, -1487, -2282, -3228, -3523, -3944, -4072, -3954, -3818, -3246, -2462, -1623, -615, 353, 1367, 2245, 3028, 3462, 3887, 4242, 4111, 3926, 3285, 2556, 1780, 723, -114, -1232, -2061, -2856, -3478, -3982, -4062, -4234, -3811, -3353, -2794, -1770, -1000, -73, 1163, 1992, 2606, 3370, 3692, 4089, 3972, 3692, 3493, 2799, 1975, 1177, -20, -827, -1690, -2673, -3290, -3634, -3892, -4106, -3792, -3403, -2666, -2078, -1237, -171, 592, 1514, 2590, 3122, 3614, 3926, 3974, 3861, 3527, 2969, 2123, 1213, 354, -456, -1372, -2261, -3001, -3683, -3827, -3949, -3873, -3603, -2931, -2342, -1543, -538, 362, 1179, 2288, 2830, 3290, 3771, 3994, 3994, 3602, 3177, 2341, 1698, 663, -261, -976, -1798, -2759, -3443, -3755, -3833, -3928, -3714, -3227, -2451, -1768, -886, 193, 1019, 1705, 2647, 3202, 3591, 3949, 3894, 3818, 3258, 2726, 1876, 1256, 279, -789, -1466, -2323, -3083, -3567, -3825, -3891, -3670, -3303]
4075c303N36O74J051P46R97Q37P36P55M98Q9K70j76l78n49o18r18p71q25j160
4094a509p08o25m18o20L0O6L94M36N94P97R92R17Q21P68O69P27J36L01n2m47k44
4115C025o60p75p15j133n68r60q40n06l92l05M9L35L71M74P74Q73R26P98R38O57
4135B366N36O07o6K62k35k86n09p73p22q47j022p40p05p78l57k23j5nM28L91O45
4156b048R25O95J151O88O94N50N09J65K34q0l77l25o40q47q87o91q40p28o48n66
4176c066l11k20j0L58N87M25P02R07O05R40Q32O19N05M04K33J6j54m69n92o45
4196A666q85p36q23o69o89n64n18j20j06L10L36K43Q67P61Q33N16Q65Q66M36L98
4216B987K60Q5j00k25m95p24n39p69j102p23o99k68p17j96j06J16L33L12N51O59
$$ y = [-3303, -2767, -2093, -1042, -296, 701, 1538, 2274, 3029, 3527, 3616, 3886, 3710, 3332, 2783, 2165, 1247, 476, -349, -1509, -2217, -2842, -3260, -3880, -3850, -3784, -3390, -2954, -2360, -1563, -571, 346, 1167, 1935, 2604, 3331, 3467, 3768, 3716, 3269, 3025, 2365, 1590, 875, -258, -826, -1786, -2626, -3132, -3524, -3829, -3780, -3445, -3074, -2600, -1826, -953, -27, 771, 1709, 2366, 2902, 3509, 3443, 3705, 3470, 3184, 2675, 1902, 1180, 333, -689, -1429, -2134, -2912, -3269, -3492, -3507, -3512, -3084, -2693, -2048, -1123, -428, 723, 1411, 2105, 2655, 3164, 3329, 3563, 3483, 3106, 2781, 2141, 1294, 407, -284, -1124, -1852, -2500, -3066, -3377, -3597, -3607, -3249, -2662, -2237, -1535, -628, -23, 917, 1749, 2368, 2873, 3277, 3510, 3526, 3372, 2903, 2311, 1666, 781, 45, -778, -1447, -2136, -2700, -3218, -3338, -3444, -3134, -2798, -2555, -1688, -927, -94, 422, 1287, 2153, 2589, 2987, 3247, 3332, 3232, 3007, 2512, 1788, 1249, 480, -622, -1345, -2044, -2312, -3029, -3225, -3331, -3215, -2882, -2570, -2019, -1360]
4236a360Q17P69Q05O99P46K77M90L5m9j46n74l96o84q64p82n91q47m63o64j74
4256b956k98l5M14J30Q11N17P00Q28O60Q46O07M64K64L55k92j43l55l40p17o48
4276H12q14q13n26n67m46p06K8RK08J77N66N61N70Q03O25O22Q38M22M04J67k8
4297B912O2k41l54p29p41n71p91n95p87o00k36j48j35LL83K97O08M85P79P25O67
4318I93P53N66K52K96K02qj44o52n02m69q29p32n09o44o40m78l18n0L8N6M18O51
4340a750M56O72R39N22N37N66N53K74K52j38k70j91n01o16n97p65n60o17n52n23
4360b309k91l67J95M9M39K65N30N82P96Q73N61N52M74K24K55qJ43o45l16o76n89
4381G37n39o79o82o29n43q0l11k80L86P9N19L41O28Q86N51O58O55J84M71M02J17
$$ y = [-1360, -543, 226, 1031, 1730, 2476, 2753, 3243, 3278, 3229, 3083, 2509, 2113, 1429, 565, -217, -808, -1655, -2118, -2782, -2956, -3254, -3289, -2875, -2745, -1934, -1417, -717, 111, 771, 1617, 2224, 2688, 2952, 3307, 3015, 2872, 2517, 2177, 1460, 812, -2, -815, -1341, -1908, -2354, -3060, -3032, -3023, -2815, -2638, -2072, -1511, -941, -138, 487, 1109, 1947, 2369, 2773, 2940, 2912, 2974, 2733, 2379, 1650, 909, 338, -453, -1048, -1835, -2435, -2671, -2819, -2954, -2951, -2568, -2271, -1663, -1178, -399, 326, 993, 1746, 2312, 2564, 2860, 3062, 3054, 2910, 2258, 1756, 1287, 458, -274, -783, -1427, -2067, -2545, -2863, -2913, -2875, -2819, -2401, -1750, -1294, -622, 317, 839, 1376, 1942, 2495, 2769, 3021, 2883, 2613, 2422, 1921, 1305, 708, -57, -617, -1234, -1786, -2309, -2600, -2967, -2772, -2723, -2284, -2019, -1489, -907, -111, 762, 1323, 1875, 2349, 2573, 2828, 2820, 2963, 2318, 2002, 1326, 737, 198, -481, -1163, -1792, -2335, -2415, -2726, -3006, -2620, -2541, -2022, -1681, -1053, -167, 384, 1042, 1697, 1881, 2352, 2754, 2871]
4402B871j42j81l07n48o11o88p59n73o72l47o01k66j79L3K84M43M87O16O70P28
4422B58N36O18P73J43M10Q9r2k81j64n16p33n56o40m97p95o08l85k80j89O3J21
4443b725M41L83O55M34J035M92N00P14L72L52K79Pk27l01m95l88o55p68n63o51
4463a109p86k17l49k68qk9L90K27O13N51P63O15O40P25K70M71L73p1L7l10l50
4484B178n16n52o54o65o55n54n63o49p8JN7J64K51N42L96O38Q95N10P57N24M46
4505B473R0K79ml03k94m48l85p48p15n26o95o52m22l73j61L28J10J37L43O20O51
4526f95M19P79O80L43N90M05K61m8j60k26l72n44n38n86p86m50n91n07m63j66
4546b655j42J0N10J00N25N71O11O63Q53M04O12K34K20K63k45P3m52n46k72p35
$$ y = [2871, 2729, 2548, 2241, 1693, 1082, 394, -365, -938, -1610, -1957, -2558, -2824, -3003, -2970, -2686, -2243, -1756, -1140, -470, 258, 794, 1412, 2185, 2328, 2738, 2827, 2735, 2454, 2290, 1774, 1041, 485, -155, -652, -1447, -2055, -2440, -2720, -2909, -2846, -2725, -2284, -1901, -1246, -812, 223, 715, 1215, 1929, 2301, 2653, 2932, 2939, 2712, 2411, 1916, 1528, 873, 105, -458, -1109, -1895, -2112, -2461, -2729, -2737, -2766, -2376, -2149, -1536, -985, -222, 393, 1033, 1758, 2028, 2499, 2872, 2801, 2838, 2528, 2178, 1662, 1110, 456, -209, -864, -1418, -1981, -2630, -2708, -2707, -2650, -2486, -2235, -1693, -1297, -659, 236, 746, 1503, 2027, 2473, 2563, 2842, 2838, 2535, 2241, 1793, 1408, 660, -55, -581, -1276, -1928, -2350, -2723, -2884, -2556, -2446, -2309, -1966, -1346, -695, -276, 503, 1183, 1526, 2116, 2521, 2782, 2734, 2574, 2348, 1976, 1432, 894, 308, -478, -928, -1519, -2026, -2489, -2655, -2797, -2787, -2277, -2177, -1652, -1081, -470, 193, 1046, 1450, 2062, 2296, 2516, 2779, 2534, 2607, 2155, 1609, 1337, 602]
4566F02o50p25o12m88l92l39%k2J07M33L75N78M23Q00L98P11N16M01K08L03j89
4587B438K5r8m70l79p23p53l35o32n72m89k49k93p2J69J65L63M42M37R09L88O09
4608H80O80L66K82J87L2Q8m28P2o14n47o15p97m02n47l90l95k05j14P7N2M62L14
4630a562N39N24N92O02O97L02L75L99k56L29j28m33m28m17l76p92n52o61l88k43
4650a877k82J1l13Q9L31M49L16M79Q99L89M08O51M57Q0K15J71l01j35n37m43l63
4671F94n52n13n49l41m56m21l9l4k7K29L59K96L89P32L92O04O32M10J37J64K60
4692B366q6l01l20l73l95n24o06n58m29l40m73j03o1P3M3L09N50L42N42N21M67
4713F44M88K49N05J52K10l7j19l92l84l22o06m68m69o99k73l37R4o00L09K4K22
$$ y = [602, -48, -773, -1385, -1873, -2265, -2604, -2604, -2626, -2519, -2086, -1711, -1133, -710, 90, 488, 1199, 1715, 2116, 2324, 2627, 2438, 2463, 2365, 1895, 1516, 793, 40, -295, -927, -1499, -1988, -2237, -2530, -2602, -2433, -2268, -1905, -1463, -1026, -117, 271, 880, 1560, 1926, 2208, 2395, 2427, 2515, 2087, 2159, 1545, 998, 383, -414, -816, -1363, -1753, -2148, -2353, -2467, -2390, -2338, -1876, -1562, -1023, -499, 93, 695, 1392, 1694, 2069, 2468, 2212, 2541, 2413, 1980, 1552, 1135, 759, -33, -585, -1246, -1634, -1877, -2159, -2148, -2461, -2372, -2041, -1592, -1276, -797, 102, 491, 899, 1550, 2007, 2087, 2302, 2473, 2172, 2037, 1500, 1057, 694, 142, -371, -920, -1261, -1717, -2138, -2177, -2211, -2238, -2009, -1650, -1354, -965, -233, 159, 763, 1395, 1805, 1942, 2106, 2366, 2280, 1979, 1659, 1286, 891, 367, -239, -797, -1226, -1566, -2039, -2142, -2203, -2130, -2087, -1778, -1228, -886, -344, 177, 644, 1132, 1381, 1886, 2038, 2248, 2211, 2092, 1700, 1316, 994, 388, -80, -549, -1248, -1521, -1858, -1764, -2364, -2055, -2031, -1809]
4734a809L91N53L56N25M00O43M08K22L39J24j48O8k39l52l20n71m34n75n42n59
4754a520k02k29j17j34K56l6N46K98N20O45K52O03L08N66L32J5k0o8L9m98m22
4775A134n37m99m36m29l12m19k65k37p2L5N3K21N62M67N56K49N88N58M78K13J22
4796B030P9j85n8j73l94o47l04n10m40m56m54m59l8j00N2K17Q0L63O06M59N42
4817B10K70O35N07Q7K20J55nr0l15l19n40j44n19n35o43l87j90l33j17P3P9K75
4839a626J07M22O99L44M22N08M97L15J71L22jj81j06l19m01n74m27n20m85l08
4859a141l94m23m8K7kJ41K68N47K80N58M06M52M64L30L90M3Q0n6m1k62k60n35
4881H24l83n96l85m85n06l27j43j27J82J20J46K91M72N52L75N16M00M16K39K11
$$ y = [-1809, -1418, -865, -509, 16, 416, 1059, 1467, 1689, 2028, 2152, 2004, 2072, 1833, 1481, 1161, 590, 156, -419, -961, -1520, -1722, -1951, -2068, -2202, -1946, -1982, -1436, -1138, -618, 27, 279, 882, 1190, 1756, 2088, 2103, 2083, 2015, 2054, 1556, 1134, 597, 98, -338, -767, -1079, -1498, -1763, -2000, -2072, -2037, -1984, -1763, -1201, -734, -178, 71, 659, 1217, 1695, 1908, 2030, 2109, 1924, 1866, 1693, 1299, 652, 348, -162, -602, -1058, -1512, -1971, -2009, -2109, -2057, -1840, -1760, -1397, -791, -332, 210, 480, 1115, 1622, 1709, 1929, 2084, 2079, 1989, 1674, 1355, 815, 671, 152, -383, -1026, -1413, -1603, -1936, -2053, -1980, -1901, -1626, -1519, -1097, -398, -54, 368, 876, 1373, 1688, 1859, 2181, 2180, 1999, 1893, 1574, 1173, 599, 172, -348, -833, -1141, -1535, -1958, -2006, -1979, -1981, -1840, -1572, -1025, -745, -187, 219, 671, 1135, 1465, 1855, 1898, 1978, 1922, 1881, 1619, 1359, 824, 441, -155, -540, -1025, -1531, -1858, -2001, -2128, -1946, -1826, -1680, -1389, -917, -365, 10, 526, 926, 1342, 1581, 1792]
4901A792J92J55l54j26l14k57l88q42l22m19l41k53l84m6k42K22J59L56J96P52
4921d64K98M82M19M01M69J51J84J22k30j64j65k36o23n04j36p83k92l68l56l20
4941b115K24k01J37O36N4M32N02M00L65N06N48J79J79K9%j94R8o46j81l76n45
4962C1m94l98n12k36k89J07j19N4J56K27M52N17M22L53O05L18L70K49pO7j16k88
4984A469k8l64l83n77n27l02k31l37l45j75O7j23K54K41K78N08L25M53L05M87
5004I95K85M10N7J20k9M7l51l13l47o78l83l87l50k84j50k79j42p3R0M83J77L87
5026g15K21N27L84M30M26J43K45l8O1N0l23j36m70k23n51k80m90k18l21m96M8
5047a726R6j05J38M58J94L42L97M80L14J89N64L48j4n7j64J44m11j64l45l73k61
$$ y = [1792, 1984, 2139, 1785, 1659, 1345, 1088, 700, -142, -464, -883, -1224, -1477, -1861, -1907, -2149, -1927, -1768, -1412, -1216, -464, -166, 316, 735, 1136, 1605, 1756, 1940, 2062, 1832, 1668, 1503, 1267, 644, 140, 4, -779, -1071, -1439, -1795, -2115, -1891, -2092, -1955, -1319, -1265, -833, -331, 69, 434, 940, 1488, 1667, 1846, 1875, 1875, 1681, 1779, 1133, 952, 576, 31, -463, -861, -1373, -1609, -1898, -1791, -1910, -1856, -1700, -1473, -1021, -504, -82, 271, 876, 1194, 1564, 1813, 1806, 1873, 1757, 1469, 1441, 1077, 694, 117, -410, -712, -943, -1280, -1625, -1800, -1733, -1856, -1602, -1361, -1083, -575, -250, 203, 508, 995, 1280, 1690, 1747, 1867, 1838, 1885, 1534, 1221, 874, 196, -187, -574, -924, -1208, -1358, -1637, -1779, -1852, -1762, -1279, -1102, -715, -494, 33, 417, 847, 1273, 1416, 1661, 1623, 1684, 1734, 1411, 1275, 805, 582, 31, -249, -739, -957, -1278, -1774, -1726, -1630, -1735, -1597, -1139, -945, -603, -206, 274, 588, 777, 1341, 1689, 1675, 1618, 1454, 1598, 1187, 1023, 678, 305, 44]
5068D4o21m07n7m22j37K9n4n5L51K15M34L51M09O02J46J96M71N5J90n1l17n0k74
5091A048k92l65n08l94k23m27k82m05M14j74J91J18L1O23L34K44N49L44J23M99
5111A448J66P1r0rj88o0o55j49n95k55l46l50j69j41k39r2L54j08L52K51L14L74
5133a16K14N66K66R1L97J2O9ol15o4j93m36m10l18k13n01j70j53j68k51J53K52
5155a294J08K86K84M08O33J11M11J78J36K34P6k0j92j98j28k66n28m03l62k16
5175g42k60l35m0k46K25M2P3K12L92L28L79M52M65J48O9M51j62J13J2l75jm79
5197G21k82m19m20j62l80m60M6j37N2P6n6L48K30M15L07N45R7K75N02LJ59m6N3
5220A467j05l58j88l00l96k59m84j44l02l35r2l6p6M77J2K07M97L25K29M32L30
$$ y = [44, -577, -984, -1041, -1463, -1600, -1571, -1625, -1680, -1329, -1114, -680, -329, 80, 682, 828, 1024, 1495, 1550, 1740, 1689, 1372, 1322, 1048, 756, 391, -117, -511, -734, -1161, -1443, -1848, -1434, -1608, -1417, -1299, -1268, -645, -311, -67, 482, 826, 949, 1448, 1614, 1685, 1595, 1586, 1398, 1338, 683, 534, -61, -316, -662, -1012, -1181, -1322, -1561, -1653, -1299, -1407, -1055, -804, -490, -116, 98, 664, 930, 1021, 1418, 1430, 1499, 1493, 1178, 1114, 921, 485, 75, -243, -456, -957, -1127, -1280, -1448, -1699, -1546, -1294, -1186, -900, -616, -208, 425, 536, 947, 1125, 1261, 1495, 1571, 1551, 1359, 1161, 1033, 767, 239, -164, -526, -742, -1002, -1337, -1377, -1623, -1398, -1356, -1283, -1071, -679, -351, 28, 480, 945, 1093, 1162, 1613, 1451, 1564, 1576, 1201, 1200, 721, 439, 20, -400, -562, -942, -1402, -1356, -1493, -1441, -1365, -1421, -1073, -843, -428, -121, 424, 521, 796, 1298, 1301, 1460, 1414, 1467, 1362, 1004, 816, 516, 120, -139, -623, -767, -1069, -1404, -1496, -1532, -1608, -1131, -1119, -912, -415, -90, 139, 571, 901]
5241I01K99m7K54K19j11j98r9k59k55m27k41n15j33l44m05l5j30m8J55J82M33
5262h04J80K03O42K61K15J72M61O5N4L3j11jl85l29l16l62j82l11m15l91J8k14
5284a517J11k44K11K99J97N10K84N40J01L94J87K06K73O9l14r4Kl74k04n53k24
5305a40m68k88k51k79K1k66L60o4Q3L54K99N11J07N85K91K79J25J66j5q9O8j4
5327A375l62l62l08l06n32j78k66l74N8j47j72J79O4K83K33M96J39M16M84J97
5347I17K54J84QJ31o9k37j67j33m31l14k32o85k36p6l28Rr7J52O5J68M50O9M57
5370a41L87M57p7M69K48o0m6J85j22k90j78j62m41k93l21l64l85l1k07j71K96
5391a247j39J32N30J01Q9N54K26L95L56J18K76N6L5J09m96k90j15k16m66l20k72
$$ y = [901, 1200, 1153, 1407, 1626, 1515, 1317, 1218, 959, 704, 277, 36, -479, -612, -956, -1361, -1396, -1526, -1574, -1419, -1237, -804, -624, -421, 221, 482, 697, 869, 1330, 1395, 1449, 1482, 1371, 1370, 985, 656, 340, -22, -204, -515, -930, -1321, -1303, -1517, -1406, -1650, -1439, -1140, -943, -433, -149, 391, 492, 886, 1073, 1279, 1552, 1621, 1307, 1213, 1215, 841, 637, 84, -140, -608, -896, -1147, -1426, -1405, -1671, -1311, -1375, -1292, -938, -639, -128, -21, 564, 855, 1134, 1259, 1425, 1410, 1321, 1389, 1375, 1013, 651, 343, 37, -495, -673, -939, -1313, -1255, -1402, -1574, -1395, -1331, -1048, -815, -319, -180, 236, 720, 917, 1171, 1355, 1363, 1494, 1425, 1188, 1021, 888, 457, 143, -89, -774, -1010, -1086, -1414, -1405, -1502, -1350, -1285, -1117, -667, -598, -141, 246, 703, 626, 1095, 1343, 1283, 1237, 1422, 1300, 1010, 832, 670, 229, -64, -385, -749, -1134, -1165, -1372, -1543, -1247, -1386, -1254, -724, -623, -534, 20, 246, 641, 997, 1115, 1391, 1447, 1482, 1591, 1095, 805, 690, 474, 8, -312, -584]
5412e84j47l09m37J51n6J7J98J90K61J34N73K30J88M06K05J23M03q4k9j76k98
5433I59r7n09n9m89j91k62k96k73n5l3j21O2K89J66M01L63K18K91K51J43M08K26
5455A392Nlj28Q6l98k69l76l05l62k47j18l67k05oj28J60J07K83oN05M84J80L04
5478E88L67K37L3J41j7M9j19l94j80k90m06m01r1k31l84j54M7n1N5J3K81J18L60
5501d29L83J73M03K31K06J00M6J81J4j02k51j25k77m42m0n65k44k23o0k11j10
5522a342K9J90J26J92M26L03J77K86L34K33J99Q1N4k4j11k15m1k25l39k89m80
5543d36j68k30n3k95k18J54pK19J01L75J28L99M34J15L53N0J59J75j51Q8j51o8
5565I73j80m00m19k14k24m64n6q0k38R8J16l2M15K58j2K10M60J90M14J14K92m2
$$ y = [-584, -731, -1040, -1477, -1326, -1382, -1365, -1167, -977, -716, -582, -9, 221, 409, 815, 1020, 1143, 1546, 1462, 1433, 1257, 959, 862, 353, 294, -195, -386, -648, -944, -1217, -1272, -1305, -1426, -1364, -1075, -909, -508, -145, 73, 364, 615, 758, 1166, 1392, 1397, 1394, 1266, 1352, 954, 685, 309, 4, -358, -605, -723, -1090, -1295, -1301, -1429, -1269, -1162, -879, -885, -380, 104, 284, 588, 955, 1192, 1225, 1366, 1349, 1398, 1279, 885, 705, 415, 9, -392, -483, -714, -1098, -1252, -1205, -1256, -1201, -1188, -907, -789, -429, -46, 127, 530, 761, 967, 1067, 1113, 1294, 1308, 1206, 955, 830, 553, 111, 71, -494, -738, -961, -1021, -1232, -1342, -1313, -1123, -997, -805, -379, -76, 101, 387, 721, 954, 1153, 1234, 1288, 1264, 1153, 938, 897, 672, 333, 44, -436, -604, -834, -887, -1182, -1400, -1246, -1253, -1034, -933, -558, -430, -31, 403, 518, 871, 921, 1080, 1255, 1104, 1192, 1041, 973, 793, 393, -26, -240, -464, -928, -984, -1064, -1302, -1204, -1088, -1120, -705, -447, -459, -249, 211, 401, 815, 929, 1221, 1179]
5587A179P8L0m16K50m24k14l25m9n18l73J0k67k35O2j43K01K76J60L25L68K28
5608B03J66L64L16j25J99q7J93r9q6p8m42k67k98k59k07j42l74p2j03K8m9K25
5630i94J43J90L43L34M05K76J9K05L03K4J04k80J7k81l42j29l30k63j76k88l37
5651a057N2k27J01k2J40J0K11K95L88M22J48L46L06o1J77k3l9r2j19j78l79l82
5673A7j37m14k15O1l20j42r8O0J78J3K07K38M09J90L30K72K74N8J07M8n7K28m82
5696H25j99J03n42q9l42m06l11m0r3j9j15J06K68NK79K86K97K71L05J29J77K28
5718A123L7k8j07k2j10k65k66l64l34j86l14n6k1j14l6q6J09M3L42K34M07K68
5740B54L19J55J55R5J32J81k16J02m56j09j85l04m33k4l61k76j39LJ44k45J13
$$ y = [1179, 1257, 1287, 871, 1121, 697, 483, 158, 109, -409, -782, -772, -1039, -1274, -1212, -1355, -1154, -878, -718, -393, -25, 203, 369, 733, 1049, 924, 1123, 1036, 1229, 1130, 1044, 966, 524, 257, -41, -300, -507, -649, -1023, -1095, -1198, -1170, -1219, -994, -851, -661, -318, 16, 421, 697, 716, 921, 1224, 1248, 1352, 1072, 1089, 808, 466, 337, 7, -256, -432, -720, -1057, -1005, -1232, -1131, -1153, -1013, -1003, -792, -497, -109, 313, 461, 807, 1113, 1052, 1229, 1206, 1167, 1075, 956, 778, 399, 17, -120, -534, -749, -688, -1008, -1150, -1248, -1188, -1010, -997, -790, -552, -143, 47, 377, 649, 923, 981, 1088, 1136, 1079, 1307, 825, 626, 729, 187, 98, -244, -650, -961, -1001, -1094, -1113, -1228, -1122, -854, -849, -570, -284, 13, 284, 589, 718, 895, 1123, 1160, 1132, 1025, 1003, 893, 628, 362, -2, -336, -522, -836, -892, -913, -1027, -1063, -1149, -1040, -997, -655, -421, -14, 254, 573, 728, 883, 978, 1110, 1291, 1075, 1177, 721, 612, 427, 123, -310, -334, -695, -971, -1110, -1107, -963, -1208, -1095]
5761a095K02L03J77K72K28K38K20L98O5J10o1O7p0j91q1k86m42q2l72j14l21k22
5783a057j01m6M3J77J11M5L16Q0N24M48m2K26K43R7J46l2q2r5k37k36k72k29k09
5806a82k82l74j96j66J34n3j0N9M27J37J60M43O2J98K64K69L80j59J97k86j62
5827H60J68n17q0m38j22l43k17m0k78j17N4p5K71J14o8L72K22L55O7M26J68J77
5849I59R6P4n7P1k00l81r6k03m05j28k85k32m4l48J11l9NJ79O1L12M51Q0L01K13
5873D95J10K28P0K61n3Oj94j34j53k05m38j29l14k10k82j54l6N4K7L13k6L8K92
5896d34J72L98L93P8K50J8K57j01J00m3j07k06l00j65m58j84l09j10l07J27p8
5917a009k5J27Q4K01K83K58J72J70K29J73K49RJ14Jl3k45r0k30ml72k46k57l03
$$ y = [-1095, -893, -590, -413, -141, 87, 325, 545, 943, 1008, 1118, 1057, 1124, 1054, 863, 782, 496, 54, -28, -400, -514, -835, -1057, -1158, -1204, -1161, -984, -873, -828, -512, -432, 92, 540, 498, 724, 967, 1064, 1210, 1178, 1096, 1001, 764, 528, 256, 27, -182, -464, -838, -1034, -1200, -1066, -1119, -1129, -1070, -643, -506, -346, 97, 159, 357, 621, 890, 1270, 1111, 1308, 1022, 860, 1028, 511, 431, -7, -129, -472, -689, -729, -1007, -1124, -1070, -1145, -874, -760, -828, -456, -234, 121, 188, 614, 782, 959, 1055, 1129, 1072, 1143, 943, 562, 466, 263, -142, -270, -555, -787, -831, -1179, -1068, -1107, -1102, -923, -862, -550, -99, -19, 282, 495, 605, 833, 903, 1164, 1111, 1117, 923, 789, 636, 431, -7, -136, -450, -660, -942, -1096, -1132, -1078, -1051, -738, -764, -726, -434, -262, 136, 529, 607, 857, 875, 1132, 1031, 1131, 1088, 981, 775, 475, 310, -148, -332, -641, -751, -1058, -931, -1009, -1034, -907, -823, -622, -339, -81, 91, 261, 490, 663, 912, 921, 1035, 1036, 1003, 758, 668, 438, 434, 62, -184, -441, -744]
5940g44O0k54j30m3j2L42J02J04L32K08L07P1L31R1L74q0o3Mj18j21j43k19l64
5963C5k11j37j46j87l40R7j03n4K62J2L2M29J81K21K41K13P1M52j33O9n5p0j46
5986G33l15j12k44j29k61k87j25k09j49J09r5J55NL77k6M02K52J42K68J79K38
6007I08l7K5Q4o9j35p9l51k42k8l23q3l84j83J11j58k30L87N6J41R9L87K12R3
6030B01J79k2K48K40j1J37r9j98j07k72p0j95j31r3k55j88k50o9J4J07J17n4K24
6053e47K28J80K82L40n6J42K90J0J51j77N2k81m5k94j70k43N7m52o8o3k42N5o
6076h57O3K54J39R3K98J94J07J70P4J41O7l8o0M9L5k93p4j48l47m6k36l13R4k38
6100h72j9j3K93N6l1K09K21L77J53OK13J11Q0qJ28j63M3k69j28k26k52k25k0j30
$$ y = [-744, -684, -938, -1068, -1111, -1123, -781, -679, -575, -243, -35, 272, 343, 674, 765, 1139, 1059, 996, 1000, 882, 761, 618, 399, 35, -176, -313, -459, -646, -986, -889, -992, -1046, -784, -772, -740, -311, -130, 91, 332, 545, 616, 1068, 935, 1004, 949, 879, 733, 418, 306, 62, -67, -328, -615, -740, -949, -1098, -989, -1084, -929, -924, -547, -573, -171, 81, 223, 491, 670, 908, 871, 896, 980, 911, 776, 697, 346, 104, 76, -247, -330, -714, -897, -786, -944, -1174, -787, -731, -590, -491, -104, 108, 201, 380, 358, 606, 846, 835, 972, 873, 675, 568, 296, 226, 31, -100, -193, -448, -636, -886, -955, -941, -834, -717, -771, -547, -319, -139, 143, 483, 427, 569, 859, 869, 1020, 843, 895, 614, 569, 275, 105, -138, -81, -533, -601, -664, -906, -851, -857, -794, -540, -401, -308, -10, 184, 291, 461, 535, 676, 743, 705, 645, 694, 729, 436, 362, 214, -133, -179, -415, -728, -634, -872, -891, -904, -611, -555, -586, -377, -156, 221, 374, 380, 593, 704, 784, 776, 904, 741, 784, 515, 387, 161, -91, -316, -336, -466]
6124d66k54r2%J33p2L1K46M7L75L5J74J66L39L6l5J25pJ5j51o8j6m09k65j17j64
6149c94j6j23j89j71M6mK57l3R0L75K17L5K37K28J59Q1r0J92l3j63l0l37K0m34
6173h0j11j13j22j91j76q9O9r0M0K36K04J67K07J32K02J92J18j2K02M2n5op5k01
6197D90k08j47k36n5q6m84J43k27J94j51O6o4K50K21J13L52L9J61K28J6p3J96
6219G38o7J2p3r0j13r4l50k04j57k43nK4j61j20N6K58P5J7J53K82K59J36J89J6
6243E38J31N6J04o9l2k43k0k18j78p8l55n7k98j41KJ21J03J0l7K50K00J42J52
6266H3R5J13K10K17O9k9K4r7k31o8k68J15l58j19l6k12j85P4j31kjl8L73l0K96
6291a36o3L31J84J36J11Q4R0K57l16p4j09K3k90k15l57N0l9j59k00j63J80P2l2
$$ y = [-466, -720, -812, -812, -679, -751, -720, -474, -427, -52, -17, 157, 323, 662, 698, 663, 788, 781, 796, 645, 577, 561, 152, -113, -230, -394, -410, -533, -722, -893, -847, -851, -594, -627, -537, -162, 55, 90, 327, 555, 714, 795, 705, 897, 864, 701, 671, 334, 354, -80, -191, -304, -426, -617, -793, -882, -813, -903, -863, -627, -423, -256, -49, 83, 285, 477, 595, 583, 785, 827, 772, 766, 691, 490, 282, 135, -101, -156, -242, -726, -583, -810, -616, -767, -701, -765, -515, -294, -181, 171, 210, 371, 599, 615, 542, 738, 671, 683, 610, 520, 407, 313, -37, -241, -398, -641, -646, -622, -783, -903, -847, -589, -514, -497, -344, -62, 197, 333, 522, 538, 669, 725, 829, 760, 728, 485, 465, 247, 69, -9, -364, -421, -719, -860, -858, -737, -634, -624, -661, -411, -211, -69, 83, 178, 291, 501, 718, 787, 758, 782, 685, 454, 386, 118, 233, -125, -244, -280, -492, -677, -603, -734, -736, -737, -775, -402, -432, -136, -199, 132, 316, 452, 563, 647, 737, 994, 678, 604, 495, 518, 228, 13, -344, -294, -333, -492, -692, -855, -675, -603, -635]
6314f35J46J38L1K40K36M0L00m7K76Q5n5Jj0k21k54N8l06p7j20j42k54m2j23m5
6338g80J35j6J38J18K92K4Q2K33K9L28k02K96NM1n7m8j30k44k38j13j08L3m71
6361f53K16k13J8r8L3K16p2L24Q7M2K68J75L4L6J48J08j55K63j90j57l07j03j97
6384a77J05l38j04j37J93l8l14K30J49K2M5J68K37J68r9L69j4L7J19j17%j2j16
6407C76j4j31Om35p3j24O2j39p4p1K6J12k7J04J69J18L2L39K15o2J30n3J4n8M7
6432D89Mj74j04j29n5k76o0k73M8rR0n4O9L5J3J77J24J51N6J37N0p4M09j88l6
6457D20J32j04j83j6j48j31l0l06j81O3m2P7PQ0j2P6P3K39r6K33J30L2Q5J60n5
6482E03n2Pp3k5k96R6k74J3k34j48m5j7o6J52r1J02O2J04J86p5L07J17J41K02
$$ y = [-635, -489, -351, -320, -80, 156, 196, 496, 449, 725, 810, 755, 756, 746, 525, 271, 329, 23, -54, -174, -316, -570, -612, -735, -780, -645, -661, -523, -405, -113, -89, -7, 226, 255, 583, 381, 677, 682, 723, 666, 618, 488, 244, 6, -107, -215, -182, -653, -437, -650, -632, -730, -697, -481, -553, -229, -142, -100, 168, 343, 377, 413, 561, 669, 514, 777, 587, 430, 123, 20, -177, -72, -410, -514, -651, -458, -496, -810, -580, -431, -409, -364, -196, 41, 209, 110, 479, 465, 502, 621, 504, 504, 492, 376, 362, 231, 237, -198, -271, -395, -333, -472, -546, -617, -591, -479, -506, -402, -233, -115, -83, 256, 471, 409, 539, 486, 500, 442, 489, 493, 319, 215, 86, 31, -245, -305, -578, -530, -539, -449, -503, -434, -399, -386, -209, -85, 66, 122, 259, 309, 235, 644, 456, 420, 552, 448, 265, 249, 101, -30, -60, -366, -547, -484, -526, -449, -442, -362, -374, -298, -225, 14, -82, 151, 281, 313, 398, 558, 503, 451, 458, 385, 360, 64, 160, -114, -101, -335, -483, -528, -545, -611, -459, -550, -448, -386, -282, -96, -171, 136, 253, 394, 596]
6506E96j69K18r7j14q4J2j7m08J66m02O7k33K2R7j80J16k14J67J96J00rJ25J19
6529G4J25K56L9Pq3J62j74q5m8o3j87k22P9n9L9j75k39r6R6J1n6K19L5L36m0p8
6555a27M00J18J55m3r7K27j83K3k32m3kk16k06j31O8k09j3J3j31M7J83j96L50
6578b45Q3J11K02L1Q5J70o1J39J04p3Nk63o6l5ok81q9r5j06j64J41k14j08L27
6602d08l8J34J1L11O9L5Q5J85R5j49K70q3rK2k70n4j81j31k04m3jM2o1j69Q1r3
6628e54K25k4J93Q3pK60J49K9J88k7j20K86k33J63k64k46L4N5l83O8r2k97k2r9
6652f35L4k4R8K47K8M7pM18nM3J60qJ69Qj63j9j01J15l07p2n2j37r8j29J9j34
6678e05O8l7P5R8J06j25N15k26P8J84J50N6P1j5n5p4o8J58m32J28j77J3l46K9
$$ y = [596, 427, 645, 548, 434, 350, 362, 345, -63, 103, -299, -232, -465, -443, -346, -526, -410, -624, -457, -261, -161, -170, -45, 74, 199, 455, 494, 501, 418, 580, 406, 321, 273, 210, 23, -199, -120, -179, -140, -315, -554, -650, -554, -543, -599, -380, -345, -9, -49, -127, 273, 391, 546, 503, 406, 633, 450, 473, 241, 198, 196, -20, -226, -357, -289, -498, -511, -498, -629, -582, -399, -595, -245, -162, -51, 151, 182, 267, 437, 376, 515, 619, 546, 551, 288, 222, 187, 181, -100, -189, -284, -390, -554, -413, -627, -735, -408, -446, -312, -301, 10, 79, 114, 199, 384, 479, 330, 600, 517, 508, 530, 260, 206, 25, -106, -310, -353, -354, -312, -373, -542, -461, -554, -329, -353, -160, -77, -84, 176, 325, 354, 542, 515, 395, 681, 448, 611, 347, 101, 135, 190, -193, -125, -217, -514, -536, -635, -601, -625, -527, -280, -252, -205, -212, 206, 201, 244, 404, 396, 565, 573, 410, 391, 290, 405, 98, 26, -26, -163, -261, -390, -371, -505, -437, -474, -399, -301, -195, -320, 195, -31, 47, 231, 381, 437, 508, 493, 438, 364, 296, 454, 22, 150, -27, -14, -360, -331]
6702c31q6p1O3QL7J61j39J60R4O9L7K15L21r4k3j03J96j10j2j20Q0k34%k78q6
6727b46o7l7j0p4k19K68j1L8J66K65O3j14O9J51K84j20p6J52k0j10J2j98J1k48
6751g1m1j73J3j4j19K6n2ol0J70J04R1J49l8J36l8J63J84p0j6J11l0k05J20k30
6776A34j64Q6l72Q0m7p8j55kL82j45rJ43L2J95k33L05J25J00k25M11l09P8j5j76
6800A41J94j66k31J00j11k38P2r7j3j4m5P7J68K6J50n8J05j3J62R5J34p1JJ1n8
6825C21q7K1l35K02k48R3p6k40J95l45J18L9O6l5J51J46J98j79J53k9J81n5P7
6848C32N8J2j68N6j11n3j01k19Mn9j4k73J70j23K37m5oQ1J40J04J73J24J36j55
6872C00K8J48j09j18j3J52j33j12j95j49Q3j09o0L0k02J42j18Q9K87j72J65J83
$$ y = [-331, -417, -488, -425, -417, -380, -219, -358, -198, -104, -35, 2, 217, 538, 444, 421, 318, 514, 404, 392, 272, 352, 118, 118, -160, -246, -313, -350, -360, -434, -653, -385, -396, -358, -192, 73, 136, 22, 91, 242, 526, 406, 330, 482, 462, 352, 364, 166, 177, -71, -112, -285, -272, -286, -405, -379, -431, -437, -467, -297, -193, -102, 47, 9, 145, 107, 270, 454, 384, 368, 479, 449, 244, 364, 134, -30, 56, -316, -236, -283, -361, -516, -518, -136, -281, -290, -147, -115, 80, -153, 152, 277, 377, 152, 563, 254, 332, 317, 141, 335, 169, -62, 38, -73, -311, -239, -336, -349, -363, -408, -331, -163, -137, 13, -45, 60, 47, 209, 304, 438, 367, 368, 379, 321, 234, 255, -80, 122, -126, -33, -109, -349, -154, -499, -381, -342, -276, -311, -160, -14, 184, 5, 158, 129, 310, 255, 332, 390, 402, 234, 290, 179, 126, 25, -194, -190, -249, -263, -536, -366, -489, -252, -297, -303, -222, -82, 22, 195, 319, 455, 300, 328, 476, 367, 249, 236, 388, 255, 143, -52, -201, -118, -227, -287, -257, -459, -317, -435, -346, -59, -231, -66, 117]
6894A17j10O4J27P4o8J15L4k03R0on0k01J9j44k9j86J43k7k5k26J43O2K9m3Q2
6919b19K19K27J02j94K24N3N0r6l9L5j00q6j06j19L8l0k86r6j16J97j95k1J33
6942d25Q2J10N8J42J46n6J22J67p4J49K0J52l37J52j75k16qo4l8r2k05l1L4k19
6966f06K06j2J21p7L06n1J43K69j47K87k67L00om6j43Q3j3k60m5O6n0l86O5j93
6990d56o9J07J70j1j56K68LK9K28O8P2J26J3O5m8p8j9K7Nj03k04p8P8k94k0j53
7016d30r3J53m7P9j6N3Q7J90j37K03O7M15k47N4P7J21l17Nn9l5j00k14J63j86
7040b14N8j18k02M6LNQ8N9M2K49j19K02k9J61o8K10K31j63L7L5k42m1l8k34m9
7065i1j06pk1p5m6j19OJ55j47K84P6K7Q5p8M48l8J9o2J55j67J0j7j35J12k46O7
$$ y = [117, 7, 71, 198, 272, 204, 319, 353, 150, 240, 234, 184, -17, 2, -142, -171, -357, -214, -241, -266, -492, -349, -287, -258, -301, -219, 0, 227, 329, 135, 359, 412, 462, 366, 327, 362, 262, 176, 70, -49, -11, -41, -327, -423, -539, -342, -537, -558, -425, -343, -233, -175, -33, 113, 57, 179, 346, 272, 421, 441, 593, 256, 408, 233, 17, 9, -55, -93, -185, -390, -421, -387, -606, -400, -412, -291, -368, -62, -113, 30, 299, 152, 439, 172, 472, 466, 420, 277, 360, 347, 87, 42, 108, 58, -328, -263, -456, -525, -418, -248, -259, -415, -147, -144, -115, 113, 181, 253, 379, 392, 457, 409, 331, 312, 339, 344, 241, 37, -41, 37, -257, -277, -430, -523, -370, -417, -338, -354, -301, -214, -24, -161, 42, 109, 524, 277, 331, 408, 529, 212, 217, 158, 123, 23, -191, -28, -214, -156, -274, -476, -430, -427, -422, -334, -275, -233, 16, -103, 99, 70, 231, 163, 373, 604, 441, 478, 513, 271, 230, 192, -42, -91, -197, -204, -225, -300, -346, -465, -459, -304, -451, -167, -91, -64, 21, -57, 391, 353, 372, 310, 465, 298, 308, 291, 156, 268, 22, 89]
7091H9k29r3j33J04l00L26j85J77k13O5M24p7K6l2L20J28j21m9k9M4Q1J5j27J05
7115C16j41j38j96N6k08L5q1nj84J03J7J79J57n4K84j14J53k01L27L1j29J78M2
7138D27m8j90J0k23P2l9k08q8k36K96k01pJ28j2J78r9R5J01J3R4K59k90L13l8
7162C07J33q4k8j47J9j22j92o8k20K27Kp2j33K8J08k35M3L78j23J14J18q1P3K64
7186C09J26j21M3P0j02k4q0k42J29k61K48k17j90j20J63j16J15L4J6M1n1J39L0
7209f1K17L1J32J05k8rj68J61k27j8j47J18l77J25L5k41K48j68j27J04N2j80K15
7232b08J98m7N4J26k8J35O9J27j40J16k97J98q1q2j13q7Q3k47K9j84j57J26L3
7255c77K56k27J79k4K06m9K64p6J92rL2L7m0j05Q0k42L6j15L6k00o3j59M2kk14
$$ y = [89, -140, -233, -366, -262, -562, -236, -421, -244, -457, -392, 32, -45, -19, -51, 269, 397, 276, 227, 198, 242, 323, 338, 211, 316, 175, 37, -159, -103, -311, -276, -357, -362, -546, -443, -426, -247, -90, -144, 140, 26, 179, -22, 305, 336, 207, 385, 427, 379, 189, 199, -24, 48, 9, -199, -287, -523, -227, -428, -435, -307, -319, -141, -240, -145, -44, -31, 63, 322, 32, 345, 307, 440, 356, 328, 181, 200, 78, -114, -182, -402, -175, -173, -245, -378, -350, -242, -477, -434, -56, -179, -65, 53, -28, 45, 309, 435, 314, 357, 427, 325, 301, 221, -21, 108, -153, 95, -122, -312, -432, -269, -385, -270, -236, -220, -179, -230, -91, -61, 156, 187, 319, 424, 396, 387, 219, 380, 153, 135, -12, 106, -271, -146, -111, -352, -104, -272, -399, -295, -243, -423, -208, -10, -57, -3, 123, 95, 230, 299, 426, 286, 402, 105, 303, 222, 140, 27, -60, 23, -224, -195, -379, -536, -410, -377, -121, -348, -169, -193, 13, -36, 228, 152, 344, 335, 367, 404, 364, 259, 339, 97, 133, 18, 54, -146, -209, -368, -326, -328, -542]
7280e42J15mJ73j47K13o2K15J86K8N1J06k33L34P8j67j62Q1Ok29j27r8Qo3n5k12
7305e07M6O6M0M1l6M01k0N4K9qL3J17J71M1r4j6K17l54m2k48J73j00j34lp3j28
7331c34J38j34l1N1N8J01J46L1J8K2Q7j5K16J59M8k30o3J82k73O9n4r3j39j53
7355a93j72N9J2j36Mj4P8J40n3K74n6R0K31J5ok7K29j96k1J45l3q7k10M8j95j07
7381a81j42J4q0K0N0j22J46J09r3K68j17N9L29r4J67J32j70J24K3M2j76j10O6
7404B64k05n8k38p0m8L8m2j8j2m2Q5O8Q3L73j78N3O4J74n2J92J11r2J3k12N3j73
7430A31j22j47J71k60J1j00k1r3k6J82p8K2J16L4K0K62J75M7K6o1J68p4J44r1
7454D36j37j7qj21r9k79r0l8M3l0j32K22m1Q4K0P5O3K2K93q1J01K13j31m5L7j0
$$ y = [-542, -427, -431, -258, -405, -192, -254, -39, 147, 175, 226, 332, 99, 433, 511, 344, 182, 263, 269, 40, -87, -185, -177, -240, -295, -507, -461, -395, -355, -314, -350, 51, 31, 85, 114, 106, 139, 256, 427, 468, 374, 358, 575, 221, 179, -69, 104, 4, -130, -133, -206, -334, -196, -330, -361, -310, -252, -151, -5, 26, 44, 66, 153, 138, 354, 513, 561, 331, 268, 450, 177, 246, 192, 99, -40, -193, -365, -306, -294, -430, -426, -440, -362, -222, -275, -1, -57, 33, 264, 279, 273, 246, 475, 279, 258, 403, 370, 283, 73, 121, -74, -181, -323, -309, -389, -369, -319, -441, -295, -186, -279, -11, -128, -69, 260, 166, 333, 465, 295, 419, 442, 484, 308, 198, 264, 59, 1, -237, -307, -355, -317, -359, -377, -389, -431, -346, -278, -195, 178, 0, 53, 117, 291, 239, 431, 542, 450, 463, 251, 304, 131, 9, -138, 33, -227, -216, -316, -337, -430, -456, -274, -352, -330, -214, -180, -160, 102, 277, 324, 350, 289, 457, 383, 527, 436, 299, 282, 274, 153, 54, -225, -315, -353, -310, -340, -472, -250, -291, -207, -187, -112, -49, -27, 266, 185, 286, 499, 368, 323, 360, 350]
7480C50J38l61K42q3j81J8m13p1J03j01r4M9j41K13N2J53KO0K09p0J90J44j83
7503B25rJ94o6Q2q8l30jm3R3m34R6P2j82L6J05K5j29P3J19J1L03j60J17J60j03
7528A66K07o3J76r1%r2L0k15L3j47k03j49J49k22mJ24j86L13j16Q2J61j9J40m
7552G0J16J27P5L2K5Rj70O3j01k47R0j31j57nk28O9k5o0J31n2oJ35P9J39Rn6L42
7579B73p6J06Q1k19J11J04k12J16j12K7j33j74O0j47j45l4L8OkJ0O9R4J1N6R4
7604BJ42J84j03P3K3R4Qj91okj64n1o5N4j52lk42p7J03k4NR8J34N5J1K83l61L16
7632A44j2J91P5J03J8k24j7j69N3j73k8j98J25j91n2J54k53Q9L3Q8M9j27L19j80
7656a83K80L16j14N4Lj9Q3m0p8l65J12J3k13O7r0o4j09j16O4k9j12J29J47PK40
$$ y = [350, 488, 127, 369, 286, 105, 123, -290, -361, -258, -359, -453, -404, -545, -332, -280, -127, -125, -65, 144, 74, 264, 408, 225, 216, 410, 344, 426, 338, 8, 7, -36, 57, -377, -281, -209, -391, -355, -250, -225, -354, -281, -162, -151, 152, -8, 109, 269, 166, 373, 310, 486, 395, 395, 303, 333, 118, 151, 4, -199, -348, -199, -421, -425, -301, -487, -174, -290, -208, -47, -66, 74, 70, 186, 313, 388, 420, 445, 454, 284, 347, 246, -1, 89, -42, -199, -204, -432, -363, -388, -448, -317, -369, -375, -240, -161, -22, -13, -69, 273, 197, 303, 384, 165, 276, 380, 168, 284, 172, 199, 66, -108, -48, -195, -340, -374, -336, -330, -332, -322, -253, -159, -148, -92, 2, 144, 328, 225, 298, 321, 415, 423, 232, 226, 224, 60, 9, -56, -2, -154, -157, -399, -476, -373, -397, -392, -294, -160, -105, -94, 189, -172, 144, 132, 323, 398, 501, 519, 295, 278, 109, 162, -11, -39, -237, -112, -303, -355, -201, -454, -365, -332, -244, -195, -322, -3, -183, 97, 413, 299, 353, 356, 337, 420, 380, 302, -63, 49, 62, -151, -84, -174, -238, -347, -463, -399, -428, -540, -411, -264, -257, -17]
7681a7j21J14K31n3R1J9J27j24l9Q6mj87K0j72K2p9j96q8J2j77Q5JK18op6K41
7707g2j5K37J9j19L00O6k01K07M0j97l6p1k2j85nj51J19q4j78l2J2l0j09K08J42
7732a57Q8mL6Q3J52j11Q4K02Q6J01n2kj08k20k1l14q6J02j14j19J19j26Q0K28
7756g3j69n1L5J23R3J09N4O8R2N5N7l0J1j64K49j67l36J40q6j83j3j24k1j10m
7781d45l5oJ75J59rJ34J14j9j07L71J6r9J85n1j03O3k10r0p0N4k06o2k56L15j5
7806a97k56J13Q4J23j57J76J8J84j65J96M6J21o7J26j53K57k38M4n6j87O6j58
7828h0j0j82j33Nj2rn2K97p0O8J4J41J19R2J73M4j2l7K3k9J23k88J60j44k28J15
7854H8p6m15J77k15P4q2l4K39j91J39J26P4K24J3KQ2J50J72k17L2n8N9r0l0j35
$$ y = [-17, -138, -24, 207, 154, 245, 264, 391, 267, 228, 314, 310, 123, 143, -29, -7, -86, -282, -370, -358, -535, -450, -449, -231, -237, -313, -72, -87, 150, 169, 50, 350, 416, 215, 422, 462, 265, 229, 158, 136, -49, -54, -205, -86, -170, -348, -380, -368, -398, -507, -299, -157, -69, -73, -37, 46, 198, 87, 171, 373, 459, 560, 508, 506, 398, 178, 157, -157, -243, -141, -255, -374, -255, -381, -301, -73, -242, -293, -258, -135, -42, 67, 121, 189, 281, 336, 393, 363, 374, 210, 459, 292, -44, 96, 10, -173, -186, -310, -331, -441, -445, -480, -486, -311, -152, -161, -27, 87, 68, -39, 332, 348, 249, 434, 383, 280, 343, 133, 43, -27, 27, -179, -241, -497, -182, -197, -453, -340, -256, -133, -290, -114, -96, 88, -77, 119, 165, 286, 219, 345, 192, 449, 211, 255, 199, 12, 78, -80, -90, -272, -405, -400, -412, -421, -473, -176, -246, -178, -164, -23, 96, 188, 361, 405, 393, 356, 379, 350, 473, 185, 345, 201, -27, 88, 12, -403, -226, -441, -367, -449, -483, -244, -435, -296, -170, -96, 128, 141, 143, 225, 375, 547, 330, 362, 304, 363, 273, 243, 108]
7879A08o4r9j95j65Q8O3j50K8q4Q2K4K11O2L3oJ26K20q3L56r5l9M2j14j6j94J04
7905B43j48l02J02k76l2NJ27r7J44J3j30Q6J70OK23J81j43P6J42m3P9L4j19J5
7929C56j62K8o2j69j99j82r3K99j64n7M0p8N8P1J38M6O9J68P9K2K22N0N0m6j11
7954C73M8p1p3k24j36k6q8%k40K8L%j44K33q6K43Q6Q6N2j56K90J38J7kp1J86j94
7981B72J16j95j8k71j06J63j98l9q4J29k92J43j5J12K5Q2L1M05j79lJ52O2N2J2
8005C56O3R4j63j92R%l86N3J11k05j97Q0m0Q8o9j0J08O2K02N1Q0p2K99k7J60l0
8031D25P4q5p7j72P6j34P2l05J61l96O2m8j82L1J16J29l8j8K94k7J42O3j21L05
8055C47N5J23j21j7m5j6j0j77r7q1r0j49k9j28JM8R3p0kK55m5K73m5L1R0n4J31
$$ y = [108, 44, -55, -250, -415, -327, -264, -414, -386, -470, -388, -364, -153, -91, -58, -64, 62, 282, 199, 555, 460, 421, 463, 349, 333, 139, 243, 95, -207, -105, -381, -413, -408, -281, -378, -234, -221, -351, -265, -95, -89, 134, 315, 172, 248, 390, 347, 426, 460, 341, 356, 194, 222, 160, -9, -208, -390, -483, -184, -348, -405, -365, -443, -385, -314, -176, -130, -61, 107, 186, 208, 430, 480, 530, 484, 373, 421, 350, 277, 53, -83, -109, -197, -197, -437, -409, -406, -406, -550, -317, -403, -160, -74, 12, 64, -92, 198, 336, 353, 351, 280, 466, 272, 388, 193, 175, -96, -202, -39, -237, -276, -360, -231, -523, -380, -395, -283, -258, -176, -145, 260, 81, 78, 230, 292, 344, 356, 419, 513, 350, 158, 167, 167, -219, -166, -55, -260, -457, -377, -417, -329, -398, -408, -300, -238, -36, 15, 95, 23, 322, 295, 455, 425, 499, 414, 337, 165, 241, 107, 179, -126, 35, -361, -299, -347, -529, -498, -382, -253, -291, -309, -15, -42, 100, 163, 42, 347, 402, 525, 404, 387, 342, 326, 316, 139, 42, -39, -129, -278, -307, -435, -434, -386, -293, -363, -365, -110, -155, 118, 73, 104, 194, 140, 271]
8082B71K68l67L09q4r0J3k24J9k03p5N5j91j14j42J68P3Ok19M03j87K02J30J0
8105C1J89J66m8n7J99j58J2k63L79j65k17N3j69q1l1j85P4k50J77Kp6J87k30M35
8129b6q8J18L97k69K65ROj19J04j29m0R8j09r7k87j86M5J6k14P9o5p2L09l7j89
8154d81K68K58K17J9j87K01J99r0N7j66J38n9o9P8k78j26k8j20l20O7J03o8kk1
8178d10j11J67J18J97K7R5J14J68q7N5O9r1J38
$$ y = [271, 539, 172, 481, 397, 307, 320, 96, 115, -88, -163, -108, -299, -413, -555, -387, -314, -308, -527, -124, -311, -109, 21, 31, 220, 386, 338, 281, 480, 322, 334, 71, 450, 285, 68, 121, -48, -129, -160, -345, -271, -521, -344, -342, -418, -231, -461, -26, -114, 4, 401, 132, 397, 406, 412, 293, 397, 268, 228, 326, 217, 120, -167, -353, -308, -292, -506, -427, -492, -564, -255, -292, -481, -213, 45, 262, 281, 94, 295, 494, 404, 461, 295, 433, 374, 305, 383, 105, -21, -49, -169, -489, -422, -319, -387, -389, -410, -521, -354, -236, -39, -12, 83, 197, 365, 278, 333, 402, 311, 449]
8191D49
$$ Imaginary data points
##PAGE= N=2
##DATA TABLE= (X++(I..I)), XYDATA
0@%%%%%%%%QqQj6J6k4L2m0M8n7P3q9J06j30J54j79K12k46K87l34L87m43N08n80
32c07O60p49Q46r54J073j203J343j501J673j861K064k290K536k801L092l411L762
49A972m144M564n028N542o112O752p471Q284r213J0292j1556J3061j4896J7186
63I233k0140K4118k9805L8668n4567R2149l57100l83757J66140M7177J71630J14212
75a82042J81303J36239J60694J11835J19740N9233N1849p284k4974p1164r1443
86D43986j22094j33450j50294j40712j44230j19368j06387p3284m6910n342J7111
97e80974O0559Q1535J09661J29342J34970J40461J37050J21690J05122P7760M7267
108E64443J7538j4743n1679p4084j05333j17563j32275j37548j30121j22385j01469
$$ y = [0, 0, 0, 0, 0, 0, 0, 0, 0, 8, 0, 8, -8, 8, -16, 16, -24, 24, -33, 40, -49, 57, -73, 81, -98, 114, -132, 155, -179, 208, -235, 273, -307, 353, -396, 450, -504, 569, -634, 709, -792, 881, -980, 1084, -1206, 1330, -1471, 1621, -1790, 1972, -2172, 2392, -2636, 2906, -3206, 3546, -3925, 4359, -4854, 5438, -6118, 6943, -7953, 9233, -10907, 13211, -16594, 22074, -32493, 59656, -297444, -681201, -515061, -467884, -296254, -182042, -739, 135500, 296194, 408029, 527769, 587002, 638851, 631567, 606593, 535429, 443986, 321892, 188442, 38148, -102564, -246794, -366162, -472549, -545833, -592743, -598085, -580974, -520415, -438880, -329219, -199877, -64907, 75554, 212604, 334294, 439416, 517176, 564443, 581981, 567238, 515559, 441475, 336142, 218579, 86304, -51244, -181365, -303750, -405219]
119d05219p9087n1650k0291J2586L9533P0836R3927J09796J26479J24979J27676
130A49565J16214R8924Q0456N1999K5570m526l3466o1903q1643j04292j14789
141A22109j20204j22841j10870j01402p9577n6725l0440j888K6779N3306P6309
152c45444R7169J07263J19299J16039J11497R9895P9895O1069L2131O436k1945
163D63304m6426p0744q9300j03992j10983j11052j09651r4494q1911n9195l4490
174d48934j1424J6650M0341O3760Q1223R6833J02747J07460J02947R2972Q0621
185C25196N8737L9738J3483j0222l4616n6875p5258q9655r7848j03465r8977r2988
197b22750p8048o1621m1192j6562N191L1390N0360P0003Q4732R4442R7592R6720
$$ y = [-405219, -484306, -535956, -556247, -543661, -504128, -433292, -339365, -229569, -103090, 21889, 149565, 265779, 364703, 445159, 497158, 522728, 518202, 484736, 422833, 341190, 236898, 122109, 1905, -120936, -231806, -333208, -412785, -469510, -499950, -501838, -475059, -421753, -345444, -248275, -141012, -21713, 94326, 205823, 305718, 385613, 446682, 478813, 485249, 463304, 416878, 346134, 256834, 152842, 41859, -69193, -178844, -273338, -355249, -414444, -448934, -460358, -443708, -403367, -339607, -258384, -161551, -58804, 48656, 151603, 244575, 325196, 383933, 423671, 437154, 426932, 392316, 335441, 260183, 170528, 72680, -30785, -129762, -222750, -300798, -362419, -403611, -420173, -414982, -383592, -333232, -263229, -178497, -84055, 13537, 110257]
209A10257R0190P6731O3127M0476K0489k988k5747m5756o5395p7588q9413r2314
221B069r3412q6205p6442o1043m2169k3593N76J9736M1886N8473P3894Q3372Q8015
234a4843Q9958Q3421P5619O0029M4839K4060M058j6910l7967n2964p0284p8416
246A10600q5704q5380q2432p3655o0463m5337k4879o912J4698L2482N0976O5106
258a90900P4523Q2181Q1961Q0713P0652O0680M4524K7188Q763j2010k8741m7608
270B51926n9662p2349p7050p9574p7514o9559o0116m4146k9526r328P601K6816
282b92481M3005N6412O8536P3498P7915P3991O9368N8878M5156L0141J1550m792
294C11177k4650l8499n4389o4295p1147p4590p2292o8498n7277m6970k9758j4601
$$ y = [110257, 200447, 277178, 340305, 380781, 401270, 398282, 372535, 326779, 261384, 183796, 94383, 2069, -91343, -177548, -253990, -315033, -357202, -380795, -380219, -360483, -318597, -260124, -186230, -102858, -14843, 75115, 158536, 234155, 294184, 339023, 363083, 367141, 350231, 312264, 259300, 189016, 110600, 24896, -60484, -142916, -216571, -277034, -322371, -347250, -354162, -339464, -306982, -256006, -190900, -116377, -34196, 47765, 128478, 199130, 259810, 304334, 331522, 340285, 328275, 299534, 251926, 192264, 119915, 42865, -36709, -114223, -183782, -243898, -288044, -317570, -326898, -319297, -292481, -249476, -193064, -124528, -51030, 26885, 100876, 170244, 229122, 274278, 304419, 315969, 311177, 286527, 248028, 193639, 129344, 58197, -16393, -88685, -157183, -214460, -261430, -291188, -305789]
306c05789L577K0918L5914N1160O0218O9475P0651P1614O6150N7669M6546L0820
318B78923J6472j804j7247l4054m6701n8125o5905o8772p0210o3924n8221m5707
330b35275l2987j7291o75J4664L1632M3253N5815O2689O7362O7321O3860N7249
342A77617M5847L4451J8075L551j3267k7786m1369n2623n9974o5835o5051o3550
354a09914n5872m7021l4564j9934n402J1362K4651L9303M9237N8457O2636O3999
366C6938O2155N5487M7498L4533K2224O475q118k2696l6516m6327n6517n9917
378C5219o3143o0140n5751m7015l5648k3580q221N390K0893L2686M4876N2822
390a01612N8613O1404N8666N5492M6904L7332K3984J0842l544j7924l0257m2260
$$ y = [-305789, -302212, -281294, -245380, -194220, -134002, -64527, 6124, 77738, 143888, 201557, 248103, 278923, 295395, 293591, 276344, 242290, 195589, 137464, 71559, 2787, -67423, -131347, -189568, -235275, -268262, -285553, -286228, -271564, -239932, -196679, -140864, -78175, -10813, 56508, 120368, 177617, 223464, 257915, 275990, 279541, 266274, 238488, 197119, 144496, 84522, 18687, -46364, -109914, -165786, -212807, -247371, -267305, -272707, -261345, -236694, -197391, -148154, -89697, -27061, 36938, 99093, 154580, 202078, 236611, 258835, 265310, 257192, 234496, 197980, 151653, 95136, 35219, -27924, -88064, -143815, -190830, -226478, -250058, -258279, -252889, -231996, -199310, -154434, -101612, -42999, 18405, 77071, 132563, 179467, 216799, 240783, 251625, 248081, 230157, 199900, 157640]
402A57640m9996n7280n8527n8681n4433m6931l8025k5238j3278J946J4586K8336
414a99881L8893M8174N4596N6886N7934N3181M8006L7933K6880J4758N08j2392
426B25476k5737l6032m6297n1692n6122n5889n2794m7840l8178k9239j4936l404
438b32684J0502K2859L3963M3552M9784N4412N3767N3260M6574L9578K8989J7063
450B21619N362q788j9635l2262m0802m7813n1728n3511n1678m6227m0318k8869
462a94650j9596o151N684J7807L0030L7830M5945M9705N2550M9931M6821L9415
474A55321L0460K0957P095l071j6568k6364l6102m3729m8020n0775m8841m6451
486a06088l9236l1762k0322j0109J747J4126K3354L4806M0610M6628M8430M8461
$$ y = [157640, 107644, 50364, -8163, -66844, -121277, -168208, -206233, -231471, -244749, -242803, -228217, -199881, -160988, -112814, -58218, -1332, 56602, 109783, 157789, 195722, 222602, 237360, 237868, 225476, 199739, 163707, 117410, 65718, 9596, -46293, -99087, -146927, -185105, -214344, -229280, -232684, -222182, -199323, -165360, -121808, -72024, -17612, 36155, 89415, 135989, 175567, 204556, 221619, 226981, 218193, 198558, 166296, 125494, 77681, 25953, -27558, -79236, -125463, -165781, -194650, -214246, -220397, -214713, -196906, -166876, -129046, -83101, -33396, 19154, 69085, 115906, 155321, 185781, 206738, 213833, 210762, 194194, 167830, 131728, 87999, 39979, -10796, -59637, -106088, -145324, -177086, -197408, -207517, -205770, -191644, -168290, -133484, -92874, -46246, 2184, 50645]
498E0645M5499L9404L1840K1730J2057o99j1020k2385l1705l8404m4993m6475
510E494m7589m4512l9366l2076k3353j2397j495R028K0627K8161L7755M2038M5259
523a2426M6232M3232L9749L2226K4021J3510L748p803j7723k6902l5302l9467
535F3095m4528m3822m3475l8907l2247k4623j5056m968N868J5507K5493L1999
547a05664L8572M2599M2628M2648L7670L3125K4949J6193O213m234j3649k2871
559A38179l0529l7346l9777m2484m0961l7588l3363k5012j7302o999K325J1992
571a58865K1180K9229L4643L8785M0958L9467L8591L1729K5828J7741Q233m67
583A67052j1041j9139k7344l2765l7691l8907l9813l6905l1489k6850j7606j0073
$$ y = [50645, 96144, 135548, 167388, 189118, 201175, 200476, 189456, 167071, 135366, 96962, 51969, 5494, -42095, -86607, -125973, -158049, -181402, -193799, -195294, -186266, -165639, -137478, -99723, -57685, -12426, 33806, 77038, 116787, 149013, 173034, 186544, 190292, 182489, 164766, 137864, 102562, 63095, 18567, -25255, -68730, -107637, -139884, -164507, -179563, -184531, -178663, -163156, -137663, -105664, -67092, -24493, 18135, 60783, 98453, 131578, 156527, 172720, 178933, 174699, 161050, 138179, 107650, 70304, 30527, -11957, -52918, -90506, -123869, -148881, -166183, -173182, -170857, -158865, -137685, -108456, -73813, -35028, 5930, 45397, 83988, 115717, 141545, 159286, 167519, 167052, 156011, 136872, 109528, 76763, 39072, 165, -39648, -76553, -108042, -134892, -152498, -162571]
595a62571M3R308J7158K5702L1255L6106L7965L8674L5752L2368K6208J8704J0735
608A57407N37o883j6389k3754l0116l4335l6915l7107l5642l2004k6112j9697
620a41010j0651k742N924J5270K1774K8854L2731L5933L6234L5227L1222K6421
632A15187J9885J1719L901n467j2824k0981k6942l1708l5077l5104l4571l1173
644h3155k6665k0042j2717m240L908J1573J9930K5428L0871L3364L4746L3786
656D6787L1090K6383K0227J3437N056k252j1189j8267k4183k9660l1900l4286
668h757l2960l0945k6023k0877j3898o372J867R814J6493K3644K7665L1819L3036
681D506L2450L0588K6184K1577J4111P072r27q362j5684k2041k6920l0711l1884
$$ y = [-162571, -162528, -153220, -136062, -110360, -79105, -42999, -5034, 33640, 69392, 101760, 127968, 146672, 157407, 157944, 151061, 134672, 110918, 80802, 46467, 9552, -27555, -63197, -95201, -121313, -141010, -151661, -154403, -148479, -133209, -111435, -82581, -49850, -13917, 22317, 57544, 88766, 115187, 135072, 146791, 150692, 145225, 132401, 111420, 84478, 52770, 17693, -17411, -51982, -83155, -109820, -129862, -142579, -146819, -142911, -131338, -111408, -85980, -55109, -21745, 13001, 46787, 77877, 104260, 124487, 137924, 142980, 140728, 129539, 111272, 87089, 57429, 25529, -8757, -41717, -72662, -98685, -119562, -133460, -139832, -137965, -128151, -111658, -88014, -60349, -28530, 4506, 36956, 67544, 93728, 115305, 129416, 136488, 135561, 127199, 111515, 89474, 62554, 31843, -41]
694d1l2433k9822k6738k1349j4836p788j10O952J4805K0631K5916K9345L1358
707d110L1727K9665K6738K1121J6014Q435J482o197j3437j9391k5065k8043l1063
720G876l0574k9746k6419k1989j6376q970k547N469J1739J8473K3593K7643K9987
733a1841L0115K9676K6149K2497J6561J0157L240m253j0766j7699k2420k6981
745D4435k8729k9924k9007k6331k2833j6637j1235l510K734J0168J6235K1285
757g3349K5923K8021K9493K8332K6631K2411J7643J1459M751j711r238j4859k0649
770G4858k4610k7488k8700k7946k6558k2539j8312j1772o137J168P735J4060J9837
783g6404K3337K6931K7905K8191K5826K3212J8301J2577O745n07o404j3326j8101
$$ y = [-41, -32474, -62296, -89034, -110383, -125219, -133007, -133117, -126165, -111360, -90729, -64813, -35468, -4110, 27617, 57282, 84020, 105141, 121155, 129590, 131072, 124875, 111438, 92047, 66982, 38939, 7876, -22698, -52444, -78863, -100852, -117228, -126198, -128745, -123276, -111537, -93064, -69471, -41828, -11841, 18274, 47950, 74099, 96596, 113157, 123314, 126554, 122301, 111535, 93836, 71416, 44435, 15706, -14218, -43225, -69556, -92389, -109026, -120261, -123771, -121037, -110869, -94634, -73349, -47426, -19405, 10088, 38420, 65051, 87462, 105105, 116564, 121315, 119604, 110366, 95507, 74858, 50248, 22760, -5940, -33886, -60444, -82983, -101295, -113067, -119204, -118036, -110301, -96241, -76404, -53067, -26136, 1769, 29960, 55786, 78998, 97299, 109876, 116621, 116114, 109710, 96384, 78283]
796G8283k2808k5947k7366k7721k5635k3230j8369j3572p266p34N614J1956J7251
809g9544K2037K4792K7001K6686K5866K3113J8875J4131P629K202m995j0806j6280
822H0707k0745k4099k6222k6560k5690k2804j9463j4420q528k668L699R671J5409
835h1713J9546K3322K5609K5905K4990K3204J9811J4555R698L254k656q677j4279
848H2569j8552k2591k4256k5713k4758k3155j9729j5220j0207m023J353Q101J2693
861h3488J8084K1225K3909K5118K4329K3289J9479J5886J0571N132q54o850j2084
874H3746j6939k0307k3426k4170k4287k2498k0025j6118j0943o000K46N529J1209
887h3983J5499J9994K2413K3447K3935K2434K0107J6001J1849O482O73m523j0423
$$ y = [78283, 55475, 29528, 2162, -25559, -51194, -74424, -92793, -106365, -113631, -114365, -108751, -96795, -79544, -57507, -32715, -5714, 20972, 46838, 69951, 88826, 102957, 110586, 112788, 107793, 96987, 80707, 59962, 35863, 9641, -16919, -42609, -65413, -84876, -99296, -107824, -110492, -106793, -97122, -81713, -62167, -38845, -13236, 12669, 37659, 60863, 80674, 95229, 104927, 108181, 105525, 96848, 82569, 64017, 41426, 17170, -8543, -33301, -56456, -76185, -91405, -101612, -105635, -104282, -96181, -83488, -65404, -44179, -20270, 4848, 29177, 52466, 71945, 87831, 98402, 103534, 102680, 95830, 83746, 66807, 46500, 23074, -1096, -25383, -47881, -67906, -84024, -94967, -100967, -100721, -95192, -83983, -68484, -48490, -26077, -2630, 21305, 43739, 63846, 79847, 91696, 98178, 98851, 94328, 83905]
900H3905j4335j9015k1441k3055k3270k2372k0317j6234j2393o955j845M036R124
913h4167J3904J8054K0242K3078K2393K2404J9549J7053J2571P709K353l158p902
926H4083j3585j6508j9969k1818k2317k1906j9741j6951j2772q464k846K154P164
939h3476J2318J5970J9353K0823K2225K1170J9979J6969J3047Q983L424j416o737
952H2632j0842j5577j8353k0508k1467k0952j9969j6853j3695q910m193P21N651
965h2315J0201J4767J7400K0168K0671K0775J9532J7138J3665R450N213p1n002
978H1592r711j3524j6687j9479k0145k0699j9040j7293j3891j0133n471m03M002
991h0882Q849J2716J6179J8494K0188J9926J9085J7401J3763J0706N637J456l586
$$ y = [83905, 69570, 50555, 29114, 6059, -17211, -39583, -59900, -76134, -88527, -95482, -97327, -93291, -84167, -70263, -52209, -31967, -8889, 13504, 35908, 55457, 72510, 85081, 92790, 95143, 91985, 84083, 70498, 53990, 34021, 12203, -10114, -32020, -51761, -68712, -81484, -89948, -92794, -90640, -83476, -71158, -55188, -35835, -15012, 7213, 28383, 48362, 65331, 78378, 87361, 90785, 89369, 82632, 71790, 56213, 37860, 17352, -4115, -25067, -45036, -61889, -75584, -84494, -88687, -87966, -82315, -72114, -57347, -39947, -19779, 892, 21667, 41199, 58337, 72002, 81452, 86665, 86594, 81592, 71881, 58357, 41670, 22191, 2046, -18653, -37693, -54986, -68877, -79010, -84481, -84884, -80882, -72033, -59317, -43138, -24644, -4456, 15470, 34555, 51956, 65719, 76425, 82062, 83518, 79932]
1004G9932p842j1920j5673j7841j9335j9430j9319j6934j4418j0609o498k229
1016h2116L039O762J1762J4499J7344J8624J9299J8826J6892J4770J0900P059
1028G7660K584k134o122j0684j3930j6793j8071j9030j8466j7033j4834j1303
1040f8156p639k822Q02O205R583J3476J6108J7678J8700J7963J7506J4349J1783
1053F5536P781L985q02n236q800j2983j5149j7354j8097j8228j6842j4589j2077
1066f2855q090m448J35M268Q492J1814J4711J6934J7698J8002J6549J5037J2116
1079F0363Q752M669M77l749p874j0967j4272j6213j7401j7719j6572j5244j2214
1092e7964r103n101j054L259O830J0806J3319J5551J7185J7032J6833J4947J2519
$$ y = [79932, 72090, 60170, 44497, 26656, 7321, -12109, -31428, -48362, -62780, -73389, -79887, -82116, -79077, -72315, -60553, -46054, -28710, -10086, 9213, 28039, 44931, 59701, 70601, 77660, 80244, 78110, 71988, 61304, 47374, 30581, 12510, -6520, -24986, -42019, -56853, -68156, -75795, -78617, -77815, -71610, -62027, -48551, -32443, -14765, 3935, 21898, 39404, 53753, 65536, 73317, 77302, 76500, 71264, 62464, 49481, 34332, 16978, -1119, -19347, -36189, -50778, -62855, -70945, -75393, -75258, -70990, -62498, -50684, -35973, -19039, -1341, 16661, 33210, 48247, 60363, 69115, 73784, 74261, 70512, 62638, 51671, 37399, 21186, 3785, -13934, -30506, -45750, -57964, -67067, -72168, -73222, -69963, -63133, -52327, -39008, -23457, -6272, 10760, 27593, 42540, 55059]
1105E5059R431N523K044k671o183r867j2761j5317j6436j7002j6452j4606j3155
1118e2393r625o185k347J780N553R272J2014J4662J6000J6734J6248J5121J2902
1131D9736J0000O673K677q96m898q666j1667j4055j5299j6541j5970j5328j2631
1144d6865j0438p155l321K65M629P408J1039J3189J5467J5791J6224J4701J2946
1157D3880J0884P349M315j74l336p294j0241j2596j4828j5491j5622j4862j3472
1170d1488j0742p754m604n62K509O956R264J2421J4045J5211J5585J4727J3447
1183C9015J0772Q455M643J426k571n927q784j1727j3424j5019j5206j4378j3333
1196c6058j1259q611n133k028K003M936Q531J0914J3046J4472J4497J4660J3185
$$ y = [55059, 64490, 70013, 72057, 69386, 63203, 53336, 40575, 25258, 8822, -8180, -24632, -39238, -52393, -62018, -68203, -70550, -68770, -63217, -53945, -41931, -27269, -11269, 5465, 21713, 36834, 49736, 59736, 66409, 69086, 68190, 63292, 54626, 42959, 28904, 13605, -2936, -18906, -34234, -46865, -57303, -64458, -67779, -67514, -62885, -55477, -44438, -31249, -15782, 9, 16233, 30934, 43880, 54764, 62113, 66428, 66254, 62918, 55624, 45383, 32787, 17959, 2468, -13154, -28016, -41488, -52230, -59984, -64588, -65150, -62641, -55685, -46421, -34000, -19955, -4744, 10841, 25568, 39015, 49787, 58242, 62885, 64311, 61740, 55813, 47029, 35302, 21878, 6859, -8347, -22725, -36058, -47317, -55928, -61061, -63089, -61086, -56150, -47619, -36705, -23659, -9187, 5310, 19970, 33155]
1209C3155J1702Q570N808K290j069m535p735j0297j2807j3538j4757j4276j2943
1222c0432j1697q963o372k765L77M093P003J0028J1855J3628J4361J3872J3524
1235B8512J1317R467O411L285j15l564o546r282j1469j3238j3741j3835j3268
1248b6066j1443r488o919l503l24K742O043Q827J0859J2718J3447J3617J3010
1261B3520J1617R695O784M248Q97k374n583p881j0664j1994j3241j3410j2664
1274b1050j1803r659p274m481j363J649N050P480J0104J1607J2961J2881J2800
1287A8902J1486R879P746M681J925j399m303p142r222j1157j2577j2682j2716
1300a6579j1374j0232p712m955k450Q61L777O581Q661J0938J1814J2576J2288
$$ y = [33155, 44857, 53427, 59235, 61525, 60456, 55921, 48186, 37889, 25082, 11544, -3213, -17489, -30432, -42129, -51092, -57464, -60229, -59852, -55759, -48756, -38728, -26873, -13245, 1116, 14988, 28512, 39829, 49296, 55707, 58992, 58877, 55313, 48767, 39485, 28016, 14778, 1037, -12798, -26066, -37509, -46997, -53916, -57419, -57743, -55001, -48958, -40131, -29272, -16554, -3107, 10510, 23520, 35137, 44832, 51616, 55864, 56761, 54387, 48804, 40923, 30259, 18265, 5024, -8386, -21050, -32853, -42512, -49786, -54267, -55630, -53981, -48931, -41451, -31347, -19740, -6779, 6102, 18902, 30388, 40267, 48013, 52694, 54619, 53220, 48917, 41775, 32553, 21396, 8819, -3863, -16579, -27953, -38185, -45897, -50852, -53302, -52441, -48664, -42083, -33422, -22484, -10670, 1906, 14194]
1313A4194J1559R981Q194N623K338r4l461n991q122j0286j1775j2314j2004j1683
1327b3841r925q173n866l022j22L006N373P729J0146J1071J2037J1743J1691R945
1341C1792Q368O048L308O13k417m988p489r537j0685j1608j1860j1183j0402q390
1355c8430o131l692p90J756M648O947Q969J0400J1330J1692J0958J0160Q736O258
1369D2811L968J490j458m162o249q830j0090j0941j1423j0907j0111q690o835
1382d1427l834j962J103L523O008Q241R507J0696J1352J0596J0223Q753O917M714
1396D4410J781n48l073n770p488r420j0357j0882j0883r775r175o725m912k152
1410d4969P1K700N071P218Q961J0049J0729J0572J0055Q737P249N085K446K75
$$ y = [14194, 25753, 35734, 43928, 49551, 51889, 51795, 48334, 42343, 34221, 23935, 12160, -154, -12158, -23841, -33766, -41939, -47805, -50827, -50949, -47943, -42570, -34841, -24695, -13624, -1587, 10156, 21847, 31792, 40160, 46208, 49516, 50129, 47712, 42724, 35235, 25698, 15013, 3405, -8455, -19638, -30040, -38430, -44561, -48253, -49043, -47287, -42639, -35692, -26723, -16323, -4993, 6699, 17657, 27817, 36553, 42811, 46779, 48269, 46811, 42649, 36400, 27570, 17480, 6539, -4884, -15791, -25902, -34592, -41427, -45261, -47223, -46120, -42597, -36589, -28348, -18841, -8145, 3207, 13803, 24026, 32779, 39696, 44410, 46191, 45643, 42570, 36800, 29312, 19892, 9535, -1347, -12230, -22005, -31180, -37905, -42817, -44969, -44898, -42198, -37127, -29909, -20948, -10899, -170, 10402, 20457, 29194, 36443, 41528, 43974, 44249]
1424D4249k345m579o875q376r873j0548j0414r956q860p265n182k893q22K355
1438d1384M114O343Q314R285J0157J0242R902Q793P508N289L350R84j476m167
1452C7254n817p896r059r872j0247r645q927p455n708l671j067J073L772N353
1466c1912P739Q660R677J0127R573Q800P472O063L517J526q59k991n441p022q604
1481A6325r443r536r550q988p580o034l759j997O73K597N045O780Q108R080R560
1496A281R481Q705P770N855M415K154j90k570m350o514p724q833r375r154q773
1511a7822p801o414m470k219k43K113M112N997P487Q547R056R160Q762P772O570
1526C0607M397K802N61j816l702n652p061q260q820r223q623p721o562m831l074
$$ y = [44249, 41904, 37325, 30450, 22074, 12201, 1653, -8761, -18717, -27577, -34842, -40024, -42917, -43739, -41384, -37270, -30927, -22613, -13328, -3171, 7071, 16973, 25766, 33274, 38563, 41913, 42897, 41421, 37254, 31437, 23541, 14482, 4610, -5637, -15282, -24209, -31664, -37372, -41043, -42110, -41037, -37265, -31912, -24173, -15513, -5836, 4291, 13864, 22664, 30136, 36199, 39716, 41242, 40383, 37392, 31951, 24929, 16325, 6882, -2654, -12204, -21192, -28772, -34806, -38565, -40562, -39889, -37292, -32247, -25467, -17359, -8279, 1281, 10762, 19467, 27237, 33092, 37507, 39661, 39471, 36901, 32551, 26037, 18313, 9480, 105, -9049, -17822, -25623, -32037, -36507, -38726, -38969, -36856, -32744, -26747, -19260, -10713, -1657, 7503, 16265, 24037, 30607, 35004, 37806, 38367, 36551, 32849, 27197, 20136, 11876, 3056, -6167, -14790, -22511, -29073, -33904, -36978]
1541c6978p54J335L503N340O494Q079Q645Q987Q399Q206O472N166L011J061q36
1556C6130l422m582o582p698q425q900q466p890o647n129l413j415Q45K706M499
1571b8389O302P351Q402Q417Q656P782O841N237L606J569n08k216m638n671p157
1586A5584q208q494q454p663o607n764l791j646J54K035M000N433P269P742Q234
1601a76Q299P782O815N555L961J957L16j723l592n578o644p565q020q141p684
1616a4438o802n711m327k195p75J682L298M886O562P365P750Q047P851O809N933
1631B5935M449K533O88j140l232m472o202p144p771q067p458o972n905m619k820
1646c2197j017R22K668M589N703O802P848P791P597P015N662N103L161J123o11
$$ y = [-36978, -37732, -36397, -32894, -27554, -21060, -12981, -4336, 4651, 13050, 21256, 27728, 32894, 35905, 36966, 36130, 32708, 28126, 21544, 13846, 5421, -3479, -11945, -19835, -26482, -31611, -35024, -36439, -35594, -32888, -28389, -22087, -14736, -6334, 2083, 10739, 18521, 25362, 30599, 34205, 35774, 35266, 33050, 28412, 22741, 15584, 7376, -1118, -9572, -17235, -23842, -29606, -33397, -35043, -34889, -32854, -28854, -23421, -16152, -8410, -176, 8123, 15905, 22720, 28275, 32236, 34193, 34509, 32786, 29194, 23616, 16972, 9407, 1387, -6754, -14438, -21240, -26951, -31278, -33473, -34248, -32566, -29268, -24382, -17820, -10455, -2705, 5342, 13193, 20002, 25935, 30384, 32917, 33605, 32465, 29233, 24761, 18559, 11415, 3644, -4423, -11881, -18853, -24758, -29377, -32197, -33214, -32292, -29624, -25035, -19332, -12530, -4682, 3109, 10706, 17721, 23383, 28486, 31647, 32770, 32159]
1661C2159k397m232n489o721p474p632p752o842o242m746l300j333K79K137L568
1676b6017N289O583P246P431P671P061O173M940L508J609oj729l614m979o184
1691A4982p130p347p481p116o204n013l686k007l12J623L229M861N542P003P484
1706a572O877P361O329N197L885K220M89j211k917m449n357o830p176p347p074
1721a1575o369n268l964k585o42R05K677L995N553O514O963O977P028O539N346
1736B2094M169K601J230p60k431l686m996o399o676p206o910o565n376m480k897
1751b8288j207L24K147L458N105N850O818O823O947O320N533M558L001J595j56
1766B8828j801l081m756n830o448o669o953o344n902m521l169j731o4J454K937
$$ y = [32159, 29762, 25530, 20041, 13320, 5846, -1786, -9538, -16380, -22622, -27368, -30668, -32001, -31722, -29585, -26017, -20728, -14145, -6899, 532, 8203, 15264, 21437, 26377, 29885, 31494, 31488, 29759, 26145, 21166, 14982, 7852, 505, -6976, -14092, -20296, -25309, -28995, -31002, -31314, -29691, -26462, -21601, -16059, -9056, -1572, 5305, 12666, 18995, 24192, 28077, 30297, 30786, 29575, 26658, 22209, 16852, 10022, 2846, -4501, -11575, -17944, -23212, -27176, -29761, -30403, -29498, -26821, -22826, -17273, -10759, -3796, 3181, 10209, 16748, 22094, 26263, 28864, 30094, 29334, 26903, 23217, 18221, 11822, 5146, -2060, -8970, -15535, -20911, -25391, -28288, -29495, -29171, -27024, -23566, -18461, -12611, -5793, 1030, 7977, 14297, 19830, 24388, 27389, 28984, 28828, 27027, 23946, 19190, 13360, 6912, 243, -6710, -13054, -18956, -23477, -26646, -28377, -28441, -26987, -24050]
1781b4050M245N652O284O635O885O282N690M796L253K081L21j021k979l890n363
1796A4821n920o673o611o467n688m872l621k139p95J023K540L702M935N994O601
1811c170O381O455N719N048L645K495Q32o44k190l561m819n774o103o446o365
1826h497n747n117l656k669j211L26K035L259M612N615N959O189O174N911N023
1841A8206M308K425J353l2j790k959m437n107n953o224o299n598n335m031k896
1856b4369j419M6J386K795M213M806N780O197O040N737N048M370K941J653K66
1871B5490j206k455l866m861n642o014n916n817n026m294l251j975n32J047K531
1886b1787L582M670N444N815N804N746N033M513L379J947N22p53k168l268m370
$$ y = [-24050, -19805, -14153, -7869, -1234, 5651, 11933, 17623, 22419, 25672, 27753, 28074, 27053, 24074, 20184, 14821, 8901, 2228, -4383, -10850, -16538, -21410, -25031, -27170, -27965, -26942, -24402, -20700, -15765, -9771, -3170, 3211, 9666, 15385, 20433, 24078, 26573, 27405, 26761, 24571, 21010, 16191, 10417, 4314, -2132, -8497, -14244, -19361, -23017, -25686, -26897, -26571, -24536, -21277, -16665, -11050, -5091, 1098, 7272, 13183, 18206, 22514, 24939, 26292, 26260, 24470, 21511, 17074, 11967, 6014, -210, -6509, -12107, -17442, -21473, -24369, -25788, -25742, -24356, -21561, -17348, -12542, -6762, -565, 5475, 11212, 16260, 20630, 23571, 25224, 25490, 24284, 21829, 17963, 13102, 7460, 1446, -4470, -10287, -15313, -19607, -22858, -24833, -25365, -24318, -21787, -18205, -13535, -8091, -2276, 3528, 9274, 14307, 18820, 22199, 24146, 24668, 23915, 21747, 18479, 14109]
1901A4109n222n646n857n732n119m633l275k175o76L55J960L108M333M877N395
1916d198N993N465N255M435L618K448Q45k23j685k851m130m811n406n796n536
1931f577n187m720l484k315j104q5J544K732M015M701N053N723N459N245M506
1946A5506L765K473J439k4j190k716l534m739m848n488n692n184m622l787k713
1961b1354j497j44J084K449L416M303N181N145N574N197M798L832K773J535O33
1976B2925j012k086l386m274m784n414n189n302m685m088k949j833m81O97K000
1991a9861L191L874M876N202N337N247M537M245K898J861P49m22j692l079l801
2006A3162m592n068n495n056m673m202l222k097p90K99J533K761L775M435N154
$$ y = [14109, 8887, 3241, -2616, -8348, -13467, -18100, -21375, -23550, -24226, -23871, -21911, -18803, -14470, -9593, -4198, 1795, 7260, 12515, 16950, 20568, 23016, 23861, 23638, 21953, 19102, 14972, 10161, 4755, -1041, -6577, -11764, -16484, -19968, -22283, -23387, -23472, -21928, -19196, -15181, -10480, -5427, 296, 5755, 11000, 15506, 19271, 21744, 23183, 23159, 21969, 19253, 15719, 10980, 6132, 644, -5048, -10232, -14854, -18641, -21354, -22851, -22995, -21911, -19462, -16046, -11743, -6562, -1417, 4157, 9354, 14152, 17984, 20757, 22292, 22925, 21913, 19827, 16441, 12167, 7383, 1969, -3220, -8522, -13207, -17295, -20244, -22077, -22558, -21861, -19861, -16670, -12796, -7920, -2718, 2619, 7866, 12403, 16648, 19546, 21407, 22156, 21734, 20042, 16963, 13162, 8570, 3502, -1993, -7049, -11722, -15924, -19146, -21243, -22033, -21734, -20201, -17440, -13665, -9230, -4076]
2021d076N260N027M969M130L137K346J040k06j304k611l827m081m923n202n049
2036e370m968m111l381k529j307J61J233K353L386M263M700M878N431M705M454
2051A3898L376K681J442j98q01k138l210m275m550n072n063m927m306l526k589
2066a9258j669m32J027J825L050L933M584M962M908M945M499L724K747J755O45
2081B1245p33j869k731l825m378m810n116m772m553l987k743j961o81M10J462
2096a9042K806L474M344M724N059M825M532L827L044K175P78j72j371k286l501
2111A3216m212m566m731m794m639l896l400k183j250o8J426K195L172M032M504
2126e194M880M742M525M203L196K395J222K41p14k266l162l785m386m595m721
$$ y = [-4076, 1184, 6211, 11180, 15310, 18447, 20793, 21833, 21627, 20323, 17712, 13885, 9804, 4881, -321, -5370, -10338, -14449, -17830, -20359, -21666, -21505, -20272, -17919, -14533, -10270, -5570, -692, 4739, 9444, 13898, 17274, 19955, 21397, 21199, 20398, 18260, 15050, 10775, 6225, 1153, -3910, -8837, -13143, -16669, -19258, -20927, -21359, -20332, -18507, -15457, -11524, -6940, -1978, 2930, 7875, 12374, 16098, 18845, 20600, 21245, 20512, 18643, 15912, 12087, 7709, 2899, -2217, -6989, -11542, -15529, -18272, -20233, -20914, -20504, -19042, -16236, -12762, -8418, -3694, 1365, 6190, 10722, 14549, 17593, 19768, 20546, 20374, 19003, 16717, 13216, 9004, 4438, -293, -5087, -9726, -13622, -17022, -19205, -20455, -20523, -19097, -16902, -13730, -9698, -5194, -314, 4428, 8953, 13156, 16352, 18747, 19969, 20210, 19496, 17230, 14068, 10283, 5897, 1302, -3419]
2141c419m585m241l318k611j563j60P81J859K635L766M321M343M913M412M207
2156A1340L734K479J749M53n75j580k921l414l925m541m794m369m122l790k563
2171a6839j742q68N01J397K338L171M107M379M669M518L987L773K901K033P73
2186A9098l04j176k136l277l840m201m595m317m224l543k881k212j074P4R25K188
2202a5495K897L626M215M413M297M216L569L096K301J108N9j054j640k749l573
2217I286m124m001m292m267l803l030k239j418j05P71J412K817L103M169M060
2232a661M324M032L822L029K360J534K57m33j519k508l214l651m150m146m012
2247e936l893l014k513j465p20M26J280K392L051L537L862M255M020L868L109
$$ y = [-3419, -8004, -12245, -15563, -18174, -19737, -19897, -19116, -17257, -14622, -10856, -6535, -2192, 2721, 7133, 11340, 15074, 17553, 19302, 19755, 19180, 17600, 14679, 11265, 7340, 2799, -1995, -6364, -10486, -14276, -16839, -18581, -19449, -18948, -17551, -15213, -12042, -7935, -3556, 1113, 5631, 9618, 13391, 16292, 18325, 19098, 18794, 17618, 15482, 12205, 8365, 4164, -431, -4748, -8972, -12515, -15396, -17608, -18682, -18608, -17683, -15495, -12598, -8972, -4757, -344, 3953, 8169, 11738, 14834, 17135, 18243, 18302, 17248, 15608, 12859, 9286, 5162, 1161, -3131, -7398, -11201, -14231, -16470, -17888, -17993, -17222, -15810, -12993, -9890, -5721, -1661, 2663, 6695, 10517, 13546, 15906, 17440, 17697, 17264, 15745, 13237, 10023, 6372, 2222, -1924, -5936, -9829, -12843, -15356, -16821, -17541, -17115, -15835, -13443, -10392, -6855, -2993, 1262, 5282, 9150, 12259]
2262A2259K441J799O57k12j160k280k668l495l989l999m206l604k958k722j978
2277a6115o67O9J133J766K829L674L424L930L981L558L455K646J932Q78j6p79
2293A5698j853k647l166l958l847l671l892l243k800j656j094k01R17J536K457
2308a1420L112L744L868L709L698L255K703K225J112J22o35j385k563l170l453
2323D922l702l648l592l468k858j784j463m03N56J428K327K863L454L617L708
2338A957L604L502K826K260J162L42m17j207k182k802l069l870l837l469l516
2353h716k731k174j408o22K94J278J957K725L287L396L861L484L437L007K255
2368A3330J644N50n06r55j908k427l050l586l596l659l502k879k380j694o09j29
$$ y = [12259, 14700, 16499, 17156, 16944, 15784, 13504, 10836, 7341, 3352, -647, -4853, -8457, -11415, -14137, -16115, -16782, -16713, -15580, -13814, -10985, -7311, -3887, 43, 4024, 7582, 11037, 13683, 15615, 16493, 16477, 15698, 13845, 11198, 8032, 4074, 227, -3444, -7336, -10579, -13379, -15035, -16129, -16330, -15413, -13877, -11420, -8308, -4564, -696, 3013, 6711, 9966, 12669, 14894, 16006, 16128, 15493, 14108, 11545, 8375, 4922, 1220, -2428, -6020, -9488, -12346, -14130, -15593, -15996, -15440, -14012, -11685, -8822, -5368, -1751, 1957, 5561, 9063, 11889, 14149, 15311, 15653, 15236, 14029, 11847, 9045, 5976, 2106, -1731, -5200, -8716, -11447, -13621, -15029, -15651, -15357, -14079, -12122, -9397, -6110, -2714, 1147, 4631, 8068, 11075, 13330, 14974, 15524, 15018, 14063, 12155, 9728, 6678, 3092, -504, -4163, -7665, -10544, -12924, -14618, -15227, -15356]
2384a5356J089J614K674L103L388L614L579L459L068K425J642P88K0j069j339
2399A2699k530k921l297l564l720l240l064k483k017q36j61O77J516K266K996
2414g679L235L659L542L489K882K675J870J094L07o80j379k136k849l182l414
2429A434l629l381l351k568j744j306l77L46J434K059K627L169L455L617L343
2444E128L353K550K121J405L38k94j211j811k730k951l474l576l408l339k528
2459a0427k299j411m37O3Q14J975K451K943L420L384L548L133K829K400J390Q11
2475A4587n4p44j612k528l011l175l272l498l512k702k285j801r22%Q54J557K158
2492i960K760L178L427L580L135K930K474J518J179L10p69j229k130k850l026
$$ y = [-15356, -14267, -12653, -9979, -6876, -3488, 126, 3705, 7164, 10232, 12657, 14299, 15087, 15107, 14038, 12699, 10169, 7248, 3951, 387, -3333, -6573, -9637, -12120, -14137, -14973, -15134, -14457, -12941, -10675, -7679, -4444, -785, 2757, 6246, 9128, 11803, 13673, 14767, 15074, 14394, 13015, 10879, 8030, 4848, 1434, -2195, -5576, -8927, -11495, -13239, -14545, -14922, -14576, -13142, -11083, -8456, -5287, -1832, 1785, 5128, 8481, 11031, 13152, 14557, 14895, 14601, 13390, 11579, 8849, 5898, 2424, -1152, -4560, -7899, -10427, -12726, -14137, -14574, -14511, -13697, -11722, -9271, -6328, -2908, 476, 4024, 7157, 9986, 12386, 13776, 14587, 14533, 13789, 12177, 9649, 6638, 3463, 191, -3307, -6819, -9521, -11806, -13607, -14529, -14529, -13675, -12118, -9960, -7200, -4022, -595, 2985, 6120, 9050, 11524, 13042, 14221, 14531, 13762, 12533, 10403, 7553, 4527]
2507D527l308l440l185k909k693j861j173k03M26J421J806K648L051L177L538
2522A822L033L072K481K004J075N57l25j241j672k627k841l163l344l154l031
2537g354k650j903j408p58N63Q80J775K305K711L055L487L184L012K692J998J315
2553A2904N91k1o49j788k055k703l160l220l204k932k568k122j461j005R8N90
2569a2705J588J885K588K943L254L372K688K792K206J558Q15O0n11j292j827k613
2585F801k725l186l198k968k503k312j588j107n8L52J107J697K516K805K934L162
2601A729K935K668K281J731R59M74n11j109j555k255k790k738l213k766k719k107
2617h986j925j102l68J94R66J483K300K386L088K962K826K682K354J910Q94M58
$$ y = [4527, 1219, -2221, -5406, -8315, -11008, -12869, -14042, -14245, -13819, -12398, -10592, -7944, -4893, -1716, 1822, 4855, 7927, 10408, 12412, 13487, 14044, 13719, 12478, 10806, 8179, 5338, 2175, -1169, -4323, -7354, -10004, -11907, -13315, -14073, -13510, -12630, -10855, -8550, -5839, -2784, 703, 3887, 6899, 9591, 11589, 12904, 13495, 13474, 12825, 11037, 8982, 6279, 3119, -101, -3305, -6237, -8805, -10927, -12388, -13393, -13295, -12705, -11117, -9232, -6644, -3701, -447, 2925, 5613, 8405, 10611, 12169, 12984, 13044, 12533, 11241, 9414, 6801, 4076, 890, -2308, -5276, -7779, -10091, -11679, -12786, -12844, -12492, -11385, -9688, -7172, -4367, -1433, 1729, 4664, 7332, 9613, 11344, 12303, 12777, 12266, 11157, 9602, 7347, 4557, 1819, -1394, -4160, -6879, -8986, -10911, -12013, -12381, -12187, -11221, -9738, -7438, -5052, -1964, 998, 3824, 6506, 8860, 10770, 11664, 12122]
2633A2122o5r04j486k102k268k953k820k928k622k345j751j290p38K05P82J397
2649i766K034K571K529K826K851K637K376J850J281Q09k75p27j208k125k264k546
2665B853k720k768k496k599j570j505r04J41M93J265J913K275K681K417K822K856
2681E154K098J813J480O57J08m30j366j505k083k457k852k786k458k363k034j274
2697a0298q01j73M83J104J513K073K507K513K946K510K452J930J324R10J35j44
2713A0984j179j512k198k484k462k601k683k494j697j617r98m40M64J150J332
2728h435K084K415K534K647K651K558J693J510R97M92k75q59j670j808k170k729
2744A635k604k630k369j981j585r78m25J72R21J447J514K449K537K282K892K342
$$ y = [12122, 12057, 11153, 9667, 7565, 5297, 2344, -476, -3404, -6026, -8371, -10122, -11412, -12150, -11945, -11163, -9766, -7732, -5161, -2632, 194, 3045, 5682, 8058, 9908, 11189, 11998, 11723, 10996, 9788, 7663, 5399, 2853, 133, -2635, -5131, -7730, -9300, -10805, -11709, -11568, -11075, -9810, -7897, -5622, -2941, -524, 2298, 5154, 7252, 9065, 10545, 11202, 11310, 10880, 9514, 8009, 5926, 3469, 617, -2169, -4627, -6990, -9024, -10298, -11099, -11272, -10789, -9685, -8172, -6099, -3592, -1079, 1867, 4377, 6829, 8759, 10083, 10993, 11128, 10984, 9805, 8293, 6095, 3611, 1149, -1452, -4135, -6629, -8326, -9943, -10941, -11381, -10917, -9767, -8435, -6351, -3936, -1402, 1245, 3896, 6454, 8147, 9657, 10654, 11146, 10871, 10012, 8342, 6534, 4364, 1635, -969, -3599, -5968, -7949, -9534, -10512, -10937, -10765, -9844, -8397, -6883, -4434, -1897, 385, 3277, 5619]
2760E619K047J650J198M34p9q34j459j649k169k585k527k630k290k115j705j198
2776a0292m32r7O80J270J647K285K433K465K629K469K133J641J297Q91k39n30
2792A0250j341j573k092k419k379k671k618k008j743j355q00J24J82J085J771
2807g587K071K304K644K424K576K060J959J282R88Q7l36j001j708j899k382k559
2823I23k654k435k037k014j291q24n84O36P20J466K009K128K635K621K527K141
2839E967J937J396Q37N05j78q80j276j957k212k375k454k636k293j936j667j006
2855a0228n87K87Q44J207J800K312K211K714K347K211K213J504J140L89J85p46
2871I803j062j979j881k365k500k276k471j983j707j299o60r0O15J172J391K093
$$ y = [5619, 7666, 9316, 10514, 10948, 10869, 10035, 8576, 6927, 4758, 2173, -354, -2984, -5274, -7389, -9094, -10292, -10724, -10821, -10141, -8871, -7224, -4939, -2506, -41, 2588, 5057, 7190, 8831, 10128, 11019, 10780, 10250, 8909, 7336, 5244, 2825, 446, -2225, -4843, -6851, -8594, -9949, -10749, -10625, -10443, -9358, -7587, -5516, -3212, -568, 1856, 4432, 6492, 8451, 9733, 10721, 10808, 10472, 9471, 7763, 5864, 3482, 923, -1731, -4166, -6203, -8217, -9508, -10332, -10916, -10280, -9560, -8094, -6085, -3957, -1322, 1299, 3826, 5967, 7904, 9300, 10137, 10642, 10464, 9584, 8308, 6351, 4139, 1764, -690, -3326, -5619, -7555, -9222, -10228, -10815, -10528, -9684, -8477, -6677, -4365, -2154, 560, 2907, 5118, 7331, 8835, 9975, 10364, 10549, 9803, 8741, 6762, 4881, 2516, 16, -2260, -4731, -6714, -8421, -9720, -10380, -10470, -9855, -8683, -7292, -5199]
2887e199K189K516K424K477K059J743J070J096J19p09r67j414j916k228k386k604
2903a730k081k204j839j309p66k59K28R63J434J820K067K433K641K154K149J816
2919G517J377R81L08k93q41j166j978k060k210k417k389k149j808j545r63l87
2935a0023L54O00J247J548J920K359K484K214K090K089J250J147N44J33p52j243
2951G961j645j855k188k467k094k238k048j356r37q67P2M21J217J452J996J911
2967b665K503K026K333J702J638J285N42Ll52q79j215k053k145k086k181k133
2983c677k073j505j322n38j51L93O59J341K012J853K225K184J959J880J673J280
2999H193P06J99j31r13j202j610k108j994k225k133k136j502j221p51j33K18O59
$$ y = [-5199, -3010, -494, 1930, 4407, 6466, 8209, 9279, 10375, 10494, 9785, 8818, 7404, 5488, 3260, 874, -1730, -3811, -6015, -7854, -9163, -9929, -10188, -9960, -8997, -7563, -5743, -3676, -1243, 1398, 3552, 5701, 7517, 8894, 9875, 10183, 9890, 9049, 7883, 5905, 3845, 1635, -782, -3171, -5320, -7128, -8673, -9636, -10023, -9669, -9069, -7822, -6274, -4354, -1995, 489, 2703, 4793, 6882, 8132, 9279, 9823, 9956, 9204, 7961, 6316, 4461, 2273, -194, -2288, -4526, -6574, -7930, -8867, -9734, -9662, -9241, -8024, -6572, -4576, -2665, -162, 1864, 4197, 5899, 7537, 8822, 9364, 9367, 9015, 8136, 6921, 4868, 2723, 637, -1544, -3677, -5750, -7255, -8577, -9115, -9266, -8873, -8214, -6873, -4861, -3008, -783, 1401, 3360, 5240, 6913, 8193, 8899, 9098, 8967, 8054, 6852, 5242, 3134, 1140, -1085, -3218, -5354, -6856, -8077, -8828, -8961, -8743, -8084]
3016h084J116J726J825J947K245J828K246J603J093R33L05J1p40j129j488j633
3032C804k074k139k112j836j663j447q74n19J23P21Q80J526J770J813K199K139
3048B311J874J649J232J147L34o9m01j017j372j670j935k185j875j875j786j336
3064f974r16o44qN73R59J283J644J722K141J945J848J710J609R78N69R5m26q97
3082G211j501j475j680k229j726j953j818j555q82o37l6K43P74J388J254J961
3098b661J961J964K103J569J457J273K94M05l63p02j206j549j729j986j989j860
3114c019j663j630r01q08j30K79O99R51J532J907J541K095J908J714J527J135
3130G137O18M02j19p19q43j609j579j878j829k187j481j688j074j128j60J80M19
$$ y = [-8084, -6968, -5242, -3417, -1470, 775, 2603, 4849, 6452, 7545, 8478, 8783, 8794, 8054, 6925, 5437, 3804, 1730, -409, -2521, -4357, -6020, -7467, -8341, -8860, -8737, -8016, -7136, -5610, -3840, -2027, 172, 2311, 4185, 5834, 7066, 8213, 8547, 8478, 8077, 7060, 5688, 4018, 2083, -102, -1977, -3852, -5638, -6974, -7890, -8534, -8542, -7969, -7010, -5727, -4083, -2361, -220, 1725, 3573, 5283, 6892, 7870, 8439, 8534, 8108, 7211, 5710, 4235, 2555, 326, -1400, -3353, -5171, -6726, -7608, -8245, -8281, -8038, -7264, -5876, -4622, -2661, -700, 1264, 3367, 4936, 6393, 7666, 7960, 8365, 8002, 7300, 6094, 4545, 2816, 830, -1159, -3019, -4682, -6312, -7213, -8021, -8151, -7872, -7173, -6222, -4690, -2783, -1242, 853, 2761, 4475, 6002, 7137, 7755, 8157, 8038, 7319, 6476, 4867, 3288, 1410, -419, -2606, -4087, -5775, -6849, -7977, -8137, -7957, -7538]
3147g538J240J171J660J837J834J929J858J525J136R59N39j50o02p23j400j497
3163C778k022j615k179j741j433j558q20l69n1M16Q43J324J642J781J869J803
3179A668J996J599J180P82P87J7k67r84j085j612j644j902j999j711j812j311
3195f298q53q46j35L02R24R48J613J822J926J642K016J677J237J106O91J03l5
3212G840r83j043j309j573j947j718j878j815j428j047p59k45J71P27P98J431
3228d778J710J763J817J894J450J571J238P87L97j29p02p63j171j634j903j756
3244b09j925j765j265j372q14l68o9M58R88J198J390J893J686J924J666J527J404
3261F347Q11M42Q5k73p96j562j045j684j946j835j678j583j404j033l72o1J54
$$ y = [-7538, -6298, -5127, -3467, -1630, 204, 2133, 3991, 5516, 6652, 7611, 8150, 8000, 7398, 6675, 5275, 3778, 1756, 141, -2038, -3779, -5212, -6770, -7590, -7959, -8010, -7594, -6751, -5427, -3785, -2004, -135, 1668, 3664, 5263, 6443, 7225, 8012, 8029, 7762, 6778, 5693, 4081, 2437, 535, -1464, -3175, -4987, -6298, -7151, -7997, -8132, -7830, -6906, -5958, -4345, -2523, -597, 1045, 3061, 4738, 5975, 7081, 7772, 7875, 7840, 6857, 5814, 4505, 2932, 985, -733, -2611, -4426, -5854, -6901, -7660, -7905, -7734, -7007, -6209, -4778, -3068, -1305, 512, 2406, 3856, 5427, 6665, 7452, 7849, 7720, 7018, 6255, 5084, 3450, 1547, -209, -2134, -3899, -5164, -6536, -7350, -7718, -7787, -7329, -6341, -5143, -3753, -1860, -174, 1750, 3416, 4943, 6347, 7158, 7600, 7685, 7412, 6616, 5054, 4009, 2325, 379, -1456, -3134, -4717, -6121, -7154, -7526, -7587, -7433]
3278g433O91J015J543J656J807J845J606J850J354Q25M73L36l41m87j111j341
3294D288j508j804j797j784j670j321q85q48j16M9O18Q64J349J649J614J836J637
3311B171J827J363J021Q88K89m76j96r81j071j443j894j742j651j576j320j113
3327e904r36m00J25K96P76J206J509J429J655J810J554J533J226P90M25K8m95
3344F627n49j090j265j636j622j774j622j508j360o19n43j52K99O75Q84J301J689
3361b265J709J657J529J493J224Q78N56K20k57m74j107j220j442j622j529j778
3377b428j475j199q54q21j80K21M76Q49J053J626J506J755J706J312J389R36M93
3394F365L74l8m72p46j251j375j526j743j400j594j417q45o22m71K85L82O44J219
$$ y = [-7433, -6742, -5727, -4184, -2528, -721, 1124, 2730, 4580, 5934, 6759, 7232, 7568, 7227, 6740, 5629, 4288, 2780, 976, -821, -2605, -4275, -5596, -6481, -7329, -7445, -7396, -6778, -5914, -4565, -2916, -1302, 534, 2171, 3998, 5361, 6382, 7270, 7559, 7083, 6887, 5906, 4835, 3392, 1498, -244, -1895, -3471, -4791, -5904, -6840, -7240, -7115, -6819, -6043, -4837, -3328, -1899, -244, 1566, 3120, 4653, 5879, 6669, 7094, 7122, 6627, 6078, 4988, 3723, 2087, 465, -1309, -2931, -4439, -5799, -6418, -6961, -7113, -6814, -6139, -5255, -3954, -2265, -556, 1101, 2630, 4123, 5347, 6225, 6781, 7001, 6744, 6270, 5163, 3943, 2501, 879, -650, -2428, -3903, -5102, -5956, -6777, -6957, -6736, -6260, -5411, -4358, -2732, -1226, 529, 2235, 3547, 4936, 5872, 6365, 6739, 6701, 6229, 5483, 4232, 2857, 1331, -412, -1812, -3406, -4823, -5668, -6290, -6761, -6476, -6094, -5450, -4231]
3412d231J308J536J549J598J410J280R54R29K61J4o38l92j106j252j500j389j769
3429a438j521j150j270m68q62K27M16M67J108J200J432J447J510J670J251J040
3445E059O96O38k8k09o20r49j217j273j541j632j301j462j006q48m80k75L58N03
3463e587R53R65J400J658J395J509J238J170R79M01L1L5o10q71j016j566j412
3480F72j275j337j353j319q44o01k21L12J35J005J041J162J513J565J412J235
3496C102J124J032O13L13l7n88p28j017j143j426j533j286j410j373q42n95l97
3513f191L4N22O23J105J023J506J222J620J299J263R78N29N00j27j15p26j052
3530D013j009j313j375j601j211j331r44o92m66N5N0N47J155J109J248J292J509
$$ y = [-4231, -2923, -1387, 162, 1760, 3170, 4450, 5404, 6333, 6594, 6608, 5970, 5578, 4472, 3220, 1720, 331, -1438, -2959, -4109, -5379, -5847, -6709, -6482, -6066, -5599, -4491, -3291, -1859, -412, 1098, 2768, 4019, 5059, 5755, 6393, 6365, 6156, 5536, 4587, 3370, 2097, 556, -1076, -2377, -3839, -4845, -5693, -6173, -6448, -6090, -5587, -4634, -3669, -2269, -611, 784, 2293, 3531, 4701, 5680, 6081, 6112, 6147, 5537, 4666, 3650, 2084, 672, -603, -1940, -3293, -4612, -5456, -6057, -6278, -5966, -5831, -4826, -3785, -2623, -1110, 455, 1867, 3102, 4226, 5258, 5871, 6184, 6147, 5559, 4831, 3814, 2671, 1245, -288, -1574, -2984, -4357, -5199, -5794, -6191, -6157, -5635, -5012, -3907, -2884, -1378, -156, 1464, 2763, 4026, 5004, 5533, 6033, 5906, 5791, 5065, 4013, 3004, 1691, 316, -1285, -2496, -3827, -4771, -5463, -5929, -5874, -5824, -5277, -4122, -3013, -1765, -473, 1036]
3547A036J461J121J087Q43L40L1k01o14p40j204j378j384j162j501j064j306n95
3564e230n61j14R2P43P21J011J128J431J494J371J256R51R17M45J86j42k67q42
3582D590j086j223j469j220j301j329j236r03n00j53qM28P96R06J215J234J385
3599A26J399J271J183R91O30M01k40l26p28p55j158j535j107j507j335j147p63
3616d600n53o97p7L70O27Q18J235J104J520J385J175J262R67P74L73J48m24l59
3634E048q18j207j314j169j366j447j068j071o27o20j64J98N65R27R06J147J324
3651g56J389J348J169R71Q77M27K40k18m38m99j141j035j472j225j595j166r52
3668d076p91n84k18K43K35P40Q73J046J277J436J243J239J072Q54P10K22P2l89
$$ y = [1036, 2497, 3618, 4705, 5548, 5888, 5919, 5718, 5104, 4364, 3160, 1782, 398, -764, -2265, -3329, -4635, -5230, -5791, -5905, -5813, -5070, -4349, -3338, -2210, -779, 715, 2086, 3342, 4293, 5210, 5655, 5841, 5699, 5432, 4590, 3504, 2281, 812, -408, -1709, -3038, -4274, -5177, -5677, -5830, -5838, -5410, -4614, -3708, -2493, -1259, 126, 1525, 2796, 3979, 4970, 5600, 6001, 5761, 5435, 4707, 3952, 2794, 1259, 152, -1355, -2690, -3837, -4600, -5153, -5850, -5927, -5557, -4930, -4112, -2877, -1773, -253, 1132, 2307, 3569, 4536, 5310, 5683, 5831, 5407, 5048, 4230, 3023, 1709, 540, -826, -2273, -3341, -4412, -5039, -5659, -5823, -5625, -5060, -4133, -3227, -2080, -756, 633, 1981, 3150, 4121, 4998, 5425, 5665, 5447, 5009, 4510, 3369, 2334, 862, -363, -1958, -3124, -4076, -4867, -5451, -5669, -5426, -5191, -4451, -3578, -2532, -1255, 181, 1424, 2663, 3735, 4589, 5299, 5521, 5593, 5204]
3686E204o86q58j088j199j202j329j199j342p13o07k85n6J55N36R78Q63J226J350
3704b52J281J139J135R06O49L58K24j41n91p28j071j106j205j326j306j063r37
3721d034n57o93j3L41O6P82J249Q60J217J356J274R61J146P08M38J16l4l61p59
3740D063o44j320j208j243j134j262q13q81l77m13Q9L72M53R19J173J056J123
3757d7J335J268Q74P02O24L64n9l00m55r31q57j156j218j216r77j139r12m69m09
3776d978l9J98M39R14Q43J082J130J239J232R12P08P83K60J98k75l10o16j112
3794B608j011j007j133j337r14q86p02l44j69N5M20O36J072R68J065J136R96J179
3812B632Q63N05P10J16K6l85q06p59r27r41j250j012j119q45o48o33l32J90J85
$$ y = [5204, 4518, 3660, 2572, 1373, 171, -1158, -2357, -3699, -4412, -5019, -5304, -5360, -5205, -4669, -3691, -2828, -1602, -252, 1029, 2168, 3303, 4209, 4858, 5216, 5440, 5299, 4708, 3980, 2909, 1803, 598, -728, -2034, -3097, -4034, -4591, -5284, -5297, -4956, -4890, -4108, -2859, -1999, -782, 574, 1848, 2809, 3955, 4663, 5101, 5217, 5183, 4822, 4063, 3419, 2099, 891, -352, -1486, -2748, -3561, -4442, -4819, -5232, -5143, -4771, -4318, -3399, -2226, -1170, -47, 1288, 2556, 3430, 4132, 4756, 5120, 5061, 4761, 4306, 3375, 2518, 1362, 144, -1072, -2049, -3188, -4100, -4569, -4978, -5017, -4819, -4380, -3466, -2623, -1541, -411, 828, 2060, 2972, 3680, 4463, 4723, 4921, 4646, 4336, 3720, 2608, 1597, 590, -543, -1880, -2794, -3680, -4382, -4726, -4895, -4840, -4420, -3784, -2712, -1744, -679, 457, 1453, 2632, 3495, 4000, 4710, 4826, 4852, 4467, 3661, 2902, 1975, 1034, -216, -1228, -2347, -3192, -3840, -4473, -4805, -4615, -4430]
3831d430O18Q56Q46J048J324Q20J024R95O96N42K83p2k87n31n96q74j019j070
3849A73j377r89p74o61o41k12oJ64M46P55P82J177Q93J111J013Q62P90N49K76
3868D331J19k39m06n07r50r93q85j101r98r87o24q01j78j79R3N44L90Q96R50R54
3888e71R45J127J005P83N05L68K31o2m52o61n69r59j171o80j316p12r95o23l81
3907d188q2Q1M31K81P40J091P63J102J047R20P47M91O44J54k4j84m96o70q97r87
3927I64j026r93r56p02p58l40m17j01N37L88P02P68P35J038J121Q83O65P92M79
3946C779L24q2r2m84m66j008p38r60q42j059q77p74m48j62k73K05L32N98O80J145
3966a202P84J074R87P63Q96L90K86J6j24l09n48p00o80j049j124p23j057p09n35
$$ y = [-4430, -3812, -2956, -2110, -1062, 262, 1082, 2106, 3101, 3797, 4339, 4622, 4550, 4263, 3732, 3136, 2262, 1243, 173, -1204, -2193, -2967, -3628, -4269, -4481, -4487, -4323, -3877, -3122, -2340, -1163, -270, 841, 1854, 2716, 3506, 4055, 4331, 4450, 4211, 3805, 3298, 2348, 1355, 470, -631, -1629, -2616, -3240, -4041, -4219, -4398, -4305, -3761, -3371, -2475, -1525, -571, 374, 1501, 2506, 3289, 3794, 4162, 4393, 4331, 3879, 3218, 2649, 1690, 519, -161, -1477, -2189, -3184, -3807, -4188, -4270, -4189, -3758, -3477, -2737, -1646, -883, 219, 1266, 2186, 2933, 3424, 4068, 4222, 4198, 4014, 3518, 2848, 1951, 964, -62, -1055, -2011, -2713, -3471, -3811, -4228, -4329, -3792, -3404, -2702, -1934, -1199, -161, 960, 1843, 2508, 3300, 3779, 4103, 4021, 3929, 3445, 2979, 1971, 1233, 273, -569, -1628, -2505, -3279, -3727, -3889, -4162, -3957, -3625, -3027, -2347, -1202, -418, 656, 1643, 2406, 3302, 3692, 3978, 3994, 3870, 3561, 3013, 2313, 1633, 584, -540, -1263, -2320, -3029, -3564]
3985c564l56m6n0N23L96P50O82J093Q08J012R07O54P48J23M28j87k68l58o84q21
4005A790j064r38r00q10q23n76n92r7p8L59L67P17J001O72J117Q18Q09Q41O33
4024C246K36N44j74j37n31n26o96q69r58r34r00p30n81o15k78MO1K90O74P80Q56
4045a238R04P84J041P86O50O13K15K72l83j93o18o87n58j046q96r33j052n17m84
4064c340o19L5L2M33M60O16P08J045P03J268O85N56P40L93O2j25j20o74m13r75
4084A470n60j113q96o83r30n17k81k75k13L38N27M90O82R93R11Q56R19P49O59
$$ y = [-3564, -3920, -3966, -4016, -3493, -3097, -2347, -1665, -572, 236, 1248, 2155, 2809, 3557, 3680, 4108, 3921, 3653, 3295, 2611, 1790, 726, -212, -1112, -1922, -2745, -3321, -3913, -4010, -4088, -3729, -3362, -2645, -1644, -972, 145, 963, 1772, 2613, 3246, 3482, 4026, 3852, 3715, 3184, 2658, 1962, 1093, 135, -799, -1699, -2429, -3010, -3625, -3903, -3899, -3838, -3548, -2874, -2094, -1238, -334, 450, 1491, 2277, 2927, 3540, 3755, 4027, 3644, 3451, 2833, 2146, 1588, 542, -354, -1287, -2339, -2856, -3340, -3959, -3924, -3892, -3459, -2999, -2383, -1675, -630, 73, 1341, 2026, 2582, 3322, 3715, 3777, 3652, 3532, 2858, 2445, 1470, 910, -203, -1099, -1782, -2712, -3229, -3510, -3785, -3998, -3660, -3133, -2643, -1961, -968, -57, 799, 1718, 2467, 3126]
$$ [...]
8191C9
##END NTUPLES=NMR FID
##END=
