##TITLE=1H_Pr BDME
 D2O
 8sc, 
 16.2.2024
##JCAMPDX= 6.0         $$ Bruker NMR JCAMP-DX V2.0
##DATA TYPE= NMR FID
##DATA CLASS= NTUPLES
##ORIGIN= UXNMR, Bruker Analytische Messtechnik GmbH
##OWNER= root
$$ XWIN-NMR		Version 3.5
$$ Fri Feb 16 16:08:43 2024 Russian Standard Time (UT+4h)  she@DPX200
##.OBSERVE FREQUENCY= 200.1313
##.OBSERVE NUCLEUS= ^1H
##.DELAY= (6, 6)
##.ACQUISITION MODE= SIMULTANEOUS
##.ACQUISITION SCHEME= undefined
##.AVERAGES= 8
##.DIGITISER RES= 18
##SPECTROMETER/DATA SYSTEM= spect
##.PULSE SEQUENCE= zg30
##.SOLVENT NAME= D2O
##.SHIFT REFERENCE= (INTERNAL, D2O, 0, 15.7039)
##AUDIT TRAIL= $$ (NUMBER, WHEN, WHO, WHERE, WHAT)
$$ ##TITLE= Audit trail, XWIN-NMR		Version 3.5
$$ ##JCAMPDX= 5.01
$$ ##ORIGIN= Bruker BioSpin GmbH
$$ ##OWNER= she
$$ F:/spectra/data/she/nmr/H-F/1/audita.txt
$$ ##AUDIT TRAIL=  $$ (NUMBER, WHEN, WHO, WHERE, WHAT)
(   1,<2024-02-16 16:07:29.48 +0400>,<she>,<DPX200>,
      <created by zg, POWCHK disabled, PULCHK disabled
       configuration hash MD5:
       00 E9 B6 7A A2 85 ED C7 34 08 36 98 17 FE 4E 26
       data hash MD5: 16K
       04 3B 1C 24 31 04 22 20 D4 C8 9C 19 31 42 E2 71>)
$$ ##END=
$$ 
$$ hash MD5
$$ 8E F2 47 8F FE 91 3F AD A2 A9 44 61 1E 08 B3 78
##$RELAX= 
##$RELAX= 
##$RELAX= 
##$RELAX= 
##$RELAX= 
##$RELAX= 
$$ Bruker specific parameters
$$ --------------------------
##$DU= <F:/spectra>
##$EXPNO= 1
##$NAME= <H-F>
##$PROCNO= 1
##$TYPE= <nmr>
##$USER= <she>
##$AMP= (0..31)
100 100 100 100 100 100 100 100 100 100 100 100 100 100 100 100 100 100 
100 100 100 100 100 100 100 100 100 100 100 100 100 100 
##$AQSEQ= 0
##$AQ_mod= 1
##$AUNM= <au_zg>
##$AUTOPOS= <>
##$BF1= 200.13
##$BF2= 200.13
##$BF3= 200.13
##$BF4= 200.13
##$BF5= 200.13
##$BF6= 200.13
##$BF7= 200.13
##$BF8= 200.13
##$BYTORDA= 1
##$CFDGTYP= 0
##$CFRGTYP= 5
##$CHEMSTR= <none>
##$CNST= (0..31)
1 1 145 1 1 1 1 1 1 1 1 1 1 1 1 1 1 1 1 1 1 1 1 1 1 1 1 1 1 1 1 1 
##$CPDPRG= <>
##$CPDPRG1= <>
##$CPDPRG2= <>
##$CPDPRG3= <>
##$CPDPRG4= <mlev>
##$CPDPRG5= <mlev>
##$CPDPRG6= <mlev>
##$CPDPRG7= <mlev>
##$CPDPRG8= <mlev>
##$CPDPRGB= <>
##$CPDPRGT= <>
##$D= (0..31)
0 1.2 0 0 0 0 0 0 0 0.06 0 0.03 0 0 0 0 0.0002 0 0 0 0 0 0 0 0 0 0 0 0 
0 0 0 
##$DATE= 1708085248
##$DBL= (0..7)
120 120 120 120 120 120 120 120 
##$DBP= (0..7)
150 150 150 150 150 150 150 150 
##$DBP07= 0
##$DBPNAM0= <>
##$DBPNAM1= <>
##$DBPNAM2= <>
##$DBPNAM3= <>
##$DBPNAM4= <>
##$DBPNAM5= <>
##$DBPNAM6= <>
##$DBPNAM7= <>
##$DBPOAL= (0..7)
0.5 0.5 0.5 0.5 0.5 0.5 0.5 0.5 
##$DBPOFFS= (0..7)
0 0 0 0 0 0 0 0 
##$DE= 6
##$DECBNUC= <off>
##$DECIM= 32
##$DECNUC= <off>
##$DECSTAT= 4
##$DIGMOD= 1
##$DIGTYP= 9
##$DL= (0..7)
0 120 120 120 120 120 120 120 
##$DP= (0..7)
150 150 150 150 150 150 150 150 
##$DP07= 0
##$DPNAME0= <>
##$DPNAME1= <>
##$DPNAME2= <>
##$DPNAME3= <>
##$DPNAME4= <>
##$DPNAME5= <>
##$DPNAME6= <>
##$DPNAME7= <>
##$DPOAL= (0..7)
0.5 0.5 0.5 0.5 0.5 0.5 0.5 0.5 
##$DPOFFS= (0..7)
0 0 0 0 0 0 0 0 
##$DQDMODE= 0
##$DR= 18
##$DS= 0
##$DSLIST= <SSSSSSSSSSSSSSS>
##$DSPFIRM= 0
$$ [...]
##$SUBNAM2= <"">
##$SUBNAM3= <"">
##$SUBNAM4= <"">
##$SUBNAM5= <"">
##$SUBNAM6= <"">
##$SUBNAM7= <"">
##$SUBNAM8= <"">
##$SUBNAM9= <"">
##$SW= 18.0517328524113
##$SWIBOX= (0..15)
0 0 2 0 0 0 0 0 0 0 0 0 0 0 0 0 
##$SW_h= 3612.71676300578
##$TD= 16384
##$TD0= 1
##$TE= 0
##$TE2= 300
##$TE3= 300
##$TEG= 300
##$TL= (0..7)
0 120 120 120 120 120 120 120 
##$TP= (0..7)
150 150 150 150 150 150 150 150 
##$TP07= 0
##$TPNAME0= <>
##$TPNAME1= <>
##$TPNAME2= <>
##$TPNAME3= <>
##$TPNAME4= <>
##$TPNAME5= <>
##$TPNAME6= <>
##$TPNAME7= <>
##$TPOAL= (0..7)
0.5 0.5 0.5 0.5 0.5 0.5 0.5 0.5 
##$TPOFFS= (0..7)
0 0 0 0 0 0 0 0 
##$TUNHIN= 0
##$TUNHOUT= 0
##$TUNXOUT= 0
##$USERA1= <user>
##$USERA2= <user>
##$USERA3= <user>
##$USERA4= <user>
##$USERA5= <user>
##$V9= 5
##$VALIST= <valist>
##$VCLIST= <CCCCCCCCCCCCCCC>
##$VD= 0
##$VDLIST= <DDDDDDDDDDDDDDD>
##$VPLIST= <PPPPPPPPPPPPPPP>
##$VTLIST= <TTTTTTTTTTTTTTT>
##$WBST= 1024
##$WBSW= 4
##$XGAIN= (0..3)
0 0 0 0 
##$XL= 0
##$YL= 0
##$YMAX_a= 353398
##$YMIN_a= -217761
##$ZGOPTNS= <>
##$ZL1= 120
##$ZL2= 120
##$ZL3= 120
##$ZL4= 120
##$ABSF1= 10
##$ABSF2= 0
##$ABSG= 5
##$ABSL= 3
##$ALPHA= 0
##$AQORDER= 0
##$ASSFAC= 0
##$ASSFACI= 0
##$ASSFACX= 0
##$ASSWID= 0
##$AUNMP= <proc_1d>
##$AZFE= 0.1
##$AZFW= 0.1
##$BCFW= 1
##$BC_mod= 2
##$BYTORDP= 1
##$COROFFS= 0
##$CY= 11.3945322036743
##$DATMOD= 1
##$DC= 2
##$DFILT= <>
##$DTYPP= 0
##$F1P= 15.7292609196834
##$F2P= 12.9074282941183
##$FCOR= 0.5
##$FTSIZE= 0
##$FT_mod= 4
##$GAMMA= 1
##$GB= 0.15
##$INTBC= 1
##$INTSCL= 1
##$ISEN= 128
##$LB= 0.24
##$LEV0= 0
##$LPBIN= 0
##$MAXI= 10000
##$MC2= 0
##$MEAN= 0
##$ME_mod= 0
##$MI= 1.114404
##$NCOEF= 0
##$NC_proc= 0
##$NLEV= 6
##$NOISF1= 3.799351
##$NOISF2= 2.8
##$NSP= 1
##$NTH_PI= 0
##$NZP= 0
##$OFFSET= 15.70392
##$PC= 1
##$PHC0= -25121.55
##$PHC1= 9.85264
##$PH_mod= 1
##$PKNL= yes
##$PPARMOD= 0
##$PSCAL= 0
##$PSIGN= 0
##$REVERSE= no
##$SF= 200.130013532006
##$SI= 16384
##$SIGF1= 3
##$SIGF2= 2
##$SINO= 400
##$SIOLD= 16384
##$SREGLST= <1H.CDCl3>
##$SSB= 0
##$STSI= 0
##$STSR= 0
##$SW_p= 3612.71676300578
##$SYMM= 0
##$S_DEV= 0
##$TDeff= 0
##$TDoff= 0
##$TI= <>
##$TILT= no
##$TM1= 0
##$TM2= 0
##$TOPLEV= 0
##$USERP1= <user>
##$USERP2= <user>
##$USERP3= <user>
##$USERP4= <user>
##$USERP5= <user>
##$WDW= 1
##$XDIM= 8192
##$YMAX_p= 0
##$YMIN_p= 0
$$ End of Bruker specific parameters
$$ ---------------------------------
##NTUPLES= NMR FID
##VAR_NAME=  TIME,          FID/REAL,        FID/IMAG
##SYMBOL=    X,             R,               I
##VAR_TYPE=  INDEPENDENT,   DEPENDENT,       DEPENDENT
##VAR_FORM=  AFFN,          ASDF,            ASDF
##VAR_DIM=   8192,          8192,            8192
##UNITS=     SECONDS,       ARBITRARY UNITS, ARBITRARY UNITS
##FACTOR=    0.0002768,     1,               1
##FIRST=     0,             0,               0
##LAST=      2.2672688,     0,               0
##MIN=       0,             -217761,         0
##MAX=       2.2672688,     353398,          0
$$ Real data points
##PAGE= N=1
##DATA TABLE= (X++(R..R)), XYDATA
0@%%%%%%%%%%%%%%%%%%%%%Mj0J4j6J6j6J6j8K2k4K8l4L8m0M5n3N6o3P3p9Q8r8
43e1J06j16J30j44J58j73J89k09K31k55K81l10L46l87M35m94N61o44P53q93J086
64F00j366J807k584M201q876M8281K18016j5554k37951k05993j5412R5344L5918
77h3569n8827j3257J40586K06115Q4407r1233j39213m3022M5465P639r3906r8333
89a37148K1195J15316O7235n0334r2149k6020M5166K7390l8473k6774Q8498J70939
101A64841R3858q1391j69269q0674O6782Q5231m9063j57661r0415P8231J53009
112A3479O5024o1546p4284K6383R3607K5807r1057r2623M2050J58891J18946l9653
124A85024j51717j20265k1448J4329k1272k7468M0939J10644R2829j352p0216
$$ y = [0, 0, 0, 0, 0, 0, 0, 0, 0, 0, 0, 0, 0, 0, 0, 0, 0, 0, 0, 0, 0, 0, 4, -6, 8, -8, 8, -8, 8, -10, 12, -12, 16, -18, 20, -20, 25, -28, 28, -35, 38, -41, 47, -51, 55, -61, 69, -75, 83, -90, 99, -110, 121, -134, 147, -163, 183, -204, 231, -263, 298, -346, 407, -486, 600, -766, 1041, -1543, 2658, -6218, 42063, 260079, 244525, 6574, -199419, -214831, -119487, -83569, -142396, -155653, -15067, 191048, 275455, 184222, 45009, 1987, 47452, 55091, -38815, -137148, -115953, -637, 66598, 16264, -75885, -101905, -56739, -29349, -67822, -94596, -6098, 164841, 258699, 177308, 8039, -72635, -5853, 79378, 30315, -127346, -217761, -139530, 13479, 78503, 16957, -57327, -30944, 62663, 88470, -2587, -95210, -53160, 105731, 224677, 185024, 33307, -86958, -108406, -94077, -115349, -142817, -101878, 8766, 101595, 100243, 30027]
135C0027m1581L0573L6702l3143p1002m339R7612J05514q604j27725j25311k2632
147a33909M6316J6599l2266Q71R8143J40469N2104r1958j37936l9779P9292Q3139
159H1085j3358p9314l7902M5559N4880k4233q6700n2699K9486N8930J4188k8666
171c8744K31P2858R1266J6007p3215p8414j2668K7811l033m8256l0578L9914P2261
184C5440J6513o2884o8209L774O2009L8952k7865m1546L1501J05090P6096l8272
196A30599j17021q7106k860L4320J367k9026P421P2941P4717q057q9803q1659
208i4167N426P6678O3162J575k0070J6625L9325n092p3226q4529k5161L7104L8161
221b4189k962j4440K6957O1763L0510m2107p3585k4249N1158O4755O785m2458
$$ y = [30027, -11554, 19019, 55721, 22578, -48424, -52763, 44849, 150363, 141759, 14034, -111277, -133909, -87593, -70994, -103260, -102389, -4246, 136223, 188327, 96369, -41567, -81346, -2054, 81085, 67727, -11587, -49489, -3930, 50950, 26717, -59983, -112682, -83196, -24266, -10078, -38744, -38513, 34345, 125611, 141618, 68403, -10011, -22679, 5132, 2099, -46157, -76735, -36821, 35440, 51953, -10931, -79140, -75366, -13357, 25595, -2270, -43816, -12315, 92775, 168871, 130599, 13578, -73528, -76388, -42068, -40701, -69727, -62306, 10635, 85352, 77295, -12508, -94167, -88741, -12063, 51099, 52674, 32604, 49229, 88554, 83462, 10236, -74293, -99454, -62350, -24189, -27151, -41591, -14634, 47129, 77639, 35532, -38053, -62302, -11144, 53611, 60396, 17938]
233A7938k0968L0587L0895l0641p9733n2416K5388O5813K8211k9997k8099L2912
245a0110P3360L6437m1162p2479k7610L1004L2046j1132k8534N520M0725K1167
257D9232l9691p2695l6376L0380N6120K7188k423J1237M2302L1832k8622p6878
269h394n5481J0929M5820J9446j8885j3514K5125L6386r625o6175o2279Q351P3304
282a4992O8016J1095k5528q108K0976N196m5607o6113k3163L8198N2416J2305
294B4691k7986k2036J4500K7040m183l6626k2045K7093N1403K3461j9642k4811
306A0859O368K1502r448n0347m6828K334M2883L2669p454k1987Q655M0698K4005
319E3909k8547n3681j8944L5283M6664Q792k5342j5561J4868J3845k6408n7696
$$ y = [17938, -3030, 27557, 58452, 27811, -51922, -104338, -78950, -13137, 15074, -14923, -43022, -10110, 63250, 99687, 58525, -13954, -41564, -10560, 21486, 10354, -18180, -12660, 28065, 49232, 9541, -63154, -99530, -69150, -13030, 14158, 11735, 22972, 65274, 97106, 68484, -8394, -63875, -52946, -7126, 12320, -6565, -20079, 5046, 41432, 31807, -34368, -96647, -88296, -14992, 53024, 64119, 38591, 30483, 51459, 56655, 11048, -55065, -78228, -40030, 12386, 24691, -3295, -25331, -10831, 16209, 12026, -24600, -46645, -19552, 31851, 55312, 35670, 10859, 17227, 38729, 29281, -21066, -67894, -65560, -22677, 9992, 2538, -19449, -10794, 29904, 53909, 25362, -28319, -47263, -11980, 34684, 43476, 18134, 2573, 17441, 31286, 4878, -52818]
331e2818l6280K1705N7860M0648N04j2361O852J6121j1204m4932l7265J1647M9678
344A0155L6401p827l1094j5097O215k897l1431l4388O641N4127N6453J1809k8365
357C0702k3538O346J2633j5603l7390j7336K5929M1917J2417k7228l2025k186
369b5362J9748N807k1428j9294J6813M4200K9275j0178k6771o412J5009K751k9729
382e571l8520o916L1892L5274L700k2196j2084J5183J7509j2163l4301j4505K9888
395a2810M8990K2319j7811k8692r667K469j2724l2508k2171J7812M7944L5847
407C8998l794k6598j4023O295K630j6853j7124J3056M1619L2254q511l7787k9089
420a8927k259O356r322j9099J700L6204M3314R939k8208l0461j451J8275O262
$$ y = [-52818, -89098, -67393, -9533, 31115, 31619, 19258, 26110, 42231, 31027, -13905, -51170, -39523, 10155, 46556, 38729, 7635, -7462, -1247, -4144, -35575, -69963, -63322, -9195, 47258, 59067, 30702, 7164, 13510, 26143, 10540, -26850, -44186, -18257, 23660, 36077, 8849, -23176, -25362, -5614, 193, -21235, -40529, -23716, 20484, 49759, 39581, 12810, 6398, 21407, 24158, -5571, -44091, -51007, -19115, 16159, 19859, -2337, -14421, 762, 18271, 6108, -28193, -42698, -12810, 36180, 58499, 40688, 11996, 2329, 4798, -7926, -40434, -62605, -44793, 3151, 38998, 35204, 8606, -5417, 878, 3508, -13345, -30469, -17413, 24206, 56460, 47949, 10162, -18927, -21186, -14830, -24152, -43251, -41551, -5347, 37967, 47906, 19698, -10763, -12214, 6061, 12323]
433A2323j6392j4735J2129K9957J3448k0360l3053j3704J1669J2446p198j4967
445b8437N980L1910K9011p91k2597j5138M702O518j2596k4163o622K4016L1619
458B3412O406k2961k5005k591J2619J545j5674p107K4679M1950K1140j7614l5380
471E419k0403J902L481j0895j2005J0831L3000K5400p615l2370k4327K728J5738
484i116N227l964P680K5944K2172o867l3838l1636n603J3435P088p160l501J6669
498c470K6240Q173k0986k7842n183J8648J6171l721j1158L565J9455J2476j3407
511A8961l0027j8397O088J4127P56r702J199K2072K5082K543k1621k0657m67J0759
525G16J832j0241m616J4638K3267N401k2916l1100j1584J0925J3177J126j288
$$ y = [12323, -4069, -18804, -6675, 23282, 36730, 16370, -16683, -30387, -18718, -6272, -13470, -28437, -22457, 9453, 38464, 37673, 15076, -62, 4640, 11158, -1438, -25601, -32223, -8207, 23412, 29818, 6857, -18148, -20739, -8120, -6575, -22249, -29356, -4677, 37273, 58413, 40799, 5419, -14984, -13082, -9601, -20496, -32501, -21670, 11330, 36730, 29115, -3255, -27582, -24854, -9116, -3889, -7853, -173, 25771, 47943, 41076, 7238, -24398, -30001, -16566, -9478, -16638, -20139, -3470, 22770, 30943, 9957, -17885, -23068, -4420, 11751, 8030, -3128, 437, 19892, 32368, 18961, -11066, -29463, -23375, -9248, -8492, -18194, -16995, 5077, 30159, 32702, 11081, -9576, -10043, 716, 2548, -7693, -12309, 2329, 25596, 30997, 8081, -23019, -34603, -23678, -10501, -9375, -10663]
538a0663J3893K7056J5153j5304l3342k1633L351J4770O660l323J333J4074J2670
551B4695r479k8767k2559L351K1255J6819K993O81J0986J2980m874k5668k5440
564b3027m021J5668J4647j413q956K331J5003P199j4236k2856p129J5803K0822
577I835N361q559l164J1209J1153p363k3960k0241Q3J4571R477l546k984J0681
591B553J6197K376j6819k0043l951J3004J3369J990k551N475J0658k31j9799k7381
605b5153j2378J1459K0106R449m89L839J2323O773j2258k5056j5795Q319K2224
618C363J3857k641p378M1L578o824k0673j8222L749K3086K0683L901n911j677
632H932N095N59j2610j7241m423J3393J6106L097q717o879K777M180o846j5420
$$ y = [-10663, 3230, 30286, 45439, 30135, -3207, -24840, -21489, -6719, -59, -3382, -2049, 12025, 24695, 15216, -13551, -36110, -32759, -11504, 5315, 8308, 8989, 19975, 32955, 28081, 2413, -23027, -27048, -11380, 3267, 1854, -7102, -4771, 10232, 17431, 3195, -19661, -26790, -10987, 9835, 15196, 6637, 3473, 14682, 25835, 18472, -5488, -25729, -25646, -11075, -1598, -5144, -8128, 2553, 18750, 21126, 4307, -15736, -19687, -6683, 6686, 8676, 6125, 11600, 22258, 22027, 2228, -25153, -37531, -26072, -5966, 3483, 2994, 6833, 19156, 25929, 13671, -11385, -27180, -18861, 3363, 17220, 14579, 7201, 7242, 10820, 3996, -16677, -34899, -31150, -8064, 12619, 16520, 10609, 8932, 14027, 14586, 1976, -15265, -19688, -6295, 9811, 12908, 4191, -2688, 89, 4269, -2577, -17997]
646a7997o549J1746J8822R061l509m581M034O946m440j8618j6898P29J5272J2313
660F331p22o704Q66Q455J437j4230j7631j871J7168K0749Q249m939o180K30r03
675A0305j2254j9266r017J0429K0584J3045j430o990j867O74n997j1961n480R887
689i338J9232J3296j965j1012p431j881n236j2311r452N702J9094J6572P52j1054
703D968o855L422M232m877j0576l253J1066J6392N370j0160j2945l228L612r85
717c817r191p281N734J6600J3238N59o964m051N60j900q077q630R73J1990J1813
732A1556O07p753n693k99j690q444r380K373J7247J9689O470q296j1157m235K0
747A015m706j0599n481J0024J9169J0866o501j5272r630M90L383r59j609O400
$$ y = [-17997, -24546, -12800, 6022, 15083, 11574, 6993, 11027, 17973, 13533, -5085, -21983, -21254, -5982, 6331, 5609, -1095, -229, 8226, 9663, -4567, -22198, -24069, -6901, 13848, 22097, 17158, 10978, 11208, 10305, -1949, -21215, -30232, -19803, 781, 13826, 12396, 5406, 3539, 4213, -1784, -13745, -19225, -9338, 9894, 23190, 21225, 10213, 2782, 901, -4335, -16646, -26098, -20396, -1302, 15270, 16022, 4968, -1887, 1535, 5767, 890, -9686, -12939, -1873, 14519, 19889, 9729, -3216, -6444, -2832, -3817, -13008, -20289, -14555, 2045, 15283, 15842, 8878, 4827, 5387, 3487, -4590, -13220, -12247, -257, 11556, 12163, 4410, -1283, -1582, -3272, -11716, -21096, -18723, -1476, 18213, 24683, 16387, 5230, 995, 1015, -3691, -14290, -19771, -9747, 9422, 20288, 13787, -1485, -11115, -10625, -7242, -8201, -9810, -3410]
761c410J4321J1389j466j2062j1860m457J47k119l226L277J1342J0036n28r389
775A995q107j05M099J79m030J45R655J2343L106r743j3201n035L381J796n772
790i294o038M428J4198J2154j71j0414r152r65L119k66l154J238R135J0462J295
805A6575r984j2491n943j26J38l64M330J1323J2222L434q114j1908n838J044J455
820d247j622K1P373J1413M529r101j5648r166K094O863L471P86M202R406P731
835A8105k693j2369j1521j936N334M142o35p26M195O340K67q048r274k779M011
850g587N000J779J131N020P462K588o884j1207o482J049L381K7j435L106Q511
865E459O360k989j0165q391l40N269M218J105K128O562O585j853j1530j2869n096
$$ y = [-3410, 10911, 22300, 20834, 8772, -3088, -7545, -7398, -9517, -12743, -9466, 1876, 11912, 11384, 1995, -6112, -6217, -2118, -1939, -5969, -5824, 3831, 16174, 19280, 9537, -3664, -8699, -5318, -3522, -9294, -15332, -10904, 3294, 15448, 15277, 4863, -4289, -5254, -2135, -2401, -5555, -4317, 4818, 15280, 16575, 6591, -5900, -11843, -11969, -11831, -12195, -7865, 3458, 15680, 19114, 11000, -908, -6746, -5702, -4247, -5869, -5848, 1525, 12938, 17467, 8366, -7282, -16448, -14354, -7491, -4020, -3234, 968, 10374, 18105, 15412, 3043, -8478, -10414, -5080, -938, -1573, -2299, 1896, 8236, 8503, 455, -8819, -11598, -7587, -2587, -808, 323, 5343, 12805, 15393, 8509, -2698, -9180, -8131, -4750, -4723, -6158, -3052, 5459, 11819, 8830, -1335, -9726, -10066, -4797, -579, 526, 2654, 9216, 15801, 13948, 2418, -10451, -15547]
880a5547L677N960L209K318N175O179Q24p751j1019n442L815P963N013J043J335
895F752L254K51p215j1582p291K055P891O383K127J336L199K757k855q473p503
910h914M8O644N956O02j676R14K568j189p337q478k283N267P197L501K95J583
926D698M202K003m927r663o582J521O346M361K73QK341J787l365q335p145K47
942a2230P040P920M095J126J301J015l333q925r045k238N619P733M132L75qO37
958E214j758o217p443k031O072R685O043p8k424j100j354n035p911m720K891Q138
974b028O606J119k025j356L18j354m508m412P76O479O790J967k403k474p77j711
990A007m870n910j665M691P295M601L64j062k7J5l333o089l771K791P178N539
$$ y = [-15547, -11870, -5910, -2701, -383, 4792, 10971, 11795, 4044, -6975, -12417, -8602, -639, 4374, 5417, 6752, 10006, 10257, 3042, -8540, -15831, -13776, -5885, 498, 2625, 3961, 7160, 9917, 7062, -1411, -8914, -8866, -2222, 3734, 4336, 2660, 3574, 6142, 4953, -2384, -10862, -13145, -7878, -681, 2820, 3115, 4698, 8900, 10903, 5976, -3687, -10269, -8748, -2402, 1959, 2232, 2240, 4581, 6368, 3003, -5332, -12477, -12230, -5190, 2730, 6825, 7951, 9252, 10267, 6934, -1991, -11036, -13274, -7655, 78, 4210, 4585, 4577, 5214, 3456, -2761, -10204, -12235, -6163, 3522, 9565, 9487, 7063, 5963, 4609, -426, -8337, -13057, -10166, -2028, 4578, 5697, 3672, 2316, 2634, 1280, -3228, -7640, -6864, -385, 6405, 8372, 5969, 3495, 2718, 1007, -3863, -9773, -11438, -6747, 548, 5149, 5513, 4451, 4424, 4439, 1106, -4983, -8754, -5963, 1215, 6754]
1006F754M27k457j954j557l515n861m181K126Q095Q339L424j467k783j726k597
1021A067n052m963J15O490P847L257k416m577l247j838k601k958J80N639Q487
1036E430N401p80m747l999k041k130l196j527K848N985M699r0l450l494j228o71
1052b990j788j309K112O081N994J412l478m169k027j137k950l595n55M489O904
1067B994M215j219m226k781n88p63k063j028L242O692N254k50m827n286l424k128
1083f186j744j49L091O232N949J548l287m593k904j413j129m93K514N791N457
1098H684M96m873o148l765o17J97m7J266M593O467L627k434n919m519p98J078
1114b712M26n8J692L829L044q15m357m811k354L39J357J249K427M315L972M25
$$ y = [6754, 7181, 4724, 2770, 1213, -2302, -8163, -12344, -10218, -2123, 6216, 9640, 8173, 5390, 3664, 1067, -3985, -8948, -8833, -2343, 5504, 8761, 6345, 1768, -1479, -3317, -5918, -8876, -8696, -3057, 5430, 10831, 10051, 5304, 1305, -736, -2866, -6062, -7589, -4741, 1244, 5943, 5853, 2403, -1091, -2319, -2990, -4778, -6087, -3975, 2106, 8100, 9512, 6034, 1865, -162, -1299, -4249, -7844, -8399, -3910, 2994, 7209, 5990, 1764, -1017, -1605, -2368, -4431, -5459, -2217, 4475, 9729, 9479, 4652, -634, -4058, -6186, -7930, -8079, -4988, 1244, 7193, 8741, 5454, 861, -2043, -3456, -4585, -5078, -2564, 3227, 8684, 9180, 4307, -1841, -5606, -6223, -6026, -6073, -4807, -214, 6253, 9880, 7446, 1527, -2992, -3790, -2712, -2286, -2344, -652, 3177, 6221, 5406, 1049, -3762, -6116, -5777, -4420, -3171, -744, 3571, 7543, 7968]
1130G968l426m305k782r43n14m85J008L979M657J445k928n207l567k88J387Q77
1146c124J110L512N387L283k104o257o125k578R13J740J604K338L557K798l35
1161E719m124n195k627R79K507K519K818L254K056j291m650n650l244M64K022
1176d443J957J959K853K929Q42k871n119l187P31K792K012R03J120J924J165j712
1192C855m791m820j538J764K908K193J753K275K134r0l396m581k378O40J963K110
1208AJ762J720J477n61l552m952l101N44K862L141K404K320K368N84l063n468
1224a514m207n07K598L365K238J074P83J28k126m393l899o79L007M343L134J361
1240D706O03L7j733l956m094j808J431L390K817J071L07J44p34k577l498j641
$$ y = [7968, 4542, 237, -2545, -3488, -4002, -4487, -3479, 500, 5157, 6602, 3674, -1533, -5100, -5388, -4001, -3124, -2014, 1498, 6885, 10168, 8064, 1807, -4318, -6896, -5983, -4243, -2639, -301, 3256, 6054, 5719, 1595, -3600, -6227, -5248, -2741, -222, 2596, 5850, 7906, 6615, 1965, -3685, -6929, -6465, -4443, -2486, -527, 2326, 5255, 6097, 3226, -1893, -5080, -4349, -1557, 455, 1358, 2478, 4402, 5567, 3855, -936, -5756, -7294, -5530, -2622, -429, 1324, 3599, 5733, 5643, 2247, -2334, -4712, -4072, -2109, 1, 1763, 3483, 4960, 4399, 847, -4105, -7206, -6662, -3800, -659, 1745, 4065, 6433, 7017, 3954, -1514, -5721, -6228, -3630, -265, 1973, 3047, 3830, 3958, 1832, -2561, -6460, -7139, -4132, 211, 3345, 4706, 5309, 5346, 3613, -343, -4437, -6245, -4814, -1424, 1393, 2464, 2771, 2915, 2181, -396, -3894, -5535]
1256e535J288L703L219J270L06O7o74k528l731l143l62K555L370K175O65N42J82
1273C369j398l055l235q45K393L632K748Q52n1q36j865l402l663j833J603M193
1289a393L775J749J38o09j254k529l232j876J160L550L606J623l64j497k019k448
1305a620k817j919Q56L596M144K336J0j033j400j702k380k155j45K369L410K112
1321C662L9j439j644j395j798j898m89K044L703L051R85p87j421j576j861k315
1337c139j415P91K764L111J541n15j460j449j726j996j272Q68L180L838K230k07
1353E144j777k212k243k137j677O1K441L656K754K51j741k131j722j465j053L01
1369c550K286L456K659M71j759k729k406j679j139n0J583L223L018R39j301k125
$$ y = [-5535, -4247, -544, 2675, 3945, 4251, 4318, 3644, 1116, -2615, -5758, -6120, -3565, -195, 1980, 2645, 3187, 3369, 1971, -1084, -4319, -5164, -2771, 861, 3609, 4461, 4410, 3574, 1709, -1693, -5356, -7189, -5586, -1393, 2382, 4131, 4269, 3660, 2406, -123, -3355, -5231, -4071, -521, 3085, 4708, 4344, 2847, 828, -1620, -4437, -6356, -5500, -1904, 2240, 4576, 4586, 3553, 2153, 451, -1929, -4084, -4229, -1860, 1550, 3662, 3701, 2262, 618, -777, -2575, -4473, -4962, -2918, 785, 3836, 4821, 4034, 2613, 1037, -824, -3139, -4554, -3763, -999, 2112, 3653, 3138, 1678, 229, -1497, -3493, -4765, -3897, -717, 3121, 5351, 5144, 3367, 1155, -1088, -3225, -4902, -4841, -2400, 1256, 4010, 4261, 2520, 389, -1333, -2798, -3851, -3550, -1264, 2192, 4851, 5322, 3563, 834, -1572, -3251, -4390, -4440, -2857, 366, 3384, 4323, 3022, 897]
1385H97j674j105p65k08J018K298K779J354q99k498k471j462p53l15N69K104L070
1402A939K254R5j674k225j886j053l86L66J689K538K099J73j653k466k019j187
1418c396n48K38J879L190K906R95j515k742k464j365l65K74J164K273K586J181
1434D291j135k790k738j320L6R05J567K136K329J279n13k167k746k016n82L93
1450c071J146J818K241J370l29j930k428j512k04M30R74J610K102J726K32j667
1466B508k773k270q03L50P17J060J779K002J145p81k301k478j369J86J165J596
1482b67J752J644P53p39k306k728j703k29Q56J622J984K038J209m62k036k596
1498a208j738k06R16J432J629J677J127j81k028l050k131l49J224J837J770J451
$$ y = [897, -777, -1882, -2647, -2855, -1837, 461, 3240, 4594, 3695, 1197, -1274, -2736, -3489, -3804, -3235, -1131, 1939, 4193, 4288, 2614, 389, -1497, -2550, -2936, -2570, -881, 1657, 3756, 3929, 2276, -190, -2209, -3396, -3944, -3706, -1827, 1363, 4269, 5264, 3749, 1007, -1457, -2822, -3187, -2913, -1749, 524, 3110, 4291, 3156, 366, -2372, -3692, -3656, -2751, -1184, 952, 3281, 4560, 4047, 1880, -866, -2882, -3464, -3071, -1925, -107, 2134, 3504, 3175, 1245, -1183, -2695, -2899, -2469, -1495, 115, 2217, 3943, 4175, 2508, -265, -2535, -3338, -2988, -2271, -1211, 568, 2570, 3715, 2934, 633, -1845, -3214, -3028, -1863, -267, 1485, 3129, 3882, 3143, 837, -1891, -3594, -3823, -2967, -1345, 639, 2677, 3886, 3424, 1388, -1208, -2946, -3152, -2236, -804, 825, 2502, 3629, 3448, 1420, -1630, -3761, -4110, -2886, -1049, 721, 2172]
1514B172J106J01j225k296k241q91O27J559J614J274Q43J55j100k088k063j022
1530c475M12J383J745J612J308M95p14k056k339j520Q0J273J497J292J073O62
1546B728k96j551k298j807k40J208J898J823J314N62l11j486k388k169p95R46
1562b862J869J924J346N98k74j314k049j832q25Q93J800J927J409N02l17j170
1578A625j996k163j134M90J771J918J452O72j03q87j513j886j181J41J516J913
1594F35J463N69j81p89j472j846j447k61J188J919J729R11K52o09j205j640j606
1611b390n24P23J835J793J154O1o69j240j828j539p25O81J757K065J403M36n41
1628B452j122j673j751q95K71J622J971J427L51n16j145j640j568q51K02J561
$$ y = [2172, 3278, 3379, 2154, -142, -2383, -3274, -2647, -1088, 526, 1800, 2643, 2798, 1698, -390, -2453, -3475, -3063, -1680, 65, 1677, 2985, 3480, 2766, 710, -1629, -3149, -3069, -1796, -299, 993, 2066, 2728, 2432, 881, -1417, -3224, -3464, -2256, -358, 1465, 2779, 3341, 3030, 1544, -844, -3013, -3808, -2862, -993, 931, 2277, 2875, 2601, 1287, -762, -2594, -3419, -2526, -726, 1201, 2610, 3112, 2795, 1625, -371, -2534, -3668, -3178, -1407, 511, 1963, 2635, 2532, 1645, 132, -1754, -2935, -2794, -1278, 635, 2098, 2667, 2486, 1697, 225, -1621, -3068, -3329, -2141, -222, 1507, 2418, 2670, 2061, 856, -784, -2390, -2914, -2191, -356, 1437, 2591, 2652, 1983, 743, -1085, -2624, -3349, -2668, -911, 1154, 2557, 2993, 2452, 1330, -343, -2094, -2989, -2718, -1096, 875, 2302, 2653, 2137, 992, -648, -2216, -3067, -2865, -1304]
1644a304K143J649N07m97j183j455j498j011j42J029J897J721P01l01j016j445
1660b05j272r45j32R12J700J771R86k07q99j339j493j229n73O80J503J930J195
1677B383J48p80j274j361j040n71L38J355J943J484K99q47j361j626j248o53K43
1694b568J274J861J608O62m42j381j608j226n89J05J111J817J495O74n02j325
1710I66j617j287p45R9J039J692J703R81j85j279j513j298p30n2P03J416J593
1727A486R80o7j021j552j358p92o7P39J299J526J307K48q07j497j392r71m02M01
1745a940J108J570J317M99p05j333j530r72l45L96J095J555J429O97n12j360j737
1762g68j213n23L05J054J417J382Q30k21j223j614j229n19K50J021J399J393R23
$$ y = [-1304, 839, 2488, 2995, 2498, 1315, -140, -1638, -2649, -2791, -1762, 135, 1856, 2557, 2256, 1240, -205, -1477, -2422, -2554, -1642, 58, 1829, 2815, 2608, 1709, 370, -1123, -2352, -2925, -2245, -742, 1188, 2383, 2531, 1751, 477, -884, -1924, -2495, -2157, -802, 1141, 2625, 2924, 2077, 716, -910, -2158, -2811, -2568, -1294, 567, 2175, 2837, 2395, 1014, -594, -1820, -2409, -2304, -1193, 624, 2119, 2793, 2291, 966, -651, -1938, -2683, -2584, -1545, 147, 1850, 2831, 2646, 1367, -146, -1444, -2174, -2226, -1523, -107, 1486, 2466, 2399, 1378, -174, -1532, -2324, -2391, -1652, -353, 1173, 2480, 2728, 1921, 424, -968, -1939, -2341, -1940, -832, 738, 2055, 2554, 1849, 516, -1014, -1986, -2331, -1935, -840, 715, 2144, 2841, 2329, 969, -768, -1981, -2504, -2199, -1145, 272, 1654, 2484, 2263, 1040, -574, -1803, -2322, -2072, -1051, 348, 1741, 2664]
1779B664k50j235j590j382o39J34R12J314J401R64J53r36j567j363p18J55P29
1796a254J188J263R58J89p74j405j515r30o0O85J199J343J084M83n23j293j492
1813h54j092k74N52J007J316J083N22l86j189j513j131m32N29J140J317J146O65
1830B406j45j105j578j326o00L60J022J279J197O51k29q79j388j303o61K81R75
1847a043J374J224O80J1q53j471j376p72O3Q53J148J195P90K35n92j235j359r08
1865b036l9P67J225J167Q41J98n20j119j381j061l58O35J107J287R57L96l38r70
1883G58j304j145l26L75J065J165J073L59k55r22j379j214m79K52R91J425J101
1900A540N52k46p42j204j253p12J96Q20J341J096N35j19p36j213j201p62J26Q26
$$ y = [2664, 2414, 1179, -411, -1793, -2432, -2298, -1386, -72, 1329, 2293, 2446, 1510, -57, -1420, -2138, -1983, -1254, -66, 1197, 2155, 2344, 1570, 165, -1350, -2280, -2340, -1655, -456, 887, 1971, 2454, 1931, 638, -854, -1946, -2220, -1668, -661, 655, 1738, 2260, 1874, 685, -828, -1959, -2391, -1862, -722, 595, 1741, 2406, 2261, 1156, -422, -1748, -2348, -1988, -966, 313, 1510, 2161, 1932, 1053, -335, -1638, -2299, -2018, -1043, 331, 1555, 2235, 2246, 1393, -78, -1454, -2226, -2163, -1310, -162, 1033, 1823, 2058, 1466, 231, -1128, -2036, -2075, -1308, -83, 1084, 1925, 2123, 1603, 484, -897, -1958, -2316, -1681, -574, 713, 1670, 2066, 1728, 758, -546, -1691, -2017, -1642, -577, 588, 1661, 2020, 1765, 843, -536, -1750, -2229, -1977, -986, 439, 1540, 2092, 1846, 1104, -100, -1353, -2065, -1869, -1049, 292, 1388, 1923, 1804, 1068, -145, -1346, -2108, -1982, -1156]
1918a156J250J190O62N4o44j184j266p95r0O34J173J126P31Q2n43r32j148r11
1936a767k19N06J182J212P78K54m02j007j118j003m04L42R37J229R24L85k56q92
1954F81j081r55n15K66R09J196R36M92k55p97j092j084o79J18P77J278J016N70
1972A781r5o98j004j043o64o2O95J182J056O41j00o29j048j043p09j56O23J109
1990a64J112P92R0o11r11j060p28k50M09R81J084Q38J25n06q45r87q42k82L42
2009a413Q66J190Q48L07l24q25j105q08m56K02P87J065R40L98k09p68r69r04n08
2028a686J56P27J041J009M16n3o28j061r91n76mO71R30J042O31qo71q64r12p08
2048a539n7N70R55R49O73J05n26r30j042o68j14M26Q05J004P71K03l85q31r09
$$ y = [-1156, 94, 1284, 1946, 2000, 1356, 172, -1094, -1889, -1979, -1345, -172, 954, 1685, 1767, 1224, 292, -856, -1767, -1986, -1480, -298, 914, 1692, 1946, 1544, 537, -581, -1584, -1988, -1646, -709, 520, 1444, 1829, 1573, 681, -400, -1355, -1870, -1604, -695, 501, 1437, 1929, 1674, 877, -215, -1299, -1978, -1860, -1083, 195, 1211, 1781, 1686, 988, -16, -1059, -1723, -1785, -1090, 92, 1148, 1789, 1689, 1060, 12, -1031, -1740, -1896, -1273, -164, 948, 1740, 1830, 1219, 308, -752, -1480, -1730, -1321, -340, 744, 1582, 1707, 1201, 356, -631, -1473, -1755, -1413, -547, 643, 1491, 1798, 1474, 649, -456, -1264, -1720, -1518, -731, 334, 1274, 1672, 1463, 695, -274, -1178, -1686, -1530, -803, 238, 1247, 1663, 1610, 982, -79, -1070, -1646, -1650, -979, -49, 993, 1624, 1616, 945, 81, -831, -1539, -1596, -1026, -71, 878, 1551, 1656, 1130, 200, -842, -1510, -1624, -1198, -393, 611, 1382, 1585, 1200, 369, -540]
2067e40p50k50L19Q11R58P34K87k88q01r18q09k95K13P22R13R33L78k28p39q83
2087b33q66l16Q3N96R51Q27M59j22p14q73q29m62M3N25R63R72M90K7n91r19q28
2108h17o24%M96Q04Q54O43J29n17q60r34n31j10M41Q47Q17O61J70l73q06q85n90
2129a185k31K60P98Q96P06J60k74p07q70o93k97K80O69Q69P51L19k27o22q61q10
2149a069m11K08O33Q19P96M42j47o05q53p59l70J8N68Q29Q16M41l0n25q47q36
2169h82m26j07O03P38Q15N15M3l54q40p76n60m0L54P58P50O37P1l01p59p93o26
2190a180k08L38O99Q15O94J38k34p03p76o79j84J93O19P89O77L78k70o43p49p10
2210i96l31J78O25P58P38K89j01n31p82o75m18L7N91P26O86M18l2m56p70p23m74
$$ y = [-540, -1290, -1540, -1221, -410, 548, 1282, 1569, 1281, 480, -438, -1247, -1542, -1329, -607, 306, 1239, 1617, 1389, 650, -233, -1099, -1415, -1332, -736, 215, 1042, 1501, 1379, 665, -208, -1037, -1499, -1456, -931, 32, 1004, 1494, 1521, 930, 11, -817, -1441, -1441, -945, -141, 713, 1356, 1485, 968, 108, -826, -1357, -1467, -1026, -179, 638, 1299, 1469, 1096, 290, -595, -1185, -1416, -1156, -358, 538, 1244, 1404, 1130, 423, -447, -1140, -1437, -1157, -488, 381, 1132, 1451, 1224, 602, -259, -1069, -1480, -1272, -639, 180, 976, 1418, 1271, 666, -187, -946, -1316, -1298, -730, 99, 915, 1356, 1326, 801, -46, -882, -1308, -1415, -812, -74, 741, 1256, 1299, 945, 105, -671, -1231, -1271, -917, -159, 591, 1228, 1299, 998, 239, -554, -1180, -1388, -1050, -351, 464, 1158, 1296, 1062, 359, -417, -1096, -1280, -1087, -468, 321, 998, 1376, 1106, 463, -286, -996, -1327, -1149, -524, 234, 972, 1261, 1160, 629, -153, -828, -1246, -1209, -618, 108, 794, 1212, 1180, 724, -46, -769, -1243]
2231a243nN20P15P39M91nm23o89p72m64m5M16O17P24N25j3k68o41p76m98j06L86
2253h15N52P07N56K22k68o05p98n53j99K52N82P22N95K03j95m82p60o33k91K19
2273i89N17P25O38J99m0n57p01o72k66J25M48O99O17L57p3m35p22n71m17P5M21
2294f22O78O22M42k5l86p18o35m75M6L10P04N83N12M8l34n40p45m35r2L02O25
2315a35O33M42J55k43o47o19n06j60K50N25O08M93K07j78m56o54n53k24K03M46
2335d13O46N66K13j16m91n88n21l61J43L78O93N80K64o1m10n60n99l80P3L60O14
2356C0N56L46N9l96n91n89l79k4L04O32N96L62P1l07n00o13m22j05K49N05O31
2377D15M59J06k88m83n53m70j54K63M94N84M48Q8j00n06n69n38j25J42M59N18
$$ y = [-1243, -1248, -728, -13, 726, 1217, 1212, 789, 100, -672, -1136, -1181, -765, -148, 576, 1101, 1088, 820, 179, -597, -1095, -1201, -815, -263, 444, 1000, 1222, 954, 349, -449, -1002, -1201, -949, -367, 355, 950, 1153, 958, 476, -284, -917, -1208, -989, -472, 253, 891, 1090, 1050, 493, -208, -880, -1146, -1021, -573, 126, 743, 1100, 1027, 592, -130, -701, -1118, -1043, -622, 56, 678, 1120, 1095, 709, -9, -644, -1119, -1073, -763, -59, 524, 1036, 1084, 750, 210, -535, -970, -1062, -760, -135, 498, 940, 1095, 852, 205, -414, -920, -1080, -830, -305, 303, 796, 1003, 825, 369, -285, -838, -1062, -859, -413, 233, 799, 1012, 896, 405, -183, -704, -1065, -922, -544, 149, 729, 993, 932, 522, -38, -637, -1017, -944, -584, 30, 586, 932, 991, 595, 4, -585, -964, -988, -684, -52, 544, 906, 977, 670, 170, -443, -865, -970, -721, -216, 415, 874, 980, 692, 209, -344, -814, -968, -705, -211, 373, 821, 909, 809, 303, -266, -804, -929, -787, -328, 190]
2397A90M79K81j59l95n94m59k57P2M64N21N00K53r6l89n02m71k83n0L72N86M66
2418E29L14l5k68n13m93m19Q9K33N55N07M02l9l09m60n00l78j03K50N05N40L79
2439G86Q8k43m87m21m70j01K19M33N01L48J61j99m07m23m57j62J43M17M78M96
2459G00J17j34l80m17m73k38J19L09N31M42J76p7k59n56l84k14M2K62M52M87K49
2480G54L0k84n28m49k55J1K11M36M89K68J0j93m72m03l21p4K38M30M57L31Q9k19
2502E56l70m64l52j57K25L73M18L75J25j26l68m85k81j61J31L34M43L39J74j38
2522E91l24m31l86j48R2K61M14L91J84j5k43m37l65j86OK20M06L71K59k6k85l45
2544Dm17k60R9J64L84L61K74O1j94m11l79k45p4J40L90M16K09J64k65l41l58k52
$$ y = [190, 669, 950, 791, 396, -198, -657, -914, -842, -378, 143, 643, 896, 800, 411, -91, -562, -845, -895, -523, 63, 529, 843, 808, 540, 27, -466, -885, -796, -563, -8, 499, 901, 862, 553, 93, -407, -785, -888, -638, -133, 407, 786, 874, 631, 144, -277, -747, -848, -629, -196, 305, 653, 814, 615, 208, -215, -672, -834, -691, -274, 204, 700, 817, 683, 303, -114, -587, -825, -706, -397, 134, 576, 752, 675, 416, -140, -524, -738, -696, -434, 18, 505, 754, 784, 500, -28, -477, -732, -721, -510, -74, 415, 683, 693, 500, 28, -375, -696, -770, -532, -102, 355, 686, 775, 556, 186, -278, -630, -787, -562, -189, 229, 604, 729, 603, 235, -250, -531, -692, -561, -227, 216, 555, 729, 591, 267, -164, -550, -698, -606, -345, 69, 460, 644, 629, 386, -51, -416, -602, -596, -376, 30, 401, 660, 634, 349, 4, -413, -673, -574, -410, -26, 335, 609, 670, 476, 65, -314, -559, -633, -493, -103, 313, 522, 686, 421, 80, -278, -530]
2566e30j20J78L30L78K74R9j20k70m24k67j40J32K83L49K63J75p1k70l98k75j33
2587e57Q5K68K85L02J58nk79l00l57j66O5J89L08L08J68Qj17l84l18j51JJ77K58
2610e4K97K90l1j42k91l55k14p3J61K82L39K13J44j72l25k69k00r2R1K71L24K88
2632D82K8j07k14l35k80j15J02K64K71K64J48pk32l38k85q1j8K32K64K93J40m6
2654D30k18k76k78j05MJ73K20L31J62j2j87k01k50j99l4J08L03K48K11pj55k22
2676D6k81j35m9J30J88L38J80on7k75j84k81p1J11J81K74K60P7j21j82k16k38
2698c11r3O9K02K62K07J08p1j48l31k11j46Q8J93J91K26J73o6j29k42k05j38k7
2720c99K41J91K22R5M6j60j97k68j18j03J88K29K30J66M7j26j58k76j91l0N7K06
$$ y = [-530, -650, -472, -142, 236, 510, 609, 489, 219, -205, -472, -612, -480, -197, 152, 415, 590, 519, 249, -149, -424, -557, -472, -204, 81, 383, 541, 536, 257, -43, -400, -566, -501, -312, -4, 304, 472, 480, 363, -21, -339, -490, -489, -312, -54, 243, 533, 502, 360, 69, -286, -500, -573, -412, -130, 209, 422, 566, 394, 69, -200, -400, -492, -401, -130, 194, 482, 510, 403, 189, -146, -426, -541, -439, -175, 96, 360, 508, 501, 269, -69, -354, -435, -453, -221, 43, 336, 476, 430, 212, -64, -342, -447, -443, -270, -50, 281, 443, 431, 244, 43, -207, -406, -440, -332, -29, 219, 430, 423, 268, 46, -235, -370, -419, -289, -101, 237, 417, 411, 354, 79, -105, -386, -457, -346, -165, 109, 369, 446, 325, 143, -73, -311, -404, -335, -133, 129, 336, 444, 373, 225, -106, -317, -463, -375, -182, 9, 235, 408, 342, 213, -29, -234, -372, -399, -158, 33, 255, 350, 396, 236, 39, -229, -347, -450, -262, -33, 197, 363, 410, 284, 126, -150, -341, -371, -314, -108]
2742a08K73J46L0m6k70j08k33n1P1J49K91K31m3K1k03k50j86n0kJ55K67J44J66
2765C94j12j23j88k43j25J00J20K10K67J00r3j09k76j32j58OJ17J85K79R8l1j11
2787A75j66j96p8rO8J76J60J82M2j01k00k60k1j00QK68J88J09J13m9k12j66j78
2810b47o2L8J65K37J40O6n9j84j43j60j08N3J40J54K13P9j13r2j71j41q3k8J27
2833a79J76J28J12K3j34j23k33l2m3J48J32K14J47q3k8j75j99o6o8R3J22J72J22
2856B26R0j48j18j56j90M1O2J05J97J22P1q8j83j67p7m6N4J06J90O8P1pj42j76
2880i5p5j03K5J88J90Q9O0l1j06j63j88m3N2J6J87J34J02ro4j60j49q8K9N1J79
2905B8J40M0P4j45j43j76p4K9P0J16J44Q8N5r2p8j94m9k7L6J32J74Q9l8Rj91j02
$$ y = [-108, 165, 311, 341, 295, 25, -83, -316, -367, -296, -147, 144, 375, 332, 353, 150, -100, -286, -336, -338, -183, 84, 228, 394, 282, 159, -29, -272, -397, -297, -177, 33, 300, 400, 307, 198, -78, -210, -368, -362, -245, -60, 219, 317, 286, 175, 9, -187, -265, -274, -206, -30, 130, 312, 354, 253, 53, -207, -228, -328, -320, -52, 136, 245, 358, 309, 97, -69, -247, -309, -271, -106, 131, 271, 337, 278, 94, -49, -209, -317, -264, -124, 30, 243, 322, 209, 117, -54, -195, -278, -306, -179, -3, 125, 237, 260, 126, 3, -230, -262, -305, -157, -25, 189, 336, 253, 225, 50, -149, -215, -283, -190, -68, 104, 226, 316, 168, 50, -106, -296, -255, -193, -88, 109, 231, 302, 214, 31, -136, -213, -259, -205, -99, 91, 159, 230, 223, 81, -95, -170, -273, -248, -60, 130, 219, 279, 248, 142, -21, -209, -252, -200, -184, 3, 137, 239, 230, 166, 6, -143, -231, -202, -151, 28, 168, 208, 282, 137, -6, -182, -256, -227, -157, -41, 103, 191, 246, 154, 76, -118, -167, -194, -158, -26, 148, 237, 199, 208, 17, -85]
2931h5r1o0J3J48J23J41lj6o3j52r3j10Q4Q7Q8J33N5l1o6j28k05k5P5J02J39P2
2957A32N7K6m3j87r3j09M8LJ62Q3P4N9j7j94q9k9j08M8J52J54J20p4m1j19j06
2982i1r1m7R1N4J76Q7j1Rj44n4q6m7%O8J08P7O2k8m0j12j06p5K9R6J03P2P7l0
3010A47K4j38p0j09o6J48Q1J26omn5q7m2j16j9N8P9P0J56lkj07j06k4j10L7O7
3037g1J15P8K3q4o6m3j11J4N1L3J03O7L5Rp5j08n2m8N6N7LJ07N5P1j56o2r9k0
3065a18k5M4R1M1Q8J6o8o2q3Nm7J0Q7P7%K9j8o6p7o0J4LN8P6J38j0q7n9q8j6l
3096a10K4O9M3P3K4n3l9j1q4m4M7M5k0J18N5n1p7j0j02l8J5N5J61l7M1J1j24L3
3124A4o7j6lk1J32j1P9L4j03m9q6LK6L0K7K9P6J3l6l4m5l2q4P4N0OJ24m6mk6p6
$$ y = [-85, -176, -236, -223, -75, 48, 189, 186, 170, 107, -45, -138, -248, -164, -77, 11, 144, 199, 168, 102, -26, -231, -256, -181, -79, 60, 132, 189, 215, 172, -15, -108, -217, -169, -166, -4, 79, 153, 212, 195, 1, -88, -117, -225, -177, -25, 129, 249, 175, 134, 15, -91, -182, -229, -138, -84, 92, 179, 168, 177, 33, -21, -107, -154, -154, -86, 22, 99, 161, 133, 93, -19, -125, -200, -171, -75, 28, 100, 177, 147, 171, 33, -37, -146, -212, -64, 17, 143, 137, 133, 78, -9, -51, -167, -186, -128, -49, 21, 177, 174, 172, 65, -41, -65, -175, -138, -71, 44, 122, 145, 61, -5, -48, -159, -145, -94, -61, 42, 109, 144, 153, 78, -30, -82, -130, -74, -17, -14, 93, 148, 219, 63, 1, -98, -118, -143, -99, -8, 33, 121, 137, 69, 7, -76, -71, -118, -108, -21, 56, 56, 85, 67, 1, -76, -136, -122, -119, -61, 15, 153, 143, 56, -3, -91, -107, -110, -86, -17, 26, 99, 123, 70, 31, 20, -64, -108, -61, -16, -36, 82, 137, 86, 9, -1, -103, -141, -126, -71, 90, 53, 94, 105, -19, 14, -53, -69, -72, -93, 39, 28, 107, 141, 38, -11, -97, -94, -68, -38, -11, 18, 94, 107, 71, 37, -8, -40, -124, -50, 0, 6, 130, 84, 80, 54, -22]
3155b2n5j7L6mJ24J0K4kq1l1k8j30J08RM5J38k9O1j31j1l8q6L1M5N4K7L2M2qq7
3185B6r2o1N7m6P3J42n3N2l4q4J2o1k1K1N3P6K4M9m5o3o8q1K6N3J5R6%JJ2k8p7
3216b6k8j4j3N1O5M4L8n1n1qq3l0L4k5J04O9J3Ok7lp6l0q4N3L8M5Q6J3o4K3q9
3247b0o1k3P5pO1oR5p5J3p7m6l8jK0L2J34P5j42N4o2j09M8l6J7P7J12l9Q3l5j04
3277A5r4J5%J4K7M9N0K5p3j1l6o9J5j0K0N9J06no4j3r3j1n8J00L5L2L6L7K8m1
3307H5j08l5l4J3K5P7K4O3K0q3op5k4k6P0J6L6O9l1ln3p3m0J4N6M6L0K7J5K2j34
3338a7n9j0PK9k5P5J00K1M2r5q6m5p5L0L6J13rN8L3o6l3j19k7MM5Q5J39j0qm4
3368H9n1j00pkk2J13J7L7O9j8j07o7k6m4J7M0R5R1K7n4q8L0j33j5Q9l3Q1P6K4
$$ y = [-22, -77, -94, -58, -62, 62, 72, 96, 94, 13, -18, -46, -176, -68, -59, -14, 124, 95, 156, 25, 14, -24, -110, -79, -34, 20, 47, 79, 121, 113, 26, -66, -127, -70, -116, -43, 99, 46, 98, 64, -20, -8, -69, -90, -69, -16, 60, 84, 133, 88, 25, -43, -124, -98, -45, -30, 66, 66, 67, 79, 51, -26, -54, -68, -81, -30, 35, 79, 117, 66, 15, 7, -76, -106, -72, -97, 7, 76, 89, 95, 68, 65, -11, -41, -125, -72, -34, 11, 97, 110, 46, 69, -20, -81, -104, -29, -36, 25, 19, 114, 39, 52, -25, -71, -109, -110, -90, -58, 76, 151, 9, 63, 1, -108, -60, -96, -79, -2, 110, 71, 154, 119, 15, -79, -64, -64, -50, -23, 26, 76, 101, 28, 17, -19, -88, -73, -83, -63, -4, 102, 97, 33, 20, -73, -84, -142, -42, -7, 25, 61, 98, 126, 85, -23, -58, -92, -79, -54, 23, 47, 110, 130, 47, 41, -34, -58, -84, -14, 2, 38, 107, 76, 73, 20, -53, -93, -79, -23, 23, 53, 80, 95, 117, -17, -76, -86, -79, -50, -75, 0, 100, 121, 163, 68, -18, -63, -138, -108, -72, 41, 32, 90, 123, 57, 24, -95, -122, -118, -73, 12, 151, 141, 133, 89, 38, -62, -69, -71, -93, 20, 37, 74, 143, 125, 18, -49, -75, -119, -102, -62, 33, 124, 151, 97, 9, 39, -94, -109, -20, -53, 28, 104, 128]
3397A28l4k7m1j19j8L1kJ16N2K6J5q0k8q0m4n3N6J04P4k0Q2r1rp4j16rJ32K0M0
3426C1P0QJ6q6o3m7n3LQ7O0J09L1r4o5pp1l5K5M9N1J11M6n4q1j11k8kML3J13J7
3457F7K7L0q2n3p5%o5J26m3J34L9M0k7j69p7j1J7K0Q0J02P4q6L5j43Jm9k3lQ1
3486c3J14qP1n7o6p1k6qn4J14Q8L1k3L8r4q4rn4j6R7R9L8K0k8j3q3j24l1N5L7
3516h0J24K0O4rl9r8n1lj7K6N7Q5Q8p6j5o5n6l6rM6JJ21N5J7p0j6r4r5l5J7O8
3547g5J15N2jL6j12q7k7q6M0J05R3N8PPo7j03l0q0P1L0J28k5O2J2Lj22m8j08N7
3576i5O4M3O7L8N0q2p4p7l7L1l8Q9J12M6K6j00k5p6q6NM0P2L6J05K1j12j08k2
3604h7j2o3Q1J29LJ01j6l2r4n1m0k9j7P8M8R8P3m7r2k9q1q2L1K8R8P9L9K4l3j05
$$ y = [128, 94, 67, 26, -93, -111, -80, -82, 34, 86, 112, 127, 47, 19, -61, -105, -158, -102, 2, 76, 56, 138, 47, 38, -36, -152, -161, -29, -9, 31, 101, 109, 125, 39, -24, -71, -124, -121, -34, 26, 135, 166, 72, 7, 0, -71, -106, -81, -32, 19, 130, 176, 122, 41, -70, -98, -100, -96, -63, 50, 67, 94, 124, 42, -11, -86, -86, -151, -25, -68, 66, 105, 145, 118, -51, -128, -139, -122, -102, -22, 80, 154, 68, 103, -40, -39, -88, -111, -114, -33, 81, 73, 144, 87, 21, -50, -76, -84, -138, -24, 64, 95, 72, 110, 16, -68, -77, -131, -147, -50, 49, 87, 107, 79, 66, -17, -141, -172, -117, -80, 44, 64, 128, 119, 80, -18, -69, -72, -89, -63, -6, 79, 167, 91, 76, 11, -45, -81, -90, -44, -43, 78, 133, 150, 80, 64, -30, -125, -160, -143, -75, 40, 92, 91, 127, 15, -72, -99, -185, -145, -40, 53, 111, 118, 125, 58, -45, -75, -155, -84, -54, 74, 49, 111, 123, 126, 4, -44, -152, -95, -31, 12, 79, 117, 167, 85, 11, -66, -103, -72, -110, -21, 91, 137, 163, 63, 38, -38, -124, -119, -79, -7, 29, 134, 155, 43, -65, -87, -99, -162, -81, 48, 51, 152, 136, 104, 10, -41, -81, -110, -127, -49, -1, 97, 170, 123, 31, 2, -79, -161, -130, -102, -4, 75, 114, 138, 105, 0]
3634@j47k9O6J13n5J09K7LJ3j23j12LL0L3N4R7N0j4m7p6q1J6k8JP3J15J2N8q2
3663G9n3r2p4m7J15J6J61K9ro0p2m2m9p6N6P7M2J33km4n8o7j3j32R2M2O8P4M3
3692A37rr0n2q5m3QN1Q2J35o0J06q2p2j44q1lJ33O8K8J22p8qq1q2n3l4O0J53K6
3721E2J12l3n3m5j00o3nrQ3J29M2Ok2p8o7q1l0O2Q5R0M0kKo9j20o3l1N4Q5N2Q2
3752A05K4j2m2j01o0Oq0J28P5P0N0j01L2j09p4o6K4M7R6P9O2n3j9r8p1l3lO5L9
3781b0Q5J22p4k8l7j64K3%k7J22M7O3K9l3r5j25Jj6K5M0J14N0M7m6o3n0j42j0
3809a62M6R6M9M9J31p0j15kj17r3Q5J7Q3J66j8M1j37p8p5l7QQ6P1J13K5J4j20
3836E6r7r1n0J6Q3N8J05O6j0m0q5o8p2M4m4J21J09L9Lp6jj43n1n2O0J30K0J20
$$ y = [0, -147, -176, -110, 3, -52, 57, 84, 87, 100, -23, -135, -132, -102, -69, -15, 82, 132, 118, 71, -5, -86, -70, -98, -97, -24, 91, 103, 161, 79, 26, -66, -140, -187, -72, -56, 105, 134, 125, 65, -7, -49, -98, -174, -118, -41, 1, 134, 132, 88, 30, -37, -50, -182, -90, -48, 20, 94, 137, 128, 38, -14, -99, -142, -134, -83, -1, 134, 74, 180, 98, 26, -118, -199, -202, -69, -1, 27, 149, 71, 63, -18, -100, -153, -187, -127, 26, 52, 164, 131, 78, 33, -67, -130, -135, -144, -61, 68, 110, 116, 94, 16, -51, -132, -162, -100, -15, 75, 115, 113, 115, 46, -74, -137, -168, -114, -29, 23, 105, 129, 117, 75, -26, -86, -80, -160, -32, 43, 113, 163, 62, 94, -15, -89, -155, -131, -84, 12, 91, 153, 100, 81, -17, -88, -121, -124, -59, -20, 65, 187, 113, 85, 48, -116, -93, -93, -120, 2, 49, 112, 141, 108, 13, -112, -111, -127, -102, -62, 52, 102, 149, 103, 40, -10, -152, -162, -116, -20, 29, 78, 209, 139, 24, 22, -95, -188, -103, -86, -3, 163, 145, 186, 49, -29, -104, -141, -133, -47, 24, 137, 162, 176, 56, -41, -132, -182, -166, -83, -25, 80, 146, 136, 96, 11, -57, -129, -85, -129, -8, 101, 140, 143, 67, 66, -77, -128, -180, -120, 10, 30, 150]
3864A50j0m4l8j36k6n1NO2J24R3M8l1r5p7r8n2N0L4J25O5P8nj13j10m3n0oQ4Q9
3893B2R7K7M0n3j75m8l4K0j0J22J01L5K7j00k9j27p6J6L2O6J23J00k2m9q2q8m4
3920a09J6k2Q1J14J10k8q9p6Pj40n1L5Q9J24M0N3m0j16rq1j31J18J10N5O9K5m7
3947A07Mj69r6L4j5P2N9J03N9k1m2j04j24Pn3J03P1L7J29Mq4m8n4j42L3N3N6J01
3975H0N3K5n4r2k1j12p8N2O7J76P3q7L9q2j47l3m3L9R4J29M7K0k8n2j13j22mL8
4003a36O3J41K7M7J1l5j65m7j14N4R8J08O2M7l7q1o5j06m0K4P0M8J39O4n6m4r7
4030b0q5o0rL1P2J41O5M4n6j13q9n6J4J7K8J51O3M4k1j28r9l8q4L9J11J14P2j6
4058A32Np7j28m2k6K2N2N8J20L0Rj13m8j16j5k9Q0R4J25M4q2pj20p2p4l7R0J22
$$ y = [150, 140, 96, 58, -78, -104, -155, -150, -88, 36, 129, 177, 146, 51, -26, -124, -176, -126, -92, 33, 98, 176, 171, 58, -52, -95, -145, -151, -67, 22, 119, 146, 186, 133, -42, -90, -124, -104, -114, 8, 109, 144, 171, 71, 42, -85, -161, -145, -113, -47, 76, 176, 154, 105, 23, -65, -109, -93, -115, -34, 80, 190, 162, 73, -3, 4, -136, -187, -152, -63, 61, 101, 154, 114, -2, -11, -92, -223, -105, 5, 60, 129, 154, 107, 111, -58, -154, -120, -135, -63, -4, 99, 158, 137, 95, -9, -133, -126, -179, -76, -5, 32, 161, 165, 81, 33, -21, -163, -130, -77, -21, 80, 133, 158, 104, 12, -9, -121, -199, -147, -80, 96, 169, 82, 121, 39, -108, -141, -184, -145, -51, 78, 125, 145, 117, 65, -48, -170, -174, -136, -73, 68, 95, 142, 153, 118, -47, -94, -208, -154, -56, 52, 114, 161, 124, 43, -22, -128, -168, -144, -74, -26, 113, 177, 121, 77, -20, -105, -165, -174, -143, -71, 70, 135, 179, 123, 10, -79, -135, -121, -104, -76, 75, 138, 182, 161, 33, -66, -104, -188, -149, -38, 76, 148, 132, 137, 60, -68, -110, -136, -114, -62, -4, 116, 146, 155, 42, -6, -122, -137, -166, -86, 8, 133, 177, 95, 88, -32, -104, -178, -215, -125, -3]
4086cN4J11J0n5j47j02n0mO9Q5J40NM7m6j51kj14m2L0J28J12P3lj6j16r0j05O7
4114a15m6J24J30L3M8n8n8n2j37jj3P5J02P2J06r3m9j19p1o7NJ14N6J26N8j2p5
4141H3j13j13PJ3L3J19M0M1M0l8j15j09l1n0M2J22J21O1L8o2j02j06p6j9M4Q8
4167d2J66J6N9p3p0j03j01j3M0P7J33O0M1q3n9j31m3p4O7Q4P4J10k7J05j56j41
4193h4n8n0J5J16J23R5l4M5k1j97r1nj3O6J15K6J16Qo0j18j06n0oN3R5Q9Q4l6
4221A17k1q3q5n0n7N3J03Q5Q3J8l5r9r2q3j3L4Q8N4J68K2k6j16j17o2j3j1J08
4248c0J22j0J54q4j25m7o8j29Q7O4J21P3L6rj27n5j42Pk2J14J26M2O5n7Mj13j05
4275a08o0J2R0P8P0Q5om2j06r2qj17R3O8J55M1J5l2o2j36j10k0k1J77M8J17M5
$$ y = [-3, 51, 162, 172, 117, -30, -132, -182, -186, -117, -32, 108, 113, 160, 114, -37, -39, -153, -195, -165, -37, 75, 148, 145, 129, 13, -77, -182, -115, -161, -37, 93, 126, 174, 116, 58, 6, -131, -132, -145, -70, 32, 104, 210, 117, 68, -51, -122, -189, -184, -70, -14, 112, 170, 158, 83, -30, -143, -136, -123, -90, 29, 69, 110, 150, 112, -3, -112, -143, -193, -151, -29, 92, 153, 191, 129, 27, -79, -155, -174, -130, -42, 124, 140, 199, 126, 56, -47, -148, -161, -121, -44, 89, 149, 190, 107, 48, -83, -126, -200, -133, -49, 25, 135, 108, 213, 57, -84, -142, -192, -177, -61, 62, 157, 123, 168, 147, -50, -141, -146, -159, -93, 22, 48, 164, 172, 112, -6, -112, -162, -168, -115, -20, 69, 153, 117, 96, 13, -72, -122, -179, -126, -23, 62, 145, 163, 128, 29, -63, -146, -159, -125, -37, 17, 185, 207, 181, 65, -52, -114, -127, -138, -30, 92, 82, 236, 152, 27, -20, -88, -217, -130, -66, 55, 128, 164, 155, 28, -27, -169, -162, -184, -70, 56, 98, 163, 106, 110, -3, -108, -168, -156, -66, 12, 82, 167, 161, 119, 13, -79, -87, -204, -111, -43, 112, 153, 168, 136, 74, -62, -172, -192, -213, -36, 12, 129, 174]
4302A74q1m2j39nj4o7R5R4J15O7n1q1j30o5p9L6J00J14O8JP4j33m8j44j5n1J67
4329d0K6J62J5M8q3j62p7m9JN0Q2J74Rl7j9j25nj51J0O6P4Q9J48m1q2j9j67m8
4357a51m1J02P1P6J09N1o5j20o6j05j5k1J40Q9R6K4j8p9j24q0m3M5O7J16R1K3
4383A72J9p9j30r1n3K5%J67Q0N1j0n1j47n2o6rJ5J36R7Q7L1p3p6j17j16R8j4P1
4411c5J23O4L6q5q9p5r4kO0R7J01lL5oq5q9j26j4L7J14M9J45L8q3o6q8m7l8kP7
4441e1J26O2J6L8j12n8j27l6j6R7R3Q4M7K4j31o9p5r7O7O6K5Q8J30j5p2j00j05
4468a01nk8lR1J24P6K4n8q0j61p5l6J22M6J12R8K4J3j33j02j53KL5P9J66R2K7
4495A96l0p9j22q9n9P0P2K2J34R8m1j41n8j22K3o6J00P8J16J09n4o4r6j32n3J8
$$ y = [174, 93, 51, -88, -93, -107, -174, -79, 15, 130, 197, 146, 65, -65, -130, -209, -173, -73, 41, 109, 110, 184, 51, 3, -141, -156, -207, -40, -14, 148, 163, 211, 128, -34, -111, -160, -159, -109, -27, 147, 156, 119, 100, -25, -30, -181, -171, -105, -31, 58, 206, 165, 83, 64, -103, -151, -192, -90, -19, 57, 166, 217, 152, 32, -34, -139, -154, -175, -35, 54, 150, 174, 156, 77, -47, -127, -170, -125, -58, 58, 149, 172, 191, 112, -18, -109, -162, -137, -137, 30, 110, 161, 151, 100, -47, -99, -165, -174, -159, -23, 74, 161, 192, 119, 43, -74, -190, -92, -106, -35, 88, 152, 188, 103, 14, -61, -155, -157, -97, 0, 101, 98, 133, 127, 42, -47, -173, -187, -150, -36, 13, 158, 196, 113, 47, -41, -88, -126, -128, -51, 75, 137, 153, 191, 79, 21, -106, -142, -158, -61, 32, 116, 163, 187, 56, -13, -88, -185, -118, -52, -27, 61, 191, 176, 104, 4, -101, -106, -134, -137, -46, 78, 154, 178, 120, 40, -121, -196, -232, -110, -64, 48, 146, 170, 183, 50, -52, -205, -203, -168, -89, 77, 169, 196, 166, 87, -35, -124, -183, -113, -41, -19, 115, 213, 172, 31, -27, -149, -126, -192, -92, -14, 102, 211, 157, 93, -3, -135, -188, -170]
4521a70K5R9J13M0O2m8j17j34k2l6R7R3J01O8KKj37q5j18L6P3j9J03Q7N2k4p6
4548F7j04n2p6j2J66N5L4N8j3p9n6r9p7L0R3Q3R5K5M7j41r1j06KL9K8J28O1J05
4576B10q2j6j36j9j05OL7J18O9J6O4k9q3j16p8k3N7J22J03M2k5Oq8j79M3n3k4
4603a63J47Q9P3M3o6p5j02k9q1K8J16O6J10L1m9j26j19l3K6L7P2M7R8Q4q6m4p9
4630A5j25k1l9Q2J19P9J19m9r7r2r3r4K0R2Q1L6J30l7m7r4q3p5R0L6M1Q6O1K4
4658A65o2n6j22m0rNQ0R3J01J4l9l6j42r0k8M9J12N0P0Q9l4q8j19r8p9NJ68N7
4686A6J11j1J6r6n8p2r0M3P4J06J04N0o9o5m8j60j1N4K9R7L4J05l6k7q0o9j8r1
4714a62P8P7Q6J19l1q6k0j46qqRJ20M5R8l5l1q1r6j04P7m2J14R0M4N0rq4j26p3
$$ y = [-170, -145, -46, 67, 107, 169, 121, 4, -130, -152, -188, -91, 2, 103, 171, 173, 175, 38, -47, -165, -129, -56, -75, 28, 115, 167, 143, 67, -37, -89, -165, -177, -11, 44, 78, 136, 123, 44, -12, -111, -188, -158, -65, 18, 113, 138, 185, 44, -47, -153, -151, -112, -84, 44, 105, 210, 128, 112, -24, -43, -148, -142, -105, 13, 82, 98, 162, 133, 50, -66, -144, -167, -110, 12, 115, 157, 132, 138, 50, -129, -86, -139, -163, -16, 73, 146, 189, 123, 48, -54, -83, -164, -136, -20, 46, 156, 187, 138, 12, -107, -140, -114, -77, -5, 42, 140, 224, 138, 94, 15, -110, -131, -170, -88, 31, 110, 229, 180, 83, -9, -102, -196, -176, -84, -3, 33, 163, 126, 79, -15, -98, -173, -83, -47, -6, 80, 141, 165, 103, 47, -75, -115, -124, -119, -39, 54, 155, 169, 130, 94, -48, -138, -166, -117, -5, 45, 115, 204, 170, 82, -37, -135, -214, -209, -41, 16, 127, 116, 132, 36, -22, -94, -184, -141, -67, 39, 143, 193, 124, 59, 11, -149, -160, -106, -77, 20, 54, 159, 123, 96, 16, -53, -71, -162, -84, -7, 79, 198, 167, 81, 61, -85, -93, -101, -92, 28, 73, 171, 136, 105, 24, -72, -176, -99, -141, -27, 63, 107, 157, 148, 64, -62, -135]
4743a35J1J4PJ86N4J6Lo9j37n0m1rO9J32O5L0j2Kj86m5m4RN9R0N7N5Qq3o4j59
4773a67M4n0J7J51R9M5k7K3j58q7p8K6N8J01J02M6J2r7n8q6m7J3m5J27R9Q6j7
4800A32kp0j16q4o1L0J07R1J27K3Pj40j06l6l0K4K2J12J22Mq1n6j7r7p7NO7J29
4828B9Q5J2k2%j40nq8K7m1J37J22nK2l9j22%j72P8PR7J08K1O6o6r4p7o6k0P2P2
4858bR9j7Q7p0m9j18m3p0P6J35NP1L2l5j36n2l6Pm7J06J17O2J2M1j00j08j11J1
4886a33M3k5J64L9M6Mp5p6o8p2M4KR2J16NO0l2j80r7k2N3j2J44N6L5L8m5j22q5
4915a03n1L7L0M6J27O0Jo0l8j00m4q4J00P8jJ41p5O2o9j00r7l7R4O4K3R5O1n1
4943A09j1j74n9K2M5jP1R8N3l0n1j13k5q3PP3P2R6M7K0j01o4n2q8J0M6P8J04J1
$$ y = [-135, -124, -110, -103, 83, 137, 153, 156, 87, -50, -100, -141, -150, -81, 51, 116, 146, 134, 136, -50, -95, -139, -130, -71, 19, 76, 131, 139, 56, -8, -167, -123, -173, -156, -5, 94, 139, 112, 135, -23, -110, -188, -162, -104, -3, 99, 145, 157, 60, 2, -84, -131, -118, -163, -36, 63, 149, 132, 130, 60, -56, -140, -201, -171, -64, 27, 154, 177, 184, 44, -62, -98, -128, -104, -82, 30, 152, 156, 75, 19, 2, -95, -172, -167, -100, 29, 114, 126, 104, 104, -36, -41, -129, -102, -143, -6, 116, 111, 133, 94, -28, -28, -200, -122, -115, -18, 90, 111, 177, 111, 17, -60, -126, -146, -74, -2, 97, 80, 167, 97, 48, -70, -113, -183, -107, 28, 33, 104, 136, 101, -35, -87, -123, -116, -163, -57, 60, 122, 134, 175, 75, -33, -144, -133, -90, -115, 49, 88, 134, 138, 63, -13, -81, -153, -109, -107, -15, 101, 106, 166, 134, -46, -143, -165, -112, -124, 20, 76, 111, 149, 104, -18, -103, -154, -117, -87, -41, 86, 146, 147, 87, 49, -51, -95, -179, -79, -1, -2, 139, 64, 126, 57, -43, -140, -177, -83, -19, 4, 99, 160, 109, 98, -76, -135, -113, -68, -69, 2, 100, 153, 123, 72, -41, -66, -149, -142, -69, 3, 99, 146, 166, 65, 1, -51, -139, -129, -83, -5, 99, 110]
4972A10J3o4l6p3l6n5K4O2J47M9l7k7j8j05j06K3K6Q5P6L1O5n3p8o1q4l9P5K3
5000f3P9J18K9n1p4or4o9RJ18K4M3J59j34l9n8q0Ll5Q2Q3M0O5j8o8j05q2n9L1
5029a52R9N6P2O2J2m9q9n5q2qN3O2O4R6J9n9q1o9q5J0O1M4Q1M5L0l3n3q5r6J6
5059a14j4J06P9K5N0n3o1m4q0O3j16J02Q8O9O7n7j1j17o4o3L3M6O0O5Q5k4m3n4
5087B3j18L0l9L2J13J3P9Lq5p1j06K4QN8N4O2O7Op7m6q5m0KL2O8K9N4Q1j03p3
5117ej17L8m8L1O0J03L8jj8m0j01m9jQ4j5O3N9J6K4j02l5n5o6J8P5J10L3J0Nr5
5147A9j9n6k9o5R2R0K0R4p7j1o6p8j5L0n6R7Q7N7j7l0n9m0j9m4J9P8M2P7Rn0r0
5178a0l1j6k2l4J10ON2P0L2q1j44r3P4PN9O4N4j5k0k5lr7k8p7Q7J07PJ13m0m1
$$ y = [110, 123, 59, 23, -50, -86, -141, -117, -55, 92, 141, 104, 77, 59, -46, -152, -129, -103, -18, 58, 89, 154, 101, 23, -38, -122, -161, -86, -63, 16, 134, 163, 112, 38, 32, -62, -131, -122, -4, 20, 63, 222, 88, 49, -9, -89, -86, -121, -39, 44, 84, 149, 131, 63, -42, -124, -183, -152, -53, 3, 75, 137, 149, 100, 11, -44, -126, -134, -81, -19, 45, 141, 160, 101, 20, -49, -134, -124, -63, -19, 62, 107, 137, 104, 51, -34, -130, -114, -128, -22, 57, 82, 132, 79, 18, -26, -106, -43, -159, -57, 31, 100, 167, 110, 99, -18, -82, -145, -112, -66, -6, 59, 144, 120, 77, 23, -95, -65, -104, -72, 41, 54, 133, 136, 51, -20, -126, -102, -94, -36, 18, 80, 147, 153, 76, 30, -55, -95, -93, -61, 7, 36, 90, 171, 68, -5, -122, -84, -132, -101, -41, 62, 100, 99, 81, 41, -60, -109, -110, -26, -41, 22, 81, 97, 121, 19, -16, -71, -137, -119, -44, 66, 99, 109, 114, 19, 0, -56, -85, -150, -58, 32, 52, 146, 69, 58, -8, -86, -101, -71, -127, -30, 57, 114, 97, 67, 8, -32, -51, -95, -76, 2, 44, 121, 130, 80, -10, -41, -57, -79, -113, -3, 3, 55, 125, 157, 76, -68, -161, -87, -80, -21, 43, 97, 82, 62, 37, 34, -63, -91, -168, -81, 26, 33, 146, 106, 65]
5208F5p9p3j8M9l6P8J04K5K2o2q7q2K6l9O4L2Q3N6J4p6n2p7l3k5P6K6Q3Q2j05
5237D1K5o4q0j2k4O0K7J1J05M1q8L5j41l4k2Q8lK7J22o1K1m6k8m0q2P6QN3j0J40
5267A45n0l6j26K7l8j6M4Q1O0K5K3o0q7m2m4l5N5O6O3M0Qm7n9n9p0J9J09l3Q6
5296D9O7ll6l0q2k4p0L2Q2Q2M7nLr7p7j4mM1nR5N5ol2j6j12Qn3M7l4J20L8K1J
5329H8jp7o4l8l1L7J03M1L9K7j26O1r1p3J5L4N0M0O9N0o7r8k1qr6P0kJ41L7K0
5359A29j8o4j22j7M1l5M9R3K3M6%p3p7k0j7k8Q6J9O3M9p4Pr0nl2p9J06J06J3M7
5389A26k9k4p8r1PoM7L8Q5O3J1n7p5r9l4M4OO6O8PK6mq4j16lo2J18%J15RK3K7
5421A24p6r8l4k5K8L7R3M8J2k7m8m8q2j8N6O1j1R8j5L7p0m3k1l2m0J5J25l8R0
$$ y = [65, -14, -87, -105, -56, -92, -14, 90, 115, 137, 75, -12, -94, -68, -107, -43, -11, 72, 128, 142, 66, 14, -63, -96, -121, -45, -19, 64, 146, 41, 66, 2, -78, -90, -114, -54, -27, -16, 89, 130, 42, 77, -64, -98, -120, -32, -35, -8, 114, 53, 74, 28, 0, -40, -122, -46, -38, 15, 5, 145, 95, 59, -67, -40, -78, -94, -50, 31, 91, 116, 139, 79, -8, -50, -94, -129, -74, -8, 55, 95, 103, 56, -3, -62, -132, -113, -4, -37, 49, 116, 113, 77, 47, -35, -59, -129, -97, -15, 67, 114, 109, 112, 15, -62, -76, -80, -39, -44, 51, 106, 100, 68, 52, -60, -52, -105, -58, -92, 28, 66, 87, 88, 87, 10, -54, -92, -123, -86, 17, 58, 97, 124, -2, 59, -32, -105, -90, -56, -6, 34, 103, 153, 86, -12, -33, -41, -137, -67, -69, 72, 109, 129, 111, 47, -75, -92, -51, -86, -37, 56, 79, 125, 125, 52, -25, -45, -62, -90, -4, 15, 78, 127, 53, 60, -30, -35, -67, -146, -40, 66, 79, 126, 97, 73, -5, -96, -89, -95, -48, -10, 75, 138, 149, 92, 17, -82, -116, -72, -66, 0, 68, 75, 101, 97, 13, -103, -106, -168, -50, -50, 65, 74, 97, 124, 48, -50, -84, -109, -81, -44, 49, 97, 109, 82, 34, -14, -96, -114, -58, 3, -8, 90, 75, 112, 42, -1, -22, -54, -94, -79, 46, 8, 98]
5450I8o6nk3r5rO5m8J03P1K5k6l9o1l1o4Q8r7Q9J27ML3n7o5n2o3M5j1K8O9P0K1
5481A24k6j05J8j06m3L0J23R5om2Lk2j07k7l6qJ27N3J3LK5r6j8p2J2K0L1O7L6
5510F6O5m1n8K4j07q2K6P4J05L3k1O8m0j58l2kJ2J5K0N5J07j1q2m1r4j3M7K8Q1
5539D4l6M2L7m8p3j0j0l0J9j4J14N4j6j4l4pq8l5N0K2Q7R9l9m1m5m7q3k3M4O7
5569a4L0N3L0l7o1j5j06J02o3L0P1KJ02m7r1l5m2L1jQM2M3N2k7J6n1j05n6L1L8
5599g0O1P3K8Lm6l1r6m2k0M7Q9N5L8l1N1j45L0p9m4N8N8O4J4L9l0o0oo4j2j0L6
5630d2L5J33m1K3n6n9o7oP3m8P7M1K8l3K8j10l3k1K2J5P0M6L1n2nr1o5j0M5L6
5660c6L0P6O8q6j7m8k8j6n9MO6J38m0O0n2l3m6o2l1K8J08L8J6M1l2l4n7p7MML8
$$ y = [98, 32, 27, 4, -91, -100, -35, -83, 20, 91, 116, 90, 51, -10, -41, -105, -17, -114, -25, 102, 106, 139, 82, 17, -35, -98, -53, -64, -36, 33, 103, 124, 98, -7, 11, -95, -138, -108, 15, 110, 104, 62, 65, 43, -64, -91, -127, -135, -8, 45, 58, 61, 86, -10, -28, -100, -88, -68, -37, 30, 66, 131, 90, 32, 56, -51, -133, -107, -33, 72, 105, 84, 152, 112, -46, -78, -80, -68, -53, -33, 22, 129, 118, 36, -5, -99, -112, -65, -37, 44, 8, 50, 87, 39, -34, -44, -54, -84, -65, -79, 35, 89, 73, 59, 25, 18, -70, -105, -55, -33, 54, 153, 114, 73, 28, -19, -102, -125, -81, -14, 16, 69, 99, 62, 1, -14, -120, -18, -81, -51, 20, 22, 124, 77, -14, -49, -91, -60, -61, -53, -11, 32, 84, 57, 73, 22, -83, -139, -108, -70, -9, 64, 92, 95, 49, 18, -78, -120, -140, -93, -4, 51, 89, 58, 109, -36, -6, -85, -129, -71, -13, 51, 65, 104, 74, 14, 8, -56, -68, -78, -42, -7, 126, 85, 108, 52, -7, -74, -80, -7, -55, 22, 63, 91, 58, 86, -24, -57, -78, -56, -41, 29, 75, 106, 54, 49, -42, -107, -117, -72, -36, -6, 70, 138, 52, 35, -13, -41, -57, -116, -112, -46, 92, 52, 112, 60, 27, -19, -81, -112, -84, 24, 62, 78, 119, 87, 53, -4, -81, -77, -73, -35]
5691c5J06NL9j04oJ7p2j9p0J16N2K0M6l6k4j1k2m4n7P5N4J6O8j2j0r6q4J8k5L1
5721f4P7M2M0Lk2q7k9l6j9O2N0Q7J8j3n4l8j7q0j9K3P6L9P6m3m1k1j7l2l4J7J4
5752d2P6N6J9Ro2o4o1k2JP3M6m5J31n8lj08M7j08N8nJ01N2k5O5p8q2k7qm6J22
5782A2k3O7M6p3No5Po8o9R9Q6KpP4o7Rm8q7m3P5N4N9N6l0k4m5k8l4K6nl2R1K2
5815D2P9q0J3m8p4Qk5Q4J1Q9J4k9k4o2n3j5l0P9K6K3R2m1o9q5Lk9O8K9QN7N6l5
5847H2j2k9p6m6J1K4L5J09q2L9jj22PJ6l0J2K5Q5J7nl1M3j30J3j08J49n7M1N9
5876C8O4p6K2j00l8L4J2oL7L1N1j6l2j9k1mn5N0J8P5M5L5m1r6p0J0mJ8LR3k0O3
5908A01j04n6O5j11M7k7J2J16J6J8l9K9j28lN6n1P1qJ9L9J1j5j23L6m3J9N7j4
$$ y = [-35, 71, 76, 115, 11, 5, 22, -50, -69, -139, -23, 29, 49, 95, 59, 35, 24, 2, -42, -99, -24, 30, 46, 114, 102, 92, -4, -88, -70, -95, -64, 13, 55, 95, 98, 76, -11, -40, -76, -95, -33, 17, 104, 122, 109, 55, 17, 0, -80, -99, -76, 0, 39, 115, 72, 31, 10, -7, -39, -73, -56, -42, 34, 90, 109, 118, 56, -8, -69, -91, -90, -17, 29, -16, 115, 57, 54, -54, -7, -115, -57, -62, 39, 91, 66, 131, 53, -29, -56, -64, -110, 12, -11, 56, 102, 29, 34, -31, -24, -92, -161, -62, 24, 26, 19, 93, 26, 35, -13, -100, -143, -68, -14, 45, 101, 71, 47, 2, -26, -60, -34, -39, -71, 20, 42, 121, 41, 54, 6, -68, -60, -85, -1, 10, 99, 113, 84, 60, -2, -55, -70, -100, -21, 5, 28, 120, 79, 10, -75, -72, -101, -33, -4, 4, 61, 117, 82, 70, 41, -35, -81, -70, -46, -11, 98, 16, 55, 54, -68, -61, -45, -75, -63, -38, 47, 64, 59, 28, 71, -59, -46, -154, -5, -62, -21, 38, 102, 26, 48, -52, -90, -56, -44, -50, -13, 18, 69, 53, 21, 2, -19, -23, -78, -28, -10, 65, 110, 145, 104, 8, -62, -52, -56, -38, -35, 58, 38, 101, -3, -59, 6, -105, -58, -85, -73, 43, 59, 77, 38, 67, -61, -64, -8, -59, 12, 4, 23, 62, 73, 58, -65, -29, -72, -53, 4, -10]
5936a0O2L3k3Nr3l7k7j5N5J15L4n4k2J4o2k2PK4l6N6J0O4J0q1m6m9k4jJ7P7M1
5967B2Q4m9m4Kp7j5QRP6ON1O3o0r8l4O1j16N9P9K1J3L8k5m5l5n6m4L6J2P0N0j0
5999E2%k1r9M9n6K6k3R2N9k4k0l6k7l4j5J3lJ17lJ0Mm1J5n6m9Jj3N1R3kJ7l6l6
6032El4k6J5J4k0Q1K2j1K0q4l8QJ9p7Q5K8P6k2m5K8j22K4K5l2qJ18K3l2L7n0q6
6063e9J2Ok7L5N7J6J3L9o9o2ql1j2J8P4L1J2N2l7m3j4j15O4Q2q5P9OM4k3p4l5
6094e4l1pN2K8M5nm5O9m2n8M7j00L6O6K3P1j00Q1k4m4q7l9K8O3O0M5k0Mn3l0m8
6125f9j9N2ON6O0N3r9L2p0p4Pj6N7M7L7J9J0l6p6j2j1j5K1L7K8M2Om0j8p4L9J4
6157fj5J5J26j08N8m9m3j0p2K0P6L1k3M0KOl8n1j7N8m1L5L1L2LK7m0k6n5m9N6
$$ y = [-10, 52, 85, 62, 67, -26, -63, -90, -105, -50, 65, 99, 45, 23, 37, -25, -47, -40, -16, -52, 4, 14, 78, 88, 7, -39, -88, -112, -113, -96, -19, 22, 106, 57, 13, 15, -62, -77, -69, -60, 16, 22, 73, 136, 76, -22, -56, 5, -111, -52, 27, 48, 61, 99, 74, 29, -6, -62, -106, -70, -58, 12, 62, 52, 52, 31, -68, -19, -75, -49, -72, 20, 79, 55, 35, -1, -28, -62, -77, -64, -67, 50, 47, 57, 61, 20, 35, -21, -70, -69, -82, -31, 62, 60, 77, 41, 5, -29, -55, -40, -26, -46, 35, 57, 46, 66, -18, -56, -48, -29, -106, -21, 7, 83, 61, 16, 44, -78, -54, -29, -61, -69, 49, 72, 40, 77, 27, -59, -47, -41, -68, -33, 24, 40, 53, 92, 23, -39, -47, -78, -90, -72, 2, 33, 45, 97, 60, 17, 3, -112, -48, 34, -51, 28, 34, 78, 55, -19, -54, -85, -92, -40, -12, 33, 28, -17, 52, 10, -48, -1, -101, -65, 1, 24, 95, -5, 76, 52, 8, -79, -118, -90, -27, 33, 78, 58, 62, 9, -21, -69, -88, -36, -30, 26, 86, 139, 40, 72, 2, -72, -65, -81, -24, 23, 60, 79, 89, 53, -23, -35, -46, -61, -40, -3, 25, 67, 73, 33, 15, -59, -20, -6, -21, -6, 120, 12, 70, 21, -22, -32, -104, -84, -8, 23, 0, 40, 42, 48, 10, -41, -58, 0, -41, -6, 25, 57, 60, 87, 47, 21, -34, -83, -27]
6188b7k5M9L5J2J6k3k4k2o3K8L7M4N7n7M5o7M8o8o0j6M8K2K9J07m6rn3k8k8K0
6218a9n3L1J11k0l8L1l5l7Pp6N0N6J4l4J47j13Ll2j0r6Q4k9R3O6n1%m2l5Lm1%
6249f5L7M2R6p1L1n2J0o7J9m2n3J14L5N0J2m5l5L8r9k1N7L4kL0j9L0j4l4m4nm0
6280g3P7N6n6Q1o0M4m2q2j5M8m0O0L5L8%n3m5m2k6M3j5Q1O0n5O7j00lK4j30J34
6310A1l0O1L9K9m5l9o5k0M4p1P5J9K7m9Q8k8m1p0%K7K4L8kM6Om8o3R2j33l6Q2
6341c2K4NL8K4n2P4r4o6J6oN9M8J2L7q4mm1M9m4K8KN8J7j6Lj5kj30O3o9L9P4r
6374FO7n0l5j7k6L0k4M4N9nmK0l1k2n7m0J00q4Q7k1J4N2n5J1m0mm3qL7O3L6j4
6406D6J7k6q7Jp5Q6l3L7O7K6Jl2l1n3j2QL3K3O3k4K4j9m3m9k9K4rN8M1k0M8Lj22
$$ y = [-27, -52, -3, 32, 44, 60, 37, 13, -9, -72, -44, -7, 37, 94, 37, 82, 15, 63, -5, -65, -81, -33, -11, 18, 125, 79, 70, 17, -11, -39, -19, -72, -41, 70, 50, 12, 43, 8, -29, -22, -98, -48, 8, 22, -12, 135, 22, 25, -7, -17, -113, -29, -58, 35, 101, 50, 50, 8, -27, -24, -65, -65, -28, 14, 110, 39, 70, 18, 28, -39, -20, -62, -115, -1, 34, 84, 96, 51, 16, 54, -45, -66, -9, 25, 23, 53, 34, 64, 50, 16, -28, -33, -73, 4, 60, 4, 85, 25, 69, 27, -55, -70, -22, -62, -2, 33, 71, 71, 18, -27, -69, -95, -52, -67, 14, 74, 19, 86, -14, -17, 7, -123, 11, -19, 42, 81, 110, 65, 26, -39, -59, -15, -86, -11, 8, 35, -14, 74, 46, 5, -65, -65, -38, -14, 24, 22, 68, 74, 26, -37, 55, -78, -114, -32, -8, -3, 35, 59, 7, 81, -13, -79, -63, -69, -10, 38, 50, 87, 3, -1, -42, 7, -37, -9, -7, 51, 68, 52, 55, 40, 38, -92, -29, -98, -59, 15, 6, 73, 23, -12, -29, -55, -25, -49, -5, 54, 49, 45, 65, 34, 12, -45, -85, 15, -69, 18, -3, 11, 63, 8, 19, -21, -25, -68, -76, -39, 24, 60, 46, 63, 37, -50, -49, -124, -38, -71, -34, 33, 59, 60, 28, -3, -56, -68, -60, -27, -4, 59, 35, 59, 40, -3, -52, -81, -57, -66, -8, 33, 13, 61, 64, -58]
6439e8klj8N2QJ14m8L5j6m5l3o0N2k4JJ23k9K7n7p2L8m8L3J0R1Oo8M8k5j5qj10
6471a01O1l4J14k1M0NO3j02l3on7J2j0J09KN1J1o6j3k6p4K2J2L4O9J1k1j2j1l9
6501a0j2k3Pl3J25Qk8N7j04Qmm8N8k2L6M7l0K3m8L8j09j4j3P4M1k4K1J6Pl8p0
6532f4O1j4KmP5j1L4q0J1n2o%J9j8R7Kk9M5p8q7OLP8PM1N1p7M3n5o3Kpl4P2M7
6567A7N1k3N5m6n5o5KL4M6L3J9L1p9N2j08j1L0mRrN9m2oJ2n1K3j5n5M8RN9K6l4
6600A2M1K1j10l1j1L8K3J7N6Ml0j1m7l5OJ9L1N8m3N5J3r1J9j1l3j0K1M9J02p5
6630D7pmj16J0Q5q0R1j6L7l5L5k5k6k3l4mL6N5LrK7n6nj8l7N7Pm0N5J0mj1j5J8
6664Hl9o3O9K9P2m8N2k1o0k5mm8K5L7jL9j5M1m6m9K3l8k7J25QJ1K3k3j2l8om4
$$ y = [-58, -60, -63, -81, -29, -21, 93, 45, 80, 64, 19, -14, -74, -22, -46, -45, 78, 49, 76, 19, -53, -15, -63, -30, -20, 71, 77, 9, 57, 32, 17, 9, -101, -40, -74, 40, 19, 59, 64, 127, 25, -8, -14, -71, -59, -69, 40, 42, 93, 104, 38, 25, -1, -75, -53, -41, -7, 62, 73, 52, 40, 29, -10, -22, -45, -38, -71, 54, 62, 34, 91, -13, -5, -9, -57, 1, -21, 15, 62, 32, 55, 7, 45, -64, -78, -91, -17, 24, 0, 21, 37, 44, 6, -64, -3, -17, -15, -19, 56, 45, 79, -1, 10, -42, -48, -48, -29, -47, 50, 52, 23, 68, -10, -97, -91, -88, -10, -3, 38, 89, 12, 55, 0, -63, -61, -68, -102, -30, 17, 68, 45, 100, 54, -1, -66, -64, -30, 16, 49, 68, 99, 20, 72, -36, -47, -17, -21, -12, -21, 38, -4, -10, 2, -49, -26, -41, -96, -48, -39, 20, 46, 12, 53, 74, -36, -67, -78, -40, -17, 0, 56, 60, 30, 19, -28, -63, -57, -38, -7, 51, 8, 63, 76, -15, 4, -7, -40, -50, -29, 20, 122, 47, 40, 36, -80, -70, 15, -65, 26, 10, 47, 12, 47, 22, -4, -27, -61, -65, -29, 26, 29, 20, 47, -9, -14, -32, -69, -12, -5, -45, 10, 20, 16, 5, -10, 8, -31, -94, -25, 4, 76, 28, 80, 59, -1, -26, -30, -78, -53, -16, -17, 22, 7, 48, 2, -47, -24, -62, -89, 36, 44, 55, 78, 55, 43, 5, -1, -45]
6696d5nO3rL9J0n3K6m6K7n3J0M7k5N0M4m5n2M7o0j2j5J6L5j0Q9k7o1J9m5k1M7
6727a5k3J7Q7m5L8o8N1p5J1j1L3j8L7M8l5K6k8n4j2KoR6j2l9O3no9m2L5m1rR0
6759B7j2Lj7K1kk8q1L3N7n3J08K7k8J4j7mn3q3P1N6n2L2M3Qn1Pn2o8N8k2M0N1
6791C3kL3k6l3Or1M5pN5k2N0K3K3r7llr3N8N9K6K8k8K0m3l1jrL4j5P4n0J6N7j17
6825c1L7k1k0k2R5j0QM2j6l4o1j4j6P5NoL1P4k4j8j00kl1K2LKL1M1Qo4K0nKm6
6859d5J5M7M5l9L9q9Q8n9m4n5L8L6M3mJ7J6J0l6m8qj5M1KP2k8Kj8O4j09Lj1j1
6891d1P4k3M8km6jm2n4J02l0jQ4j7l4JkJ6n6J1l7J09l5L1K0p9j5L0n9k3lM7P6
6923D9J0l9l6J2j9j4lJ8L3MrJ2KK5o8j9JL7qjM6Mj4j6L6j05O2l5K6M5K0rK7l4
$$ y = [-45, -50, 13, 4, 43, 53, 0, 26, -20, 7, -46, -36, 11, -14, 36, 80, 35, -17, 30, -30, -42, -57, -41, -6, -16, 73, 46, -15, 4, -41, -62, -15, -38, -21, 66, 21, 59, -9, 42, -33, -22, -33, 0, -18, 19, 67, 32, 58, 30, -24, -36, -34, -40, 56, 44, 5, 68, 63, -6, -48, -13, -54, -63, 27, 15, 18, 1, 22, 20, -8, -89, -56, 1, -52, 56, 83, 55, 69, 52, 48, -5, -88, -17, 39, -13, 19, 62, 70, 19, 26, -26, -94, -36, -58, -18, 33, 31, 64, 38, 5, 11, -80, -35, -42, 13, -9, 41, 64, 87, -10, -13, -16, -109, -51, 8, 34, 62, 34, 54, 11, -20, -21, -30, 4, -11, 63, 13, 29, 86, -31, 6, -15, -35, -57, 38, 28, 36, 78, 62, 28, -33, -47, -63, 12, 17, 11, 42, 116, 92, 74, -26, -28, -59, -37, -34, -32, -1, 40, 48, -16, 4, -1, 1, -45, -30, 17, 62, 23, 62, -27, 61, 2, -42, -97, -59, -23, 20, 16, 33, 49, 59, 23, -25, -33, -48, -7, -5, 67, 39, 41, 23, 87, -22, -19, -30, -41, 33, 10, 58, 56, 10, 9, -33, -87, 15, -15, -16, 68, 51, 17, 18, 16, 32, -24, -13, -50, 59, 24, 55, 75, -4, -19, 11, -48, -71, -74, -27, 49, 59, 20, -16, -4, -23, -37, -40, -22, 11, 15, 6, 18, 20, 45, -23, -42, -41, -4, -12, -13, 33, 37, 23, 7, 43, -62, 0, -35, -9, 36, 56, 47, 74, 40]
6957D0Km5o3N4o4O7oM4P1n8n9rm3K4L4KJ8jL4j9J8j11L7j7M7n4P7O4n1K6n5ml0
6990c0n2K1MQ9K5pLm4p2K8%n5P8L1LM9m7K5j3o7q%K2L7%Ok6J6l2k4j1kJ9L2J6
7025A4l6P1Rn0J3l7n0RQ6Pkj2k1j3J8n0K0k2M3J6q8J45j1o6k7k0M6j7L2o4O9O5
7057G7l7k7k6k2NmK5kN5n9L8Nl6%k3j9k5N9NM2M5Qj6j04J3o2P3M7Kjk4J0j8l0
7091b6K4n4K7L2nO2l6KJ9k6n9rJ5rO8n7M2K7l5N7l7k0l9L6%J2O2k8j0M2j41j2
7123g6K2N1mL3k0Q8lq7m5K5L1l3K8mO4m5K1o4L2q4Q5J7k1N3qmlo9Qk3Mj3P1Rj2
7158B4Rm5N0p2J0k7j7P6k1kJ6K0O9q3m6J4K3l3O9k3l6Q4j9j5op1J7j1O0L1j9M2
7190F8n3Nk2l4j1L1j4P8J3k0pj2np2n2K5J29k0NL7l8j3l6l7K6N8k4K2J6O1o9k1
$$ y = [40, 42, -3, -66, -12, -76, -9, -15, 29, 100, 42, -17, -26, -69, -45, -11, -9, 9, 8, 42, 23, 41, -70, -33, -50, -3, -57, 20, 84, 33, 59, 4, 0, -30, -82, -61, -57, 32, 57, 50, 53, 9, -63, -35, -35, -90, -12, 19, 22, 71, 24, 49, 36, -31, -39, -39, -17, 20, 20, 26, 0, 16, -16, -40, -51, -53, -34, -2, 14, -22, 49, 58, 8, 21, -16, -66, -57, 29, 36, 34, 22, 1, -12, 6, -44, -24, -46, -3, 13, -75, 70, 59, -7, -34, -54, -8, -25, 7, -57, 12, 77, 40, 13, -13, -35, -30, -34, -9, -11, 44, -15, 23, 28, -8, -8, -31, -50, -75, -16, -11, 31, 76, 84, 68, -36, -23, -85, -12, 35, 37, 36, 12, 22, 4, -26, -2, -56, -29, 3, -2, 60, 24, 26, 45, 19, -40, -49, -34, -43, 25, -32, 10, 37, 2, 59, 22, 2, -37, -1, -1, 11, 73, 45, 35, 77, -64, -76, -54, -3, -7, 26, 6, 94, 91, 4, -41, -16, 15, -18, 10, 6, 70, 25, 46, -18, 14, -70, 15, 32, 11, 64, 56, 52, 49, -20, -12, -35, -31, -44, 27, 36, 24, 33, -12, 38, -34, -24, -51, -68, 8, -13, -15, 1, 21, 90, 7, -39, -25, -2, -35, 34, 11, -25, 59, 40, 25, 19, -52, -35, -46, 14, 45, 26, 68, 15, 20, -2, -36, -47, -16, -30, 48, 61, 41, 34, 22, 17, -55, -107, -82, 47, 27, 32, 69, 31, 18, -18, -55, -29, 29, 5, 27, 43, 104, 35, 14]
7222A4k6K1j6k3J6jM2k1L1m2nK8l6jL4m1lK1R1k6o0K0o7k8L4R2l2K1K3mq7N7r9
7255g3L2O8m1Q4l3Kp5M9qjj0L6m7N8J0mo7L8pk7j0k5O2PM8Jj2K2j05K2%j8QM0
7289B4k0NN1qm8nJ7l0L1JP6m8RPq4oM4o2J4O5m8N9k3jkq3Q6k8j4k0L8K1Rmm4k
7325b3l9K8O0m7K3K1j0K1l5%l3J0j6J9N3M9k2J2m2m4k8k3M9qO2J8K7%q0L2l9k3
7357b8k9P2K0qK3K0m9K1l7j07O1n%Q2lJ6jno7KN8o4nN1j8M4k7j9J3lkM1k6LN0
7392G4k0o0M1k6p7L7K6pj9P4Lk1mK2q1M1n1OJ0L8L4L7j8m7n5mL4JO6jk7j0M1l5
7426B2p0M7J8m0J5M9J9%l3j4j7n1J1J3j0R7m4JL4o4L9n2m8O1NJ1K2rJ5k8j1MR
7459Ak9K1Q9o5n0J11p6K2o5P7n3J4N2k2m8L9k2rj9rKl3R7k0J2Lk3Pm4rM0k9M1
$$ y = [14, -12, 9, -7, -30, -14, -15, 27, 6, 37, -5, -10, 18, -18, -19, 15, -26, -29, -8, 83, 57, -3, 17, -50, -78, -44, 48, 16, 37, 60, 56, -31, 26, -73, -41, 27, -14, 70, 37, 39, -36, 13, 5, 4, -6, 30, -17, 41, 51, 47, -20, 18, 11, -16, -26, -51, 11, 18, 66, 67, 55, 77, -28, -6, -6, -24, -16, 24, 4, 9, 60, 52, 4, -1, 16, -14, 17, 18, 94, 46, 55, 62, -22, -28, 16, -46, -32, 33, -15, 44, 21, 20, 18, -65, 21, -7, -21, -41, -3, 18, 27, 23, -21, -23, -62, -34, 26, -21, 2, 23, 13, 34, -1, -1, -34, -24, -40, -21, 32, 81, 59, 71, 29, -15, -43, -66, -17, -25, 37, 55, 82, 82, 2, 34, -5, -28, -57, 15, 35, 27, 50, 70, 21, 42, 5, -102, -41, -46, -46, 36, 33, 49, 48, 43, -24, -22, 36, -28, -33, 18, 0, 44, 17, -2, 11, 8, 6, 47, 21, 24, 74, 54, -6, 35, 9, -68, -31, -5, -12, -31, 43, 46, 25, 21, 43, -38, 3, -48, -42, -32, 6, 40, 77, 59, 12, -43, -47, -13, -12, 54, 53, 26, 16, 57, 22, -48, -1, 17, -23, -8, 41, 60, 60, 27, 13, -4, -55, -44, -31, -41, 56, 12, 13, 47, -17, 22, -30, -78, -17, -12, -1, 21, 12, 27, -1, -12, -8, 1, -28, -7, 82, 17, -33, 78, 2, 24, -41, 36, -17, -3, 49, 27, -21, 18, -4, -13, -32, -41, -39, -72, 25, 5, 17, 20, -3, 4, -40, -49, -9, -38, 3]
7492CL2l0M0l9m0L2j6m5J4M5k0j4N7M8q9N5q9RL5L6LM5m0j0m2K4j4j4RO8l7K2
7524C8P4o5m6rm6l8jR3OJ0L2L8l6j3l9l3K4l9M4K9Ok6M0m3J8mr2N4J7K1J9j5N9
7557G7o3n0K4nL5j0l9N0L1n2j1kL0m9j2J06m3M1k9J1l1k5j1nK6K2M8m9K1J1j0
7588C7m2q3P7m1L1K8L5k3l0P7l9n5P0r4L5K1M1j3n5O4l2m3J1j3K1J8P7j00M0l
7618A7p1MQm3M2M9l6O4q%l5K6l8N7l5N0o1k1M5L3o5K8ol5M0k9P2l1K6L4o5jm1
7651b6%l0N0M8j7Pj8k0M0o6%K5k3M0L5q5J05p0PJ8o3j8L3lL5N7k6l4M0m9l1k4
7683f3M2R1m5MRj7J7l6m5L1J1J5L2pj0J0n8P4l3l5pJ8j8O1k4m9O0M9j08J1k1L0
7715a1J3J2K2j9Lk5K0k9J9j8K8J1j3K7qo0L0k5k2L5J7k9O3k0k3K4k7k7N4n0k6
$$ y = [3, 35, 5, 45, 6, -34, -2, -18, -63, -49, -4, -24, -38, 19, 67, -22, 33, -56, -47, -12, 24, 27, 72, 32, 22, -20, 4, -10, -24, -15, 53, 16, 38, 112, 47, 1, -8, -54, -92, -93, 0, 6, 16, 48, 86, 50, 37, -2, -35, -11, -50, -6, 23, 29, 3, 43, 0, 18, 14, -78, -24, -7, 14, 33, 18, 77, 14, -36, -12, -17, 18, 8, -31, 19, 50, -2, -13, -15, 15, -34, -46, 60, 17, 58, 29, 40, 9, -16, -27, -32, -6, 16, 64, 15, 36, 47, 37, -5, -88, -11, -52, -21, 7, 42, 19, -11, 66, 27, -28, 42, -52, -17, 4, 45, 32, -23, 41, 9, -34, -23, -36, -15, 3, 80, -20, 20, 17, -54, -50, -42, -85, -43, 6, -30, 34, 26, 26, -9, 17, -21, 36, 1, 51, -10, -31, 14, 47, -18, 10, 4, -31, 9, -20, 52, 21, 47, 81, 16, 15, -26, -26, -56, -6, 42, 25, 32, 14, -6, 34, -32, -32, -7, -30, 10, 45, -40, 65, -5, 2, 20, -43, -61, -28, -31, 4, 61, 35, 1, 41, -8, -39, -63, -21, 70, 25, 29, 38, 21, 38, 2, -43, -12, -1, 14, 46, 39, 29, 39, -19, 55, 22, -13, -20, -2, -20, 41, 17, -32, 28, 77, -31, -20, -41, -11, 2, 14, 36, 17, 20, -5, 15, -14, 5, -13, 15, 26, 13, 40, 32, -28, 2, -23, -45, -10, 7, -22, 41, 21, -2, 22, -5, -32, 22, -28, -54]
7746e4M3M4l9l1J5k8J1K8k7O2J6j9nJ1j7j8J7k7J5L0j1mK1K0p8J0o4O4JjMK4J4
7779B7Ljj8o2J5k3J7O4J7j3m6rJ7j2J5k5M4j5N9l8M8j1p6N3k6m0KN9K6m9K1J8
7811D1m9j5lj6QmL4l2O7rn9O4m1L2n1K4j8M3j5nl3M3j6j9MMN7pJ6Kn2J0l3L1l2
7846b9J3kJ8J4K0%r3O9J3k5lJ5L1Nk1O4j04pnj5Rj1L1P9j4q9M5p7L6O1l8J0QJ0
7880A8m3L5l5L0o7M1kKO1j1oJ8q0O3p9M5M1m5J2J1P4o1J4r2L0om7N1N2j6M1q6
7912c7N4mq1K9K9lJ3J9Jl1j3L9m2kJ4jK9K6j2o0O1l9jMl0L4oL9oL6qm2lj6k1K6
7948el6L7J9Rl2K7Oo2%K4l5N8j7k8O3l4N3k6n8J8L2%QrK9m5L0l2k6qk2M2L6oJ6
7983B6Mk5Po7K9J2j2K4M2j1l6M1p9JJN6jK8l4OKOk9l8lN2j1J4%J6KK6p8PK1J0
$$ y = [-54, -11, 33, -6, -37, -22, -50, -39, -11, -38, 24, 40, 21, 16, 27, 10, -8, 9, -18, -3, 27, 16, 12, 33, 53, -25, -15, -79, -15, -14, -15, -11, 13, 27, 30, 29, 11, -51, -36, -59, -42, 22, 39, 26, -20, -29, -12, -24, -9, -34, 10, -5, 54, 16, 64, 53, -23, 30, 4, -36, -34, 25, 51, 2, 23, 41, -8, -23, -26, -42, -34, -38, -4, -36, 31, 22, -37, 27, -14, 18, -33, -9, -27, 16, 1, -4, -37, 6, -10, -29, -25, -21, 36, 29, 45, 47, -5, 5, -28, 3, -29, -16, -18, 0, 14, 34, 34, -59, 10, 23, -2, -5, 10, 41, 46, 25, 89, -15, -22, -27, -42, -33, -44, -13, 66, 52, -37, 8, -69, -33, 28, -10, 0, 8, 18, -25, 10, -25, 5, -62, -21, -23, -21, 40, 29, 23, 41, -39, 24, -55, -10, 31, -14, -2, 9, 83, 22, 36, -56, -26, -32, -79, -28, 24, 8, 49, -37, 17, 13, -68, -39, -10, -13, 0, 19, 20, -11, -24, 15, -27, -29, -15, -16, 13, 39, 27, -33, 28, -11, -12, -8, -38, -4, -10, 29, 23, 59, 51, 9, 6, -10, -31, -5, -41, -4, 15, 24, -8, 19, 25, -37, -37, -13, -48, 10, -7, -35, 28, -6, 47, 21, -37, -19, 13, 13, 21, 12, 41, -4, 26, -6, -32, -40, -62, -20, 16, 10, 26, 30, 5, 12, -55, -26, -14, -26, -2, 40, 29, -7, 34, -45, -44, -43, 13, 12, 40, 6, 12, 14, 20, -9, -47, -50, 2, -9, 5, 5, 21, 23, 49, -29, -22, -1, 9]
8019IK7k9j1L7l8M6j7qm3JNM4k7qL7l9K9j7oj9O8j6O6o2J2n9L4lm2jJ5L2Jk8m
8054a4P3q4j2O6Lm1P8l2Qq0N0M8p3jLJ3l9Q7q0kO4n9J6j6k4K4j2J1O6p1O9p0L8
8087Gn2L4k2NL8K1K2k2rn0j0K2l0K5O6l8J6N0m9j2K2q8M7RRK8Rm2J6l8NK5j08
8120i4O3K1L0J9l4J3M1p3k5K4Qk4K3J5QN7j09P5o8J9K0k4L4L4j5p2R0j01j7mO3
8151cL9jNl8NL4q2L8j8jK5K0J8j2o5J5M2o8P2o5J0MP7p2O6l2Lm4MK7j7NP3k0m
8186D0nl2K3q0M2
$$ y = [9, 36, 7, -4, 33, -5, 41, 24, 16, -27, -26, -21, 23, -4, -12, 25, -14, 15, -2, -8, -27, 41, 25, 91, 29, 41, -18, 16, 13, -29, -30, -15, 17, 18, -10, -14, 59, -25, -37, 29, 32, -9, 69, 37, 45, -35, 15, 63, -10, -11, -8, 5, -34, 53, -27, -29, 35, -24, -8, -24, -48, -24, -36, -25, 41, -30, 39, -31, 7, -45, -11, -33, -28, 10, 31, 53, 31, 22, -28, -38, -16, -46, -21, 45, 7, 23, 73, 24, 12, 34, -54, -7, 2, 11, 39, 48, 6, 22, -16, -11, 14, -94, -31, -10, 20, 39, 5, 18, 59, -14, -39, -15, -7, -31, -8, 7, 15, 72, -37, 38, -30, -11, 9, -15, 19, 53, 38, -34, 56, -45, -62, -66, -3, 36, 35, 40, 2, 7, 41, -41, -3, -21, -22, 3, 23, 41, 29, -36, -21, 21, -47, 25, -40, -30, -26, 51, -21, 45, 13, 16, -28, -24, 3, -14, -9, 64, 44, 40, 35, 3, 26, -54, -12]
8191a2
$$ Imaginary data points
##PAGE= N=2
##DATA TABLE= (X++(I..I)), XYDATA
0@%%%%%%%%%%qJ6j6J6k4L2m0M8n6P2q2R3j15J36j60J86k16K54k90L32l81M36m96
33b63N61o35P17q06R02j010J130j258J397j551J719j902K102k322K561k823L112
50A631l426L775m163M592n071N610o220O916p725Q675r806J1182j2899J5114j8095
65i910K2348k8956M0729o8138K52363J44962l85616j36362K0297J36036j5020
76b7267p5337l8992J21239J12676j4089j56080r5841M6158J41914O7071k5991
87E5461k8560P7884J01096k788j39020j41118m7810K9938L900m0487q582R9591
99d0495J33507K7917j14920j17944K3499J49739J05305n3593j33094l3589J05982
110E2314J03665m1130j53522j13610J6449P4914O085p1190j8991J22420J81153
$$ y = [0, 0, 0, 0, 0, 0, 0, 0, 0, 0, 0, -8, 8, -8, 8, -16, 16, -24, 24, -32, 40, -42, 51, -64, 72, -88, 98, -118, 136, -154, 178, -203, 233, -263, 298, -337, 380, -426, 476, -534, 596, -662, 735, -816, 903, -999, 1103, -1219, 1342, -1481, 1631, -1795, 1980, -2183, 2409, -2662, 2948, -3272, 3644, -4081, 4594, -5212, 5970, -6929, 8185, -9910, 12438, -16518, 24211, -43927, 208436, 353398, -32218, -168580, -148283, -12247, -27267, -102604, -141596, -20357, 92319, 78230, -77850, -173691, -127533, 14381, 81452, 55461, 26901, 104785, 205881, 203093, 64073, -77045, -124855, -94917, -91017, -131504, -140086, -40495, 93012, 120929, 6009, -111935, -88436, 61303, 166608, 113015, -20079, -53668, 52314, 155979, 114849, -38673, -152283, -135834, -60920, -54835, -126025, -145016, -22596, 158557]
121A58557P2117r6280j53761o1981N2078O2156l697k7477J9811N0727j488q8954
133a8192j09488l2046N8942O4036L353j1349N9924J22183P1564o3986j46855r1300
145i3214K9112P2412J0591m6684j3170O0292N9431m1611j35323r8852M7703J49757
157D44J04941j4564o3508l994O3291L6240n8297j01874m3019L7545M2561j6285
169a6519m7268l002O1085N6514k1739p7660l7685M8378P6235K5675k4051p706
181C2257M0997L6216l9925j02776p3135J4834N8963J9343l7146k4479N2903R6852
193G4904L5804p1398j01892k3942O7380P5518J3142k9385l804L4412O138p6117
205G60j14892n3036N4024J02185N6633j4231k4696J9015L5412j1830o1511m3485
$$ y = [158557, 230674, 134394, -19367, -81348, -29270, 32886, 29189, 1712, 21523, 72250, 70762, -18192, -127680, -159726, -100784, -36748, -33395, -44744, 15180, 137363, 208927, 144941, -1914, -93214, -64102, 8310, 18901, -27783, -40953, 19339, 78770, 37159, -98164, -197016, -149313, 444, 105385, 90821, 27313, 23319, 86610, 122850, 64553, -37321, -80340, -42795, -234, -16519, -63787, -66789, -5704, 50810, 29071, -48589, -86274, -37896, 38339, 64014, 39963, 32257, 73254, 109470, 69545, -33231, -106366, -91532, -32569, -13226, -50372, -74851, -21948, 74904, 110708, 39310, -62582, -86524, -19144, 56374, 69516, 40131, 36327, 70739, 76877, 760, -114132, -167168, -113144, -10959, 45674, 31443, 6747, 25762, 61174, 49344, -12167, -55652]
217e5652K5398O5012L2726k6182l8758q54J9995j7719o8555n7900J9426Q5897
229a7166P1307l85l9166m748M0809K3129m0935o8784k0912M7803N5270o410n9030
242a9218l7289K7908N0543O64n8882n1447J9882P3373N2697l908k1416R052K6743
255F8702r490o3844o9003j1163M9855N1064L729k5804n857K3323R625l6494n1523
268f6880k199O3036P0654J7142l0344k3980P452M186m1590p2421l6185M2105Q1762
281A2738M3784k3492m4443q607K5318R238k9756k9122K2186O4162M3988j7613
293F8381n4413l5000M688J1006j9595l6677n475M2994N1088J0540k7294j8336
305h093J7377K5384r173l9166k0623K7272M5919J2084l3755l8316j857K3390P83
$$ y = [-55652, -30254, 34758, 67484, 41302, 2544, 1690, 21685, 3966, -64589, -122489, -103063, -17166, 54141, 53756, 14590, 9842, 50651, 73780, 32845, -35939, -56851, -9048, 46222, 39812, -19218, -56507, -28599, 21944, 22608, -36274, -87721, -67839, 5534, 58231, 54323, 32907, 41959, 68702, 59212, -4632, -73635, -84798, -34943, 16121, 19850, -5954, -11811, 11512, 21137, -15357, -66880, -69079, -6043, 64611, 81753, 51409, 27429, 34881, 39067, -2523, -74944, -111129, -69024, 12738, 56522, 33030, -11413, -20020, 5298, 14536, -15220, -44342, -22156, 42006, 85994, 68381, 13968, -21032, -16344, -5338, -24933, -61610, -67085, -24091, 26997, 37537, 10243, -8093, 9284, 34668, 25495, -13671, -34294, -7022, 38897, 50981, 17226, -21090, -22947, 443, 1226]
318A226l9177l7312J5876O2632N1297m68l0851j2723J5703O278l1680m5591q955
331e3745M2018N1096R669l4547l5641n074R447r560k4807O9M7085O1705K3204
344H0919k8642m2163j5707O346m959k6949j8673K2110M9906K7632k3999m8335
356b2514k1802J8167K3452l076j5167J0672M2454L5520r625m5040l5205J146J7396
369c622k365k4330j2263K3951L8636J1331k5097k6755M197K4502Q039j9733j7367
382b0876J6214L9419K0856k1075m0421j9909Q893P922j7323k4423P136M5281M4651
395D6345L714l2685k8428Q47J3469k464j7038k158K9097L6378M305l7099m4557
408c0274j5633J2166J0494m011K005K8988M1498J5306k7229m1935j7306J3600
$$ y = [1226, -37951, -75263, -59387, 3245, 54542, 54074, 23223, 10500, 26203, 32481, 801, -44790, -53745, -11727, 39369, 49038, 14491, -21150, -26224, -16777, -26337, -51144, -51075, -3990, 57715, 80919, 52277, 10114, -5593, 753, -4206, -31155, -49828, -27718, 22188, 49820, 25821, -22514, -44316, -26149, -2697, -5773, -20940, -10268, 32186, 67706, 58081, 13041, -22164, -21018, -3622, -5987, -30317, -42580, -18629, 20007, 31338, 6241, -20514, -16317, 8185, 16224, -3509, -20876, -4662, 34757, 55613, 34538, -5883, -25792, -16899, -8977, -26300, -50723, -43587, 1694, 46345, 50059, 17374, -11054, -10207, 3262, 798, -16240, -18398, 10699, 47077, 51382, 14283, -30274, -45907, -33741, -23247, -27258, -25253, 3735, 45233, 60539, 33310, -8625, -25931, -12331]
420a2331J6093m031j2347O621K8046J7705k0772m5054k6273J3837L0537J2670
432D701q052j436K2282K7209m43l1606l1728l572J8032J0127j1592j4793P514
445a3357K5220J2263j7670k7893p115J6670J6022k687r025R634K9126J9435j5034
458C5589l8124k6981J993J4749J279j1738J147K7681L0570m04l2677l1955k158
471c1029K1985J7596n99l064J3565K1279L35l2065m1455j6807J5892K4148Q278
484a941j880Q688K0295Q671j8867l2059j4485J5795K6416R807r230o391Q701R210
498B2730j2397l2039k3284Q272K8656J8059m228p694Q726J8525M450j9844k5906
511a5974n712J7132J6264l304j3136r86J4405R212j3971k7397j2937J3738K2262
$$ y = [-12331, 3762, -269, -12616, -5995, 22051, 39756, 18984, -26070, -52343, -38506, -7969, 4701, -3351, -4787, 17495, 44704, 44261, 12655, -19073, -22645, -4613, 5514, -6078, -20871, -13357, 11863, 24126, 6456, -21437, -28552, -11882, 4140, 1453, -7572, 2062, 31188, 50623, 35589, -2535, -29516, -27523, -12774, -11495, -23233, -22086, 5595, 36165, 35761, 3084, -28871, -31029, -9044, 8552, 7953, 4889, 18454, 39733, 40068, 8003, -33452, -50259, -34367, -10219, -1941, -3821, 4867, 25162, 33833, 14966, -17093, -31578, -15783, 10633, 20440, 11210, 4819, 13520, 22730, 10333, -21706, -44990, -36718, -8062, 9997, 5769, -1925, 6801, 25326, 29776, 9932, -15974, -21686, -4554, 11710, 8406, -4730, -5716, 8689, 17901, 3930, -23467, -36404, -22666, -404]
524d04Q724l303K747J6176J3506j0066l1804k6454J095K0496J4164k687n242P688
538D636J3906k004k5342k6807j052K5259K7155R437m901k470N148j479k1190k9462
552b9166j1242J6762K6015J1541n882o573M227N067r603k0335q579J5853K6899
565A4984J4016p598j4162k538O243m397k1284j9293L729K3263J9227p53j1607
578a70k008J1642P593j0508j9301o782J3789J9766N946j0132r081L119M714r629
592a042k1106j2615R567K3146J6213O60m038L000N242o859k0301j7166L384K1803
606a12J8990j78j2119o369J891l216j5866j6353K460K4924K8015R198j0443j2200
620H622k507M12q790j6237o899J3994K3588J0226j0503j6275n822L659O11p568
$$ y = [-404, 8320, 5017, 7764, 23940, 37446, 27380, -4424, -30878, -29783, -9287, 4877, 2190, -3052, 4636, 18542, 16538, -8804, -35611, -36663, -11404, 15751, 25188, 20287, 17817, 22965, 21486, 296, -29166, -40408, -23646, 2369, 13910, 8028, 1455, 5682, 10749, 1146, -19189, -27768, -11915, 14984, 29000, 21402, 7240, 4702, 10945, 6548, -14736, -34029, -30300, -7037, 12190, 11437, -170, -2178, 9464, 17057, 6549, -12752, -19534, -5745, 14021, 19967, 9835, 754, 3873, 8587, -1042, -22148, -34763, -25196, -2050, 14163, 14823, 10785, 13785, 19027, 12168, -8133, -25299, -21915, -112, 18878, 18700, 6581, 212, 2103, -1113, -16979, -33332, -30872, -5948, 22067, 31265, 20822, 8622, 6115, 6527, -2263, -18500, -25399, -11405, 12183, 22409, 11906, -4369, -10191, -6532, -5921, -13489]
634a3489n383R845K1727J4939l925j4633r130R68P31q946j2516OJ5683J5457M47
649A1781j0695o847L838N960m138j2023l868J3750K0158P843r306j3363m327K112
663H75m845j5125j0272R380K3145J6914j169j2431q391R91J348o965q437M399
677a0583J8546J7223N31j5336j6350o306m52l751m950M865J7316J8445N197j0397
691A3998j4227n387K479q3n230o54J1095J5585M375j3132j8777p755N425N986
705f302k141l919N768J6157J3657k022j5226j2233N70O237n15p590l219Q270J3039
720A0531L675r782j2508m064L541K521j485N97R169J4311P035p174j3698p921
734e252p21j256n709l154Q188J6750J0866n725j6242j1025J197O589K222j867
$$ y = [-13489, -18872, -9027, 12700, 27639, 23714, 9081, -49, 919, 1650, -7296, -19812, -19806, -4123, 11334, 11781, 1086, -5761, -1923, 4037, -101, -12124, -15992, -2242, 17916, 25759, 16453, 3090, -1237, 875, -3970, -19095, -29367, -19987, 3158, 20072, 18903, 6472, -1919, -928, 420, -6545, -14982, -10583, 7963, 25186, 25717, 10381, -5969, -12275, -12727, -16478, -21428, -16563, 753, 19198, 24395, 13998, -229, -5616, -3137, -3220, -8450, -9104, 1991, 17576, 21951, 8819, -9958, -17713, -12288, -6302, -8443, -12362, -6594, 9563, 23220, 21198, 5972, -6261, -5691, 546, 31, -7559, -10778, -2508, 10531, 14206, 4424, -8084, -12148, -8607, -6086, -7571, -6974, 2195, 16506, 23541, 16367, 2669, -5252, -5973, -7229, -12938, -16092, -7904, 8846, 19712, 13987, -2255, -13280, -12083, -5494, -3272, -5139]
748e139L667J3989J3851j866j8433j9541o461N741P011J475M86P035J0621L364
762A5800r062j3627o515M279P911L815P53M208P152J079j0208j4618p460L036
776a3457O611K192j110L590J0334Q067l293j2599r878J423Q524L847m323l559
790c631N563R936K037j0566j5015o999M732Q512L951Q66M657R137N361n687j3728
805h74j0450k29N775L934J333L482O439K831o516j3290r783J148R012P519K989
820C320K990O773N602m150j4796j4482k657Q882R429K382j691J122M116O37p875
835c98j1600m307P464J1954O368p21j763J566J216n298j0853p614J514P439N517
850D84Q56q2K736L577j781q255p701N82P867O957J108j633J411L514j303r534
$$ y = [-5139, -1472, 12517, 26368, 24502, 6069, -13472, -19933, -14192, -7181, -5706, -5220, 1815, 12436, 15800, 6738, -6889, -13404, -9125, -1214, 2601, 3354, 7562, 14714, 15793, 5585, -9033, -16493, -13457, -6846, -4654, -5764, -2174, 8160, 16227, 12934, 335, -9543, -8120, 404, 4251, -72, -3631, 1932, 11868, 13905, 3339, -11676, -18675, -13943, -5431, -1480, -614, 4043, 13180, 18541, 12854, -874, -11324, -11553, -5778, -1844, -511, 2971, 9410, 12241, 5725, -7565, -17348, -16200, -7188, 331, 3320, 6310, 13083, 18685, 14535, -261, -14743, -17400, -8518, 911, 3293, 1602, 2724, 6840, 7477, -398, -11998, -16305, -8841, 3113, 9481, 8760, 6997, 8563, 9779, 4481, -6372, -13986, -12472, -5033, 484, 1340, 1258, 3994, 7571, 5790, -2465, -10166, -9584, -1717, 5240, 6348, 4715, 6126, 9640, 8337, -1197]
866a197j1762m421N616R284N459Q82J167L781J778n982j1261o849L666J0183P631
881G975Q83k064o70q46n593j0097p302K235J0716J0823M073j508j483L8k732p658
897c210p697l11P954R302L205l107l919j430j416m836o212j339P036J0624N881
912A0525j412l539r31L36l462p301n096K511P886N998j76l510j520J137q15n337
928d706n883O11Q425R355L529k534l233j173j950n911p428k609N405R457O166
943G521j63l173k115j394l512n465k056N460J0170P063l24n087m732l166l906
958d879n399l135L781R681Q791J712m645n074j706m64k609l072J343P193P939
973I457K077m912o831l834r02j276k345j92N012Q353N311j399m960l301m47p73
$$ y = [-1197, -12959, -17380, -11764, -2480, 2979, 3861, 5028, 8809, 10587, 4605, -6656, -13505, -9839, 344, 7975, 8858, 6794, 6124, 5278, -315, -10412, -17714, -15479, -4763, 6060, 10133, 8625, 7142, 7180, 4448, -3210, -10907, -11218, -3264, 6038, 9243, 6136, 2217, 787, -629, -5465, -11677, -13016, -5980, 4644, 10525, 9113, 5574, 4643, 4979, 1517, -5784, -10880, -8369, -483, 5515, 5339, 1829, 309, 1446, 631, -4706, -10589, -9978, -1553, 7802, 11331, 8797, 5564, 4391, 2441, -3470, -10898, -13507, -8102, 1355, 7521, 7358, 4185, 2070, 676, -2836, -8301, -10357, -4897, 5273, 12336, 12012, 6925, 2193, -973, -4879, -10278, -13413, -9632, 49, 8840, 10552, 5907, 833, -873, -1337, -3946, -7018, -5675, 1518, 9457, 11534, 6622, -209, -4043, -4945, -6221, -8566, -8758, -3746, 4607, 9918, 8519, 3559, 258, -189, -962]
989i62k904k215K178O342N183k37m712m680j796p09j938k134J939P361Q258K943
1005A1917l507n456l321j778k434l056J03N414P735L896k758o413m899j291j14
1020e962p03Q46N438Q364N304k008p243o710k944l97l04jK889O105N389O8n564
1037B567o402k530J291J846J012K114M747M660M21m789o639m109n02Q67K21Q37
1053d388L791N495K983k305n550l626K49J515l9l38K300N020L898j276o270o626
1069e167k593J032J519O87J967N028N642J816m176o681m060k42J468J622K004
1084a34L425L656O71m120o803m860n51K348K628L029M419M826J882l730p103n355
1100e772o39K498K411J171J475K730K386j543o034o130j451L360M520K817J227
$$ y = [-962, -3866, -6081, -3903, 2439, 7622, 7385, 2673, -2007, -3803, -4512, -6450, -8584, -6645, 716, 8974, 11917, 8410, 2954, -367, -2145, -4579, -7635, -7532, -2118, 5617, 9513, 6755, 342, -4557, -5848, -5962, -6665, -5819, -381, 7983, 13287, 11279, 4036, -2674, -5618, -6015, -6319, -6320, -3431, 2674, 8063, 8131, 2567, -3835, -6365, -5074, -3228, -2216, -102, 4645, 9305, 9726, 4937, -1702, -5811, -6313, -5446, -5225, -4388, -597, 4898, 7881, 5576, 26, -3600, -3351, -1836, -1875, -2213, 87, 5107, 9005, 7729, 1459, -5167, -7760, -6728, -5209, -4522, -2555, 2473, 8115, 9931, 5755, -926, -4986, -5228, -3760, -2138, -134, 3291, 6947, 7618, 3498, -3305, -8165, -8716, -6368, -3740, -711, 3708, 8534, 10416, 6686, -417, -5772, -6411, -3913, -1502, -331, 1144, 3874, 6260, 4717, -1317, -7447, -8898, -5538, -1018, 1799, 3026]
1115C026J845K306j35l956n848l726J47K742K626J459J458J989N67k696m510l016
1131e722M59K707K609J674K166K735J283k926o097n497j645K391L440K020J342
1146I39K642K624m53m857n922k605K320M934L777J398O72K29j342m039n665l777
1162i125P28M377M621K711J476R31p86l312m667k929P99L791L734J566K23o9o77
1179C392k774m558m011LM136M903K345M13J74M50p56l073m298k246J674L920L039
1196B733O64n81n94p61k423l645k439J260M143M079K411P13j75j137k731m284
1212b767l483j10L271M018K344L19m32p36j941l696l509j5M036N268L487N82j496
1229E140j926k278l368l481j422K492M786L867Q64j345j758j466j947k290r98
$$ y = [3026, 4871, 7177, 7042, 3086, -2762, -6488, -6341, -3599, -973, 486, 1944, 3933, 4500, 1804, -2706, -5722, -5263, -2556, 53, 1727, 3893, 6628, 7911, 4985, -1112, -6609, -8254, -5863, -2423, -403, 939, 3581, 6205, 5752, 895, -5027, -7632, -5312, -378, 3399, 4797, 5469, 5698, 4356, 317, -5348, -9125, -8397, -4020, 601, 3312, 4788, 5719, 4933, 1621, -3046, -5975, -5176, -1385, 2349, 3915, 4138, 4069, 3392, 618, -3940, -7951, -7948, -3812, 1091, 3436, 3849, 4023, 4473, 3717, 644, -3654, -5900, -4226, -306, 2733, 3397, 2816, 2222, 1461, -962, -4607, -7046, -5786, -1643, 2436, 4847, 5560, 5385, 4248, 1517, -2767, -6250, -6360, -3089, 929, 3273, 3592, 3160, 2424, 483, -3213, -6722, -6737, -2701, 2567, 6054, 6636, 5140, 3214, 936, -2432, -5913, -7335, -4843, -57, 3810, 4674, 3329, 1571, 105, -1842, -4132, -5130]
1244e130K058M212L811J290j560k369k084k139k478j884Q56L592M198K009n08
1259C874j554j172j181j896j820k3K475L785K426j65k086k035j743k109k303o50
1275f177K287M436L898J154j257j981j803k062k060j086J222L704L932J332j728
1290C811k870k463j884j498o89J454L841M504K371q83k753k802k245j378p32O33
1306c583K619L686K189r25k761k700j612p14j88P50K466L719K696O9k378l058
1322B75k164j058n72j76J199K909K903R04j583k656j955q25k16J72J173K741L056
1339D127J435j001k909l030j759q36l08O37K587L547K240k62k533k863j819n03
1355c250K21R63K140L010K256j62k816l736k522p69L18J057K171L019K575N57
$$ y = [-5130, -3072, 1140, 4951, 6241, 4681, 2312, 228, -1911, -4389, -6273, -5417, -1825, 2373, 4382, 3874, 2320, 1148, -33, -1929, -3749, -3772, -1297, 2488, 4914, 4749, 2663, 628, -1115, -3224, -5527, -6177, -3890, 546, 4444, 5598, 4341, 2360, 557, -1505, -3565, -4651, -3429, 275, 4207, 5539, 3811, 941, -1522, -3406, -4904, -5593, -4139, -298, 4206, 6577, 5694, 2941, 139, -2106, -3484, -4216, -3583, -964, 2722, 4911, 3986, 1225, -1475, -3087, -3801, -3989, -3239, -773, 2946, 5642, 5711, 3333, 275, -1889, -2947, -3519, -3695, -2496, 413, 3316, 4220, 2637, -19, -1974, -2799, -3015, -2843, -1670, 1071, 4127, 5562, 4561, 1652, -1378, -3137, -3973, -4281, -3644, -1057, 2490, 4730, 4468, 1935, -928, -2747, -3250, -3029, -2066, 74, 3084, 5340, 5178, 2362, -1374, -3896, -4665, -4347, -3290, -1119, 1900, 4475, 5032]
1371E032j856l194k561q45M96J070J640K221K019M97j957l375k804o68N56J162
1387b567J485K175K212J402p05k598k973j480Q5R70R97J409J745J418k99k239
1403A037k923j961j90J066J621K008K125J562J45j801l036k470q18M62J127J493
1419e53K021J964N85j678l176k687p11R17J917K009J854J536O86j187l209l251
1435b963j566M83J967J915J650J286N64p80k147k561j526K60J656K162J784J192
1451C376N30q46k317k885j855k6J406J792J538J407J009%j469k444k209l65J238
1468b120J967J503Q83O01J49j031k431k665j317O74K046K325J789R51K0r10k024
1485D10k358j588L57J638K072J555Q99J49j040k186k594j549L24J851K370J870
$$ y = [5032, 3176, -18, -2579, -3424, -2928, -1858, -218, 2003, 4022, 4519, 2562, -813, -3617, -4285, -3729, -2567, -1082, 1093, 3305, 4707, 4002, 1404, -1569, -3049, -2964, -1994, -997, 412, 2157, 3575, 3276, 1037, -1886, -3847, -4037, -2971, -1350, 658, 2783, 4345, 4490, 2689, -347, -2817, -3635, -3173, -2046, -553, 1468, 3432, 4017, 2339, -837, -3524, -4235, -3318, -1401, 608, 2462, 3998, 4684, 3497, 288, -2963, -4529, -4046, -2079, -164, 1486, 2772, 3336, 2556, 409, -2152, -3678, -3418, -1762, 400, 2184, 3376, 3906, 3060, 743, -2142, -3997, -4023, -2617, -825, 713, 2120, 3129, 3129, 1660, -784, -2993, -3358, -2120, -153, 1350, 2233, 2834, 2983, 1952, -479, -3144, -4461, -3787, -1741, 584, 2373, 3324, 3344, 2434, 410, -1948, -3536, -3179, -1541, 531, 2086, 2985, 3134, 2094, -92, -2686, -4235, -3911, -2060, 310, 2180]
1501B180J089J84n32j837k600k148k65J716K492J774P00k16p80j437j832j703
1517c215m82J229K364K184J111N3p85j322j894j874q41O59J806J953J288L53l99
1534B188j070j704j819r72N30J930K297J348L04l82r82j598k046j527j45J537
1550b111K274J976P82k88j016j391j702j491l55J305K456K072Q84l83j277j747
1566a2j810j437l52J120K153K144J236o2j020j450j613j375o18Q11K009K128J112
1583B964p4j061j551j580j319o27M61J839K240J557K57q67j403j402j209q28R2
1600b511J279J976J585M62o34j411j461j305q06l5J203J994J993R87m23j299j654
1617f0j538j018j84Q83J719J982J011j50j272j659j411r75j73Q11J841K105J361
$$ y = [2180, 3269, 3453, 2921, 1084, -1516, -3664, -3929, -2213, 279, 2053, 2753, 2537, 1757, 320, -1512, -3215, -3697, -2468, -104, 2080, 3191, 3244, 2459, 1137, -757, -2631, -3472, -2813, -1007, 946, 2234, 2587, 2188, 1118, -586, -2405, -3377, -2847, -917, 1380, 2728, 3032, 2650, 1668, 70, -1976, -3503, -3648, -2111, 163, 2139, 2921, 2633, 1617, 226, -1476, -2967, -3322, -2017, 439, 2511, 3395, 3012, 1735, -12, -1822, -3259, -3611, -2491, -338, 1806, 3042, 2980, 1960, 510, -1103, -2478, -3096, -2285, -276, 1852, 2964, 2890, 1829, 278, -1302, -2621, -3248, -2787, -948, 1292, 2849, 3106, 2239, 836, -566, -1775, -2603, -2511, -1232, 744, 2329, 2791, 2157, 746, -715, -2020, -2826, -2861, -1658, 336, 2329, 3316, 2893, 1594, -60, -1598, -2616, -2800, -1917, -198, 1784, 2795, 2645, 1373, -286, -1697, -2672, -2845, -2034, -193, 1912, 3273]
1634C273j00j278j756j661j061k93N56J564J892J569J87j038j788j427r15j11
1650b387M49J343J821J497L85r15j677j701j176l55M40J129J595J586P90n40j394
1667H90j513j191n27J83R87J605J573Q97m37j384j694j425n94J26R01J370J777
1684A544J225J09j178j808j422q21P4P89J265J576J184J33r68j768j726r60J04
1701b648Q43J456J619J412K97q12j765j709j071j25P18J265J427J255M66o55j612
1718C61j745j054o5O93J216J459J275O11l46j360j790j372m27N34R96J448J225
1735A659O83j70j069j621j376m95M15R85J312J343Q91m1r73j699j617q46J86R54
1753a479J353J279J026K40p01j484j653r91P5R36J380J365R52J68o49j527j722
$$ y = [3273, 3173, 1895, 139, -1522, -2583, -2876, -2320, -756, 1136, 2705, 2892, 1854, 66, -1361, -2276, -2387, -1938, -595, 1226, 2723, 3108, 2193, 516, -1185, -2361, -2716, -2276, -1147, 448, 2034, 2824, 2284, 890, -623, -1814, -2341, -2158, -1171, 434, 2007, 2904, 2467, 1083, -611, -2036, -2630, -2504, -1603, -233, 1544, 2769, 2878, 1700, -108, -1530, -2351, -2277, -1488, -223, 1353, 2537, 2670, 1702, -66, -1792, -2752, -2648, -1805, -349, 1270, 2682, 2979, 2167, 402, -1307, -2378, -2503, -1785, -520, 907, 2162, 2628, 1973, 361, -1384, -2438, -2503, -1810, -594, 865, 2140, 2751, 2405, 1045, -745, -2117, -2544, -2010, -1014, 434, 1659, 2342, 2172, 1103, -518, -1894, -2389, -1974, -989, 323, 1666, 2557, 2516, 1543, -156, -1773, -2619, -2433, -1479, -126, 1153, 2179, 2419, 1718, 234, -1419, -2410, -2335, -1399, -19, 1346, 2298, 2466, 1817, 290, -1432]
1770a432j066j22Q80J357J462R90M00m53j320j719j139k09P21J285J369R17L54
1787B275m08j146j637j267m15O02J349J378J060N00j83r51j509j343o09K84J066
1804i54J366J165M90j90q07j409j338o92J29J091J485J174P51J3p28j393j511
1821a358r05n9Q76J419J256P18J30o19j171j404j013k38P70J492J426Q14P7n58
1839A653j240j364j142l92O02J366J442R32K97m67j014j413j013m92N28J190J478
1856I51Q43K81l13j021j277j230n94K63J149J479J128L95k21p99j214j137o97
1873b014O1Q61J342J181N79j28q37j222j171p81l1Q03J348J294O94P9o72j065
1891C21j254r95k05N96J266J308Q66Qo10j059j224q50k03M39J207J428R30K32
$$ y = [-1432, -2498, -2620, -1740, -383, 1079, 2069, 2469, 2016, 696, -1023, -2162, -2371, -1650, -365, 1004, 1921, 2275, 1867, 721, -916, -2183, -2598, -1996, -647, 731, 1791, 2291, 2108, 1157, -352, -1695, -2304, -2020, -954, 412, 1577, 2067, 1877, 1070, -339, -1677, -2369, -2240, -1149, 336, 1510, 2261, 2274, 1546, 153, -1358, -2263, -2322, -1446, -27, 1229, 1947, 2077, 1458, 287, -1117, -2130, -2368, -1598, -106, 1320, 2134, 2211, 1653, 413, -951, -2093, -2485, -1883, -517, 925, 1857, 2154, 1687, 673, -740, -1753, -2245, -1717, -527, 951, 1794, 2075, 1762, 741, -536, -1766, -2360, -2097, -948, 531, 1659, 2054, 1833, 1034, -180, -1317, -2014, -1953, -1092, 250, 1431, 2010, 1882, 1045, -177, -1348, -2129, -2160, -1357, -9, 1285, 1979, 2058, 1386, 321, -933, -1928, -2133, -1537, -271, 1037, 1903, 1911, 1301, 242, -982, -1832, -2035, -1596, -389, 1039, 1969, 2201]
1909B201n32j169j220r61m21M24J030J302J010K99m50r79j086r99l94K54R94J245
1927E48J101M24l55r65j144r92n78J42P44J206J154O26j32q30j059j013o69P9
1945a713P10J088J174O15l3p13j080j131p68m1N22J072J244Q54J22o13j056j076
1963h23p74k17M05J065J166Q67K39o31j019j096p65k83L64R05J209R84L82m07
1981A571r34j092r66l67L08P91J102R44M18k66q39j093r09m26J54Q11J129R88
1999A324M76r0p91j103r52o21J22N77R99J086N99J9o39j050r66o07M0N37R05J021
2019H86P43J48n56r84j102o78j95M70Q64J051Q11K54m07r14j064p31k58L77Q99
2038c86R53Q67K83l43q79j059q26k70K65P99R21Q33N04k41p35j031q78l30J49
$$ y = [2201, 1669, 500, -720, -1681, -2102, -1678, -648, 654, 1664, 1963, 1513, 534, -552, -1551, -1945, -1691, -697, 548, 1649, 2073, 1718, 753, -391, -1383, -1961, -1819, -1075, 131, 1285, 1911, 1779, 949, -110, -1123, -1792, -1713, -1003, 85, 1259, 1874, 1841, 1128, 48, -1083, -1851, -1892, -1370, -298, 946, 1800, 1922, 1309, 253, -823, -1597, -1814, -1409, -344, 822, 1689, 1928, 1297, 278, -818, -1583, -1866, -1502, -597, 612, 1596, 1978, 1571, 637, -455, -1421, -1788, -1480, -689, 413, 1357, 1775, 1509, 670, -423, -1332, -1758, -1604, -793, 336, 1324, 1800, 1710, 919, -184, -1136, -1757, -1635, -1058, -59, 1027, 1626, 1645, 1006, -44, -1010, -1617, -1577, -1040, -135, 886, 1629, 1777, 1221, 237, -865, -1543, -1738, -1268, -404, 647, 1458, 1712, 1305, 391, -673, -1404, -1662, -1285, -386, 567, 1434, 1717, 1374, 495, -564, -1390, -1660, -1395, -596, 325, 1158, 1662, 1421, 686, -345, -1223, -1553, -1404]
2057a404P16R53P99N79j70p29r86r01m61J68N59R33Q92N90K6o24r13q74o49J2
2077a484N12Q83Q79O25N8m66q91r55n89j48N31Q21R61O36J60l57q18j005o82k32
2097a561L95P58Q94P48K56k92q09r35o83l42L84O61R18P89L44k11o74r80p73l80
2117a493J70P08Q26P97L97j22n79q79p66n23J11N87Q99Q27M03j0n56q07q55n37
2137a402K3N15P47R19N32O5m86p94q51o03n5M05Q19P70O94P6l70p33r03o28j83
2158a443L88P13Q95N90K63l24o91q44o87k21K07P30Q07O82L36k49o56r07o64l37
2178a412K22O67Q15O60L98j71n09q79o52m68J13N63Q18P17L69J4n48p85p85m01
2198a254%M67Q08Q27L58Q6m55p71p88m77o8M54O88P31N61J06m10o69p82n80j37
$$ y = [-1404, -688, 265, 1064, 1643, 1473, 744, -242, -1143, -1604, -1436, -877, 56, 948, 1538, 1564, 940, 27, -847, -1496, -1484, -972, -89, 790, 1415, 1473, 1007, 116, -839, -1428, -1576, -1045, -224, 737, 1373, 1533, 1176, 358, -647, -1329, -1561, -1166, -408, 486, 1234, 1490, 1198, 389, -546, -1229, -1571, -1187, -526, 392, 1181, 1525, 1314, 640, -340, -1113, -1493, -1323, -615, 211, 1008, 1405, 1283, 704, -175, -941, -1464, -1353, -766, 133, 960, 1363, 1353, 797, -10, -865, -1402, -1379, -864, -117, 802, 1334, 1399, 913, 119, -732, -1335, -1390, -985, -166, 604, 1298, 1374, 1004, 271, -632, -1260, -1443, -1055, -342, 553, 1143, 1406, 1082, 391, -453, -1140, -1361, -1154, -424, 383, 1065, 1401, 1152, 496, -411, -1075, -1412, -1190, -523, 292, 952, 1350, 1179, 670, -209, -861, -1329, -1216, -653, 165, 882, 1251, 1265, 717, -68, -853, -1254, -1254, -787, 21, 848, 1206, 1292, 837, 66, -722, -1199, -1267, -813, -125, 606, 1167, 1273, 863, 194, -588, -1168, -1305]
2219a305L49O95P58N41K54l44n78q40n94k10K83N98Q49N69K31j91o60p14o57k50
2239a216J80N87P16O29L35j62n20p54p03k56M7M95P58O73L10j2m91p24o93l57
2259a158M0M84O38P17M53j8m66o36p42m18m5L57P16O78M95P0l88n93o98m75p1
2280a060K51N70P54N12M6j79o36p08n52j22J90N84P14N34K03k07n43o90n26k56
2300a121J69N03P26N86K65j70n63o20n98k86J32M53P39N95K34o3m01o66o05l37
2320a028JN02N80O03M07n8l78o00o18m20kL62N75O61L77O7l09n91n70m95p4K23
2342g85N98O83M45O7l46m31o47m75j58K92N06O99M33J45k88m50n68n51j64J23
2362h72N13O50M70K27j85m55n37n17l20J79M15O55M89K26o8l68o32n21k81JL55
$$ y = [-1305, -956, -261, 497, 1038, 1292, 948, 370, -470, -1064, -1274, -991, -393, 456, 1025, 1256, 1065, 405, -309, -966, -1216, -1036, -449, 267, 896, 1231, 1069, 549, -205, -908, -1164, -1117, -622, 136, 809, 1119, 1107, 616, -108, -801, -1158, -1118, -634, 4, 721, 1174, 1156, 690, 54, -688, -1106, -1151, -794, -78, 600, 1095, 1165, 777, 184, -514, -989, -1060, -809, -239, 515, 1027, 1073, 894, 258, -450, -1002, -1124, -934, -350, 364, 898, 1101, 894, 351, -339, -865, -1121, -952, -449, 277, 863, 1128, 958, 395, -225, -823, -1109, -977, -524, 215, 810, 1044, 981, 580, -86, -691, -1028, -1027, -525, 55, 658, 1065, 1007, 629, 29, -589, -1009, -1011, -649, -74, 587, 964, 1031, 722, 131, -439, -934, -1008, -785, -187, 496, 941, 1008, 662, 231, -416, -891, -1049, -757, -251, 448, 881, 1026, 738, 288, -280, -831, -995, -872, -359, 291, 761, 988, 803, 348, -189, -706, -1026, -847, -432, 223, 712, 938, 870, 502, -130, -651, -932, -931, -576]
2383e76O02N83L22j1l97n76m35l80J0L32M99N40L42k2k33n10n77l85m9K53N07
2404a61N79M08O0j95n30n44l71j14J79M70N37M23J83k29m69n76m37j40J90M49
2424b88N39L97K34j05m62n55m08k20J63L71M70M37K67j09l18n68m32k64Q0L33
2444d38N10M88K47m8k75n11m61k59j1K98L94N19K89O2k87m22o05k33n9K62L87
2465a53N33L01J47k54m20m85l68q8J29M20N05L64J33j21m10m93k86j60Q3L54N27
2486B58L30K10j46l42m59m54j53J16K87M96M11J17n2k51m24m76p8m4L14M66L24
2507D50K40k9l02m17m71j91M7K32M04L74K90M3k16m59l41k98pJ67M16L69L33K2
2529F56j87l51m04l31m5J87L19L98L20J30j67k58m72l36j17J30K83M34L08J17
$$ y = [-576, 26, 609, 931, 920, 523, -53, -488, -868, -858, -526, -27, 513, 855, 833, 600, 90, -487, -872, -921, -668, -161, 418, 826, 886, 691, 161, -383, -754, -868, -689, -219, 318, 741, 924, 695, 226, -350, -787, -927, -737, -288, 251, 648, 882, 777, 315, -240, -648, -868, -705, -334, 136, 573, 840, 731, 413, -155, -587, -851, -771, -438, 72, 560, 807, 759, 484, -27, -488, -747, -758, -460, -66, 453, 742, 804, 517, 95, -510, -743, -802, -540, -153, 380, 681, 828, 574, 154, -331, -699, -787, -658, -238, 267, 631, 764, 643, 233, -260, -546, -706, -623, -269, 258, 588, 798, 652, 310, -149, -603, -756, -640, -353, 143, 554, 671, 619, 368, -56, -532, -610, -654, -340, 126, 450, 690, 661, 359, -58, -529, -720, -673, -441, -37, 337, 627, 670, 454, -5, -346, -644, -651, -484, -68, 301, 634, 656, 469, 118, -286, -617, -662, -475, -156, 242, 562, 692, 525, 267, -205, -541, -658, -528, -245, 189, 497, 614]
2549F14p1l32l69l11k37J80K50M03L61J18o2k67m15l37j62P0K53L54L61J98l3
2570E66k20l64l67j87J4K40L47L19K15Lj95l42l60j70j06K06L13L30K38M3j09
2591D14k91l59k35j22K16K18L69K67L6o6k96l35l04o7R7K96L37K58J17o5k15l29
2613e9l56p4N3K73K55K73J45n1k38l23k27k01J7K16L41L01K46q2k32k84k96k06
2635e09n1K27L02K55K45m1j54k20l19k38K2J65K39L11K54J0j44k33l07k00q9M3
2657d32L57K15J80J06n7k22k75j81j66J06J77L68J74N5j7k29k41k62j53P9K15
2678b03K71K45J11n2j68k02l27j13L7J59K55K81J65k9j99k49k00j12r6J37K73
2699a6K92J14jr0k73j84j89o1J33J91L08Q4R4j30k05k13j99p7J15K20J69K33J0
$$ y = [614, 543, 211, -158, -469, -706, -526, -276, 127, 488, 606, 544, 277, -138, -475, -637, -567, -314, 40, 401, 599, 566, 346, -18, -385, -572, -558, -318, 29, 348, 563, 566, 371, 29, -331, -501, -607, -401, -88, 242, 480, 523, 414, 123, -236, -471, -593, -377, -159, 210, 477, 513, 447, 151, -184, -488, -555, -458, -162, 175, 433, 550, 485, 270, -59, -415, -489, -436, -163, 92, 365, 510, 459, 221, -102, -329, -530, -513, -297, 44, 345, 591, 509, 277, -7, -303, -509, -560, -333, -31, 224, 469, 428, 274, 54, -265, -503, -481, -316, -77, 234, 488, 498, 354, 121, -186, -386, -475, -432, -75, 140, 320, 426, 369, 147, -128, -309, -475, -369, -192, 176, 350, 405, 388, 159, -82, -344, -497, -418, -203, 68, 313, 424, 372, 204, 2, -325, -438, -401, -242, 13, 294, 459, 430, 231, -18, -218, -330, -426, -289, -16, 276, 390, 389, 299, 26, -158, -347, -408, -275, -84, 224, 308, 402, 272, 67, -146, -345, -422, -307, -87, 82, 315, 325]
2722C25j7j90k37j92q2L5J94K44K32Q3j04j31k36k39j02P6J92J72K30J26l9j02
2744B38k78j98j45M8Q7K46K27J26M7k46j74k21q8k2J10K06K44J34O8j35k14k36
2766a76j75m0J06K28K01J50M5j34j42k29j18q7R8K25J76K16mn8j71k03j98l7j5
2789c42K15J26K53J02p2q8k65j29o4k4J07J98K20O8n1j40p5k81j01M9R1K21J71
2812A89R2J2j12j92j32j56K1N0J69J42K23K0r8k08j32j39m1L8K21J61J13J04o5
2835B80k53j31j44q2J38J11J93R3L8r9p2j82j47k8J5J38K07K15J7l7j96j53j50
2858b29o5Q6J00J12J49R3J6j60j05k18o1O3Q7J69J65O6kj13j61q6j32k5RK21J73
2883A52R2l4l9j37j57j21n6P8J31K09P2%j8j32j48j44j0O3J48J64J28l1j5q4k27
$$ y = [325, 308, 118, -119, -311, -393, -358, -164, 80, 312, 395, 291, 160, -76, -315, -417, -341, -149, 23, 253, 379, 340, 238, -40, -238, -383, -335, -248, -2, 225, 351, 398, 152, -22, -243, -331, -353, -243, -37, 207, 341, 409, 274, 60, -176, -351, -391, -285, -57, 144, 294, 339, 205, 63, -166, -284, -371, -273, -48, 128, 344, 340, 282, 111, -92, -290, -327, -342, -127, -1, 252, 354, 282, 194, -71, -200, -264, -288, -181, 17, 237, 305, 254, 114, 39, -242, -343, -294, -203, 18, 189, 281, 293, 181, -11, -143, -299, -278, -228, -59, 83, 306, 326, 228, 20, -112, -251, -292, -254, -33, 128, 241, 345, 280, 27, -104, -248, -330, -192, -81, 112, 205, 243, 144, 72, -110, -257, -285, -270, -132, 75, 290, 307, 270, 74, -79, -229, -294, -208, -108, 4, 153, 246, 262, 102, -3, -221, -282, -219, -132, 37, 202, 268, 266, 153, -8, -94, -226, -251, -242, -21, 152, 244, 210, 171, 34, -123, -244, -300, -222, -91, 118, 190, 190, 172, 40, -108, -252, -262, -199, -51, 113, 241, 210, 195, 111, -116]
2908a16j63O6%R4K23K8J04Mk08l7j85n3RQ7K68K5R1L1j60j11j65j5r9J12J91O6
2934H7J00oo7q8j55o4nL5J63J20N5j0J3j38o0j53p0K9J43J28J44K5k2j32j29r3
2960a50m1J2R9J77Q1K0j1j40j20p1r6RJ29Q4K23Nn0j27o3q9p9j0J15Q5J43L3j3
2987A55j05q6l6j40L6K9J10J28Q9m0k1q1r6j10j3R6OJ14J37k4m8p0n5j63JM2O3
3014h2J11J75m2n4o5l6j40n2J25n0J02J60m0O7j30r8m1p5OJ06J18Q0%l4Mj63p5
3041a23l7m3J19N1O0J26K2q8j17m9k8o9J11P4Q3J4M5p2p5l9j71M8K6Q7J04M4L0
3068A33m6o1q6m3m2J5O3R4O9N2m0n8o9k2r7k1J43L6R0l2K0l2j04lr2RJ0J00J12
3097I8J5rk6q4q8Ll0k1J06R2O4m7M7r1o1q6pO2J3O9Q9l7Qq0p3L7r2M9M3J05pO8
$$ y = [-116, -279, -213, -213, -119, 104, 132, 236, 240, 32, -5, -190, -243, -234, -147, 121, 146, 237, 268, 108, -3, -168, -183, -282, -170, 21, 87, 187, 181, 114, 26, -129, -193, -198, -163, 0, 120, 175, 165, 178, 40, -20, -173, -243, -214, -71, 57, 201, 226, 204, 72, -57, -150, -191, -179, -80, 97, 178, 198, 187, 47, -73, -144, -240, -231, -102, -18, 205, 210, 160, 33, -30, -119, -198, -208, -93, -8, 135, 168, 155, 50, -36, -72, -212, -176, -147, -37, 91, 180, 140, 119, 38, -58, -168, -181, -85, -79, 35, 172, 148, 100, 30, -25, -188, -187, -145, -82, 29, 204, 162, 108, 43, 7, -133, -185, -60, -110, -8, 152, 112, 179, 49, -49, -90, -165, -159, -53, 65, 145, 145, 111, 115, -48, -123, -160, -203, -84, -33, 27, 153, 175, 87, -30, -79, -107, -176, -65, 9, 92, 106, 151, 79, 4, -35, -206, -158, -132, -45, 59, 103, 133, 87, 26, -60, -103, -145, -130, -67, 27, 96, 148, 108, 50, -19, -41, -138, -159, -16, 20, 110, 78, 98, 66, -38, -41, -133, -124, -114, -14, 98, 113, 104, 78, -6, -94, -91, -121, -142, -36, 56, 120, 73, 120, 29, -32, -118, -125, -63, -50, 19, 108, 71, 79, -1, -74, -37, -129, -80, -37, 68, 61, 129]
3129A29r4no2m6m3M2N7J6P9N7m7n5k2j20L4l3L4Q9Q6k8J7j8j22l4m0M9K3O4M8
3158E5oPJ1q5n8rl2K2P7M2R2j8l4l8Qj03j8j2P3R6J3Pj7l9n3p7l0O4P1PK3P0l9
3191G0j9r5nk7qj0O0Q3j0K8Qn8r0p0M8K3L0N0Q5J3r3j2p8K5k8J1R1J1O3Lk4j1
3223F4j19qqNK6K9Q5k7J3m3j7j13j7M3M8N0M2O3m4l0n9om6l9LJ17M2Q1m8j1l1
3254D5p4o5J5L5L4O6qN3k0j7p4j01P2j8k0J37j8M4Kq8m5p4O8Pl6P6O2L4n2p4J5
3285a9l8n4MM9L2O1LP0qp7m6j01j3Q3M3K5J07p6PK0q6j30M3M4L4RJ46l7m4m1p2
3316f2ORJ1j6O8L3N9p8j1jj36K8K0j2P2Q8K9J4p9o5m3q9N7J9O0N8N6l9M5p5m0
3347a4l3n2M4K1N8O8Kn1m5m8n2mmL6Q4M9K3k5l7q2o1J1M9J8O1Q4k7J0Nj24%r7
$$ y = [129, 35, 30, -32, -78, -121, -79, -22, -6, 73, 130, 83, 28, 6, -114, -80, -113, -79, 10, 96, 68, 85, 67, -55, -89, -129, -80, -57, 7, 55, 49, 56, 67, -18, -76, -85, -117, -95, -18, 24, 116, 98, 64, 26, 34, -69, -87, -99, -26, 70, 83, 90, 73, 34, -19, -96, -126, -62, 9, 16, 39, 109, 70, 51, -44, -49, -76, -84, -94, -34, 49, 39, 67, 75, 17, -73, -143, -95, -72, -42, 8, 93, 106, 13, 1, -77, -52, -80, -69, 22, 33, 96, 99, 75, 64, -55, -63, -71, -66, -40, -11, 74, 47, 60, 17, 0, -113, -130, -87, -39, 11, 53, 116, 72, 42, -17, -23, -69, -108, -105, 12, 54, 135, 87, 76, 45, -29, -94, -79, -44, -10, 56, 48, 101, 81, 64, -10, -111, -39, -57, -77, 60, 42, 86, 88, 0, -45, -119, -51, -44, -80, -4, 58, 92, 40, -34, -19, -57, -111, -107, -58, -26, 35, 38, 108, 100, 23, -23, -124, -137, -54, -11, 14, 121, 45, 52, 72, -14, -144, -101, -57, -23, -14, 132, 95, 51, 10, -62, -56, -47, -36, -52, 16, 49, 108, 30, 19, 18, -118, -90, -70, -82, -10, 78, 107, 121, 42, -23, -66, -155, -98, -79, -19, 39, 95, 56, 101, 26, -14, -47, -99, -55, -34, 24, 92, 94, 43, -2, -50, -102, -106, -110, -74, 10, 59, 82, 57, 20, -62, -123, -112, -63, -45, 16, 100, 73, 83, 88, -36, -36, -133]
3379a33L6K5J08O1L6Rp4K0j53k4Nj9R8N2L5J1m4l8o6r7L0PR1M8L7L2j2n8m3o1
$$ y = [-133, -97, -72, 36, 97, 133, 142, 68, 88, -65, -89, -84, -103, -5, 47, 82, 93, 49, 11, -55, -152, -122, -115, -24, 24, 61, 93, 81, 23, -20, -81]
$$ [...]
8191A6
##END NTUPLES=NMR FID
##END=
