##TITLE=1H_Pr B-mat
 D2O
 8 sc, 
 27.4.2024
##JCAMPDX= 6.0         $$ Bruker NMR JCAMP-DX V2.0
##DATA TYPE= NMR FID
##DATA CLASS= NTUPLES
##ORIGIN= UXNMR, Bruker Analytische Messtechnik GmbH
##OWNER= root
$$ XWIN-NMR		Version 3.5
$$ Sat Apr 27 15:56:33 2024 Russian Standard Time (UT+4h)  she@DPX200
##.OBSERVE FREQUENCY= 200.1309
##.OBSERVE NUCLEUS= ^1H
##.DELAY= (6, 6)
##.ACQUISITION MODE= SIMULTANEOUS
##.ACQUISITION SCHEME= undefined
##.AVERAGES= 8
##.DIGITISER RES= 18
##SPECTROMETER/DATA SYSTEM= spect
##.PULSE SEQUENCE= zg30
##.SOLVENT NAME= CDCl3
##.SHIFT REFERENCE= (INTERNAL, CDCl3, 0, 15.7039)
##AUDIT TRAIL= $$ (NUMBER, WHEN, WHO, WHERE, WHAT)
$$ ##TITLE= Audit trail, XWIN-NMR		Version 3.5
$$ ##JCAMPDX= 5.01
$$ ##ORIGIN= Bruker BioSpin GmbH
$$ ##OWNER= she
$$ F:/spectra/data/she/nmr/H-F/1/audita.txt
$$ ##AUDIT TRAIL=  $$ (NUMBER, WHEN, WHO, WHERE, WHAT)
(   1,<2024-04-27 15:54:55.15 +0400>,<she>,<DPX200>,
      <created by zg, POWCHK disabled, PULCHK disabled
       configuration hash MD5:
       00 E9 B6 7A A2 85 ED C7 34 08 36 98 17 FE 4E 26
       data hash MD5: 16K
       15 2B 44 2F 7A DB C2 11 7A 1E 92 76 2A 31 E3 6D>)
$$ ##END=
$$ 
$$ hash MD5
$$ F0 2B 90 4F 27 AD B3 BB 11 88 95 83 DA 78 4F 22
##$RELAX= 
##$RELAX= 
##$RELAX= 
##$RELAX= 
##$RELAX= 
##$RELAX= 
$$ Bruker specific parameters
$$ --------------------------
##$DU= <F:/spectra>
##$EXPNO= 1
##$NAME= <H-F>
##$PROCNO= 1
##$TYPE= <nmr>
##$USER= <she>
##$AMP= (0..31)
100 100 100 100 100 100 100 100 100 100 100 100 100 100 100 100 100 100 
100 100 100 100 100 100 100 100 100 100 100 100 100 100 
##$AQSEQ= 0
##$AQ_mod= 1
##$AUNM= <au_zg>
##$AUTOPOS= <>
##$BF1= 200.13
##$BF2= 200.13
##$BF3= 200.13
##$BF4= 200.13
##$BF5= 200.13
##$BF6= 200.13
##$BF7= 200.13
##$BF8= 200.13
##$BYTORDA= 1
##$CFDGTYP= 0
##$CFRGTYP= 5
##$CHEMSTR= <none>
##$CNST= (0..31)
1 1 145 1 1 1 1 1 1 1 1 1 1 1 1 1 1 1 1 1 1 1 1 1 1 1 1 1 1 1 1 1 
##$CPDPRG= <>
##$CPDPRG1= <>
##$CPDPRG2= <>
##$CPDPRG3= <>
##$CPDPRG4= <mlev>
##$CPDPRG5= <mlev>
##$CPDPRG6= <mlev>
##$CPDPRG7= <mlev>
##$CPDPRG8= <mlev>
##$CPDPRGB= <>
##$CPDPRGT= <>
##$D= (0..31)
0 1.2 0 0 0 0 0 0 0 0.06 0 0.03 0 0 0 0 0.0002 0 0 0 0 0 0 0 0 0 0 0 0 
0 0 0 
##$DATE= 1714218894
##$DBL= (0..7)
120 120 120 120 120 120 120 120 
##$DBP= (0..7)
150 150 150 150 150 150 150 150 
##$DBP07= 0
##$DBPNAM0= <>
##$DBPNAM1= <>
##$DBPNAM2= <>
##$DBPNAM3= <>
##$DBPNAM4= <>
##$DBPNAM5= <>
##$DBPNAM6= <>
##$DBPNAM7= <>
##$DBPOAL= (0..7)
0.5 0.5 0.5 0.5 0.5 0.5 0.5 0.5 
##$DBPOFFS= (0..7)
0 0 0 0 0 0 0 0 
##$DE= 6
##$DECBNUC= <off>
##$DECIM= 32
##$DECNUC= <off>
##$DECSTAT= 4
##$DIGMOD= 1
##$DIGTYP= 9
##$DL= (0..7)
0 120 120 120 120 120 120 120 
##$DP= (0..7)
150 150 150 150 150 150 150 150 
##$DP07= 0
##$DPNAME0= <>
##$DPNAME1= <>
##$DPNAME2= <>
##$DPNAME3= <>
##$DPNAME4= <>
##$DPNAME5= <>
##$DPNAME6= <>
##$DPNAME7= <>
##$DPOAL= (0..7)
0.5 0.5 0.5 0.5 0.5 0.5 0.5 0.5 
##$DPOFFS= (0..7)
0 0 0 0 0 0 0 0 
##$DQDMODE= 0
##$DR= 18
##$DS= 0
##$DSLIST= <SSSSSSSSSSSSSSS>
$$ [...]
##$SUBNAM2= <"">
##$SUBNAM3= <"">
##$SUBNAM4= <"">
##$SUBNAM5= <"">
##$SUBNAM6= <"">
##$SUBNAM7= <"">
##$SUBNAM8= <"">
##$SUBNAM9= <"">
##$SW= 18.0517689322627
##$SWIBOX= (0..15)
0 0 2 0 0 0 0 0 0 0 0 0 0 0 0 0 
##$SW_h= 3612.71676300578
##$TD= 16384
##$TD0= 1
##$TE= 0
##$TE2= 300
##$TE3= 300
##$TEG= 300
##$TL= (0..7)
0 120 120 120 120 120 120 120 
##$TP= (0..7)
150 150 150 150 150 150 150 150 
##$TP07= 0
##$TPNAME0= <>
##$TPNAME1= <>
##$TPNAME2= <>
##$TPNAME3= <>
##$TPNAME4= <>
##$TPNAME5= <>
##$TPNAME6= <>
##$TPNAME7= <>
##$TPOAL= (0..7)
0.5 0.5 0.5 0.5 0.5 0.5 0.5 0.5 
##$TPOFFS= (0..7)
0 0 0 0 0 0 0 0 
##$TUNHIN= 0
##$TUNHOUT= 0
##$TUNXOUT= 0
##$USERA1= <user>
##$USERA2= <user>
##$USERA3= <user>
##$USERA4= <user>
##$USERA5= <user>
##$V9= 5
##$VALIST= <valist>
##$VCLIST= <CCCCCCCCCCCCCCC>
##$VD= 0
##$VDLIST= <DDDDDDDDDDDDDDD>
##$VPLIST= <PPPPPPPPPPPPPPP>
##$VTLIST= <TTTTTTTTTTTTTTT>
##$WBST= 1024
##$WBSW= 4
##$XGAIN= (0..3)
0 0 0 0 
##$XL= 0
##$YL= 0
##$YMAX_a= 578382
##$YMIN_a= -1010522
##$ZGOPTNS= <>
##$ZL1= 120
##$ZL2= 120
##$ZL3= 120
##$ZL4= 120
##$ABSF1= 10
##$ABSF2= 0
##$ABSG= 5
##$ABSL= 3
##$ALPHA= 0
##$AQORDER= 0
##$ASSFAC= 0
##$ASSFACI= 0
##$ASSFACX= 0
##$ASSWID= 0
##$AUNMP= <proc_1d>
##$AZFE= 0.1
##$AZFW= 0.1
##$BCFW= 1
##$BC_mod= 2
##$BYTORDP= 1
##$COROFFS= 0
##$CY= 11.3945322036743
##$DATMOD= 1
##$DC= 2
##$DFILT= <>
##$DTYPP= 0
##$F1P= 15.6554695791079
##$F2P= 12.8336369535428
##$FCOR= 0.5
##$FTSIZE= 0
##$FT_mod= 4
##$GAMMA= 1
##$GB= 0.15
##$INTBC= 1
##$INTSCL= 1
##$ISEN= 128
##$LB= 0.24
##$LEV0= 0
##$LPBIN= 0
##$MAXI= 10000
##$MC2= 0
##$MEAN= 0
##$ME_mod= 0
##$MI= 1.114404
##$NCOEF= 0
##$NC_proc= 0
##$NLEV= 6
##$NOISF1= 3.799351
##$NOISF2= 2.8
##$NSP= 1
##$NTH_PI= 0
##$NZP= 0
##$OFFSET= 15.70392
##$PC= 1
##$PHC0= -25306.86
##$PHC1= 5.587311
##$PH_mod= 1
##$PKNL= yes
##$PPARMOD= 0
##$PSCAL= 0
##$PSIGN= 0
##$REVERSE= no
##$SF= 200.130013532006
##$SI= 16384
##$SIGF1= 3
##$SIGF2= 2
##$SINO= 400
##$SIOLD= 16384
##$SREGLST= <1H.CDCl3>
##$SSB= 0
##$STSI= 0
##$STSR= 0
##$SW_p= 3612.71676300578
##$SYMM= 0
##$S_DEV= 0
##$TDeff= 0
##$TDoff= 0
##$TI= <>
##$TILT= no
##$TM1= 0
##$TM2= 0
##$TOPLEV= 0
##$USERP1= <user>
##$USERP2= <user>
##$USERP3= <user>
##$USERP4= <user>
##$USERP5= <user>
##$WDW= 1
##$XDIM= 8192
##$YMAX_p= 0
##$YMIN_p= 0
$$ End of Bruker specific parameters
$$ ---------------------------------
##NTUPLES= NMR FID
##VAR_NAME=  TIME,          FID/REAL,        FID/IMAG
##SYMBOL=    X,             R,               I
##VAR_TYPE=  INDEPENDENT,   DEPENDENT,       DEPENDENT
##VAR_FORM=  AFFN,          ASDF,            ASDF
##VAR_DIM=   8192,          8192,            8192
##UNITS=     SECONDS,       ARBITRARY UNITS, ARBITRARY UNITS
##FACTOR=    0.0002768,     1,               1
##FIRST=     0,             0,               0
##LAST=      2.2672688,     0,               0
##MIN=       0,             -1010522,        0
##MAX=       2.2672688,     578382,          0
$$ Real data points
##PAGE= N=1
##DATA TABLE= (X++(R..R)), XYDATA
0@%%%%%%%%%%MmPj4J4j4J8j8K1k8L5m5N2o2P5q6J00j15J32j52J73j98K26k56K91
$$ 0 0 0 0 0 0 0 0 0 0 0 4 0 7 -7 7 -7 11 -7 14 -14 21 -24 28 -34 41 -45 55 -60 72 -80 93 -105 121 -135 156
35A56l29L67m12M63n17N76o38P09p87Q69r61J062j172J291j423J568j726J902
$$ 156 -173 194 -218 245 -272 304 -334 375 -412 457 -504 558 -614 677 -746 822 -904 998
53I98k100K319k565K845l164L532l964M478n107N893o902Q260j0198J3209j8583
$$ 998 -1102 1217 -1348 1497 -1667 1865 -2099 2379 -2728 3165 -3737 4523 -5675 7534 -11049
68a1049L1166j15001j09401M5191j02393j43675j31671L5233J73053K12564O6069
$$ -11049 20117 -94884 -204285 -159094 -261487 -405162 -536833 -501600 -328547 -115983 -49914
79d9914j27310k58426k07488l5739J72801K70255K11768K270k20541l18978k01510
$$ -49914 -177224 -435650 -643138 -678877 -506076 -235821 -24053 -21783 -242324 -561302 -762812
90g62812N3186K80924L18672J57299r0082k56095k58031j04404J02078K48982
$$ -762812 -709626 -428702 -110030 47269 -42813 -298908 -556939 -661343 -559265 -310283
100c10283K49982J08660q7742k11580j97583p9379L6660P7379M4739J209q405
$$ -310283 -60301 48359 -39383 -250963 -448546 -527925 -491265 -413886 -369147 -367938 -376343
111c76343K1141O1537Q3288O6530J0117n9974r0159m3697N8895J42602J40849
$$ -376343 -355202 -293665 -210377 -143847 -133730 -193704 -283863 -327560 -268665 -126063 14786
122A4786N4449n1384j07719q7692j1215Q1605J46673J46807O9866m5698j24998
$$ 14786 69235 17851 -89868 -177560 -188775 -107170 39503 186310 256176 210478 85480
133H5480j11998j6280R3769J51881J34095O2004k8039j02446j28009q6827K144
$$ 85480 -26518 -42798 50971 202852 336947 398951 370912 268466 140457 53630 55774
144E5774Q8276J21062R3299L9216l906k6099l5285l3688j5639J2739L0374K1057
$$ 55774 144050 265112 358411 397627 393721 367622 332337 298649 283010 295749 326123 347180
156C47180n312k6001k9374k5137k3081j7573n51K0043K3927L922k2309l3525k8969
$$ 347180 341868 315867 286493 261356 238275 220702 220151 240194 264121 268043 245734 212209 183240
169A83240k4455k4525j5667J1352M0907M4948J2426l6235p4253q2616o0909j0019
$$ 183240 158785 134260 118593 129945 170852 215800 228226 191991 117738 35122 -25787 -35806
181c5806N5219J04156R8829L0026o2922j18299j03052l9504K4756N3006L9506
$$ -35806 19413 123569 222398 252424 189502 71203 -31849 -71353 -46597 6409 45915
192D5915o194o2716r9360r0370l5196L1009O0936L8144j2669n1368n9326m5922
$$ 45915 39721 -22995 -122355 -212725 -247921 -216912 -155976 -117832 -130501 -181869 -241195 -287117
204b87117k3978L75K2163L0940K0637K78j0029n889l383j3062k7916k3561R331
$$ -287117 -311095 -310720 -288557 -257617 -236980 -236702 -246731 -252620 -256003 -269065 -296981 -320542 -311211
217c11211M9830P2092O2949L2440p439m4817o3347m5845N940O2871Q0839M4007
$$ -311211 -261381 -189289 -126340 -93900 -101339 -146156 -209503 -255348 -249408 -186537 -105698 -61691
229f1691k1557o8790p0959l2741K1457O8744Q7361O2716K579n7643p6603m1286
$$ -61691 -83248 -152038 -222997 -255738 -234281 -165537 -78176 -15460 -12881 -70524 -147127 -188413
241a88413K1346O7853P5016N3516K2846o474k7773l3288j5883J4549L7461M2070
$$ -188413 -167067 -99214 -24198 29318 52164 45690 17917 -15371 -31254 -16705 20756 62826
253F2826L4078K9606K7331J6843o336k7399k7198n878J9376L3403L6380K9840
$$ 62826 96904 126510 153841 170684 164348 136949 109751 103873 123249 156652 193032 222872
265B22872J2125j7593m4444m4474r028M0277O9781O2198K4952k1333n8312p1362
$$ 222872 234997 217404 172960 128486 119458 159735 229516 291714 316666 295333 237021 165659
277A65659m9692N037O4477Q8848N6374j2236p1912r0650o6513k0186K6847N4541
$$ 165659 115967 121004 185481 274329 330703 318467 246555 155905 89392 69206 96053 150594
289A50594N1139J4193l6587o7647o0850k7519L542J3354P961K011r24o765j4917
$$ 150594 201733 215926 179339 111692 50842 23323 26865 40219 48180 50191 49267 42502 27585
302B7585j9593j7163j2900j1692o020J2219L4746L8878J0826l5430o7686o3782
$$ 27585 7992 -9171 -22071 -33763 -39783 -27564 7182 46060 56886 21456 -46230 -110012
314a10012k7404J8859N3920O1142L2518k5746q4719j05915o8768L354O3139P5107
$$ -110012 -137416 -118557 -64637 -3495 29023 3277 -81442 -187357 -256125 -252771 -189632 -114525
326a14525L9212j8418o4589q0840o0382j0088M1654O4822M3769n36l3582l2764
$$ -114525 -75313 -93731 -158320 -239160 -299542 -309630 -267976 -203154 -159385 -159921 -193503 -226267
338b26267r367J2463K0533J7928J6076J6417J8270J9847K1252J5071m179k7101
$$ -226267 -235634 -223171 -202638 -184710 -168634 -152217 -133947 -114100 -92848 -77777 -81956 -109057
350a09057l1016l141M0965O7531N4830J0718l5417n8670n0696j4532L4882P2555
$$ -109057 -140073 -143214 -102249 -34718 20112 30830 -4587 -63257 -113953 -128485 -93603 -21048
362b1048P3667K9544l1841o9726n9221j1048L9675O6379O1169L2042p137l7532
$$ -21048 52619 82163 50322 -19404 -78625 -89673 -49998 16381 77550 109592 102455 64923
374F4923m1923j4652K5937N0693M4389J8246l048q652m067R94K460M311N773M156
$$ 64923 23000 8348 34285 84978 129367 147613 144565 135913 131846 132840 135300 139611 145384 149540
388A49540K896P764J7179J9519L030k2650l7358k5644M880L0678L6448K2811k577
$$ 149540 152436 160200 177379 196898 199928 177278 139920 114276 119156 149834 186282 209093 206516
401B06516l0697m8344m3849j1887L0070N2218L7958l331m1298n6764m6689k0380
$$ 206516 175819 127475 83626 71739 101809 154027 191985 188654 147356 90592 43903 23523
413B3523J0004L4232L5830J2145k7098n3013m9717k3038N605J8735J6370O340
$$ 23523 33527 67759 103589 115734 88636 35623 -14094 -37132 -31527 -12792 3578 9918
425I918q092k2040k8434k0605j891J2404J0744j266r235o384J122J792m852j1276
$$ 9918 1826 -20214 -48648 -69253 -71144 -58740 -47996 -49262 -58497 -64881 -63759 -61967 -66819 -78095
439g8095j1754q243m101M568J4280J7132J770k5336m4556l8097r433K1366L4315
$$ -78095 -89849 -98092 -102193 -97625 -83345 -66213 -64443 -89779 -134335 -172432 -181865 -160499 -126184
452a26184K5792K372k4089m2894m2916j6562K2907N0050M3835J2005k2586l5659
$$ -126184 -100392 -98020 -122109 -165003 -207919 -224481 -201574 -151524 -107689 -95684 -118270 -153929
464a53929k4613N7K5573M1753M2183K3942m502k3494j8368L530K3990K8805K0480
$$ -153929 -178542 -178485 -152912 -111159 -68976 -45034 -49536 -73030 -91398 -87868 -63878 -35073 -14593
477a4593J1486O626L727M8k501q23P55p75k753L697J8328K7564J8969m123k4114
$$ -14593 -3107 3519 7246 7294 4793 3970 4725 3950 1197 4894 23222 50786 69755 65632 41518
492D1518k6934j0967J2157L1042L9498L0885N824k4624m0180k5981R749M2137
$$ 41518 14584 3617 15774 46816 86314 117199 123023 98399 58219 32238 41987 84124
504H4124M9578L1301J755k1925l3126k7431o946K0098L6479L2132Q613j5317k5849
$$ 84124 133702 165003 166758 144833 111707 84276 77330 97428 133907 166039 174652 159335 133486
517A33486k1912j4495p372J583J1023J6325J0179k818j3810j6951j5495j4074
$$ 133486 111574 97079 89707 91290 102313 118638 128817 125999 112189 95238 79743 65669
529F5669r780J005J2835J6922O873j0733k2220k4306k0687j2742j538J2394K1150
$$ 65669 55889 56894 69729 86651 93524 82791 60571 36265 15578 2836 1298 13692 34842
542C4842J2523r957l2691m0199l0158j0386R089K2267K4650J1212j5439l9189
$$ 34842 47365 37408 4717 -35482 -65640 -76026 -66937 -44670 -20020 -8808 -24247 -63436
554f3436m4295k4799N382K6807L0922J9729J587j7381l0242k7953q590J5884K9579
$$ -63436 -107731 -132530 -127148 -100341 -69419 -49690 -48103 -65484 -95726 -123679 -132269 -116385 -86806
567h6806K3237M481j1103j6751j4787r012j603O849J1134P246j144m799j198J815
$$ -86806 -63569 -59088 -70191 -86942 -101729 -110741 -112344 -105495 -94361 -87115 -88259 -93058 -94256 -92441
581i2441l041j3624j7636p372J2492K7132K7595J5270m349k2498k9711j5977J5426
$$ -92441 -95482 -109106 -126742 -134114 -121622 -94490 -66895 -51625 -55974 -78472 -108183 -124160 -108734
594a08734M6291N4057L1490o244l2976l1877q489K0330M0965M3168K6040k067
$$ -108734 -62443 -8386 23104 16860 -16116 -47993 -56482 -36152 4813 47981 74021 71954
606G1954k6019k8326q939J6045K8342K0982N250n204o888m396n55J656K390L38
$$ 71954 45935 17609 8670 24715 53057 74039 79289 74085 67197 62801 62246 63902 66292 66630
620F6630m800m015N287J7919J9532O745j3607k3685j7545J297J9815K8748K4753
$$ 66630 61830 57815 63102 81021 100553 107298 93691 70006 52461 53758 73573 102321 127074
633A27074P773j6145l3089l0521n319K4422L6722K4279l421k6724l3011k3652
$$ 127074 134847 118702 85613 55092 49773 74195 110917 135196 131775 105051 72040 48388
645D8388n135J4218K3594J5837m498k3754k6929j3667J931O776R33o456q192m994
$$ 48388 43253 57471 81065 96902 92404 68650 41721 28054 29985 36761 37694 31238 23046 18052
659A8052k605j666j821n312j1500j6249j2836J86J1559J1631k202j8090k3780
$$ 18052 15447 13781 11960 6648 -4852 -21101 -33937 -33751 -22192 -10561 -12763 -30853 -54633
672e4633j7819n875N127J2280J2647M341j1346k3776k3983r315Q821J8770J6698
$$ -54633 -72452 -78327 -73200 -60920 -48273 -43932 -55278 -79054 -103037 -112352 -103531 -84761 -68063
685f8063P598l229j2373j7011j2785Q30J5847K0971J2120j314r226r117l540O39
$$ -68063 -60465 -63694 -76067 -93078 -105863 -105033 -89186 -68215 -56095 -57409 -66635 -75752 -79292 -78653
699g8653L630P199P696M087j992m966k928ok85k063j68P457J2986J0634K220m533
$$ -78653 -75023 -67824 -60128 -56041 -58033 -62999 -65927 -65933 -66218 -68281 -68449 -60992 -48006 -37372 -35152 -39685
715c9685n988k722J779P636J4607J9931J7873O696m488q044l443M798J1014J6868
$$ -39685 -45673 -48395 -46616 -38980 -24373 -4442 13431 20127 15639 7595 4152 8950 19964 36832
729C6832J8875J5739M162r449j6170r651N253J6320J7856J0805M66r282j5987
$$ 36832 55707 71446 75608 66159 49989 40338 45591 61911 79767 90572 91038 81756 65769
742F5769j5107m795Q662J6626J2044J283p027p861n636m970m048n56M762R120
$$ 65769 50662 45867 54529 71155 83199 84482 77455 69594 63958 58988 54940 54384 59146 68266
756F8266P931M438O08l144q327j3259r978Q90J1866J4919O543m798j4035j6411
$$ 68266 76197 80635 81243 78099 69772 56513 46535 47425 59291 74210 80753 75955 61920 45509
770D5509j5260r060J082J1677J3770M151j1672k3162k2873j3378j825Q461J3634
$$ 45509 30249 21189 22271 33948 47718 51869 40197 17035 -5838 -19216 -21041 -12580 1054
783A054J0882r03j5604k4388j9590m685P463J0577O521N02m266p214r167q470
$$ 1054 11936 11033 -4571 -28959 -48549 -53234 -45771 -35194 -28673 -28171 -32437 -39651 -48818 -57288
797e7288m274j152o17j908OM959N825q14j0237j4611r415J014J0021J2440J1184
$$ -57288 -61562 -62714 -63331 -65239 -65233 -60274 -54449 -55263 -65500 -80111 -89526 -88512 -78491 -66051 -54867
812e4867M533n745j5009j6084n321J1419K2492K1103R284l484j2824j5791j0858
$$ -54867 -50334 -56079 -71088 -87172 -92493 -81074 -58582 -37479 -28195 -31679 -44503 -60294 -71152
825g1152K331J7584K4660J8126J539j2526j5767q622K744J0138J2739J0810L943
$$ -71152 -68821 -51237 -26577 -8451 -6912 -19438 -35205 -43827 -41083 -30945 -18206 -7396 -3453
838c453l092o599k115N894R548N387n85q83N088J1422J1323N794l28n258n077
$$ -3453 -6545 -13144 -15259 -9365 183 5570 4985 4102 9190 20612 31935 37729 37401 32143 27066
853B7066l34Q809J8497J9899J0003p008j7917j5625l118J0487J6951J5915P823
$$ 27066 26732 35541 54038 73937 83940 76932 59015 43390 40272 50759 67710 83625 91448
866I1448m321j6090j9948j2386L112J4368J3811M571o456j2030j1818o957l53
$$ 91448 87127 71037 51089 38703 41815 56183 69994 74565 68109 56079 44261 37304 36951
879C6951O032Q739L876m947j0339o978K23L942J450l866n621l537J34K442K572
$$ 36951 42983 51722 55598 50651 40312 33334 33557 37499 38949 35083 29462 25925 26059 28501 31073
894C1073O62n345j2431j4956q382L788J2109R417k329j3977j7630j4348n554L037
$$ 31073 31735 26390 13959 -997 -9379 -5591 6518 15935 13606 -371 -18001 -32349 -37903 -34866
908c4866R720R591J282j0459j7181j3578k641O751Q882N428k84n502r709j0354
$$ -34866 -25146 -15555 -14273 -24732 -41913 -55491 -58132 -51381 -42499 -37071 -37355 -42857 -52566 -62920
922f2920n202L290R254P500J9n130n506k539J74N99J380K175J699k17M8K788N831
$$ -62920 -68122 -64832 -55578 -48078 -48059 -53189 -58695 -61234 -61060 -60461 -59081 -56906 -55207 -55424 -55376 -52588 -46757
939d6757N336r18n408l490K932R830J1056P339K264k506n697m676J224J0126J4839
$$ -46757 -41421 -42339 -47747 -51237 -48305 -38475 -27419 -20080 -17816 -20322 -26019 -30695 -29471 -19345 -4506
954d506J1131Q05p483r274m672K171P416J0879J1145N817k916r065q931j576P315
$$ -4506 6625 7430 -53 -9327 -13999 -11828 -4412 6467 17612 23429 20513 11448 2517 941 8256
969H256J0637R607O598K285j512m987l436K528R011R902N260N49l53P40J740M90
$$ 8256 18893 28500 35098 37383 35871 30884 27448 29976 38987 48889 54149 54698 54345 55085 56825 57315
985E7315q73j43N06J484N21J817K266K60n549j1221r690k418M914P948L670k392
$$ 57315 56442 56299 56805 58289 58810 60627 62893 63153 57604 46383 36693 34275 39189 47137 50807 48415
1001D8415p995j2414j2574p233K926J1033J0909K379p684j3295j1152n425R39
$$ 48415 40420 28006 15432 8199 11125 22158 33067 35446 27762 14467 3315 -2110 -1171
1014a171O961Q900N668k239j0076j2307p110P61L568K734m69k147l579m571n668
$$ -1171 5790 14690 20358 18119 8043 -4264 -11374 -10613 -7045 -4311 -4780 -6927 -10506 -15077 -20745
1029b0745m511k547l187m513l497J18M489L944k401r448j1319o503K43N775R305
$$ -20745 -25256 -27803 -30990 -35503 -39000 -38882 -34393 -30449 -32850 -42298 -53617 -60120 -59877 -54102 -44797
1044d4797Q365K282o705j2534j0583j048R283J3523R177K182m318p295o891k742
$$ -44797 -36432 -34150 -40855 -53389 -63972 -65020 -55737 -42214 -33037 -30855 -35173 -42468 -49359 -52101
1058e2101L656R879J0035M588j568l957j728R43K034K334L025M667N021L267J857
$$ -52101 -48445 -38566 -28531 -23943 -25511 -29468 -31196 -30253 -28219 -25885 -22860 -18193 -13172 -9905 -8048
1073h048J815K080l55j959m81M674R399Q885L916j752m653m643k267K002P330
$$ -8048 -6233 -4153 -4508 -6467 -6948 -2274 7125 16010 19926 18174 13521 8878 6611 8613 15943
1088A5943J0933Q735J050o073q964m802J841O499Q175P634M041p89o100o755j594
$$ 15943 26876 35611 36661 30588 21624 16822 18663 25162 33337 40971 45012 44223 38123 31368 29774
1103B9774M664P572O042K321m23j580k671l042j125J379K852J709j650k256j730
$$ 29774 34438 42010 48052 50373 49950 48370 45699 42657 41532 42911 45763 47472 45822 43566 41836
1118D1836p69k686n431n564k824p4O25J65p52k179n331q461q203l635L254O252
$$ 41836 41067 38381 32950 27386 24562 24488 25113 25278 24526 22347 17016 8555 352 -3283 -29 6223
1134F223L124j374o273p191o996m303J712O341O998J606o003j0415p225j084L442
$$ 6223 9347 7973 1700 -5491 -12487 -16790 -15078 -8737 -1739 -133 -6136 -16551 -23776 -24860 -21418
1149b1418M328K701o87m384p481o529k016K755L812J43m504m865k171Q03J797
$$ -21418 -17090 -14389 -15076 -19460 -26941 -33470 -35486 -32731 -28919 -28776 -33280 -38145 -40316 -39513 -37716
1164c7716o03j507k530l005j296J973N557O075K049m228p010l237L427P909P790
$$ -37716 -38319 -39826 -42356 -45361 -46657 -44684 -39127 -33052 -31003 -35231 -42241 -45478 -42051 -34142 -26352
1179b6352M547K44l667o122m028L420J0121J1297N719k305o983n128m07N052Q172
$$ -26352 -21805 -21561 -25228 -31350 -35378 -31958 -21837 -10540 -4821 -7126 -14109 -19237 -19644 -14592 -6420
1194f420Q753N587N8m611m487K84O111P333M258K62j749oK385L372L630K249j23
$$ -6420 2333 7920 7978 3367 -1120 -836 5275 12608 16866 17128 15379 15373 17758 21130 24760 27009 26886
1211B6886k551l303J184N986P115K495l868p439m837J47M734O912N971K434l670
$$ 26886 24335 21032 22216 28202 35317 37812 33944 26505 21668 21815 26549 33461 39432 41866 38196
1226C8196q310p844j134O242R454O228P44l721o009n810l542J124N061N970K011
$$ 38196 29886 22042 20908 27150 36604 42832 43576 39855 33846 28036 24494 25618 30679 36649 38660
1241C8660l771o661n380k266n16o39l38o26k472m224m656l500j034j422l949n203
$$ 38660 34889 28228 22848 20582 20066 19427 19089 18463 15991 11767 7111 3611 2577 1155 -2794 -7997
1257g997l034M43K316O78k070n029m902m593k409J797N759O149J202m682q268
$$ -7997 -11031 -10588 -8272 -7594 -9664 -14693 -19595 -24188 -26597 -24800 -19041 -12892 -11690 -16372 -24640
1272b4640o179j252K913M960N094L082j195o006p981m813R14M942M829K170j381
$$ -24640 -30819 -32071 -29158 -24198 -19104 -16022 -17217 -23223 -31204 -36017 -35103 -30161 -25332 -23162 -24543
1287b4543l629m614m220j656K485N055L934l65k574j221R28J992P99j53O77J987
$$ -24543 -28172 -32786 -37006 -38662 -36177 -31122 -27188 -27553 -30127 -31348 -30420 -28428 -27629 -27782 -27105 -25118
1303b5118K682L456M200L908J141k523l909p65N157R211P440L015j425l836l524
$$ -25118 -22436 -18980 -14780 -10872 -9731 -12254 -16163 -16928 -11771 -2560 4880 7895 6470 2634 -890
1318h90j000L281O764Q637M754r13m388m540o52K613M431M919M421K062j934l963
$$ -890 -1890 1391 8155 16792 21546 20633 16245 11705 11053 13666 18097 23016 27437 29499 27565 23602
1334B3602l244O31L396L866J191n52q48m6n69m04M3L74m65j656j959J422L467
$$ 23602 20358 20989 24385 28251 29442 28890 28042 27996 27427 27023 27066 27440 26975 25319 23360 24782 28249
1351B8249K799j169m838n066j764J176L845L765K679j184n511o674m628P45M911
$$ 28249 31048 29879 25041 19975 18211 19387 23232 26997 29676 28492 22981 16307 11679 12424 17335
1366A7335M854L46l249n358o096m598k174R51L087J657k414o740o478m022m20
$$ 17335 22189 22535 19286 13928 7832 3234 1060 2011 5098 6755 4341 -2399 -8877 -12899 -13319
1381a3319N97M49r2j736l848m162l029N95L152J188j955m134k177J211L188K672
$$ -13319 -12722 -12273 -12365 -14101 -17949 -22111 -25140 -24545 -21393 -20205 -22160 -26294 -28471 -27260 -24072 -21400
1397b1400N17j424l704l354m36L420O214M863j288o159o170k095L000N046N009
$$ -21400 -20883 -22307 -26011 -29365 -29801 -26381 -20167 -15304 -16592 -22751 -28921 -31016 -28016 -22970 -17961
1412a7961J700k158m480n211j998L068O820N165R38l038m019j172P90L742M608
$$ -17961 -16261 -18419 -22899 -28110 -30108 -27040 -20220 -15055 -14117 -17155 -21174 -22346 -21556 -17814 -13206
1427a3206M184K732q80j837r17K824M785M200O04m80n3J298L182L578L489J591
$$ -13206 -9022 -6290 -7170 -9007 -9924 -7100 -2315 1885 2489 2009 1956 3254 6436 10014 13503 15094
1443A5094j072l025j514K827O294O134J401l562m970k547J340M362N508M619l5
$$ 15094 14022 10997 9483 12310 18604 24738 26139 22577 17607 15060 16400 20762 26270 30889 30854
1458C0854m375o181l365K029N592M978J522k236l487k969k054p44J595J393Q74
$$ 30854 26479 20298 16933 18962 24554 29532 31054 28818 25331 22362 20308 19564 21159 22552 23426
1473B3426j568k673j484j26O57j277k064j597l28j03j6l88J39ok168l624l066
$$ 23426 21858 19185 17701 17575 18232 16955 14891 13294 12966 12863 12847 12459 12598 12592 10424 6800 3734
1490C734j83K717K152j44k656l831m466l385j423K023L475K442k782o188o071
$$ 3734 3551 6268 8420 8276 5620 1789 -2677 -6062 -7485 -5462 -1987 455 -2327 -8515 -14586
1505a4586l589l86M87J120O34j66k184l876l413j311P51J212P57J47P59J81p45
$$ -14586 -18175 -18561 -18074 -16954 -16320 -16486 -18670 -22546 -25959 -27270 -26519 -25307 -24550 -24403 -23644 -23463 -24208
1522b4208j604m36J247K700J882M94n6R93P17M69o89j10R26J072J188J977K658
$$ -24208 -25812 -26248 -25001 -22301 -20419 -19925 -19981 -18988 -18271 -17802 -18491 -18601 -17675 -16603 -15415 -13438 -10780
1539a0780J703l67l517m051p45L448N467M291J518j098k962k982j182K340N615
$$ -10780 -9077 -9444 -12961 -17012 -17757 -14309 -8842 -4551 -3033 -4131 -7093 -10075 -11257 -8917 -3302
1554c302N967K909j860k703j500J319L171L646L625K528O47j382j530N98K920
$$ -3302 2665 5574 3714 1011 -489 830 4001 7647 11272 13800 14447 13065 11535 12133 15053
1569A5053L182J497n45j1Q22J757R95N91N01j228k359j868M59L386M557J716k490
$$ 15053 18235 19732 19187 19176 19998 21755 22750 23341 23842 22614 20255 18387 18846 22232 26789 28505 26015
1586B6015n234m545j147J406L620L474Q05l000o100n354j528L113M519J530k255
$$ 26015 20781 16236 15089 16495 20115 23589 24394 21394 15294 9940 8412 11525 16044 17574 15319
1601A5319m232m129k504j72J480J911Q51j405l827k814q82J520R52p78k658k232
$$ 15319 11087 6958 4454 4282 5762 7673 8524 7119 3292 478 -404 1116 2068 1290 -1368 -3600
1617c600o31j64M71Q16L09j253l518m263k141J534J954J654j275l620l917k954
$$ -3600 -4231 -4395 -3924 -3108 -2799 -4052 -7570 -11833 -13974 -12440 -10486 -8832 -10107 -13727 -17644 -20598
1633b0598j544P27K625K735m84m251m928k291J219L561L035J778j33j590k768
$$ -20598 -22142 -21415 -18790 -16055 -16539 -20790 -25718 -28009 -26790 -23229 -20194 -18416 -18549 -20139 -22907
1648b2907j511J750L165L377K400n70j182K30J501J893J684J537R17L64o52k10
$$ -22907 -24418 -22668 -19503 -16126 -13726 -14296 -15478 -15248 -13747 -11854 -10170 -8633 -7716 -7352 -8004 -8214
1664h214J313K571K063p9j184j033N43J480K136J632J367k6j359k487M25L057
$$ -8214 -6901 -4330 -2267 -2346 -3530 -4563 -4020 -2540 -404 1228 2595 2569 1210 -1277 -852 2205
1680B205M803L469P33k253k179j208R40L655M344L730R85k209l608j090K257L734
$$ 2205 7008 10477 11210 8957 6778 5570 6510 10165 14509 18239 19224 17015 13407 12317 14574 18308
1696A8308L333Q90j089j886j930j018R47K286K169K65k625k554j280J151J174
$$ 18308 21641 22531 21442 19556 17626 16608 17555 19841 22010 22275 19650 17096 15816 16967 18141
1711A8141N3j615j148k228j330k03J161J607j45l113m772l144K00K275K470M29
$$ 18141 18194 16579 15431 13203 11873 11670 12831 14438 14293 11180 6408 3264 3464 5739 8209 8638
1727H638j724l520m341l544k24K739L332J177k730m642l747j185R83J838J434
$$ 8638 6914 3394 -947 -4491 -4715 -1976 1356 2533 -197 -4839 -8586 -9771 -8788 -6950 -5516
1742e516P26j445l013k703j058J141J959j6j379j826p97j69M03n07o88o06j319
$$ -5516 -4790 -6235 -9248 -11951 -13009 -11868 -9909 -9925 -11304 -13130 -13927 -14096 -13693 -14200 -14888 -15494 -16813
1759a6813j657m24J197K119R65j546k560j825o49J421J828K601J707O67k089k106
$$ -16813 -18470 -18894 -17697 -15578 -14613 -16159 -18719 -20544 -21193 -19772 -17944 -15343 -13636 -12969 -15058 -17164
1775a7164j312K589L627L671J970L69j030p44o86J274K039L722K720O98j144n95
$$ -17164 -18476 -15887 -12260 -8589 -6619 -6250 -7280 -8024 -8710 -7436 -5397 -1675 1045 1743 599 4
1791DJ90J020J208J206J791L43J072j593Q17k96K570p23R79k159J595J285J161
$$ 4 194 1214 2422 3628 5419 5762 6834 5241 6058 5762 8332 7609 8588 6429 8024 9309 10470
1808A0470K299p35P73j883n48l09J218M920J322J222k428l099l39p29L049J827
$$ 10470 12769 12034 12807 10924 10376 10067 11285 16205 17527 18749 16321 13222 12883 12154 15203 17030
1824A7030J519J722l024k648j727j383L229J765n67K49l161j984j71k124N35J618
$$ 17030 18549 20271 17247 14599 12872 11489 14718 16483 15916 16165 13004 11020 10849 8725 9260 10878
1840A0878j174o34j891l007L22J222k105l34j810k416k47j92j303J223R79k796
$$ 10878 9704 9070 7179 4172 4494 5716 3611 3277 1467 -949 -1196 -1388 -2691 -1468 -489 -3285
1856c285l099j810j425O74L385J34j949j580j637k777j79K169J878O81r6k612
$$ -3285 -6384 -8194 -9619 -8945 -5560 -5426 -7375 -8955 -10592 -13369 -13548 -11379 -9501 -8820 -8916 -11528
1872a1528l567k30K298R12M25P27J01j943j992L26O33M32Q06P62j396j842N77
$$ -11528 -15095 -15325 -13027 -12115 -11690 -10963 -10862 -12805 -14797 -14471 -13838 -13406 -12600 -11838 -13234 -15076 -14499
1889a4499J567m1m79K1J652m44j617P84K739J961K37j059L74Q68M88R82K613K931
$$ -14499 -12932 -12973 -13452 -13431 -11779 -12223 -13840 -13056 -10317 -8356 -8119 -9178 -8804 -7936 -7448 -6466 -3853 -922
1907i22J172j338j002O15J886K381K421J286J059q20k193l89J580K621K449M62
$$ -922 250 -1088 -2090 -1475 411 2792 5213 6499 7558 6738 4545 4156 5736 8357 10806 11268
1923A1268o67j554m63L5P54R52J324Q11m42j132r59l16J319J876N45j301j098
$$ 11268 10601 9047 8584 8619 9373 10325 11649 12460 12018 10886 9927 9611 10930 12806 13351 12050 10952
1940A0952N52P85J095j61m78j86J27q52m06l31J222J531R03k410l480j861J21
$$ 10952 11504 12289 13384 13223 12745 12559 12686 11834 11428 11097 12319 13850 14753 12343 8863 7002 7123
1957G123J703K386K81j953l329l320j708R59K990J135j389l492l186j317M66J157
$$ 7123 8826 11212 11493 9540 6211 2891 1183 2142 5132 6267 4878 1386 -1800 -3117 -2651 -1494
1973a494K5q81q94j562j182r97L75K26p94j258j504o60O99Q67P9o94p89j086j614
$$ -1494 -1469 -2350 -3244 -4806 -5988 -6985 -6610 -6384 -7178 -8436 -9940 -10600 -9901 -9034 -8955 -9649 -10438 -11524 -13138
1992a3138n21Q62J916J528N3j937k311j074O77J843J914J687N14j178k774k186
$$ -13138 -13659 -12797 -10881 -9353 -9300 -11237 -13548 -14622 -13945 -12102 -10188 -8501 -7987 -9165 -11939 -14125
2008a4125J174K074L039J430o82j620j262o32Q96J309J801J781J3j146p91P22
$$ -14125 -12951 -10877 -7838 -6408 -7090 -8710 -9972 -10604 -9708 -8399 -6598 -4817 -4804 -5950 -6741 -6019
2024f019J510R71K43O57J209J082R68K74R00O14L92K5L72J215K020K171J142P
$$ -6019 -4509 -3538 -3295 -2638 -1429 -347 621 895 1795 2409 2801 2826 3198 4413 6433 8604 9746 9753
2042I753p33r21p20m74J166K096K694J427j260j948j828K07K53M88Q94P61J19
$$ 9753 9020 8099 7379 6905 8071 10167 12861 14288 13028 11080 9252 9459 9712 10200 11094 11855 11974
2059A1974j053j232l07J020Q99k89j297q60j36r3O7J7J49K29Q3q55q04J2l03n94
$$ 11974 10921 9689 9382 10402 11301 11012 9715 8855 8719 8626 8693 8710 8859 9088 9171 8316 7512 7524 7221 6627
2079F627j219j474k67j38l36J52L60M43n26j498k237k116m35L58K14o7r74j354
$$ 6627 5408 3934 3667 3529 3193 3345 3705 4148 3622 2124 -113 -2229 -2664 -2306 -2092 -2159 -3133 -4487
2097d487j289j101j24R34J261J60j531j853j742m20Q4M73k42l37m08n44m44N15
$$ -4487 -5776 -6877 -7001 -6067 -4806 -4646 -6177 -8030 -9772 -10192 -10108 -9635 -9877 -10214 -10622 -11166 -11610 -11095
2115a1095L60J127J67o94l24J77M52j63M66m69K51l83m13J87J027J742J108O99
$$ -11095 -10735 -9608 -9441 -10135 -10459 -10282 -9830 -9993 -9527 -9996 -9745 -10128 -10541 -10354 -9327 -7585 -6477 -5778
2133e778m58o63Q15Q73N10J299Q73Q9j051r65j086J452K034J464J48n69m51p3
$$ -5778 -6236 -6899 -6084 -5211 -4701 -3402 -2529 -2440 -3491 -4456 -5542 -4090 -2056 -592 -444 -1013 -1464 -1537
2151a537R10J055J906J723N92k26n55N08J169J370L42q8l26J37M64N66O74L88
$$ -1537 -627 428 2334 4057 4649 4423 3868 4376 5545 6915 7257 7169 6843 6980 7444 8010 8684 9072
2169I072L13q6J05m87M64Q82J092o1k09p55l07j02k03O36M06J35j252j937j279
$$ 9072 9385 9299 9404 8917 9381 10263 11355 11294 11085 10330 10023 9921 9718 10354 10760 10895 9643 7706 6427
2188F427o78P96O48j01k13j292o87j557n37O51J338L01p96j631p39J32L57k0o7
$$ 6427 5749 6545 7193 7092 6879 5587 4900 3343 2806 3457 4795 5096 4300 2669 1930 2062 2419 2399 2332
2207B332n60n64q05n45l47l08p0j090j130j053k64k22l04o70n73r43n90j158n93
$$ 2332 1772 1208 403 -142 -489 -797 -867 -1957 -3087 -4140 -4404 -4626 -4930 -5600 -6173 -7116 -7706 -8864 -9457
2226i457L17O38P65l35j035j167m39qN54M31J350N47j67j493n50O92P85J453L21
$$ -9457 -9140 -8502 -7737 -8072 -9107 -10274 -10713 -10721 -10167 -9736 -8386 -7839 -8006 -9499 -10049 -9357 -8572 -7119 -6798
2245f798n6j19n19J74J95P41R02P41j37l25K06O33O47j09L7L4M78L16P70Q45J123
$$ -6798 -6854 -6973 -7492 -7318 -7123 -6382 -5480 -4739 -4876 -5201 -4995 -4362 -3715 -3824 -3787 -3753 -3275 -2959 -2189 -1344 -221
2266b21N5j90m97k25O28J179Q71J146L52M94l29l86K0O88J628J394P69m00q98
$$ -221 -166 -356 -853 -1078 -450 729 1600 2746 3098 3592 3263 2877 2897 3585 5213 6607 7376 6976 6078
2285F078k03P32Q55R67J306O20n91j057j57N89N47Q09m05q93M3K52J40r4l93q77
$$ 6078 5875 6607 7462 8429 9735 10355 9764 8707 8550 9139 9686 10495 10090 9197 9240 9492 9632 9538 9145 8268
2305H268l57p32q39L24O9M02m89j390j065o33m59Q2j90O0k5o75j340j058l89N22
$$ 8268 7911 7179 6340 6664 6733 7135 6646 5256 4191 3558 3099 3181 2991 3051 3026 2351 1011 -47 -436 86
2325H6L86P1m43o93j054j126q55M17N33P87r00j271r57j36M2j04o5o55j89n68
$$ 86 472 543 100 -593 -1647 -2773 -3628 -3211 -2678 -1891 -2791 -4062 -5019 -5155 -5113 -5217 -5282 -5937 -6126 -6694
2345f694o03kM03K50j50q75q96j79P70P37J17o15l1j75j20n2N27P76Q77j65l75
$$ -6694 -7297 -7299 -6896 -6646 -6796 -7671 -8567 -8746 -7976 -7239 -7122 -7737 -7768 -7943 -8063 -8115 -7588 -6812 -5935 -6100 -6475
2366f475k30J35M89N20M93R41N06J55m87k75K75J021J156Q11j0k44K40R6M94M21
$$ -6475 -6705 -6570 -6081 -5561 -5068 -4127 -3621 -3466 -3953 -4228 -3953 -2932 -1776 -965 -975 -1219 -979 -883 -389 32
2386C2J272O21K63m28j94O39J049L08M71j53m9M19O64K3N28K57K64k42p24K13
$$ 32 1304 1925 2188 1760 1566 2205 3254 3562 4033 3880 3831 4250 4914 4937 5465 5722 5986 5744 5020 5233
2406E233J137O32L64N3n44p1k25j40J21P38P66K19j86j095p02K73O56L87j5l10
$$ 5233 6370 7002 7366 7419 6875 6804 6579 6439 6560 7298 8064 8283 8097 7002 6300 6573 7229 7616 7601 7291
2426G291q54p10o78R6J18L57j55q79j283o33M6l56k94j60l18j064m19n50j84O49
$$ 7291 6437 5727 5049 5145 5263 5620 5465 4586 3303 2670 2716 2360 2066 1906 1588 524 105 -445 -629 20
2446B0n36p80q38o00k26j19M28j09l00n49q00p81n35L48J120M6n47p57j401j69
$$ 20 -516 -1296 -2134 -2734 -2960 -3079 -2651 -2760 -3060 -3609 -4409 -5190 -5725 -5377 -4257 -4211 -4758 -5515 -6916 -7085
2466g085K3L88P00K90l42j139j165j75O24P67J55l62l69p0M7K90N5M91K58j68
$$ -7085 -7062 -6674 -5974 -5684 -6026 -7165 -8330 -8505 -7881 -7114 -6959 -7321 -7690 -7760 -7713 -7423 -7368 -6877 -6619 -6787
2486f787k37K2Q24J379J88m75j10j41O97O88O70M96N86Q4r9j55J80R64R20O93
$$ -6787 -7024 -7002 -6178 -4799 -4611 -5086 -5196 -5337 -4640 -3952 -3282 -2786 -2200 -2116 -2215 -2370 -2190 -1226 -306 387
2506C87N12nJ48M8k8K58N30Q92O55Km09L96J29L90M16J94N0M65k8k28J35L60M13
$$ 387 899 894 1042 1090 1062 1320 1850 2742 3397 3399 2990 3386 3515 3905 4321 4515 4565 5030 5002 4774 4909 5269 5682
2529E682k26k99O2J44O53J77k09k25j69l8j96n8J28M08J79n90l82n23j74M4k44
$$ 5682 5456 5157 5219 5363 6016 6193 5984 5759 5590 5552 5356 5298 5426 5834 6013 5423 5041 4518 4344 4388 4144
2550D144l5O01m18m68j176p32k59L38J95j13n01r56p67r56j98J09K16m7q41r54
$$ 4144 4109 4710 4292 3824 2648 1916 1657 1995 2190 2077 1576 620 -147 -1103 -1301 -1192 -976 -1023 -1864 -2818
2570b818o01j40N77k88j54m27l04o72q2K4O76O0n97r14o04K28L44L41N08l88p4
$$ -2818 -3419 -3559 -2982 -3270 -3424 -3851 -4155 -4827 -4909 -4885 -4209 -4149 -4746 -5660 -6264 -6036 -5692 -5351 -4843 -5231 -5305
2591e305q58q21J77O89O55M31n80n99m77n5L65O07O62L69K18q79q05R3J220J040
$$ -5305 -6163 -6984 -6807 -6118 -5463 -5032 -5612 -6211 -6688 -6743 -6378 -5771 -5109 -4740 -4522 -5401 -6206 -6113 -4893 -3853
2611c853Q56l32j17m58O29Q64O68Q19O6r3k43o0R13J362P24K32o79N0rO11R15
$$ -3853 -2997 -3329 -3446 -3904 -3275 -2411 -1743 -924 -858 -951 -1194 -1254 -341 1021 1745 1977 1298 1348 1339 1950 2865
2632B865N23M42L46m90l74K81M10J111P91j88l87k67r9L2K24N78P60M11n17r57
$$ 2865 3388 3830 4176 3686 3312 3593 4003 5114 5905 5717 5330 5063 4964 4996 5220 5798 6558 6969 6452 5495
2652E495k16O3P29P6K16j48n02o15l40L61P09K56k33o62r75m6J66P77l16n95n36
$$ 5495 5279 5342 6071 6147 6363 6215 5713 5098 4758 5119 5828 6084 5851 5189 4214 4168 4334 5111 4795 4200 3664
2673C664n55j90k69K97N35m12p19j350n86l57M16J10p1j31q94o42j030l76N5O94
$$ 3664 3109 2919 2650 2947 3482 3070 2351 1001 415 58 474 584 513 382 -512 -1154 -2184 -2560 -2505 -1811
2693a811M7l95r91o99o95J39N0L34K51k20m10j128J12K33M13L94j48o74n65J45
$$ -1811 -1764 -2159 -3150 -3849 -4544 -4405 -4355 -4021 -3770 -3990 -4400 -5528 -5416 -5183 -4770 -4376 -4524 -5198 -5763 -5618
2713e618N19M05L46l7l03q15O7N61O88O45r3n87m64k04L09O45P77K87J27j69n33
$$ -5618 -5099 -4694 -4348 -4385 -4688 -5503 -5436 -4875 -4187 -3542 -3635 -4222 -4686 -4890 -4581 -3936 -3159 -2872 -2745 -2914 -3447
2734c447q7M44Q27R43K93k4J00k26Q5N40M90R71N57j38l56q2N16R02L73K59n8
$$ -3447 -3534 -3090 -2263 -1320 -1027 -1051 -951 -1177 -1092 -552 -62 909 1466 1328 972 890 1406 2308 2681 2940 2882
2755B882j92n5K81N89P18M66o5p67l05N6Q80N86L15lo01o86j57R6L15N87M10j10
$$ 2882 2690 2635 2916 3505 4223 4689 4624 3857 3552 3608 4488 5074 5389 5386 4785 4099 3942 4038 4353 4940 5350 5240
2777E240j042l72k11J91R3M43l63J20n75l78o67K91KK55j16p84m44l39q9L3L34
$$ 5240 4198 3826 3615 3806 3899 4342 3979 4099 3524 3146 2479 2770 2772 3027 2911 2127 1683 1344 1255 1288 1622
2798A622k01l09o45p14q2L0L36k30l82p09p21l2J3q6j8K45r22p72o53K78M34Q5
$$ 1622 1421 1112 467 -247 -329 -299 37 -193 -575 -1284 -2005 -2037 -2024 -2110 -2128 -1883 -2805 -3577 -4230 -3952 -3518 -3433
2820c433q7m54k92m89l76L35j0L84J94j92k18n5k82M19K45M72o5J36j45m04K43
$$ -3433 -3520 -3974 -4266 -4755 -5131 -4796 -4806 -4422 -4228 -4420 -4638 -4693 -4975 -4556 -4311 -3839 -3904 -3768 -3913 -4317 -4074
2841d074K46Q45M18k50j71j32K70N58K31M16J86n70j04r1N41N76R94L68o82l05
$$ -4074 -3828 -2983 -2565 -2815 -2986 -3118 -2848 -2290 -2059 -1643 -1457 -2027 -2131 -2222 -1681 -1105 -111 257 -425 -730
2861g30J0O31N63P30K72jJ40r9j32P47M83M61J39l1p4l16N43J97O68J52K10K86
$$ -730 -720 -89 474 1204 1476 1475 1615 1516 1384 2131 2614 3075 3214 3183 3109 2793 3336 3533 4201 4353 4563 4849
2883D849o92l84L08N84L12J70k78l6p02k64N88J59j30M88q69q96l65P14L15J10
$$ 4849 4157 3773 4081 4665 4977 5147 4869 4833 4131 3867 4455 4614 4484 4972 4103 3207 2842 3556 3871 3981
2903C981l41n98l08j015K45q2N07K10l00j093q04%R8O54l43l00k86o95m81m16
$$ 3981 3640 3042 2734 1719 1964 1882 2389 2599 2299 1206 402 402 500 1154 811 511 225 -470 -951 -1367
2923a367M28K70K12k40j005l11n60K31M5k7j07j36n18q65n2nM82L41n93q61j48
$$ -1367 -939 -669 -457 -697 -1702 -2013 -2573 -2342 -2297 -2324 -2431 -2567 -3085 -3950 -4002 -4007 -3525 -3184 -3777 -4638 -4786
2944d786j37K86M36L15P0m61p71n52N21N51Q14K48m34o48m4J89O97L95M12M03
$$ -4786 -4923 -4637 -4201 -3886 -3816 -4277 -5048 -5600 -5079 -4528 -3714 -3466 -3900 -4548 -4592 -4403 -3706 -3311 -2899 -2496
2964b496N8k68m95L04O17P38N90l58K60N7k8N0K24P13L75K5k13J34k47O27P51
$$ -2496 -2438 -2706 -3201 -2897 -2280 -1542 -952 -1310 -1050 -993 -1021 -971 -747 -34 341 366 153 287 40 667 1418
2985A418J93J87j95k35P5N38O73N08N00k60q75k7N62O98N66m3K44m42m80J06R8
$$ 1418 1611 1798 1603 1368 1443 1981 2654 3162 3662 3402 2527 2500 3062 3760 4326 4283 4527 4085 3605 3711 3809
3006C809O75O70q8n64m98N6p8L10l0M29j52k09o06p17jK55L64J84m33o85j004
$$ 3809 4484 5154 5066 4502 4004 4060 3982 4292 4262 4691 4539 4330 3724 3007 3006 3261 3625 3809 3376 2691 1687
3027A687L64J19j9K29l59o51p41o17J75M96J44l12n16q45p07n1L18O03O2o45o56
$$ 1687 2051 2170 2151 2380 2021 1370 629 12 187 683 827 515 -1 -846 -1553 -1604 -1286 -683 -621 -1266 -1922
3048a922j015j52L69N52M39n27m35r61L0l66M13O27O0K8q65p59j3L4R34k33J57
$$ -1922 -2937 -3089 -2720 -2168 -1729 -2256 -2691 -3652 -3622 -3988 -3575 -2948 -2888 -2860 -3725 -4484 -4497 -4463 -3529 -3762 -3605
3069c605l91m71l35M57L95L20M01k45n24n60P2Q13Q70M57k43o0l86l47O30P67
$$ -3605 -3996 -4467 -4802 -4345 -3950 -3630 -3229 -3474 -3998 -4558 -4486 -3673 -2803 -2346 -2589 -2649 -3035 -3382 -2752 -1985
3089a985J052M49m33m99k19M49Q00Q61L13O4l65j85k2M76O79O34K54n48r9j47
$$ -1985 -933 -484 -917 -1416 -1635 -1186 -386 475 788 852 487 302 280 756 1435 2069 2323 1775 1676 1529
3109A529M70K33O75r1J93j33p5o6K42L91L91J71l73k51k69M36J40O35q1M02n80
$$ 1529 1999 2232 2907 2816 3009 2876 2801 2735 2977 3368 3759 3930 3557 3306 3037 3473 3613 4248 4167 4569 3989
3130C989m55j68K0O71N78n29j60o89m1k07J62L76j29r0n38m93m06p8L49J76m96
$$ 3989 3534 3366 3386 4057 4635 4106 3946 3257 3216 3009 3171 3547 3418 3328 2790 2297 1891 1813 2162 2338 1842
3151A842m69k30p00k8l20N8J44m17p5p27l53J23j69k88J35k48m21n8p89R4N00
$$ 1842 1373 1143 443 415 95 153 297 -120 -195 -922 -1275 -1152 -1321 -1609 -1474 -1722 -2143 -2201 -2990 -2896 -2396
3172b396K66k07k39p30j0n1J49K62J10j32p11j88l47M21L93N95j21m11n24n5J84
$$ -2396 -2130 -2337 -2576 -3306 -3316 -3367 -3218 -2956 -2846 -2978 -3689 -3877 -4224 -3803 -3410 -2815 -2936 -3347 -3871 -3926 -3742
3193c742K72K81M66l38j6q82L88L12M67K67K3K42j34j85r8M85N97P58j83o4j96
$$ -3742 -3470 -3189 -2723 -3061 -3077 -3959 -3571 -3259 -2792 -2525 -2502 -2260 -2394 -2579 -2677 -2192 -1595 -837 -1020 -1084 -1280
3214a280J02O37L57P86k7j83l9p7K88P03O86M57o8o73j22M88M55N49K87j2m09
$$ -1280 -1178 -541 -184 602 575 392 353 276 564 1267 1953 2410 2342 1669 1547 2035 2490 3039 3326 3314 2905
3235B905l84j09R8Q19L80L5j69m92l8q5K33N66N2j38N0q29k0L7K66N93j01n73
$$ 2905 2521 2412 2510 3329 3709 3744 3575 3083 3045 2960 3193 3759 3811 3673 3723 2894 2874 2911 3177 3770 3669 3096
3257C096l12m10M12j14J2K19l45j17m79l88p4K33L89j38m79q57n52K79j4K93l99
$$ 3096 2784 2374 2786 2672 2684 2903 2558 2441 1962 1574 1500 1733 2122 1984 1505 648 96 375 361 654 255
3278B55k41m53p27k96p1L93L00j51p55m94P8o22M58J53k16J43o46k35L0j99P2
$$ 255 14 -439 -1166 -1462 -1533 -1140 -840 -991 -1746 -2240 -2162 -2784 -2326 -2173 -2389 -2246 -2892 -3127 -3097 -3296 -3224
3299c224nL39l76J33m97J8K36j13O73p2m84l11M26J52N12J30j42J89l09l38K6
$$ -3224 -3229 -2890 -3266 -3133 -3630 -3612 -3376 -3489 -2816 -2888 -3372 -3683 -3257 -3105 -2593 -2463 -2605 -2416 -2725 -3063 -3037
3320c037M81P85L37m43m5m42J7M48M86M84L61k51l30J39J49L34N26L69m2j7L8
$$ -3037 -2556 -1771 -1434 -1877 -1922 -2364 -2347 -1899 -1413 -929 -568 -819 -1149 -1010 -861 -527 -1 368 326 309 347
3341C47l2N56M18K41K67m1L9j0%J51P27K44m6J83m51o6L75L29K42K12k02o07j03
$$ 347 315 871 1289 1530 1797 1756 1795 1785 1785 1936 2663 2907 2861 3044 2593 2527 2902 3231 3473 3685 3483 2876 2773
3364B773k96O67L57K1m00k23l06l10K09M52L68j04o22l32p73L70K84J75n5k1m59
$$ 2773 2477 3144 3501 3522 3122 2899 2593 2283 2492 2944 3312 3208 2586 2254 1481 1851 2135 2310 2255 2234 1775
3385A775j58n41Q0L47j01pl76n71j87Q1n3m6R5j48n84n12l00K06o5L47l06n16
$$ 1775 1617 1076 1156 1503 1402 1395 1019 448 261 342 289 243 338 190 -394 -906 -1206 -1000 -1065 -718 -1024 -1540
3407a540o44rJ68k10K48K22n56l29l56n10P9Q94m2K81m77m65m16L80K72J08K81
$$ -1540 -2184 -2193 -2025 -2235 -1987 -1765 -2321 -2650 -3006 -3516 -3437 -2543 -2585 -2304 -2781 -3246 -3662 -3282 -3010 -2902 -2621
3428b621j53j4k32j43O6P00K19J39l02J4k43J67K60N18J45J68j27o7k00M52M21
$$ -2621 -2774 -2788 -3020 -3163 -3097 -2397 -2178 -2039 -2341 -2327 -2570 -2403 -2143 -1625 -1480 -1312 -1439 -1506 -1706 -1254 -833
3449h33L86J96l51l6m2J57J07O65P00j57m50l11J93L72N75M23K32k83l8k05K43
$$ -833 -447 -251 -602 -638 -680 -523 -416 249 949 792 342 31 224 596 1171 1594 1826 1543 1505 1300 1543
3470A543K46P85P6L7k78m33M52J76L86N1O2J4j31l20k35K81M37J18L1k97p33K35
$$ 1543 1789 2574 2650 2687 2409 1976 2428 2604 2990 3041 3103 3117 2986 2666 2431 2712 3149 3267 3298 3001 2268 2503
3492B503n8M6K13j55j20l05l14n26L31M45j27j19n54l86m18m1N13J03Ml39o75
$$ 2503 2445 2491 2704 2549 2429 2124 1810 1284 1615 2060 1933 1814 1260 874 456 415 928 1031 1035 696 21
3513B1j82k45L41M82l98k46m94j39j40j01J19m5p2j63n21m69K62j83K90l1k10
$$ 21 -161 -406 -65 417 19 -227 -721 -860 -1000 -1101 -982 -1027 -1099 -1262 -1783 -2252 -1990 -2173 -1883 -1914 -2124
3534b124q8k88j09k37K04L27J48k48l27k27o1j06N30M61p3k77j14j32l03O74M74
$$ -2124 -2212 -2500 -2609 -2846 -2642 -2315 -2167 -2415 -2742 -2969 -3030 -3136 -2606 -2145 -2218 -2495 -2609 -2741 -3044 -2370 -1896
3555a896J94l3j36o25N02J55M36Q3M37m00K15k02M38L14N50k73J01k91j25M35
$$ -1896 -1702 -1735 -1871 -2496 -1994 -1839 -1403 -1320 -883 -1283 -1068 -1270 -832 -518 32 -241 -140 -431 -556 -121
3575a21J16N02m1K48J47j97N4j50M25N73K06n7j25j3j81L23J48M67J7j65l00J08
$$ -121 -5 497 456 704 851 654 708 558 983 1556 1762 1705 1580 1567 1386 1709 1857 2324 2341 2176 1876 1984
3597A984l4N30N24rk30m35l26K36J96qN82K0n00o83J66L1Q5l7ml13j74r2j98K59
$$ 1984 1950 2480 3004 2995 2765 2330 2004 2240 2436 2428 3010 3030 2530 1847 2013 2044 2129 2092 2088 1775 1601 1509 1311 1570
3621A570m6K5l24k17k65R7m02%N6j80r0m15l35j55K13K76J94l38n13j46l19P3
$$ 1570 1524 1549 1225 1008 743 840 438 438 494 314 224 -191 -526 -681 -468 -192 2 -336 -849 -995 -1314 -1241
3643a241K2Q7R1m64m3p6k94J88K0J56m73k2k72o7J82J85k16l5J61l58j16k1L74
$$ -1241 -1219 -1132 -1041 -1505 -1548 -1624 -1918 -1730 -1710 -1554 -2027 -2049 -2321 -2388 -2206 -2021 -2237 -2272 -2111 -2469 -2585 -2606 -2232
3666b232K47k14P6r3n1K45j5l0K53q8K46J40k96J68L84Q0L10k7N0r8L5J5M07L30
$$ -2232 -1985 -2199 -2123 -2216 -2267 -2022 -2037 -2067 -1814 -1902 -1656 -1516 -1812 -1644 -1260 -1180 -870 -897 -847 -945 -910 -895 -488 -158
3690a58M01j17j85K9qM12J28L62nm1R7j4p0L14L65j23L58l74l6o6N31j26K33j85
$$ -158 243 126 -59 -30 -38 374 502 864 859 818 915 901 831 1145 1510 1387 1745 1371 1335 1269 1800 1674 1907 1722
3714A722p0M77p8j47K14m2J38n2k52J77j70P6j10J54L96q0n59j66J8J80L04R2
$$ 1722 1652 2129 2051 1904 2118 2076 2214 2162 1910 2087 1917 1993 1883 2037 2433 2353 1794 1628 1646 1826 2130 2222
3736B222n86k44l09Q2J50K05K2m75j57o79RL56j53J92m33l01k11P3j77K81k27
$$ 2222 1636 1392 1083 1165 1315 1520 1542 1067 910 231 240 596 443 635 202 -99 -310 -237 -414 -133 -360
3757c60jl16j56l47J03J01o9R7k61j74k49q2L00l87K90r3J27n26j4n3J61J54k4
$$ -360 -361 -677 -833 -1180 -1077 -976 -1045 -948 -1209 -1383 -1632 -1714 -1414 -1801 -1511 -1604 -1477 -2003 -2017 -2070 -1909 -1755 -1779
3780a779K8K1k93k53J29K4M24j32J87l63n6j9K93N71j72p2k8P4N3j35L27L12k83
$$ -1779 -1751 -1730 -2023 -2276 -2147 -2123 -1699 -1831 -1644 -2007 -2063 -2082 -1789 -1218 -1390 -1462 -1490 -1416 -1363 -1498 -1171 -859 -1142
3803a142L15p1J52J33J78J06K07j47J58K84k80P2M60L87L83m86J20L35p0j61J88
$$ -1142 -827 -898 -746 -613 -435 -329 -122 -269 -111 173 -107 -35 425 812 1195 709 829 1164 1094 933 1121
3824A121J81J85k0l84J14J23K94K02K7n5J1l10L28q9L07k45L33l12l74P8J64J79
$$ 1121 1302 1487 1467 1083 1197 1320 1614 1816 1843 1788 1799 1489 1817 1728 2035 1790 2123 1811 1437 1515 1679 1858
3846A858J6k0k47q7n1M5R1O6j87k06k9k2p2L8Kj26l17J26j65k71n0R4j5P3m40
$$ 1858 1874 1854 1607 1520 1469 1514 1605 1671 1484 1278 1249 1227 1155 1193 1195 1069 752 878 713 442 392 486 471 544 104
3871A04j80q2m28O6M61n47J40k9k97l15Q4J24j44K79o60j7k2k55K01n3J28j62
$$ 104 -76 -158 -586 -520 -59 -606 -466 -495 -792 -1107 -1023 -899 -1043 -764 -1424 -1441 -1463 -1718 -1517 -1570 -1442 -1604
3893a604N8j33L1j42K77N5k8l11j32k5J49L02m9K86l55o8K28o1j00K95K06j18
$$ -1604 -1546 -1679 -1648 -1790 -1513 -1458 -1486 -1797 -1929 -1954 -1805 -1503 -1552 -1266 -1621 -1689 -1461 -1522 -1622 -1327 -1121 -1239
3915a239O3J07k4n04M40J35L81K13J3n2k32J34K57J45L36k10j5L42j47P7K02K06
$$ -1239 -1176 -1069 -1093 -1597 -1157 -1022 -641 -428 -415 -467 -699 -565 -308 -163 173 -37 -52 290 143 220 422 628
3937F28O5j29o1M61j36k8M72m1J73r9J24J62l77L86j57J01j39O1P6O5k0j13K31
$$ 628 693 564 503 964 828 800 1272 1231 1404 1305 1429 1591 1214 1600 1443 1544 1405 1466 1542 1607 1587 1474 1705
3960A705J41j54rj92l18M58J55k09Ok72o4q5N9Jk1R9l81n3k91rJ26N2j28k85J66
$$ 1705 1846 1692 1683 1491 1173 1631 1786 1577 1583 1311 1247 1162 1221 1222 1201 1300 919 866 575 566 692 744 616 331 497
3985D97k97K4j59K31k44O0k42j87q5J9J96m56r3j31r3M0k23J30J08k58K11j87
$$ 497 200 224 65 296 52 112 -130 -317 -402 -383 -187 -643 -736 -867 -960 -920 -1143 -1013 -905 -1163 -952 -1139
4007a139j37m24m4K84J00J7J0l53l7l2j3L69j38M1J85n08J59R2K16J99n3l34r5
$$ -1139 -1276 -1700 -1744 -1460 -1360 -1343 -1333 -1686 -1723 -1755 -1768 -1399 -1537 -1496 -1311 -1819 -1660 -1568 -1352 -1153 -1206 -1540 -1635
4030a635K85J15M6K61J07j29j47J39M11q8j36K14r5K72n3l9K43L31k91J26R0K4
$$ -1635 -1350 -1235 -1189 -928 -821 -950 -1097 -958 -547 -635 -771 -557 -652 -380 -433 -472 -229 102 -189 -63 27 51
4052E1L58j28L73j71J48J4O5MP4l6K21L82l66RJ99J51p0K82k24L1J64j64lJ06
$$ 51 409 281 654 483 631 645 710 714 788 752 973 1355 989 998 1197 1348 1278 1560 1336 1367 1531 1367 1364 1470
4076A470L9l28N57l72j66J36L95j24j3j85j77J05N9P5m23j21K40Rl18n5O9pl44
$$ 1470 1509 1181 1738 1366 1200 1336 1731 1607 1594 1409 1232 1337 1396 1471 1048 927 1167 1176 858 803 872 865 521
4099E21J54l42J68o2l49J57Q1j55j46N7K21k66p5l98k64J81j63J08J63R3m80k76
$$ 521 675 333 501 439 90 247 328 173 27 84 305 39 -36 -434 -698 -517 -680 -572 -409 -316 -796 -1072
4121a072p8K62P0k99J78l20L32l94n5M10k45j69j79k02L76M1l7m4L9n8K72j91
$$ -1072 -1150 -888 -818 -1117 -939 -1259 -927 -1321 -1376 -966 -1211 -1380 -1559 -1761 -1385 -1344 -1381 -1425 -1386 -1444 -1172 -1363
4143a363k59L80K92k39R6Q9j90K81j01mM3K24j0K9j1J71k5L5L94mm48L02J6K77
$$ -1363 -1622 -1242 -950 -1189 -1093 -1004 -1194 -913 -1014 -1018 -975 -751 -761 -732 -743 -572 -597 -562 -168 -172 -620 -318 -302 -25
4167b5M5N8Q5K6K25k32K51J15JJ15k53R2L63l78K64l6k7M94j12K54n28L68N2J97
$$ -25 20 78 163 189 414 182 433 548 549 664 411 503 866 488 752 716 689 1183 1071 1325 797 1165 1217 1414
4191A414k76j23Q7P8jP3M2j59J34J23o9k01r7q8J10Q5j36J93k79P3l16J76L20
$$ 1414 1138 1015 1102 1180 1179 1252 1294 1135 1269 1392 1323 1122 1025 937 1047 1132 996 1189 910 983 667 843 1163
4214A163j70k77l41K36j12o6k6kj87j29j60J33K0K74l59m14M13l7k41J16q7j04
$$ 1163 993 716 375 611 499 433 407 405 218 89 -71 62 82 356 -3 -417 -4 -41 -282 -166 -253 -357
4236c57k17J99k94l9p0J89k48J01k04j40R4l34L05j3K0k57J50O1j14j93R1J47
$$ -357 -574 -375 -669 -708 -778 -589 -837 -736 -940 -1080 -986 -1320 -1015 -1028 -1008 -1265 -1115 -1054 -1168 -1361 -1270 -1123
4258a123J01N5l17J08l9p7J91K19J07l3l70L12J66l68K91L79q2m3k45L28o2N8
$$ -1123 -1022 -967 -1284 -1176 -1215 -1292 -1101 -882 -775 -808 -1178 -866 -700 -1068 -777 -398 -480 -523 -768 -440 -502 -444
4280d44J70J64j99J67j02J29J14J52J4L0j74L46Q8j85m9J89K46oj47J9l7L00J26
$$ -444 -274 -110 -309 -142 -244 -115 -1 151 165 195 21 367 455 270 221 410 656 650 503 522 485 785 911
4303I11K40j64j40j06J74k44L24J94l1K09m59P2P8OJ48K57l47o7K1l0J19j30K21
$$ 911 1151 987 847 741 915 671 995 1189 1158 1367 908 980 1058 1064 1212 1469 1122 1055 1076 1046 1165 1035 1256
4326A256k71j20kJ67j10j00k32R2J25l29K4ok03Q4pj07M9j98k70K12m2o6K32n69
$$ 1256 985 865 863 1030 920 820 588 680 805 476 500 494 291 375 368 261 310 112 -158 54 12 -54 178 -391
4350c91J51r5j14J98j71J49l93l2j27L9Q6J81j22j40j40Q3q1q9N9J34P4k06l4
$$ -391 -240 -335 -449 -251 -422 -273 -666 -698 -825 -786 -700 -519 -641 -781 -921 -838 -919 -1008 -949 -815 -741 -947 -981
4373i81J2r4R6K64Q0n02J80O5j91J0K40j35J0K14k04K6j91K93L3J18L95k48Q1
$$ -981 -969 -1063 -967 -703 -623 -1125 -945 -880 -1071 -1061 -821 -956 -946 -732 -936 -910 -1101 -808 -775 -657 -262 -510 -429
4396d29j19L5J10Q6P6K20l06K22j86M05K43L01l44K04j40l1m5L70j15N9j22J59
$$ -429 -548 -513 -403 -317 -241 -21 -327 -105 -291 114 357 658 314 518 378 347 302 672 557 616 494 653
4418F53j4K75m21L14L3m2R9j35J54j11k38K98J27l06K24j45mM15l17J79r6l3K0
$$ 653 639 914 493 807 840 798 897 762 916 805 567 865 992 686 910 765 761 1176 859 1038 942 909 929
4441I29k53k4J71O2L3Q0k19n6j42J62j55J66o7j50j64Jj36KJ37j05k0nj67k37
$$ 929 676 652 823 885 918 998 779 723 581 743 588 754 687 537 373 374 238 240 377 272 252 247 80 -157
4465a57K13r6N9k66r7k6k6k17K15j01r8m35L84k95K26P1L6j97Pk0p2L3j4K46j12
$$ -157 56 -40 19 -247 -344 -370 -396 -613 -398 -499 -597 -1032 -648 -943 -717 -646 -610 -807 -800 -820 -892 -859 -873 -627 -739
4490g39j44j9J7k00J70j69L22M7m4l40M32l70Q1K67j46K30j50O8L9K3L96k68R6
$$ -739 -883 -902 -885 -1085 -915 -1084 -762 -715 -759 -1099 -667 -1037 -956 -689 -835 -605 -755 -687 -648 -625 -229 -497 -401
4513d01k07L43l20O4O01p06L19J63j80M72p4j84P8O4J89j0M7j5j66J30J02K30
$$ -401 -608 -265 -585 -521 80 -626 -307 -144 -324 148 74 -110 -32 32 221 211 258 243 77 207 309 539
4535E39j05J72O2K9j9ol40P69k49m0P4k25j9J4J97k29J50j23J03K3j89j14O10
$$ 539 434 606 668 697 678 672 332 1101 852 812 886 661 642 656 853 624 774 651 754 777 588 474 1084
4558A084j85k35O4j0j99L06J15m99J75J5r0J3k65Q5L9N2k72J02K0p0p2k6r9L31
$$ 1084 899 664 728 718 519 825 940 441 616 631 541 554 289 374 413 465 193 295 315 245 173 147 48 379
4582C79j62l71m3J29M1j16j14j08j22J15j37j94J88P8K3m3j26k80L53l07J93j47
$$ 379 217 -154 -197 -68 -27 -143 -257 -365 -487 -372 -509 -703 -515 -437 -414 -457 -583 -863 -510 -817 -624 -771
4604g71J80j63oq4k8K13J42k24n0J5p4jJ19p2L3J82j95m6K14K2L27m55K55l06
$$ -771 -591 -754 -760 -844 -872 -659 -517 -741 -791 -776 -850 -851 -732 -804 -771 -589 -784 -830 -616 -594 -267 -722 -467 -773
4628g73L88p7L6J29j32Q6P9k38K16j10K97k5J08J96l29J2L84K60m34J28Q9j57
$$ -773 -385 -462 -426 -297 -429 -343 -264 -502 -286 -396 -99 -124 -16 180 -149 -137 247 507 73 201 290 133
4650A33K68PO5j15K73j59K2j5R4j06K69K41l01J50J6j10r4J1J72Kj24P3Nj37K6
$$ 133 401 408 473 358 631 472 494 479 573 467 736 977 676 826 842 732 638 649 821 823 699 772 777 640 666
4675F66q0J73j17J25j24k18L8J06J61j61J84k40j24j1J15k51K0L2J03k02k8j12
$$ 666 586 759 642 767 643 425 463 569 730 569 753 513 389 378 493 242 262 294 397 195 167 55
4697E5J10j72j0Q1j32N7j14kk7q9J04j57r0J37M1j84k23k3L56o1o6k79M4j1j13
$$ 55 165 -7 -17 64 -68 -11 -125 -127 -154 -243 -139 -296 -386 -249 -208 -392 -615 -638 -282 -343 -409 -688 -644 -655 -768
4722g68J51K27l44L1nN4j68L11l52K71r7J33l40K13j69K78o4j06J8J97j84j26
$$ -768 -617 -390 -734 -703 -708 -654 -822 -511 -863 -592 -689 -556 -896 -683 -852 -574 -638 -744 -726 -529 -713 -839
4744h39K72K86q7j54K78J6J58j95j3Q6j58o8K67j05K32Q2K13m24K07K03k88K58
$$ -839 -567 -281 -368 -522 -244 -228 -70 -265 -278 -192 -350 -418 -151 -256 -24 58 271 -153 54 257 -31 227
4766B27NL34l75J3K06j34J57J62P1j51K48l39P5j67M27j22m03K04L17j96KjR3
$$ 227 232 566 191 204 410 276 433 595 666 515 763 424 499 332 759 637 234 438 755 559 561 560 653
4789F53J72j59j9Q5J35J06l44J31j45K09m35K70R1l06J54O6j76J1k18JJ57r8J98
$$ 653 825 666 647 732 867 973 629 760 615 824 389 659 750 444 598 664 488 499 281 282 439 341 539
4812E39k28O9n3j75r2oJ62j09q4Mlm13l0L79p9q4J40k29j92L0J54K2J47m40r7
$$ 539 311 380 327 152 60 54 216 107 23 27 24 -389 -419 -40 -119 -203 -63 -292 -484 -454 -300 -278 -131 -571 -668
4837f68J76N0nj12J34p9J49l61K83M3m13J22QN0r4L69k07m85M57Q4n5O9k72J2
$$ -668 -492 -442 -447 -559 -425 -504 -355 -716 -433 -390 -803 -681 -673 -623 -717 -348 -555 -1040 -583 -499 -554 -485 -757 -745
4861g45J88j1J50m2k86L98l20K67N2j17K98j26n0N6J25k35J71K27K9J7j8J32m1
$$ -745 -557 -568 -418 -460 -746 -348 -668 -401 -349 -466 -168 -294 -344 -288 -163 -398 -227 0 29 46 28 160 119
4884A19O1KJ05l05K40J78j42j1qP9N8j19O8J50k3q3J46m5j64J25J25K52m19MR4
$$ 119 180 182 287 -18 222 400 258 247 239 318 376 257 325 475 452 369 515 470 306 431 556 808 389 393 487
4909D87K91l29J17rK17l55K86j60J63j46K1k00J44k15J31k8J35qj48l3Q5p5j59
$$ 487 778 449 566 557 774 419 705 545 708 562 583 383 527 312 443 415 550 542 394 361 446 371 212
4932B12J84j95M2k42J87p8j47k62J52N6o2o6J9l9J7j35j5l3j42N4K9j20L07l26
$$ 212 396 201 243 1 188 110 -37 -299 -147 -91 -153 -219 -200 -239 -222 -357 -372 -405 -547 -493 -464 -584 -277 -603
4956f03K29o0l10J84K57k55L4j42J19J53q1k67j5K56j37l5L14k05J07p0J99j77
$$ -603 -374 -434 -744 -560 -303 -558 -524 -666 -547 -394 -475 -742 -757 -501 -638 -673 -359 -564 -457 -527 -328 -505
4978e05Lk8L29n5l04J45O9L9j86K24j53J51k8K0J33J12O7J05k93J78Oj94M88j13
$$ -505 -502 -530 -201 -256 -560 -415 -346 -307 -493 -269 -422 -271 -299 -279 -146 -34 33 138 -155 23 29 -165 323 210
5002B10j24Q9K39k16J07k6J31k56R2P1J06j02L64j27k22O5k9Q6K86l23L9R8J08
$$ 210 86 175 414 198 305 279 410 154 246 317 423 321 685 558 336 401 372 458 744 421 460 558 666
5025F66k07L11l7k35l4M9o0K66k32o6L68l90L12l66J92m36L67j53J84l28O9K25
$$ 666 459 770 733 498 464 513 453 719 487 421 789 399 711 345 537 101 468 315 499 171 240 465
5047D65k43R8j13j19J99p9l6K5q9k31K26q3J78l06k50M51r8j40j32J14m40J87
$$ 465 222 320 207 88 287 208 172 197 108 -123 103 20 198 -108 -358 93 -5 -145 -277 -163 -603 -416
5069d16K04j45k28K62N6j35j05K59k62m1J94j62MK7k60O70m89N1j01O1P9j00J03
$$ -416 -212 -357 -585 -323 -267 -402 -507 -248 -510 -551 -357 -519 -515 -488 -748 -78 -567 -516 -617 -556 -477 -577 -474
5092d74lJ15k21l6L4j87K48K21k25R2K05Q9j34J2O7r7K43j10J4K6j98K77K29m06
$$ -474 -477 -362 -583 -619 -585 -772 -524 -303 -528 -436 -231 -142 -276 -264 -197 -294 -51 -161 -147 -121 -319 -42 187 -219
5116b19J75M1Q5J86l66L65o1M6o7J7p4J3L96OM0k04J0J56k61J25j81J82L2j34
$$ -219 -44 -3 82 268 -98 267 206 252 185 202 128 141 537 543 583 379 389 545 284 409 228 410 442 308
5140C08J77J68l3j36K45l14r4j63M09J62k61o2J20r1J40k24Q2K75k81J04m9j10
$$ 308 485 653 620 484 729 415 321 158 567 729 468 406 526 435 575 351 433 708 427 531 482 372
5162C72k60K75k85K14k3o8M5l39K27p4L34l16j9J5o7j98K43l44L14j6k70J3J34
$$ 372 112 387 102 316 293 225 270 -69 158 84 418 102 83 98 31 -167 76 -268 46 30 -240 -227 -93
5185i3l7j28J7k64J54N2q7J25k00j5K07P7k40j71K48K85o69P7L63l43K47o2K8
$$ -93 -130 -258 -241 -505 -351 -299 -386 -261 -461 -476 -269 -192 -432 -603 -355 -70 -739 -662 -299 -642 -395 -457 -429
5208d29j20J49p6J10k08L75r8k69J74k0j49M14r1L5j13p3q9L53Q9l01n6M73j68
$$ -429 -549 -400 -476 -366 -574 -199 -297 -566 -392 -412 -561 -147 -238 -203 -316 -389 -478 -125 -36 -337 -393 80 -88
5231h8l4l3K17O7l67L3J86k0JQ7K37j50j33K78j84J96n4q7J32J72j07j03K8r0
$$ -88 -122 -155 62 129 -238 -205 -19 -39 -38 49 286 136 3 281 97 293 239 152 284 456 349 246 274 184
5255A84J23J29J42r5J6k4k06L09l56J20K15j36N7r8P3m02L58K8k1K8o2l3J72l40
$$ 184 307 436 578 483 499 475 269 578 222 342 557 421 478 380 453 51 409 437 416 444 382 349 521 181
5279A81K01L8j3j92O1k12NJ46L94l67k44N3m8j07kK40n13J87J52Q3m15J54J75
$$ 181 382 420 407 215 276 64 69 215 609 242 -2 51 3 -104 -106 134 -379 -192 -40 43 -372 -218 -43
5302d3p4j71K05l16K22j22R9j49l6J44j70O8K4K00J1k5l67K96l76J98j08Q8P4
$$ -43 -117 -288 -83 -399 -177 -299 -200 -349 -385 -241 -411 -343 -319 -119 -108 -133 -500 -204 -580 -382 -490 -402 -328
5325c28k85J77k58Q1K13M4j51J31r9Q9j7L4pL17k41K18k38o5L67k69J06J69k20
$$ -328 -613 -436 -694 -613 -400 -356 -507 -376 -475 -386 -403 -369 -376 -59 -300 -82 -320 -385 -18 -287 -181 -12 -232
5348b32L75l08K6lL8J44k5K02l71K98J01Nn8O3J75k76O1k03J36J20J82l83J82
$$ -232 143 -165 -139 -142 -104 40 15 217 -154 144 245 250 192 255 430 154 215 12 148 268 450 67 249
5371B49M9m1M9m3L15j09j33lj44J98j87J15J34o0Q9j32J90k72J95J17n61L23j
$$ 249 298 257 306 263 578 469 336 333 189 387 200 315 449 389 478 346 536 264 459 576 15 338 337
5394C37m0J51l31K04o0j0K02j90L4K67k66ol43K52J52k08m46L23k05K30l08J15
$$ 337 297 448 117 321 261 251 453 263 297 564 298 292 -51 201 353 145 -301 22 -183 47 -261 -146
5416a46L17k94k03J85Q0J55j10l08L6K50J4j33l1k34K38r8p9j44K07j5M9j12N0
$$ -146 171 -123 -326 -141 -61 94 -16 -324 -288 -38 -24 -157 -188 -422 -184 -282 -361 -505 -298 -313 -264 -376 -326
5439c26K3p5k4J78L0M4l22M01l47N8j33K0K24J91j90P0j25J64j14P5j46Q5j6k22
$$ -326 -303 -378 -402 -224 -194 -150 -472 -71 -418 -360 -493 -473 -249 -58 -248 -178 -303 -139 -253 -178 -324 -239 -255 -477
5463d77L10n7K30J0l39L97J52l13K01O0p6j44J48J73k43N26m15j51J02N3j3l2
$$ -477 -167 -224 6 16 -323 74 226 -87 114 174 98 -46 102 275 32 558 143 -8 94 147 134 102
5485A02J62j74p9K11P5r4K17k3m7j25qK90p3J24j24l08L71k79K32j81R5n1Q0k52
$$ 102 264 90 11 222 297 203 420 397 350 225 217 507 434 558 434 126 497 218 450 269 364 313 393 141
5509A41K86l49K2P5L47j5j07k59L03l89Q1J11j19Jn6K58l38K20j43j06J43j15
$$ 141 427 78 100 175 522 507 400 141 444 55 136 247 128 129 73 331 -7 213 70 -36 107 -8
5531hk27M26k38lk07J62j41K23j23O7lk91K28k4K56l97J2J00J51k75rL0qP7J20
$$ -8 -235 191 -47 -50 -257 -95 -236 -13 -136 -69 -72 -363 -135 -159 97 -300 -288 -188 -37 -312 -321 -291 -299 -222 -102
5556a02m2k48R6J32k35O1p2M74k36n13N19l01J20L34k42j20o3K22J16n4M7k49
$$ -102 -144 -392 -296 -164 -399 -338 -410 64 -172 -685 -166 -467 -347 -13 -255 -375 -438 -216 -100 -154 -107 -356
5578c56K80l94K77j67N1L72l13R7J11k19K96l7OM2j3Q9p9kj5O1J24r5Mp0j4j7
$$ -356 -76 -470 -193 -360 -309 63 -250 -153 -42 -261 35 -2 4 46 33 122 43 41 26 87 211 116 120 50 36 19
5604A9J61J0oj16J01q7Q7O6J72j85K2K83l82K54l14Q4J66k3P5j05p7J57o5LM7
$$ 19 180 190 184 68 169 82 169 235 407 222 244 527 145 399 85 169 335 312 387 282 205 362 297 300 347
5629C47l11J79J79k64M67m49l6q3J36R9p9R8j40k00L21k6j87r0m8J13p6J10J3
$$ 347 36 215 394 130 597 148 112 29 165 264 185 283 143 -57 264 238 51 -39 -87 26 -50 60 73
5652G3J33j94J8r1K1l02M14j23l5KP0p9l3n7m3rk9oK45m34K10Q2M9j01j43M4j24
$$ 73 206 12 30 -61 -40 -342 72 -51 -86 -84 -14 -93 -126 -183 -226 -235 -264 -270 -25 -459 -249 -167 -118 -219 -362 -318 -442
5679d42L48q0k1j70J58j6P0j21n0J30k9J69R6k22j08Q6P0j32M04l82o5K71r7J81
$$ -442 -94 -174 -195 -365 -207 -223 -153 -274 -324 -194 -223 -54 42 -180 -288 -202 -132 -264 140 -242 -307 -36 -133 48
5703D8j87j68K03j56K34M6j05L24q0J48k73l9L02n03J33J43K46k23M5n9k02K03
$$ 48 -139 -307 -104 -260 -26 20 -85 239 159 307 34 -5 297 -206 -73 70 316 93 138 79 -123 80
5725H0J29J02q0Q8m78J84J68l4j17l3L16k84L17k36N6N4j08j56L30Or6m5J39K5
$$ 80 209 311 231 319 -159 25 193 159 42 9 325 41 358 122 178 232 124 -32 298 304 208 163 302 327
5749C27r6J04j50M4k77K01R8J40n4n1j61k4j7J42l1k87J91L1k34Q3j14K46o8l35
$$ 327 231 335 185 229 -48 153 251 391 337 286 125 101 84 226 195 -92 99 130 -104 -21 -135 111 43 -292
5773b92J98j6K07k09rK18N0j10m48J51j78J94j68k4L95l85K25r3L3M15m09J71
$$ -292 -94 -110 97 -112 -121 97 147 37 -411 -260 -438 -244 -412 -436 -41 -426 -201 -294 -261 154 -255 -84
5795h4j04j34l3J91Mk9L0P9n6j66Q1r3J74J62j75j4j58O0M21k58Nj7n4M6r6q0
$$ -84 -188 -322 -355 -164 -160 -189 -159 -80 -136 -302 -221 -314 -140 22 -153 -167 -325 -265 156 -102 -97 -114 -168 -122 -218 -298
5821b98Q1K40J6k61K00j19N2RK46j88N2N8K69k68p5k7m7j17L10J73j99m6K03j25
$$ -298 -217 23 39 -222 -22 -141 -89 -80 166 -22 30 88 357 89 14 -13 -60 -177 133 306 107 61 264 139
5845A39J5r3lj4K23J67j24j79P2Q7j33J09R3j64l3q5J82j47J71J20j78k35L59
$$ 139 154 61 58 44 267 434 310 131 203 290 157 266 359 195 162 77 259 112 283 403 225 -10 349
5868C49k48Qp3p9j20L55P3k82R5P2k21P3Q1j12R5K57k54r0M6o5P8k13J79K60j24
$$ 349 101 109 36 -43 -163 192 265 -17 78 150 -71 2 83 -29 66 323 69 -21 25 -40 38 -175 4 264 140
5893A40q2j56Mp4K19k53L47j12m19M22l6N2k35q0J42r1l94N71j96M2k8K48l78
$$ 140 58 -98 -94 -168 51 -202 145 33 -386 36 0 52 -183 -263 -121 -212 -606 -35 -231 -189 -217 31 -347
5916c47O1K40j31J62l91L91j47L5r8J69j42K39k65J7K58J25k69qN2j99J42Q1m2
$$ -347 -286 -46 -177 -15 -406 -15 -162 -127 -225 -56 -198 41 -224 -207 51 176 -93 -101 -49 -248 -106 -25 -67
5939f7j13j16N11l37j73J14J25J92m46L16K07p9K0j67M2l9n8J99J24l15Q0j41
$$ -67 -180 -296 215 -122 -295 -181 -56 136 -310 6 213 134 154 -13 29 -10 -68 131 255 -60 20 -121
5961a21oL27J91m32j19M01j19n1q6L02k05J38l85K61J41N5l73M1K51J39j89j61
$$ -121 -127 200 391 -41 -160 241 122 71 -15 287 82 220 -165 96 237 292 -81 -40 211 350 161 0
5983@K34j99J93j61O8MJ0j20R0j98KJ98m6m4l1J38M3j71J56k2r9j26K26k29p6
$$ 0 234 35 228 67 135 139 149 29 119 -79 -77 121 75 31 0 138 181 10 166 144 45 -81 145 -84 -160
6008a60J56n5j19K53L5l03J7j8P6O0Qr1n3J54k3J20m16L56J41l17L4J90j22l25
$$ -160 -4 -59 -178 75 110 -193 -176 -194 -118 -58 -50 -141 -194 -40 -63 57 -359 -3 138 -179 -145 45 -77 -402
6032d02O14l99J81l39K40R2J16k6j13n3m4j01L20m29K90O9q3J5N8j67Q5j37J71
$$ -402 212 -187 -6 -345 -105 -13 103 77 -36 -89 -133 -234 86 -343 -53 16 -67 -52 6 -161 -76 -213 -42
6055d2j16p4K18J2L5J6O3j18j9K35l07J49R0j55J07j05m7J05M9j70l0N81l45j69
$$ -42 -158 -232 -14 -2 33 49 112 -6 -25 210 -97 52 142 -13 94 -11 -58 47 96 -74 -104 477 132 -37
6079c7K35j3j84K29j81K3o8l2m7K94j00J03M6k35K57k81J59J05m01j9M04j65K30
$$ -37 198 185 1 230 49 72 4 -28 -75 219 119 222 268 33 290 9 168 273 -128 -147 257 92 322
6102C22j98j26J06L64rj97m14J80N5j35J65j25J59K2q2J08m04K38j92J0L39O6
$$ 322 124 -2 104 468 459 262 -152 28 83 -52 113 -12 147 169 87 195 -209 29 -163 -153 186 252
6124B52l36R9N3j22p3N8J54K01l12n5l5j76R2K23k09J13M1Nk17j20K26J47j06
$$ 252 -84 15 68 -54 -127 -69 85 286 -26 -81 -116 -292 -200 23 -186 -73 -32 -27 -244 -364 -138 9 -97
6147i7p3o6K19J92l96k71N06J14j09l59L3J6O7J64j54K75m72O12j38n6j70O5K09
$$ -97 -170 -236 -17 175 -221 -492 14 128 19 -340 -307 -291 -224 -60 -214 61 -411 201 63 7 -163 -98 111
6170A11j20m2r0j86K13J08r4R4j98K2L82k86q0K86n5k13p1M19j75p3oO4k7o9K29
$$ 111 -9 -51 -141 -327 -114 -6 -100 -6 -204 -182 200 -86 -166 120 65 -148 -219 200 25 -48 -54 10 -17 -86 143
6195A43K28j16Ql26K72r1M7K7J16k03J20l15J69J43k17O6J36l31L05J68l08J51
$$ 143 371 255 263 -63 209 118 165 192 308 105 225 -90 79 222 5 71 207 -124 181 349 41 192
6217A92r8J5J50M8l36J84k31P5J34j83L5J54K3q0j10N9Q6j58L30l60K53m15L93
$$ 192 94 109 259 307 -29 155 -76 -1 133 -50 -15 139 162 82 -28 31 117 -41 289 -71 182 -233 160
6240A60m8J64l08j77J74n0O9J66j16J28k05L3j62K75m54K6M42j85Mo3J07j23q
$$ 160 112 276 -32 -209 -35 -85 -16 150 34 162 -43 -10 -172 103 -351 -325 117 -68 -64 -127 -20 -143 -151
6263a51j36K97O7%J29k71K80j70k71J82K32n57J68J73k69l7M04K05l29j3Rj46
$$ -151 -287 10 77 77 206 -65 215 45 -226 -44 188 -369 -201 -28 -297 -334 70 275 -54 -67 -58 -204
6285b04P6K69k85J50j79p9J82j36J84j8j21K28R2l71N6L20q7n8m8K42m34O9J31
$$ -204 -128 141 -144 6 -173 -252 -70 -206 -22 -40 -161 67 159 -212 -156 164 77 19 -29 213 -221 -152 -21
6308b1K7J03k12J09K7j24M4j67K98p2L8oP5j01J59JJ31k60j7k03J58J11N1K30
$$ -21 6 109 -103 6 33 -91 -47 -214 84 12 50 44 119 18 177 178 309 49 32 -171 -13 98 149 379
6332C79l72K48m6k35k7J31p9lJ40j55M32m12L4J41j23j29J85j51J82j5k81L08
$$ 379 7 255 209 -26 -53 78 -1 -4 136 -19 413 1 35 176 53 -76 109 -42 140 125 -156 152
6354A52J37k65o8j26L43j02q5QM4J36K95m49k45R1J63l9j5j13J36Oj94k9r8L88
$$ 152 289 24 -44 -170 173 71 -14 -6 38 174 469 20 -225 -134 29 -10 -25 -138 -2 4 -190 -219 -317 71
6378G1k5k10K37N7k60j49L1K86p2p1o3j04Q7L01k56J80k14K41j07J71K5m91L69
$$ 71 46 -164 73 130 -130 -279 -248 38 -34 -105 -168 -272 -185 116 -140 40 -174 67 -40 131 156 -335 34
6401C4n5k40N5J97j03J92j78J1n0J33pj42K83k92Q5k3N8O5j43J4J84k75L70q1
$$ 34 -21 -261 -206 -9 -112 80 -98 -87 -137 -4 -11 -153 130 -162 -77 -100 -42 23 -120 -106 78 -197 173 92
6425I2N8k21P8l8k27L77l37N12j92k77L02k20L30k05q0N12l80o1j84K45j30J04
$$ 92 150 -71 7 -31 -258 119 -218 294 102 -175 127 -93 237 32 -48 464 84 23 -161 84 -46 58
6447E8O5j24J26k32K02K83k79P7K4k33K82j07J66k54k74K22L08m82K87mj7J54
$$ 58 123 -1 125 -107 95 378 99 176 200 -33 249 142 308 54 -220 2 310 -172 115 111 94 248
6469B48l99L59k21n2O3M4O4r9jM7p5K00l66J23j06k9rK31j27K56j46L0R2k32k4
$$ 248 -151 208 -13 -65 -2 42 106 7 6 53 -22 178 -188 -65 -171 -200 -209 22 -105 151 5 35 127 -105 -129
6494a29J30k17n0N94m14n5J83j46Q4k47J41J98r5PM8j61M9p0R3J86q5q0l39R3
$$ -129 1 -216 -266 328 -86 -141 42 -104 -20 -267 -126 72 -23 -16 32 -129 -80 -150 -57 129 44 -36 -375 -282
6518b82K60J28l85K89J27r4j05KQ0K4L40l77L4q5J65l20O2J85l11L09m1J27n0
$$ -282 -22 106 -279 10 137 43 -62 -60 20 44 384 7 41 -44 121 -199 -137 48 -263 46 5 132 82
6541H2k03k19K95l1J65pj34J58Kk31M2L43l77J58J54q7k17P5p5J5J19O1n1J74
$$ 82 -121 -340 -45 -76 89 82 -52 106 108 -123 -81 262 -115 43 197 110 -107 -32 -107 -92 27 88 37 211
6565B11L8l41P4O4J82l69L15J3k63K50J70j21P5m51K17L5j8n5L66l14j34K6J36
$$ 211 249 -92 -18 46 228 -141 174 187 -76 174 344 223 298 -153 64 99 81 26 392 78 -56 -30 106
6588A06j56O7j70oo7P1O1j75K41J28k24K46Q4k45N8q8J31J88k55M6M3k99L2Q4
$$ 106 -50 17 -153 -159 -226 -155 -94 -269 -28 100 -124 122 206 -39 19 -69 62 250 -5 41 84 -215 -183 -99
6612i9Q5p5q9L06r2q1k11k5L81Q8j85j81Q7R5j07J60j63J03p9l17L11j53K31m8
$$ -99 -14 -89 -178 128 36 -45 -256 -281 100 188 3 -178 -91 4 -103 57 -106 -3 -82 -399 -88 -241 -10 -58
6636e8JJ21L4k46O1j8K75k74K51p8j24%k8K7j00j4M52m49J26j83K31Nk1lJ9J03
$$ -58 -57 64 98 -148 -87 -105 170 -104 147 69 -55 -55 -83 -56 -156 -170 282 -167 -41 -224 7 12 -9 -12 7 110
6662A10j95Q5J64j6k62q1J21K68k98O1J47k21OK42j09J61R6mn21M54k9r6k33K44
$$ 110 -85 0 164 148 -114 -195 -74 194 -104 -43 104 -117 -111 131 22 183 279 275 -246 208 179 83 -150 94
6686I4p3Q6L1l13k8L53j33M6R6n1J4j03K66j60J51k49M6k73K73j68%K20J92l97
$$ 94 21 107 138 -175 -203 150 17 63 159 108 122 19 285 125 276 27 73 -200 73 -95 -95 125 317 -80
6710h0J79p8N8R7j58J47l23K00m7jj17L39j05l50K46o7n9J68J3M5j55J3j69J51
$$ -80 99 21 79 176 18 165 -158 42 -5 -6 -123 216 111 -239 7 -60 -119 49 62 107 -48 -35 -204 -53
6734e3Q0j39L93k18qj53J79J34k57K19k33k12J70Q1k85L01l19m5L59m39M77j47
$$ -53 27 -112 281 63 55 -98 81 215 -42 177 -56 -268 -98 -17 -302 -1 -320 -365 -6 -445 32 -115
6756a15J36J25j98m4J89k00n4P7K35k11j53J97n9J72N2k37p9l9J73J51J16j52
$$ -115 21 146 -52 -96 93 -107 -161 -84 151 -60 -213 -16 -75 97 149 -88 -167 -206 -33 118 234 82
6778H2n1J36l00J93k10K25J34j63M2n5%M6j20j6J24j29J02j00J08L6q3j8L8J37
$$ 82 31 167 -133 60 -150 75 209 46 88 33 33 79 -41 -57 67 -62 40 -60 48 84 1 -17 21 158
6802A58q6j77p4L1J08k0J92p7J23l63K54K7M9q7L5j7L7j80L79j73m4j70P7kL02
$$ 158 72 -105 -179 -148 -40 -60 132 55 178 -185 69 96 145 58 93 76 113 -67 312 139 95 -75 2 0 302
6827C02n08L96j35j0j67J64q7P7J8R4k10n8O2K23n2K5r7J18j10r8q5K3m3Q9q4
$$ 302 -206 190 55 45 -122 42 -45 32 50 144 -66 -124 -62 161 109 134 37 155 45 -53 -138 -115 -158 -69 -153
6852a53J81J63k59J1l7L72J03j94m62L18k3k9j10J12j72K24l75m9K72M1J93l35
$$ -153 28 191 -68 -57 -94 278 381 187 -275 43 20 -9 -119 -7 -179 45 -330 -379 -107 -66 127 -208
6874b08j3K56m5Q3k1j80P7J20k25K4K56j84M7k0J20k41q1L4L08N5m31J46j6K96
$$ -208 -221 35 -10 73 52 -128 -51 69 -156 -132 124 -60 -13 -33 87 -154 -235 -201 107 162 -269 -123 -139 157
6898A57j80J86j55K79k03j2nL8j05K0j38J69K17k99J45Lj74Q7r1Q1j24L31j56
$$ 157 -23 163 8 287 84 72 67 105 0 20 -118 51 268 -31 114 117 -57 30 -61 20 -104 227 71
6921G1k03J71Q4J10j22k77K80q8j67K72k90q8K25N4m5J73k06j8K7j04k5K28Nk25
$$ 71 -132 39 123 233 111 -166 114 26 -141 131 -159 -247 -22 32 -13 160 -46 -64 -37 -141 -166 62 67 -158
6945a58K04k37J35L5P5Q9j04l4J13j88j76M17L5k8k47j15L44L1j38K4M6q6k02
$$ -158 46 -191 -56 -21 54 143 39 5 118 -70 -246 171 206 178 -69 -184 160 191 53 77 123 37 -165
6968a65L12n0q5m2nK8k30L18lq0oj63J56n9J54Lj09j23J72J24o6j73L44j02k10
$$ -165 147 97 12 -30 -35 -7 -237 81 78 -2 -8 -171 -15 -74 80 83 -26 -149 23 147 81 -92 252 150 -60
6993f0l67L75j31K15q4n1K0r8K17j22K1k1J7J6N3o2RP9MJ25j92K14l34J30Q1j9
$$ -60 -427 -52 -183 32 -52 -103 -83 -181 36 -86 -65 -86 -69 -53 0 -62 -53 26 30 155 -37 177 -157 -27 54 35
7019C5k30L90l1l45K50j51J24q3M8M2K2j71K53j61j73j11K77M2k04L73J24k75
$$ 35 -195 195 164 -181 69 -82 42 -41 7 49 71 -100 153 -8 -181 -292 -15 27 -177 196 320 45
7041D5r9J07j46J38L5P4Q1J9m23j20K00J08p6j62M04m52M34k91M64m10J2K78k20
$$ 45 -54 53 -93 45 80 154 235 254 -169 -289 -89 19 -57 -219 185 -267 167 -124 340 -70 -58 220 0
7064@r7J43K3O2P8j82R1l6j11j09j4L9K88k40K17q3o4K52j72Pk59M7L69j06j26
$$ 0 -97 46 69 131 209 27 118 82 -29 -138 -152 -113 175 -65 152 69 5 257 85 92 -167 -120 249 143 17
7089A7J2j31K75j64l65K31Q7j25K43j13J33k32m9N3K70l66J96K19j04q0j82J01
$$ 17 29 -102 173 9 -356 -125 -38 -163 80 -33 100 -132 -181 -128 142 -224 -28 191 87 7 -175 -74
7111g4j35M37l36NO0J94l57K76j02Qj82R4J25K53j49l39P9K33k06K40k00n7J10
$$ -74 -209 228 -108 -103 -43 151 -206 70 -32 -24 -206 -112 13 266 117 -222 -143 90 -116 124 -76 -133 -23
7134b3J20J14j47R3l08K73K82m34J20M3l80L41J23k99J2J94j79J83R9l40N8N1
$$ -23 97 211 64 157 -151 122 404 -30 90 133 -247 94 217 -82 -70 124 -55 128 227 -113 -55 -4
7156dj25lj01K95l79R5K60J57K8k20k8j30N8R5k17M06l09j21J24R0p0o1L35k94
$$ -4 -129 -132 -233 62 -317 -222 38 195 223 3 -25 -155 -97 -2 -219 187 -122 -243 -119 -29 -99 -160 175 -119
7180a19J62K3j48q0N0k09M39n6N2M7j98J4P4l44K49j28K46k28J56k35K43QL6j15
$$ -119 43 66 -82 -162 -112 -321 118 62 114 161 -37 -23 51 -293 -44 -172 74 -154 2 -233 10 18 54 -61
7204f1j40K82J14l11O5J22LlN3K30l25j95j6O8J1j24M44k70J22L2r4J8O9l39M80
$$ -61 -201 81 195 -116 -51 71 74 71 124 354 29 -166 -182 -114 -103 -227 217 -53 69 101 7 25 94 -245 235
7229B35m21K12K54j23j94k32M34k91J93R1j82K95m60J59K72j42m9O1K69l38n4
$$ 235 -186 26 280 157 -37 -269 165 -126 67 158 -24 271 -189 -30 242 100 51 112 381 43 -11
7250a1J62m32J24l4J48M5J08j07J12m1p3J07r8k50K05J48m4J86j74k78Q0j65K75
$$ -11 151 -281 -157 -191 -43 2 110 3 115 74 1 108 10 -240 -35 113 69 255 81 -197 -117 -282 -7
7273gM6j73J22K00n8j17j67j61L46q7K08j57K23k13j61P0L7N6l1K70l28%N3l7
$$ -7 39 -134 -12 188 130 13 -154 -315 31 -56 152 -5 218 5 -156 -86 -49 7 -24 246 -82 -82 -29 -66
7297f6J64J4p1K9q9K21l61L11k49L38l56l3P4J41j82o2K47j88P7j19L06j34j77
$$ -66 98 112 41 70 -19 202 -159 152 -97 241 -115 -148 -74 67 -115 -177 70 -118 -41 -160 146 12 -165
7320a65R7m2J46j6J47l37J80j54M05l86K94K9l10L9O3L4O7O2L5k75J05L5j14L66
$$ -165 -68 -110 36 20 167 -170 10 -144 261 -125 169 198 -112 -73 -10 24 91 153 188 -87 18 53 -61 305
7344C05J48m14P6j45l0J56l78N3N1J59k03J40j55J00L03k27m9K14Pq1K9k45J51
$$ 305 453 39 115 -30 -60 96 -282 -229 -178 -19 -222 -82 -237 -137 166 -61 -110 104 111 30 59 -186 -35
7367c5R7MQ1j6j17O6P3j90Q9L1k34J36N6k74J65J45P7l31J48O2q4P9Q3J64m56
$$ -35 62 66 147 131 14 80 153 -37 52 83 -151 -15 41 -233 -68 77 154 -177 -29 33 -51 28 111 275 -181
7392a81J32o5K38r1k81K34K02l04M48m10j24L08M9j45rj08J26m4L5k2p5K23j16
$$ -181 -49 -114 124 33 -248 -14 188 -116 332 -78 -202 106 155 10 1 -107 19 -25 10 -12 -87 136 20
7415B0J10l11J67J6J5j3n2K2J08r3K22j56j85m8K96k30J88j68K57k31k3J73r7
$$ 20 130 -181 -14 2 17 4 -48 -26 82 -11 211 55 -130 -178 118 -112 76 -92 165 -66 -89 84 -13
7438a3L81l13j8j87J87qO3j10J69k50J76o4J37m1l1k1J32k10j2j7j00LM34k75
$$ -13 368 55 37 -150 37 29 92 -18 151 -99 77 13 150 109 78 57 189 -21 -33 -50 -150 -147 287 12
7462A2J8j57R5R7k05K07m4j60MJ54J63l24O4J77k89J53j25K51m6J51j39q1j60
$$ 12 30 -127 -32 65 -140 67 23 -137 -133 21 184 -140 -76 101 -188 -35 -160 91 45 196 57 -24 -184
7485a84K66j66P9L55m29L54m19J28j00J8J6K25j22p9j73J85llj61P6J48j74K41
$$ -184 82 -84 -5 350 -79 275 -144 -16 -116 -98 -82 143 21 -58 -231 -46 -49 -52 -213 -137 11 -163 78
7508G8l63L90k5l69M63m95L63j41j36K13k9K16k20l3J15J15j26J21J94l26K82
$$ 78 -285 105 80 -289 174 -321 42 -99 -235 -22 -51 165 -55 -88 27 142 16 137 331 5 287
7529B87l68J8J61P9k60j17K79j84J34r2J84j67o8L06m16lJ40N0K46j70j39K41
$$ 287 -81 -63 98 177 -83 -200 79 -105 29 -63 121 -46 -114 192 -224 -227 -87 -37 209 39 -100 141
7551A41m9j29K16k9k43K57l04M1q8J01K74k38o3J3k09L68j33J46r3k3N9j88J74
$$ 141 92 -37 179 150 -93 164 -140 -99 -187 -86 188 -50 -113 -100 -309 59 -74 72 -21 -44 15 -173 1
7574Ak72L54K3j01L17m56K59N2k69K44J5k66M45k48mj98q6M72k41j7J58j98j91
$$ 1 -271 83 106 5 322 -134 125 177 -92 152 167 -99 346 98 94 -104 -190 282 41 24 182 -16 -207
7597b07L46l18J65J11k9R0k10qk06K94l61L78j60J83j04J39k71L36nm64L25j26
$$ -207 139 -179 -14 97 68 158 -52 -60 -266 28 -333 45 -115 68 -36 103 -168 168 163 -301 24 -102
7619a02N7Q5r0J86k3M5r7o3j52J28k71K82k80J76L18k84L68o11J60P5P5J40l02
$$ -102 -45 40 -50 136 113 158 61 -2 -154 -26 -297 -15 -295 -119 199 -85 283 -328 -168 -93 -18 122 -180
7642a80n7J12J93J06j42k29J76Q7k35J11K7o8J26K74l60J65k78j10M53k03KJ12
$$ -180 -237 -125 68 174 32 -197 -21 66 -169 -58 -31 -99 27 301 -59 106 -172 -282 171 -32 -30 82
7664H2n0M2k82n4K98K07o3j42Q3p2R5l63M26j26l14K30k02L72k71R3R4jp7o7K39
$$ 82 32 74 -208 -262 36 243 180 38 121 49 144 -219 207 81 -233 -3 -205 167 -104 -11 83 82 5 -62 177
7689A77j44j10j49J81m1j6L24m85L08l0O6j71M8P2p0K63k32J61j35j84K88k9l31
$$ 177 33 -77 -226 -45 -86 -102 222 -263 45 15 81 -90 -42 30 -40 223 -9 152 17 -167 121 92 -239
7712b39K39j6J82k34L53k43K7P9nk14J21K5k44L38j60n0j87L23Oj71J07r4J06
$$ -239 0 -16 166 -68 285 42 69 148 143 -71 50 75 -169 169 9 -41 -228 95 101 -70 37 -57 49
7735D9l9P3k1L13o28K96j21Q9k8j46J58N8j84n8N10l22M4j31K0M6R2nJ39j87k37
$$ 49 10 83 62 375 -253 43 -78 11 -17 -163 -5 53 -131 -189 321 -1 43 -88 -68 -22 70 65 204 17 -220
7760b20J42j5J37j06k3K12j66j42k1M02k46J43k37M1J98j51R7J58k26Q3p8m1J04
$$ -220 -78 -93 44 -62 -85 127 -39 -181 -202 200 -46 97 -140 -99 99 -52 45 203 -23 60 -18 -59 45
7783D5j99K13J44k18n0J92k3k10K77k00N4J8K15k09k6L1q6o7j7K09K54l20j9j66
$$ 45 -154 59 203 -15 -65 127 104 -106 171 -29 25 43 258 49 23 54 -32 -99 -116 93 347 27 8 -158
7807a58J85Q2j9n4J38m34J05K05J13L7k43J68k14J37r2J08r4l8Q4o2K9K14O6j2
$$ -158 27 109 90 36 174 -260 -155 50 163 200 -43 125 -89 48 -44 64 -30 -68 16 -46 -17 197 263 251
7831B51j79J4j91k6K33l80L68j52R2P5J7p5l3J54k4j91J17o7J60n6k63J08J11
$$ 251 72 86 -105 -131 102 -278 90 -62 30 105 122 47 14 168 144 -47 70 3 163 107 -156 -48 63
7854F3j5J85m78J17N8q5L11l27K05j97L93k46O1j33J0P0j18J27k54L37q9J63q0
$$ 63 48 233 -245 -128 -70 -155 156 -171 34 -163 230 -16 45 -88 -78 -8 -126 1 -253 84 -5 158 78
7877G8k98O8J42k10L98o9l06J41k9K23n9o2q0r0L02k37J87j46K3j10p3n9Q5j84
$$ 78 -220 -152 -10 -220 178 109 -197 -56 -85 138 79 17 -63 -153 149 -88 99 -47 -24 -134 -207 -266 -181 -365
7901c65M13K2j34K39k41J31k43K76m39M10j95L81k38O1j51j78J78m5L40j17J66
$$ -365 48 70 -64 175 -66 65 -178 98 -341 69 -126 255 17 78 -73 -251 -73 -118 222 105 271
7922B71j37j54J71k33J18l7J05l71N27k8j76J95m68K94q6K33j46j35kn9M18k29
$$ 271 134 -20 151 -82 36 -1 104 -267 260 232 56 251 -217 77 -9 224 78 -57 -59 -118 300 71
7944G1o3j6q3L22l17M2L37l11k5J8k9l4k4Q0n1K57J0k05j20L39m2p7m8j51K14
$$ 71 8 -8 -91 231 -86 -44 293 -18 -43 -25 -54 -88 -112 -32 -83 174 184 -21 -141 198 156 79 31 -120 94
7969I4j78K66j75N5r9M5p9J86l1l26K64K11j08k87L06k53L1J62o78P41l14J44
$$ 94 -84 182 7 62 -37 8 -71 115 84 -242 22 233 125 -162 144 -109 -78 84 -594 147 -167 -23
7991b3k1J21j11l01K71r0J65n9j97p1K68J21j82J34n6J44r7r7L57m85J42J22K00
$$ -23 -44 77 -34 -335 -64 -154 11 -48 -245 -316 -48 73 -109 25 -31 113 16 -81 276 -209 -67 55 255
8014B55j81k4K0K5j47Q9m0J48m40L25j7R9j71j44K44J67k42n2j45J93p2o2J84
$$ 255 74 50 70 95 -52 37 -3 145 -295 30 13 112 -59 -203 41 208 -34 -86 -231 -38 -110 -172 12
8037A2M8K0j56P9J40j57n1J94k17K54j41n4K65j74k07K39k24j0K43j37O4K62q9
$$ 12 60 80 -76 3 143 -14 -65 129 -88 166 25 -29 236 62 -145 94 -130 -140 103 -34 30 292 203
8060B03k86J7n2K50J85n67L49o1O0o4j31L90l66j29K77k85L63j28j0J59l31K03
$$ 203 -83 -66 -118 132 317 -250 99 38 98 34 -97 293 -73 -202 75 -210 153 25 15 174 -157 46
8082D6%J44j45k56L11j93j1K29k64j24N36j65k10m3J09J2lM4lj41L26n11K27K55
$$ 46 46 190 45 -211 100 -93 -104 125 -139 -263 273 108 -102 -145 -36 -24 -27 17 14 -127 199 -312 -85 170
8106A70j97k16L88o9j29Q5l5J86k79J38m1m6R7k48N4J43J78m1m48L19j18K04j58
$$ 170 -27 -243 145 76 -53 32 -3 183 -96 42 1 -45 52 -196 -142 1 179 138 -310 9 -109 95 -63
8129f3K27j61l5j58J96J86m5k88K46k23k7M15j87J08k86O9l77K83K76l41j85K52
$$ -63 164 3 -32 -190 6 192 147 -141 105 -118 -145 270 83 191 -95 -26 -403 -120 156 -185 -370 -118
8151a18J58Q2j85J2L03l33K24l12J57K38q8l5P4j74J06r6J05j18j91K17K6P5p4
$$ -118 40 122 -63 -51 252 -81 143 -169 -12 226 138 103 177 3 109 13 118 0 -191 26 52 127 53
8174E3m7r7J23M1N0l87K79l7j62N17l04J86r7L4k7j09j06
$$ 53 6 -91 32 73 123 -264 15 -22 -184 333 29 215 118 152 125 16 -90
8191i0
$$ Imaginary data points
##PAGE= N=2
##DATA TABLE= (X++(I..I)), XYDATA
0@%%%%%%PpPj4J4j4K1k8L5m2N5p5R0j05J26j47J75k10K45k87L34l85M43n11N83
$$ 0 0 0 0 0 0 0 7 0 7 -7 7 -7 14 -14 21 -21 34 -41 49 -56 70 -77 98 -112 133 -154 180 -205 238 -273 310
31C10o66P57q55R67j089J222j371J533j710J904k115K348k602K879l183L511l871
$$ 310 -356 401 -454 513 -576 646 -725 808 -902 1002 -1113 1235 -1367 1512 -1671 1840 -2031
48b031M267m701N180n706O288o940P665q483R417j0484J1722j3180J4927j7066
$$ -2031 2236 -2465 2715 -2991 3297 -3643 4022 -4461 4956 -5528 6194 -6986 7941 -9125
62i125J9750k3240K7984l4846M5713o5621J14107m70368o14876M06200M13387
$$ -9125 10625 -12615 15369 -19477 26236 -39385 74722 -395646 -1010522 -604322 -190935
73a90935K66080j15954k69716l17140r3562J25188L16562K61721R3661j37891
$$ -190935 75145 -40809 -310525 -627665 -721227 -596039 -279477 -17756 75905 -61986
83f1986j99849j28326N4052J52360J57067N1152l8647q8253m2566L5765J15929
$$ -61986 -261835 -390161 -336109 -183749 -26682 24470 -14177 -102430 -144996 -109231 6698
94F698J09056K8549r0499j30974o3476P9955J71338J46234O718j43058k17129
$$ 6698 115754 144303 53804 -77170 -140646 -60691 110647 256881 263599 120541 -96588
105i6588j60468k996J86635K99142K64512Q8145j19434k28458j75941j6203J35365
$$ -96588 -257056 -260052 -73417 225725 490237 578382 458948 230490 54549 38346 173711
116A73711J89990J36409K1829q7122j35370r7853M74R4379J17738O2172j8915
$$ 173711 363701 500110 521939 434817 299447 201594 202068 296447 414185 476357 457442
127D57442o2653n1676j9514K12J388P51M725P364M374K08p902k8944o4231q7714
$$ 457442 394789 343113 323599 323811 325199 325950 330675 338039 342413 342621 334719 305775 241544 153830
141A53830o7485j959O7878R5950O9212J1822m6932q9931j08833r3370m0561K5539
$$ 153830 86345 84386 152264 248214 317426 329248 282316 192385 83552 -9818 -50379 -24840
153b4840O2363M5708p812n9606q3042p3344l8904J1419O0202P5366L6290l8628
$$ -24840 37523 83231 75419 15813 -67229 -140573 -179477 -168058 -107856 -32490 3800 -34828
165c4828r7137r7879m4663K3380O7433P3351M4955o469o2735r2890p4286j4352
$$ -34828 -131965 -229844 -274507 -251127 -183694 -110343 -65388 -71857 -134592 -227482 -301768 -316120
177c16120M5011O8013N1531K1430l607k1962l7147m4509l6385k0036r745j0594
$$ -316120 -271109 -203096 -151565 -130135 -133742 -155704 -192851 -237360 -273745 -293781 -303526 -314120
189c14120q329O877K4864K2188n054l2213k9863J452L9724O1132N7677L1372r665
$$ -314120 -322449 -315572 -290708 -268520 -273574 -305787 -335650 -334198 -294474 -233342 -175665 -144293 -153958
202a53958m8667n6387j2905O1660J16961J10004M2537l7138q1347o9996j5772
$$ -153958 -202625 -259012 -271917 -210257 -93296 16708 59245 22107 -59240 -129236 -145008
213a45008N3330J06486J15281O7953j0396p0050p5080l1809J9121M2632L5819
$$ -145008 -91678 14808 130089 198042 187646 117596 42516 10707 29828 72460 108279
224A08279J6581j718j4860j9734j1066R414K6236K5962J3951Q630J6322K2843
$$ 108279 124860 123142 108282 88548 77482 86896 113132 139094 153045 161675 177997 200840
236B00840J1216j2998k7717j9114N222K9270M3020M5066L0544m517m9697p3987
$$ 200840 212056 199058 171341 152227 157449 186719 229739 274805 305349 300832 251135 177148
248A77148n3416M079O0169Q0288N7672P640m5395q1847q5256m7813J5732O5397
$$ 177148 123732 127811 187980 268268 325940 333580 288185 206338 121082 73269 89001 154398
260A54398O6711K1419l6521o8710o3856l4806J553L2098M5412L0921o611m6032
$$ 154398 221109 242528 206007 137297 73441 38635 40188 72286 117698 148619 142008 95976
272I5976o0839m5740j9897k507M455R312J2851N796j3930l6506m5698m0333k8720
$$ 95976 35137 -10603 -30500 -33007 -28552 -19240 -6389 -593 -14523 -51029 -96727 -137060 -165780
285a65780j5426M782L0090M4017K7785j4794n6779o9625m7551n153L8396O6876
$$ -165780 -181206 -176424 -146334 -102317 -74532 -89326 -146105 -215730 -263281 -268434 -230038 -163162
297a63162O6343K9590l0313p6693p4486k1789M4782Q2562P1755K6021k7461o5230
$$ -163162 -96819 -67229 -97542 -174235 -248721 -270510 -225728 -143166 -71411 -45390 -72851 -138081
309a38081p0769m0659J2121N5819O0908K7599j6731l8958l2774j3976j098M633
$$ -138081 -208850 -249509 -237388 -181569 -120661 -93062 -109793 -148751 -181525 -195501 -196599 -191966
321a91966R333J5194J9381K1278K3572K2345Q749j6970l4124k1359K3488O9966
$$ -191966 -182633 -167439 -148058 -126780 -103208 -80863 -72114 -89084 -123208 -144567 -121079 -51113
333e1113Q4716N8421Q314l6326n4173l8554P690O3845R5675P6999J3484n4282
$$ -51113 33603 92024 100338 64012 9839 -28715 -21025 42820 138495 215494 228978 174696
345A74696q1797n6822j683M8838P0095N5661J5312l3639o2500n3656j1794L1073
$$ 174696 92899 36077 34394 83232 153327 208988 224300 190661 128161 74505 62711 93784
357I3784M4403K7128k83j3512j1059m085J17K36n12k733l100L919K1264L2367
$$ 93784 138187 165315 165032 151520 140461 136376 136493 136729 136217 133484 130384 134303 155567 187934
371A87934K2044j1530m4928m9904k2224J8556M4496M4598J9287j9366n5742o9552
$$ 187934 209978 198448 153520 103616 81392 99948 144444 189042 208329 188963 133221 63669
383F3669m7435J960M5766N5318K3937k2821n4835n9470m0446r228K2014L7784
$$ 63669 16234 18194 63960 119278 143215 120394 65559 6089 -34357 -43585 -21571 16213
395A6213K7507n119l9208m9541l2805n888J0601J2593P359k08r543j9468k2710
$$ 16213 43720 38601 -607 -50148 -82953 -88841 -78240 -65647 -58288 -58496 -68039 -87507 -110217
408a10217j6346n372l166o876p798J925J3953J4000r22j9115k5891j9496n184
$$ -110217 -126563 -131935 -135101 -141977 -149775 -147850 -133897 -119897 -120819 -139934 -165825 -185321 -190505
421a90505J2065K8365L5640K4957m965l3944l9513j5655J9388M2621M2254K3622
$$ -190505 -178440 -150075 -114435 -89478 -94443 -128387 -167900 -183555 -164167 -121546 -79292 -55670
433e5670l134k8017l9897k7713N073L9025M9438K8484n919l0974l3821k0240P73
$$ -55670 -58804 -86821 -126718 -154431 -149358 -110333 -60895 -32411 -38330 -69304 -103125 -123365 -122592
446a22592K1094L3845L0803J1593j0675j7975n796J2943K1359J7079R983Q929
$$ -122592 -101498 -67653 -36850 -25257 -35932 -53907 -59703 -46760 -25401 -8322 1661 10590
458A0590J3148J5291J5159J3722J0689L178n856m569J1489L2119L7133J7453j1939
$$ 10590 23738 39029 54188 67910 78599 81777 75921 71352 82841 114960 152093 169546 157607
471A57607l1788l0096j0864J4661L4552L9266K0335j6060m9281n4862k5976J6309
$$ 157607 125819 95723 84859 99520 134072 173338 193673 177613 128332 73470 47494 63803
483F3803M3672M1968J7048j2281l3752l8846k5537K202K7533L5195J8412o690
$$ 63803 107475 149443 166491 154210 120458 81612 56075 58277 85810 121005 139417 132727
495A32727k1992k0181j0429l614O91L864O925M363k149q778r153j0539j5118k1046
$$ 132727 110735 90554 80125 76511 77202 81066 87991 92354 90205 81427 72274 61735 46617 25571
509B5571j8191k943J3460J7873N152j4588k9337l5046k9549j3740J0355L0600
$$ 25571 7380 4437 17897 35770 40922 26334 -3003 -38049 -67598 -81338 -70983 -40383
521d0383L1336Q717k4050m2876l8995j7729O063K2859K8250J9241k755k7359l9344
$$ -40383 -9047 -330 -24380 -67256 -106251 -123980 -117917 -95058 -66808 -47567 -50322 -77681 -117025
534a17025k9112n197J6487K3121J7877Q336m959j8386k7224k1842l061J7200K6405
$$ -117025 -146137 -151334 -134847 -111726 -93849 -85513 -90472 -108858 -136082 -157924 -160985 -143785 -117380
547a17380K0207Q657j365q054j2651j1243q92J3944K2275K0812J2994Q010N365
$$ -117380 -97173 -88516 -89881 -97935 -110586 -121829 -122721 -108777 -86502 -65690 -52696 -44686 -39321
560c9321m22r962j4567o705J0775K6385K8470J8672J746j6141k8115k6053n459
$$ -39321 -39743 -49705 -64272 -70977 -60202 -33817 -5347 13325 15071 -1070 -29185 -55238 -60697
573f0697K5386M5492L9021R475k2069l5648k6535k697K2199L9742L9556K2149
$$ -60697 -35311 10181 49202 58677 36608 960 -25575 -28272 -6073 33669 73225 95374
585I5374n428k4712k1857j324J9417K6654K0426R989K683j762l494k018J962L547
$$ 95374 89946 65234 43377 42053 61470 88124 108550 118539 121222 119460 115966 113948 115910 119457
599A19457j542p941o281N425J6562J3025n455k4727l2011k2043j583J8244K8479
$$ 119457 117915 109974 103693 109118 125680 138705 133250 108523 76512 54469 52886 71130 99609
612I9609K1686k982l3267m8820l4917J612L3881M1689K1758j0006l2720l8196
$$ 99609 121295 118313 85046 36226 1309 2921 36802 78491 100249 90243 57523 19327
624A9327k3684O58K3638K8911J3875j2036k8855k4905p572N795O990r57q251j0102
$$ 19327 -4357 -3699 19939 48850 62725 50689 21834 -3071 -10643 -4848 2142 1185 -7066 -17168
638a7168q007m575r70O16n501j5471k0436j2387N617J7951J4842j559j8153k5498
$$ -17168 -25175 -29750 -30720 -30104 -35605 -51076 -71512 -83899 -78282 -60331 -45489 -47048 -65201 -90699
652i0699k0172p909Q944K3034K4278R646j4355l0396k5844n590J4731K3472J9197
$$ -90699 -110871 -118780 -109836 -86802 -62524 -52878 -67233 -97629 -123473 -129063 -114332 -90860 -71663
665g1663O660p943j8405j8340o209J1940K2572J8462M654o331o868o74L961N297
$$ -71663 -65003 -72946 -91351 -109691 -115900 -103960 -81388 -62926 -58272 -64603 -71471 -72145 -68184 -62887
679f2887O011P978Q715Q394O666P641P227K192n726p955J132J4353K0079J4345
$$ -62887 -56876 -48898 -40183 -31789 -25123 -17482 -10255 -8063 -13789 -21744 -20612 -6259 13820 28165
693B8165K659n640r254p991l194M930J4551J7573J0015k500j1759j0530k737M796
$$ 28165 30824 25184 15930 7939 4745 9675 24226 41799 51814 49314 37555 27025 24288 29084
707B9084J1664J6465J7236R895m096j4789j2830k97J3415J8724J6170Q520L62
$$ 29084 40748 57213 74449 84344 80248 65459 52629 52332 65747 84471 100641 109161 109523
720A09523p168j1670j0029j13Q072Q912K387l180m782l958o060j0041j1717p152
$$ 109523 102355 90685 80656 80543 88615 97527 99914 96734 91952 87994 81934 71893 60176 53024
734E3024o74K575J115j844m728r152j4454j5567p493M837J2859J0769Q97r051
$$ 53024 52350 54925 56040 54196 49468 40316 25862 10295 2802 7639 20498 31267 32164 23113
748B3113j4471j6065j3687m128R345J8874J6082J266j5821k3590j9682r447J992
$$ 23113 8642 -7423 -21110 -25238 -15893 2981 19063 20329 4508 -19082 -38764 -48211 -46219
761d6219J1655J4178O864p188k0084k1777j1436J421P276N084O39j882l821n959
$$ -46219 -34564 -20386 -13522 -20710 -40794 -62571 -74007 -72586 -65310 -60226 -59587 -61469 -65290 -71249
775g1249p938n527j548R56J503M094P733R613M304o095j4091j1769o19R873J6060
$$ -71249 -79187 -84714 -86262 -85306 -83803 -79709 -71976 -62363 -58059 -64154 -78245 -90014 -90633 -80760 -64700
790f4700J6071J1068K117j0197j7586j3850J18J6123K2095J7668O756l688j1459
$$ -64700 -48629 -37561 -35444 -45641 -63227 -77077 -76959 -60836 -38741 -21073 -14317 -18005 -29464
803b9464j3388o263Q384K1516K4006J2751k813j1618r616q19P024J2504J4242
$$ -29464 -42852 -49115 -40731 -19215 4791 17542 14729 3111 -6505 -7324 -300 12204 26446
816B6446J0683M240l281m518r29L484K537j353j716M285J0742J1731M830l900
$$ 26446 37129 41369 38088 33570 32641 36125 38662 37309 35593 39878 50620 62351 67181 63281
830F3281j0741j0978p681J233J2023J9614J5518J375j4019j8270j0944K441J2819
$$ 63281 52540 41562 33881 35114 47137 66751 82269 83644 69625 51355 40411 42852 55671
843E5671J6878J4402L679q532j8642j7860n197J0303J6877J1370n93j1147j5513
$$ 55671 72549 86951 90630 82098 63456 45596 40399 50702 67579 78949 78356 67209 51696
856E1696j3945q922l56N547M699k509j0241j0497m418L18j156p697j1665q880
$$ 51696 37751 28829 28473 34020 38719 36210 25969 15472 11054 11372 10216 2519 -9146 -18026
870a8026j963L910O983N973q63j0631j7335j4318j073J2907J6754Q200o354j5581
$$ -18026 -19989 -16079 -9096 -3123 -3986 -14617 -31952 -46270 -47343 -34436 -17682 -9482 -15836 -31417
884c1417j6789j0404m34J0027J4828J0302k727j5756j9032j1262R36Q972R761
$$ -31417 -48206 -58610 -59044 -49017 -34189 -23887 -26614 -42370 -61402 -72664 -71728 -62756 -52995
897e2995N969J30o431j0274q638j008P494R250L733k531l474l10M161N294L388
$$ -52995 -47026 -46896 -53327 -63601 -72239 -73247 -65753 -56503 -52770 -55301 -58775 -59085 -54924 -49630 -46242
912d6242J806j31j213J39M086R573R945L210n415q516k098P807J3458J2753O497
$$ -46242 -44436 -44567 -45780 -45641 -41555 -31982 -22037 -18827 -24242 -32758 -34856 -27049 -13591 -838 5659
927E659l58o593q487m221O197J5928J6708R256j917p947o487j602M452Q881J1692
$$ 5659 5301 -1292 -9779 -14000 -7803 8125 24833 34089 32172 24225 17738 16136 20588 29469 41161
942D1161R652K948n256q796m446K816O842O313L204J425j742m433n229k563J983
$$ 41161 50813 53761 48505 39709 35263 38079 44921 51234 54438 55863 54121 49688 44459 41896 43879
957D3879M085K175j284j650J128K891k14l824m984k933Q05K779N011N560L174
$$ 43879 47964 50139 48855 47205 48333 51224 51010 47186 42202 39269 40074 42853 47864 53424 56598
972E6598l228r771j1709n353L326Q588O713J26n737j0092j2994j1491l928M671
$$ 56598 53370 43599 31890 26537 29863 38451 45164 45290 39553 29461 16467 4976 1048 5719
986E719P861M251n471j2581j3593j0414m868O42N280O590J182o166j1585r662
$$ 5719 13580 17831 12360 -221 -13814 -24228 -29096 -28454 -23174 -16584 -15402 -21568 -33153 -42815
1000d2815k119K642L491J786J123M93J31j809j889j220p84k319l554M18N367Q237
$$ -42815 -44934 -42292 -38801 -37015 -35892 -35399 -35268 -37077 -38966 -40186 -40970 -43289 -46843 -46425 -41058 -32821
1016c2821L433m417j0590j0082m045K967Q224J0213P172r84j0570j4063q184L767
$$ -32821 -29388 -33805 -44395 -54477 -58522 -55555 -47331 -37118 -29946 -30930 -41500 -55563 -63747 -59980
1030e9980J2704J3978Q119K23n119p929n884Q31R330J3392J0541K757k255l095
$$ -59980 -47276 -33298 -25179 -24956 -30075 -38004 -43888 -43057 -33727 -20335 -9794 -7037 -9292 -12387
1044a2387K30K710L174L701M833M945L341K598K618L090J429k422m197l12O595
$$ -12387 -12157 -9447 -6273 -2572 2261 7206 10547 13145 15763 18853 20282 17860 13663 13351 19946
1059A9946J0855Q852K485l177o387o461k428L494J0892J2501O533l544j0074r432
$$ 19946 30801 39653 42138 38961 32574 26113 23685 27179 38071 50572 57105 53561 43487 34055
1073C4055l185L167P231P576N092Q4o245r259p062o99M461M680J925m04j631k699
$$ 34055 30870 34037 41268 48844 53936 54020 47775 38516 31454 30755 35216 39896 41821 41417 39786 37087
1089C7087l973m591k816K87Q63L00K64Q06Q74j539n838p457m500j78L126K351
$$ 37087 33114 28523 25707 25994 26857 27157 27421 28227 29101 27562 21724 14267 9767 9589 12715 15066
1105A5066P95j176m779q382j0030o028L89N018M060j431n718q617q788o839k890
$$ 15066 15861 14685 9906 1524 -8506 -14534 -14145 -9127 -5067 -6498 -12216 -20833 -29621 -36460 -39350
1120c9350L433O437M659k134p626q035m590K75L303L891L476J753j187l406l016
$$ -39350 -35917 -29480 -24821 -26955 -34581 -42616 -47206 -46931 -43628 -39737 -36261 -34508 -35695 -39101 -42117
1135d2117J199L641K865q15j402R4K844L106Q41r01j552k203j585K58M186O725
$$ -42117 -40918 -37277 -34412 -35227 -36629 -36535 -33691 -30585 -29744 -30645 -32197 -34400 -35985 -35727 -31541 -24816
1151b4816M332j529o654n850n06M984Q553P814M406j68m808o677k511O146J1775
$$ -24816 -20484 -22013 -28667 -34517 -35023 -30039 -21486 -13672 -9266 -9434 -14242 -20919 -23430 -17284 -5509
1166e509J1458M421k349m636l291J197N427Q066P918L858k738n548k367L626P273
$$ -5509 5949 10370 8021 3385 94 1291 6718 14784 22702 26560 23822 18274 15907 19533 26806
1181B6806N467J185k038k113k11K193L179L394J477k358m689k538L312P530O095
$$ 26806 32273 33458 31420 29307 29096 31289 34468 37862 39339 36981 32292 29754 33066 40596 46691
1196D6691l56o373q163m899J62M352P260N229j40p070j0815p813j97N788O149
$$ 46691 46335 39962 31799 26900 27062 31414 38674 43903 43763 36693 25878 18065 17868 23656 29805
1211B9805K518k996o393p999o264k150L368N703L553k531o091o477k365L71J160
$$ 29805 32323 29327 22934 14935 8671 6521 9889 15592 19145 16614 10523 4046 1681 2052 3212
1226C212M1p24j009k671k241q10L44q00m495o569n582l08L931L673l96m734p151
$$ 3212 3253 2529 1520 -1151 -3392 -4202 -3858 -4658 -9153 -15722 -21304 -21612 -17681 -14008 -14404 -19138 -26289
1243b6289p247n309r10M259O217L131k939q283p338k869J933M957N857N020J831
$$ -26289 -33536 -38845 -39755 -35496 -29279 -26148 -29087 -37370 -44708 -47577 -45644 -40687 -34830 -29810 -27979
1258b7979k311n709m504Q66N690P304N088J888J38j773k188j461J503M359M414
$$ -27979 -30290 -35999 -40503 -39637 -33947 -26643 -21555 -19667 -19529 -21302 -23490 -24951 -23448 -19089 -14675
1273a4675J615q39l22J310K589M84j798j452k07K175L507M309M150K002j852n097
$$ -14675 -13060 -13899 -14221 -12911 -10322 -9838 -11636 -13088 -13295 -11120 -7613 -3304 846 2848 996 -4101
1289d101l141K575Q252R498N313O98l258l754k769P45N711R154P839K679k935
$$ -4101 -7242 -4667 3585 13083 18396 19094 15836 12082 9313 10058 15769 24923 32762 35441 32506
1304C2506o013l477L90L169M881M606L042l92m332m994j970K116L264J050j246
$$ 32506 26493 23016 23406 26575 31456 36062 39104 38712 34380 29386 27416 29532 32796 33846 32600
1319C2600j542o12n18o04j019r22k060k831k770j76L406L587p66o079p669m935
$$ 32600 31058 30446 29928 29324 28305 27383 25323 22492 19722 19546 22952 26539 25773 19694 12025 7090
1335G090m26K357L876K770k27m874p408p223k240L138N310K529j070m094m584
$$ 7090 6664 9021 12897 15667 15440 10566 3158 -4065 -6305 -3167 2143 4672 3602 -492 -5076
1350e076m746l461l55L314L595J438l041n382m071k053O8L35N09J19j585l140
$$ -5076 -9822 -13283 -13638 -10324 -6729 -5291 -8332 -13714 -17785 -19838 -19770 -19435 -18926 -18807 -20392 -23532
1366b3532l289j294Q71R81k039m150l121O19L165L021P70j666k652l443j120K175
$$ -23532 -26821 -28115 -27244 -26263 -28302 -32452 -35573 -34954 -31789 -28768 -27998 -29664 -32316 -35759 -36879 -34704
1382c4704O258P192K953k767m952k738J919N509O809M829K516p85l297l493J37
$$ -34704 -28446 -21254 -18301 -21068 -26020 -28758 -26839 -21330 -14521 -9692 -7176 -7961 -11258 -14751 -14614
1397a4614N049O617M508K78k344k326j522R34K535L886L627J87k259k842M31M293
$$ -14614 -9565 -2948 1560 1838 -506 -2832 -4354 -3420 -885 3001 6628 6815 4556 1714 2145 6438
1413F438M541K026p64j946l74J308L764M969L112M69l093l948j27N603P399M991
$$ 6438 10979 13005 12241 10295 9921 11229 14993 19962 23074 23543 20450 16502 16375 21978 29377 34368
1429C4368r68m938n596k411J652N003N983L491k107o215o782k924K771M836K737
$$ 34368 33400 28462 22866 20455 22107 27110 33093 36584 34477 28262 21480 18556 21327 26163 28900
1444B8900q55l276l831l541k204r2K013J914j066l705l876j908J83M36j299j684
$$ 28900 28045 24769 20938 17397 15193 15101 17114 19028 17962 14257 10381 8473 8656 9092 7793 6109
1460F109k431j540j650p84P37Q61j497m889n998l114J203M418L069o0l146n072
$$ 6109 3678 2138 488 -296 441 1302 -195 -5084 -11082 -14196 -12993 -8575 -5506 -5566 -8712 -13784
1476a3784n146k764J669M610M393R06m336n765l553K16K192J877J083K73j139
$$ -13784 -18930 -21694 -20025 -15415 -11022 -10116 -14452 -20217 -23770 -23554 -21362 -19485 -18402 -18129 -19268
1491a9268k675k920r73L87J436K56r1J86O61L55j324j938q10J042J445J231J345
$$ -19268 -21943 -24863 -25836 -25449 -24013 -23757 -23848 -23662 -23001 -22646 -23970 -25908 -26718 -25676 -24231 -23000 -21655
1508b1655K203K678J221O2j233J12J875L134L777L603L117J606j127k738p11L247
$$ -21655 -19452 -16774 -15553 -15491 -16724 -16612 -14737 -11603 -7826 -4223 -1106 500 -627 -3365 -4076 -829
1524h29N334M706J642o69j513k042j942R93L593M541L369k8k723k490j262M04
$$ -829 4505 9211 10853 10184 8671 6629 4687 5680 9273 13814 17183 17155 14432 11942 10680 11084
1540A1084J272J763K991K043N95j755j290M36J607J500kj78Q11Q36J348P80O46
$$ 11084 12356 14119 17110 19153 19748 17993 16703 17139 18746 20246 20244 20066 20877 21713 23061 23841 24487
1557B4487l14j431k464j808J458L961L361j256m883n580l335J53K647L679K031
$$ 24487 24173 22742 20278 18470 19928 23889 27250 25994 21111 15531 12196 12349 14996 18675 20706
1572B0706j398n489p340n128M27L702L677K52l043m075l914k700o59R92J038o17
$$ 20706 19308 13819 6479 1351 1778 5480 9157 9409 6366 2291 -1623 -4323 -4982 -3990 -2952 -3569
1588c569k681l600j998M59J279o6j744k099k055p07k27J280J808N14j688m318
$$ -3569 -6250 -9850 -11848 -11389 -10110 -10176 -11920 -14019 -16074 -16781 -17008 -15728 -13920 -13406 -15094 -19412
1604a9412l036L54L817M115J459j894l373l904k364J045L909N037K612j799n013
$$ -19412 -22448 -22094 -18277 -14162 -12703 -14597 -17970 -21874 -24238 -23193 -19284 -14247 -11635 -13434 -18447
1619a8447m147m77K454L247K419L10j326k271j520r1K754L804J781m50j488m77
$$ -18447 -22594 -23071 -20617 -17370 -14951 -14641 -15967 -18238 -19758 -19849 -17095 -13291 -11510 -11960 -13448 -13925
1635a3925K118K462K073J971Q52J315N52Q18K180L190L219O41r31r60O56K102
$$ -13925 -11807 -9345 -7272 -5301 -4449 -3134 -2582 -1764 416 3606 6825 7466 6535 5575 6231 8333
1651H333L286K750K110K77j693k752j790J405L745L521R76j930k983k573k58J159
$$ 8333 11619 14369 16479 16756 15063 12311 10521 11926 15671 19192 20168 18238 15255 12682 12424 13583
1667A3583K520L230J106j635l564k666N03K423L068J261l36j274j540j246m43
$$ 13583 16103 19333 20439 18804 15240 12574 13077 15500 18568 19829 19493 18219 16679 15433 14990
1682A4990J069J971M93j612k528j249N21J446j42j141j945k389k678r92J92J749
$$ 14990 16059 18030 18523 16911 14383 13134 13655 15101 14959 13818 11873 9484 6806 5814 6006 7755
1698G755R78j643m590m860k225N66K872J484k55l074m010m530k200J293L969K764
$$ 7755 8733 7090 2500 -2360 -4585 -4019 -1147 337 82 -2992 -7002 -11532 -13732 -12439 -8470 -5706
$$ [...]
8191c2
##END NTUPLES=NMR FID
##END=
