##TITLE=1H_Pr AmSuc
 CDCl3+DMSO, 8 sc, 
 14.05.2021
##JCAMPDX= 6.0         $$ Bruker NMR JCAMP-DX V2.0
##DATA TYPE= NMR FID
##DATA CLASS= NTUPLES
##ORIGIN= UXNMR, Bruker Analytische Messtechnik GmbH
##OWNER= root
$$ XWIN-NMR		Version 3.5
$$ Fri May 14 11:05:53 2021 Russian Standard Time (UT+4h)  she@DPX200
##.OBSERVE FREQUENCY= 200.131506
##.OBSERVE NUCLEUS= ^1H
##.DELAY= (6, 6)
##.ACQUISITION MODE= SIMULTANEOUS
##.ACQUISITION SCHEME= undefined
##.AVERAGES= 8
##.DIGITISER RES= 18
##SPECTROMETER/DATA SYSTEM= spect
##.PULSE SEQUENCE= zg30
##.SOLVENT NAME= CDCl3
##.SHIFT REFERENCE= (INTERNAL, CDCl3, 0, 15.7039)
##AUDIT TRAIL= $$ (NUMBER, WHEN, WHO, WHERE, WHAT)
$$ ##TITLE= Audit trail, XWIN-NMR		Version 3.5
$$ ##JCAMPDX= 5.01
$$ ##ORIGIN= Bruker BioSpin GmbH
$$ ##OWNER= she
$$ F:/spectra/data/she/nmr/H-F/1/audita.txt
$$ ##AUDIT TRAIL=  $$ (NUMBER, WHEN, WHO, WHERE, WHAT)
(   1,<2021-05-14 11:04:37.29 +0400>,<she>,<DPX200>,
      <created by zg, POWCHK disabled, PULCHK disabled
       configuration hash MD5:
       00 E9 B6 7A A2 85 ED C7 34 08 36 98 17 FE 4E 26
       data hash MD5: 16K
       EE 77 17 42 89 77 24 AE 71 24 7F 6A AB 07 9F 63>)
$$ ##END=
$$ 
$$ hash MD5
$$ 26 12 58 EC 3E DC 89 7F BF BC 9F 86 1C F2 BF D4
##$RELAX= 
##$RELAX= 
##$RELAX= 
##$RELAX= 
##$RELAX= 
##$RELAX= 
$$ Bruker specific parameters
$$ --------------------------
##$DU= <F:/spectra>
##$EXPNO= 1
##$NAME= <H-F>
##$PROCNO= 1
##$TYPE= <nmr>
##$USER= <she>
##$AMP= (0..31)
100 100 100 100 100 100 100 100 100 100 100 100 100 100 100 100 100 100 
100 100 100 100 100 100 100 100 100 100 100 100 100 100 
##$AQSEQ= 0
##$AQ_mod= 1
##$AUNM= <au_zg>
##$AUTOPOS= <>
##$BF1= 200.13
##$BF2= 200.13
##$BF3= 200.13
##$BF4= 200.13
##$BF5= 200.13
##$BF6= 200.13
##$BF7= 200.13
##$BF8= 200.13
##$BYTORDA= 1
##$CFDGTYP= 0
##$CFRGTYP= 5
##$CHEMSTR= <none>
##$CNST= (0..31)
1 1 145 1 1 1 1 1 1 1 1 1 1 1 1 1 1 1 1 1 1 1 1 1 1 1 1 1 1 1 1 1 
##$CPDPRG= <>
##$CPDPRG1= <>
##$CPDPRG2= <>
##$CPDPRG3= <>
##$CPDPRG4= <mlev>
##$CPDPRG5= <mlev>
##$CPDPRG6= <mlev>
##$CPDPRG7= <mlev>
##$CPDPRG8= <mlev>
##$CPDPRGB= <>
##$CPDPRGT= <>
##$D= (0..31)
0 1.2 0 0 0 0 0 0 0 0.06 0 0.03 0 0 0 0 0.0002 0 0 0 0 0 0 0 0 0 0 0 0 
0 0 0 
##$DATE= 1620975876
##$DBL= (0..7)
120 120 120 120 120 120 120 120 
##$DBP= (0..7)
150 150 150 150 150 150 150 150 
##$DBP07= 0
##$DBPNAM0= <>
##$DBPNAM1= <>
##$DBPNAM2= <>
##$DBPNAM3= <>
##$DBPNAM4= <>
##$DBPNAM5= <>
##$DBPNAM6= <>
##$DBPNAM7= <>
##$DBPOAL= (0..7)
0.5 0.5 0.5 0.5 0.5 0.5 0.5 0.5 
##$DBPOFFS= (0..7)
0 0 0 0 0 0 0 0 
##$DE= 6
##$DECBNUC= <off>
##$DECIM= 32
##$DECNUC= <off>
##$DECSTAT= 4
##$DIGMOD= 1
##$DIGTYP= 9
##$DL= (0..7)
0 120 120 120 120 120 120 120 
##$DP= (0..7)
150 150 150 150 150 150 150 150 
##$DP07= 0
##$DPNAME0= <>
##$DPNAME1= <>
##$DPNAME2= <>
##$DPNAME3= <>
##$DPNAME4= <>
##$DPNAME5= <>
##$DPNAME6= <>
##$DPNAME7= <>
##$DPOAL= (0..7)
0.5 0.5 0.5 0.5 0.5 0.5 0.5 0.5 
##$DPOFFS= (0..7)
0 0 0 0 0 0 0 0 
##$DQDMODE= 0
##$DR= 18
##$DS= 0
##$DSLIST= <SSSSSSSSSSSSSSS>
$$ [...]
##$SUBNAM2= <"">
##$SUBNAM3= <"">
##$SUBNAM4= <"">
##$SUBNAM5= <"">
##$SUBNAM6= <"">
##$SUBNAM7= <"">
##$SUBNAM8= <"">
##$SUBNAM9= <"">
##$SW= 16.9725357007746
##$SWIBOX= (0..15)
0 0 2 0 0 0 0 0 0 0 0 0 0 0 0 0 
##$SW_h= 3396.73913043478
##$TD= 16384
##$TD0= 1
##$TE= 0
##$TE2= 300
##$TE3= 300
##$TEG= 300
##$TL= (0..7)
0 120 120 120 120 120 120 120 
##$TP= (0..7)
150 150 150 150 150 150 150 150 
##$TP07= 0
##$TPNAME0= <>
##$TPNAME1= <>
##$TPNAME2= <>
##$TPNAME3= <>
##$TPNAME4= <>
##$TPNAME5= <>
##$TPNAME6= <>
##$TPNAME7= <>
##$TPOAL= (0..7)
0.5 0.5 0.5 0.5 0.5 0.5 0.5 0.5 
##$TPOFFS= (0..7)
0 0 0 0 0 0 0 0 
##$TUNHIN= 0
##$TUNHOUT= 0
##$TUNXOUT= 0
##$USERA1= <user>
##$USERA2= <user>
##$USERA3= <user>
##$USERA4= <user>
##$USERA5= <user>
##$V9= 5
##$VALIST= <valist>
##$VCLIST= <CCCCCCCCCCCCCCC>
##$VD= 0
##$VDLIST= <DDDDDDDDDDDDDDD>
##$VPLIST= <PPPPPPPPPPPPPPP>
##$VTLIST= <TTTTTTTTTTTTTTT>
##$WBST= 1024
##$WBSW= 4
##$XGAIN= (0..3)
0 0 0 0 
##$XL= 0
##$YL= 0
##$YMAX_a= 413795
##$YMIN_a= -482962
##$ZGOPTNS= <>
##$ZL1= 120
##$ZL2= 120
##$ZL3= 120
##$ZL4= 120
##$ABSF1= 10
##$ABSF2= 0
##$ABSG= 5
##$ABSL= 3
##$ALPHA= 0
##$AQORDER= 0
##$ASSFAC= 0
##$ASSFACI= 0
##$ASSFACX= 0
##$ASSWID= 0
##$AUNMP= <proc_1d>
##$AZFE= 0.1
##$AZFW= 0.1
##$BCFW= 1
##$BC_mod= 2
##$BYTORDP= 1
##$COROFFS= 0
##$CY= 11.3945322036743
##$DATMOD= 1
##$DC= 2
##$DFILT= <>
##$DTYPP= 0
##$F1P= 15.9154993809931
##$F2P= -4.1035820241983
##$FCOR= 0.5
##$FTSIZE= 0
##$FT_mod= 4
##$GAMMA= 1
##$GB= 0.15
##$INTBC= 1
##$INTSCL= 1
##$ISEN= 128
##$LB= 0.24
##$LEV0= 0
##$LPBIN= 0
##$MAXI= 10000
##$MC2= 0
##$MEAN= 0
##$ME_mod= 0
##$MI= 1.114404
##$NCOEF= 0
##$NC_proc= 0
##$NLEV= 6
##$NOISF1= 3.799351
##$NOISF2= 2.8
##$NSP= 1
##$NTH_PI= 0
##$NZP= 0
##$OFFSET= 15.70392
##$PC= 1
##$PHC0= -11126.52
##$PHC1= 7.401
##$PH_mod= 1
##$PKNL= yes
##$PPARMOD= 0
##$PSCAL= 0
##$PSIGN= 0
##$REVERSE= no
##$SF= 200.130013532006
##$SI= 16384
##$SIGF1= 3
##$SIGF2= 2
##$SINO= 400
##$SIOLD= 16384
##$SREGLST= <1H.CDCl3>
##$SSB= 0
##$STSI= 0
##$STSR= 0
##$SW_p= 3612.71676300578
##$SYMM= 0
##$S_DEV= 0
##$TDeff= 0
##$TDoff= 0
##$TI= <>
##$TILT= no
##$TM1= 0
##$TM2= 0
##$TOPLEV= 0
##$USERP1= <user>
##$USERP2= <user>
##$USERP3= <user>
##$USERP4= <user>
##$USERP5= <user>
##$WDW= 1
##$XDIM= 8192
##$YMAX_p= 0
##$YMIN_p= 0
$$ End of Bruker specific parameters
$$ ---------------------------------
##NTUPLES= NMR FID
##VAR_NAME=  TIME,          FID/REAL,        FID/IMAG
##SYMBOL=    X,             R,               I
##VAR_TYPE=  INDEPENDENT,   DEPENDENT,       DEPENDENT
##VAR_FORM=  AFFN,          ASDF,            ASDF
##VAR_DIM=   8192,          8192,            8192
##UNITS=     SECONDS,       ARBITRARY UNITS, ARBITRARY UNITS
##FACTOR=    0.0002944,     1,               1
##FIRST=     0,             0,               0
##LAST=      2.4114304,     0,               0
##MIN=       0,             -482962,         0
##MAX=       2.4114304,     413795,          0
$$ Real data points
##PAGE= N=1
##DATA TABLE= (X++(R..R)), XYDATA
0 0 0 0 0 0 0 0 0 8 -8 8 -8 16 -16 24 -24 32 -41 53 -64 74 -89 105 -128 149 -177 204 -237 273 -314 358
30 358 -406 464 -527 594 -672 753 -847 945 -1055 1174 -1305 1448 -1605 1775 -1961 2164
46 2164 -2386 2628 -2894 3186 -3510 3866 -4261 4705 -5199 5760 -6401 7142 -8005 9031
60 9031 -10265 11791 -13725 16262 -19742 24811 -32859 47502 -82159 315458 127904 -450019
72 -450019 358612 -148242 71331 2056 -187903 378261 -289333 -54248 324784 -310834
82 -310834 198316 -93292 -79352 294879 -341329 172930 78556 -252356 292933 -228936
92 -228936 78311 168884 -362869 288173 -20201 -162461 187696 -191015 186567 -73253
102 -73253 -158157 332051 -271736 20483 169778 -202408 184320 -155129 18016 183687
112 183687 -289871 211088 -19561 -163015 238870 -211375 96075 79627 -224801 214024
122 214024 -95015 -13517 88694 -174345 206114 -113219 -81221 231036 -221940 79339
132 79339 51828 -123034 171566 -176081 62347 114621 -214582 172571 -44555 -69988 122812
143 122812 -134741 117985 -32756 -94968 172022 -143710 55456 52491 -136876 161726
153 161726 -100932 -10315 120366 -154267 105685 -19663 -55714 123496 -141883 77089
163 77089 42026 -123269 128903 -71700 3156 53338 -99926 125126 -76143 -36859 125541
174 125541 -126127 62850 13791 -72597 102597 -97215 41364 51780 -118178 102892
184 102892 -37516 -25026 65431 -87151 73603 -25232 -44180 91788 -87977 36113 20396
195 20396 -68318 91248 -69067 -1317 64689 -85386 60260 -18259 -25541 57981 -75228
206 -75228 52015 8252 -62526 66987 -40851 11765 18294 -54161 71054 -45549 -14532
217 -14532 63957 -65824 34373 -2712 -25046 54772 -59670 24265 27781 -52933 45370 -21594
229 -21594 1706 22890 -49103 54066 -15583 -30362 46896 -33604 20410 -3532 -22799 50027
241 50027 -44150 4031 37283 -40913 21448 -7721 -283 21960 -41347 32033 3213 -29324
253 -29324 29352 -16339 9260 -867 -21215 37993 -23558 -10433 27829 -22478 12420 -7161
265 -7161 -4717 23288 -31819 12595 14033 -22217 11592 -7484 7343 2347 -21193 23897 -7138
278 -7138 -13417 16895 -11044 7442 -6220 -7647 21607 -17918 -1678 12211 -9348 4879 -6580
291 -6580 4011 7924 -17410 9512 6386 -9463 2584 -2554 8908 -4951 -9067 15929 -5256
304 -5256 -7214 7591 628 302 -5641 2540 8922 -9382 -763 7841 -2105 -2768 -463 6432 -1473
319 -1473 -6682 5633 4290 -4990 -2268 4919 2316 -4731 -1441 6970 -807 -7431 4680 5721 -6636
334 -6636 -2033 5415 631 -3426 -2904 6886 -881 -7923 6140 1670 -3509 -1506 455 5747 -6882
349 -6882 -2563 8433 -5320 -1713 1394 140 3081 -8901 4586 5577 -10491 3845 1317 -480
363 -480 -368 -5613 9114 -3044 -7826 10048 -3691 -1106 393 -2138 8233 -9725 1210 8596
377 8596 -9463 4351 -521 -637 4958 -9855 7869 2471 -9406 8215 -3653 2454 910 -8079
391 -8079 12971 -6709 -4660 10494 -6980 3544 -2410 -1056 9937 -13079 5178 6937 -10837
404 -10837 7482 -3658 2343 3236 -11447 12791 -3513 -7177 10088 -7371 4800 -1465 -5810
417 -5810 12738 -10661 350 7690 -8931 7055 -6708 1830 8207 -15423 9971 1893 -9634
430 -9634 8080 -6162 5226 -1201 -9009 14878 -9618 -2386 9577 -9906 7700 -4772 -2077
443 -2077 10558 -13454 6875 2656 -8454 9845 -9106 4124 5177 -12954 11975 -3654 -3532
456 -3532 7085 -9414 10636 -4849 -7110 15404 -11312 750 6303 -6667 7587 -8442 4349
469 4349 6862 -15140 12366 -945 -7505 9762 -8178 6276 -754 -7223 12629 -9677 1560
482 1560 6442 -10250 10273 -5955 -2129 10261 -12064 7266 -19 -5897 9556 -10563 6097
495 6097 3320 -11930 12017 -4871 -2494 5923 -8179 9551 -6620 -3350 12928 -13650 4788
508 4788 4450 -8560 8081 -6751 3277 3421 -10686 11023 -5101 -3154 8758 -10534 7489
521 7489 -794 -7068 10460 -7986 2362 2323 -6699 9968 -8743 321 9256 -11797 6030 407
535 407 -3187 5513 -8845 8692 -379 -9922 12580 -5679 -1903 5241 -5704 7251 -6201 -295
549 -295 8620 -10989 6300 706 -5863 8741 -8081 2926 4221 -8115 7047 -3880 805
562 805 4015 -9224 9430 -2009 -6876 9398 -5549 1866 -98 -3698 8761 -8813 1348
575 1348 7102 -9047 5091 -1314 -1210 4561 -8043 6446 14 -6306 7209 -5264 2244 1727
589 1727 -7002 8535 -4124 -2609 5729 -5009 4224 -3397 -1366 7915 -9215 2903 4372 -6315
603 -6315 4471 -3390 2515 1556 -7401 8086 -2469 -3888 5828 -4820 3497 -1171 -3571 7334
617 7334 -6102 940 3391 -4817 5178 -4070 427 4919 -7229 4239 603 -2979 3675 -4597
631 -4597 4400 169 -5882 7353 -3190 -1515 3240 -3442 4097 -3550 -519 5476 -6321 2742
645 2742 1523 -3500 4021 -3994 2180 1904 -5282 5065 -2172 -1003 3056 -4381 4146 -1358 -2965
660 -2965 5044 -3985 1017 967 -2957 4206 -3944 568 3382 -5113 3200 -511 -1298 2630 -3701 3518
676 3518 -308 -3438 4624 -2816 90 1717 -2864 3579 -2462 -283 3242 -3673 2229 -153 -1389
691 -1389 2975 -3228 1925 1096 -3340 3173 -1593 -170 1546 -2742 3036 -1376 -1377 3276 -2659 909
707 909 277 -1324 2512 -2760 995 1704 -2951 2275 -694 -302 1411 -2362 2504 -429 -1761 2615
723 2615 -1798 418 510 -1364 2235 -2011 -40 1932 -2244 1353 -337 -460 1425 -2174 1613 561
739 561 -1732 1736 -829 -33 377 -1402 1982 -1173 -798 1664 -1539 728 -191 -493 1396 -1733 689
756 689 996 -1652 966 -597 225 386 -1435 1574 -361 -1175 1327 -749 498 -279 -551 1440 -1264
773 -1264 -84 985 -820 587 -314 177 766 -1193 1013 233 -901 785 -321 499 -132 -665 1320
790 1320 -535 -387 713 -478 268 -254 38 770 -990 337 480 -649 199 -259 427 -54 -732 724
808 724 57 -507 335 -133 259 -295 -173 676 -493 -102 286 -70 100 -383 469 200 -644 291 364 -247
828 -247 -75 -71 189 -237 -364 442 -182 -360 80 212 -243 -350 282 161 -359 15 365 86 -172 -123 332
849 332 -32 -295 281 221 -98 -452 382 173 -278 52 150 69 -291 136 499 -308 -255 442 132 -223 -58 198
871 198 192 -470 336 167 -396 32 -75 300 -268 -178 606 -230 -274 136 74 206 -441 194 500 -451 67 183
893 183 -25 -20 -267 388 -64 -496 472 23 -261 114 -77 374 -388 -23 486 -558 34 204 -255 242 -395
914 -395 134 226 -438 210 29 -35 119 -522 481 -83 -441 549 -218 2 16 -133 501 -407 -3 527 -637
935 -637 224 136 -96 297 -346 540 -136 -431 578 -311 -66 308 -294 379 -276 -150 368 -485 387 -78
955 -78 -186 598 -518 200 226 -401 253 -203 215 -51 -570 533 -248 -339 615 -323 124 -31 -232 420 -410
976 -410 308 361 -736 494 -113 -56 353 -552 349 -56 -204 459 -505 327 208 -563 466 -267 -157 351
996 351 -263 230 -272 -36 440 -538 403 192 -467 448 -282 141 75 -355 705 -342 -195 614 -537 118
1016 118 -32 -200 481 -489 203 248 -319 417 -332 126 424 -512 388 -12 -203 313 -323 336 -40 -473
1036 -473 677 -425 -234 482 -429 150 -234 -22 317 -604 437 -15 -350 370 -274 97 128 -369 517
1055 517 -323 -110 307 -494 420 -122 -237 575 -411 -10 192 -318 372 -443 161 344 -608 438 45 -51
1075 -51 240 -188 373 -99 -502 595 -294 -23 236 -289 302 -272 36 466 -459 82 33 -107 426 -374
1095 -374 191 304 -452 331 -104 20 45 -252 274 -108 -278 343 -245 131 95 -168 413 -494 58 398 -416
1116 -416 176 -113 -61 61 -469 318 62 -276 297 -106 116 11 -209 540 -295 -67 417 -234 180 -146
1136 -146 9 272 -333 202 273 -325 261 -147 112 168 -249 399 -33 -96 397 -285 17 -13 -139 245 -283
1157 -283 76 299 -312 196 -69 21 116 -450 200 18 -214 226 -161 300 27 -212 357 -271 -165 183 -97
1178 -97 261 21 6 289 -243 133 255 -228 237 -37 -4 108 -188 216 -32 -192 223 -120 105 -4 -208
1199 -208 310 -191 -145 164 -128 196 -140 27 286 -90 39 95 -249 59 -33 25 96 -129 273 -61 -17 145
1221 145 -76 230 -100 -55 175 -167 118 20 -93 27 -11 -29 194 -97 -29 -13 -97 152 -180 170 22 -104
1243 -104 81 -70 -81 -61 -19 97 -94 -43 51 -43 -66 -94 -102 -9 11 -101 29 -41 92 25 -112 -20 -21 214 76 -124
1269 -124 182 -30 -150 105 -32 35 -110 -68 108 -21 -150 24 -51 -20 -63 -11 -111 -11 4 6 -38 38 -136 95
1293 95 -176 -36 84 -86 15 55 11 3 63 -11 90 -37 18 8 41 26 8 -31 -50 42 68 -26 -12 -31 -73 11 19 145
1321 145 20 -149 -43 -41 -16 2 -78 57 -74 -51 -32 -48 -121 10 116 201 -307 -108 60 -103 -70 -9 -9 -5 -61 -15
1347 -15 -6 82 -2 109 -42 8 -129 -29 -3 -147 -182 -34 -42 -81 117 84 -151 6 48 -34 -19 -111 126 -81 -13 107
1373 107 72 -49 128 106 40 40 -54 87 58 116 -21 43 11 -79 31 112 76 -3 67 -73 -111 -52 28 -103 23 9
1399 9 -27 -59 -121 54 69 -163 124 37 -10 -89 -3 39 47 -111 -36 -183 24 28 -77 127 -103 160 95 -13 39 5
1425 5 -33 -70 -6 202 -55 -101 121 -69 10 -107 -60 226 -95 -70 115 -125 58 -147 -79 126 -179 116 -27
1448 -27 -186 -50 -58 70 18 -79 4 5 -22 281 -110 138 64 30 309 -41 -120 181 -176 102 -59 47 104 -276
1472 -276 159 -16 -168 32 -184 148 25 -188 235 -48 -79 178 -147 241 -190 -79 283 -225 -21 150
1492 150 -53 17 -4 -66 124 -14 351 159 -62 68 -130 99 -43 -126 255 -159 99 60 -168 199 -60 -78
1514 -78 262 -211 96 -107 -147 210 -264 157 122 -204 275 -99 -47 15 -214 168 -86 -56 255 -187 50 90
1536 90 -167 12 -186 54 88 -229 183 -150 15 157 -155 159 -60 -189 241 -129 102 16 -205 310 -100
1557 -100 7 217 -332 38 -36 -46 169 -342 252 -78 -286 318 -257 72 165 -190 242 -165 -30 373 -337
1578 -337 245 82 -209 244 -231 204 -65 -358 320 -166 -39 221 -253 353 -48 -95 314 -263 182 -106
1598 -106 -226 328 -429 76 265 -391 188 -120 -140 191 -341 328 29 -291 386 -155 71 29 -359 439 -261
1619 -261 1 370 -491 282 -3 -47 341 -418 192 299 -447 285 -271 -39 111 -439 301 -125 -298 239
1639 239 -340 213 4 -309 471 -376 118 198 -368 275 -184 -79 336 -509 161 100 -341 396 -90 223 155
1660 155 -414 376 -69 -163 244 -334 303 -153 -65 375 -269 167 148 -177 275 -256 77 185 -402 397 -32
1681 -32 -230 267 -297 218 -72 -264 407 -319 -59 143 -364 303 -187 -16 399 -397 202 105 -240 234 -264
1702 -264 182 172 -533 278 -62 -41 13 -226 269 -200 -28 431 -338 163 317 -204 306 -295 215 203 -298
1723 -298 207 -48 141 180 -387 234 117 -207 501 -139 244 92 -107 242 -263 -143 430 -356 159 -48
1743 -48 -98 115 -383 131 11 -325 204 -68 -2 30 -396 216 -74 -130 173 -237 -16 -37 -155 333 -227 55
1765 55 125 -352 189 76 -67 -33 -315 218 23 -165 231 -127 35 18 -95 205 -208 -181 348 -184 55 98
1787 98 0 112 -142 118 12 -217 265 -1 40 66 -126 7 14 -181 117 -60 82 -57 -64 143 -120 -75 172
1810 172 -91 59 -4 8 149 -162 88 189 -49 161 -14 120 90 3 168 -156 -94 167 97 -78 -35 4 60
1833 60 -219 11 179 -103 87 -56 -7 38 -164 179 -51 -106 101 -58 5 -12 -65 137 -65 -127 4 0 -121
1856 -121 -57 -47 104 -9 -26 40 -143 -59 50 -102 52 -7 28 69 -211 93 74 -110 14 -24 -17 -4 47 -12 115
1881 115 -41 42 -13 30 92 -98 90 -129 -23 8 -10 -103 -11 -23 196 -106 46 218 -171 -36 110 -2 -34
1904 -34 -49 73 37 -166 134 -131 -159 96 3 162 -134 13 57 -41 -37 55 -114 180 -101 25 238 -148 75
1927 75 94 220 127 -190 145 -36 -283 277 -34 -112 157 -121 162 -41 -56 202 -246 65 -154 -207 182 -89
1949 -89 0 125 -190 48 63 -14 96 -167 96 -102 -90 209 -92 -63 26 -59 184 -103 31 70 -180 57 -38
1972 -38 2 118 -95 36 -36 -229 302 -61 9 94 -215 63 -125 -89 252 -86 78 -107 -59 339 -241 -160 137
1995 137 -148 151 2 29 103 -282 306 -164 -365 63 -185 56 22 -140 278 -62 -8 1 -31 221 -59 -100 55
2018 55 -157 62 99 -84 98 -211 37 95 -144 184 -131 -88 69 -74 138 -115 -140 123 -224 76 10 -187
2040 -187 52 -168 -25 38 -143 126 -50 -164 145 -131 100 8 -82 195 -176 172 163 -172 211 -186 -87 127
2062 127 -151 63 15 -11 194 -161 132 -10 -234 108 -60 61 81 -239 96 30 -126 216 -107 -59 64 -51
2084 -51 111 -200 111 40 -179 72 -117 -67 13 -92 164 -37 25 44 -53 80 111 -129 63 -7 167 94 -162
2107 -162 103 -16 2 -20 -52 57 -22 -142 39 -104 101 -88 -176 101 -231 -11 45 -47 127 -97 -113 69 -123
2130 -123 87 -47 -114 -5 -18 -22 140 10 84 -107 -147 97 -58 22 130 -29 87 121 -27 35 3 75 -84 78
2154 78 16 -289 97 34 -35 142 -10 -63 -95 27 -1 -43 66 -9 -93 -69 -40 -55 -67 -179 -29 34 -78 76 27
2179 27 40 135 -22 113 -2 -36 61 -35 37 -46 -102 49 -175 60 18 -158 90 -34 -199 107 -116 59 -60
2202 -60 28 151 26 101 63 -53 -41 8 39 14 32 56 -5 130 11 -127 47 -31 64 93 -106 27 -38 89 118
2227 118 -123 -126 110 21 32 -110 93 139 -32 35 -108 2 -2 -147 31 52 -99 69 -98 21 206 2 -11
2250 -11 -71 -49 192 -102 -46 120 -32 222 -105 72 -18 -19 72 16 56 -2 31 48 -2 -1 50 -97 -90 6 -8 125 -28
2277 -28 -56 -39 -65 48 7 -11 -80 -43 127 -99 27 -19 -15 168 -78 98 6 -88 29 -41 -111 70 18 -89 -71 -7
2303 -7 54 6 -146 31 -74 -34 45 -137 41 -20 23 101 -98 9 -141 -24 -19 -102 -75 36 -12 -113 13 58 26
2328 26 41 -22 -100 -177 -3 38 76 -14 97 -15 -104 127 -40 -21 2 12 -78 160 -68 -13 -89 -73 18 -127 -17 -142
2354 -142 -89 -176 -47 -162 27 105 23 -4 -75 44 47 47 149 52 -77 -108 -36 -54 -36 66 -38 35 -21 -83 105 -86
2380 -86 -73 103 38 -83 -5 -165 -97 -60 117 -70 -41 13 1 4 19 141 77 -20 13 99 6 -71 128 -29 -10 -63 -76
2407 -76 -2 15 -48 -109 98 -115 76 51 133 -63 -71 110 32 -114 -127 -25 3 8 83 146 -193 46 -110 9 -16 16
2433 16 -33 -102 -22 -48 72 -150 106 -134 56 -50 -56 45 23 103 -19 62 -48 112 -22 90 95 78 65 -181 -93
2458 -93 -79 174 42 0 69 35 47 -95 57 -54 -198 1 -28 9 24 97 -77 -28 -85 17 -25 -111 66 -32 -23 -94
2484 -94 57 -41 74 -9 43 -12 -39 61 -11 25 -70 42 -184 -209 42 8 120 43 -50 56 -5 43 87 -2 91 113
2510 113 -74 -103 -108 -36 -19 -94 18 21 -89 -26 -56 83 -8 -77 17 69 11 -14 -175 76 -211 -7 80 -112 -157 -64
2536 -64 -85 -34 -175 -66 50 21 92 -4 -51 35 -117 125 -27 -138 220 -129 -112 97 -91 225 -163 96 79
2559 79 -149 -76 -40 67 64 -48 86 -48 -187 154 -65 37 145 -109 33 -89 -43 155 -199 -41 11 -61 85
2582 85 37 92 47 -45 146 69 -1 48 -94 -32 18 -110 68 24 -24 -113 -153 66 5 107 -14 -276 213 77 -2
2607 -2 63 -65 -74 -32 -95 126 -32 -47 147 -101 125 3 -19 51 -75 49 91 -51 120 -24 70 51 -115 107
2631 107 -34 -37 117 -18 71 -94 -72 46 78 25 72 -13 129 -94 -154 208 -1 5 -24 108 -56 -14 43 270 -100
2656 -100 121 14 -16 170 50 95 -101 79 249 11 2 -78 -105 -16 -22 107 131 -54 99 -68 -98 32 -174 87
2680 87 -35 -70 132 -23 41 2 57 88 -58 13 107 -122 111 23 -24 12 -160 81 -42 -72 80 36 91 62 -139
2705 -139 -18 -100 66 70 -55 -8 -11 -35 16 -120 115 65 -146 35 -99 67 -70 -159 137 -17 124 -27 -42 -139
2729 -139 15 -4 63 -66 73 -88 24 90 37 -16 16 -4 -64 24 -102 19 58 -29 41 -150 87 -87 0 85 -139
2754 -139 195 -100 -30 -44 -105 -11 16 -23 -109 -73 102 43 -56 33 -231 -37 -9 54 98 -81 27 26 -79 66 87 -12
2780 -12 -48 2 -124 19 54 46 36 2 -24 60 123 68 23 33 -164 82 -14 -62 37 -102 -143 84 -146 -38 -101 43
2806 43 145 -57 86 -63 27 81 -132 11 -40 54 62 46 -25 44 -41 121 45 114 58 71 5 -131 10 -15 -47 -126
2832 -126 29 -123 -82 51 33 72 -50 -96 -62 9 -35 -176 54 -42 -54 83 -220 60 -41 -18 9 -71 32 35 66
2857 66 59 85 -34 73 -18 -27 79 -100 9 -58 101 -79 36 126 -78 95 120 28 -73 -81 62 -14 -58 -72 -113 -71
2883 -71 -74 41 182 -6 -13 -126 20 69 -24 39 -1 -13 -25 42 -117 -62 -43 75 -32 5 -15 41 -73 93 93 -8
2909 -8 -87 39 47 127 -3 -55 -79 -59 130 32 66 61 -10 113 -225 114 -7 120 -48 -29 -22 96 51 128 92 -209 37
2936 37 103 -11 1 -156 27 31 -55 28 41 43 -90 -97 11 4 -99 16 -23 -125 -21 -17 -19 10 36 11 -37 -28 -7 -12 25 -23
2966 -23 71 68 -79 118 -8 3 39 34 -28 30 -51 135 -89 0 90 7 0 143 22 45 3 17 51 -12 42 48 -72 56
2994 56 205 -3 62 29 13 -123 29 58 -16 -61 -54 14 173 -27 -38 17 23 -15 -28 58 74 -45 41 -56 17 73 -46
3021 -46 27 6 -102 -25 -170 54 -29 -57 58 30 62 165 -70 -88 -47 16 34 35 59 -108 -22 -51 -152 97 -48 -26
3047 -26 62 -146 -49 -55 -149 61 -31 -105 77 -75 143 53 -27 80 5 46 45 -171 88 115 25 -42 -100 6 -21 -42 58
3074 58 -28 14 -62 -96 -65 -4 -128 116 -55 150 -21 -41 26 63 103 -17 -106 -16 125 -5 95 -127 36 -70
3098 -70 -15 69 -105 -38 -62 -40 29 -27 8 -17 104 28 -20 4 20 -45 86 -3 -109 100 -2 -221 -28 82 -6 -48
3124 -48 -126 58 -5 146 -218 27 71 27 -64 -4 -43 -8 -34 -28 -25 15 38 -17 68 -80 -123 -117 61 16 143 -8 59 110
3152 110 94 -52 -95 -94 106 -65 4 51 -14 -3 -17 6 -35 1 14 22 -70 23 -47 95 18 -123 50 -47 21 -133 -10
3179 -10 14 54 92 -13 69 68 -159 -82 17 32 86 11 58 -33 11 144 118 -6 21 22 -36 -59 -13 -38 -137 40 -22 -101 12
3208 12 -155 0 54 -19 57 -1 -13 -35 -79 -60 -18 105 -16 -26 -19 -21 114 -3 -36 -1 -127 -120 -11 -46 -39 43 -123 53
3236 53 16 -35 28 -36 5 -107 88 -141 -40 -46 -32 -38 45 -58 -26 -19 -95 -37 -44 18 64 109 -10 -67 15 50 -7 -26 -11
3265 -11 5 69 -48 -45 110 166 78 16 9 -76 -8 9 -65 -122 4 -68 -13 13 -22 109 223 -140 -15 -67 56 16 138
3292 138 6 32 -13 -43 32 110 -80 -37 -52 43 60 -180 49 16 92 -57 17 -37 38 -102 -51 -68 -52 15 70 -93
3318 -93 -53 -88 126 -5 -73 -1 -83 86 -81 3 79 32 101 89 -47 -36 -41 -105 -7 44 22 121 20 105 38 -10 22 -40
3346 -40 -22 12 -107 -23 -122 114 14 -34 -54 -125 -86 -66 -13 129 -13 59 86 -36 88 -6 -24 -59 -181 29 101 20
3372 20 -23 -49 -25 52 -139 117 19 -62 -23 -36 -18 -131 20 174 93 -108 24 8 -61 -99 -32 21 44 13 45 -43 -71
3399 -71 134 154 123 42 -135 -40 -35 108 -75 -17 -12 34 -23 81 10 -192 55 -28 -8 64 6 -103 -85 99 -19 -45
3425 -45 27 -6 135 -62 -87 37 44 -26 21 -11 -44 6 -74 -68 -58 15 -57 -70 0 -175 60 -50 -69 22 73 14 -45 -61
3453 -61 -55 -119 -34 47 -36 -7 139 35 4 -42 34 15 -47 -2 -27 8 65 75 -2 94 -23 56 2 -165 -13 44 26 38
3481 38 -24 88 -74 171 50 56 120 46 -54 8 -61 74 108 45 67 -60 1 -54 61 6 -29 -9 -108 -75 -104 52
3507 52 38 12 -47 -17 106 23 37 35 116 -37 -58 30 7 -38 -76 -68 17 -36 8 45 -41 14 -137 4 0 13 68 -29 -3 -117
3537 -117 -8 84 -1 -12 18 -107 -90 -12 -36 14 84 -28 34 -104 -27 -63 -22 -74 25 -169 -11 -77 -67 69 -1 4 6
3564 6 36 65 -72 30 108 1 42 -80 112 37 52 22 -126 77 115 -74 -36 37 -19 51 71 60 -57 -104 10 28
3590 28 64 -68 53 -21 87 -98 -17 -87 2 26 -103 -36 50 22 77 -149 68 -86 -84 34 -23 9 13 -117 97 37
3616 37 75 31 39 43 -11 -67 -52 145 34 -14 13 97 -93 -29 -36 -85 -41 -179 167 -71 -109 -140 4 3 42 38 -46 -16 -66
3645 -66 -1 -107 -4 -40 -19 88 -75 -15 171 40 61 41 -8 45 36 94 10 47 36 58 -81 99 40 19 -173 31
3671 31 -43 -7 -72 -8 -191 12 62 -91 69 -145 12 -112 125 -112 -187 12 18 -114 36 34 -159 -28 123 54
3695 54 54 -36 49 -11 6 -12 -103 80 79 43 -33 -3 177 -62 13 76 32 -1 -48 -72 24 -28 -8 3 -47 5 -31 57 19 -36
3725 -36 83 25 82 -118 10 52 55 -130 -159 -3 28 116 20 42 42 64 34 76 -49 153 24 18 -31 37 -51 19 196
3752 196 -54 32 -119 53 39 -24 48 27 -135 -79 36 -51 3 35 -55 15 44 111 -52 -76 3 -72 -41 -41 60 10 153
3779 153 -81 25 15 69 -25 -82 55 -27 125 131 19 23 35 -9 -71 -51 -43 -73 -34 64 36 -53 61 44 -7 -17 83 -69
3807 -69 22 4 114 -120 -43 -26 0 60 -21 23 54 13 77 -116 58 -28 -36 -18 -58 -21 29 119 -156 71 31 98 53 35
3835 35 -8 -137 21 -124 -9 85 25 98 -47 -70 -76 -51 110 90 -16 -41 70 99 -18 -163 10 -25 -15 -44 102
3860 102 -49 -86 -138 -31 -16 -63 92 56 1 -92 24 -70 -20 88 -13 -28 -17 -19 3 75 -34 -83 25 -36 -154 40
3886 40 -30 5 -24 -15 -2 19 23 50 -23 -70 -23 35 107 120 -54 50 -35 -37 92 -111 -24 -22 -45 -87 -67 198 -30 11 -9
3915 -9 -116 19 -70 -4 3 31 -36 -42 -16 -192 13 31 30 -21 -4 1 -129 -80 54 12 107 -40 38 -132 1 24 -21 -107
3943 -107 -55 -60 8 -163 -52 143 19 10 17 61 -55 -69 12 78 -112 19 33 1 31 -72 -16 17 -168 -16 2 -119
3969 -119 -30 -114 -52 190 -114 -44 59 -127 83 26 -7 -75 129 38 70 77 -68 85 -67 -3 -81 91 8 -13 -65
3994 -65 3 -90 39 -121 -90 1 -9 79 -139 -42 28 -154 -83 71 -118 -84 126 160 104 25 150 -54 -36 -165 74
4019 74 134 54 39 -43 -39 131 40 44 8 125 -80 -52 34 -111 135 -39 -21 258 35 -64 -1 34 63 -19 45 47 -43 -3
4047 -3 -21 -50 -48 -32 76 1 11 103 186 25 54 23 102 -56 -51 1 48 31 -53 10 -4 131 76 -23 11 53 -133 128 52
4076 52 2 -60 -74 77 -69 -110 -69 -20 59 -10 -22 -109 -108 -115 2 -15 65 -66 -57 71 -76 56 2 -109 -32 -129 -3
4103 -3 181 70 87 52 37 56 44 84 -55 16 -19 -4 -75 -77 15 92 84 -17 -29 -34 78 -84 48 44 62 -25 -30 46 48 32
4133 32 79 128 9 -12 24 -15 -80 3 124 27 -61 62 60 -44 81 132 76 -31 -128 -93 140 33 27 -25 73 -83 14
4160 14 -52 -34 -59 167 -23 105 133 -61 80 145 37 117 -57 15 -93 34 -35 -24 -12 5 -107 65 -89 -108
4184 -108 125 -104 95 -24 153 -22 -1 84 40 39 -14 -90 24 109 -82 39 47 -21 119 -91 -99 -127 96 -123 -61
4209 -61 51 -10 -74 -125 -73 -9 -7 9 78 -89 110 64 9 69 -21 -3 32 72 8 -38 78 73 -54 -160 25 24 -173 -22
4237 -22 -145 25 64 6 14 9 -30 -9 145 99 10 66 -54 -38 30 -138 100 -37 40 -69 -26 16 -23 22 83 19 33
4264 33 42 -89 -10 159 -50 -21 -66 8 -28 -23 -22 65 10 -39 22 109 -99 -172 -47 111 -34 -1 39 -37 -105 -53 -2 -110
4292 -110 91 -48 -66 141 47 13 9 -61 -29 28 -73 33 -18 36 -99 -9 -84 -52 85 -3 58 47 61 -7 -79 -78 88
4319 88 -5 -17 1 -49 62 -18 4 125 25 75 -80 -35 63 6 141 -52 -55 20 53 184 -124 5 -112 117 43
4344 43 -50 110 100 33 -52 95 -40 46 -67 21 12 55 34 -90 6 23 122 -60 44 60 -27 21 -99 119 -19 26
4370 26 8 17 106 -58 -34 -36 35 -48 30 98 -135 31 -96 15 -87 94 -39 13 92 0 -97 -13 -158 -36 97 -36
4396 -36 -71 49 146 -60 42 -46 -85 -79 28 -174 40 99 117 -21 104 31 -17 12 -56 25 29 -55 -115 113 -6 96
4422 96 87 72 125 -35 54 -101 63 1 -58 -60 -135 29 114 89 -13 74 8 57 42 -1 -53 9 -35 -196 -114 55 -119
4449 -119 -6 -27 20 -78 38 -88 10 6 -50 6 -41 37 -73 60 86 -23 129 -35 -26 -46 -117 -27 100 -79 74
4474 74 -18 -42 120 -6 17 -137 -32 -63 20 -44 93 -40 11 13 -33 -1 95 -102 14 60 -24 45 84 0 -14 -71 88
4501 88 49 15 6 122 50 -48 -133 -93 -125 8 -98 -19 -231 1 44 6 -8 22 -18 -152 -7 -38 127 -38 -18 -204
4527 -204 137 -33 -164 -20 69 -48 27 -141 -30 -46 -42 74 -91 11 74 -6 -4 3 -20 -14 22 54 174 152 24 -1
4553 -1 57 71 -65 -75 -71 0 -49 83 -91 -60 18 15 -4 -62 55 53 -128 134 -37 -85 -164 -52 -103 -49 32 39 75 40 88
4582 88 16 -121 -66 -66 -32 5 -115 65 -62 8 89 16 -66 -26 29 -196 -24 -71 -112 -3 -70 33 59 31 -111 61
4608 61 2 -14 12 48 -46 -5 -55 44 91 -14 -14 59 -58 51 106 20 64 41 70 -76 -63 37 73 17 -98 93 -71
4635 -71 -85 -21 0 58 102 -27 104 -36 -9 -40 -144 -26 59 15 7 -65 70 -57 -80 142 -3 102 -71 -67 104
4660 104 38 -6 -66 -57 56 -34 5 -13 26 -46 53 -58 -41 -20 84 58 33 164 -34 117 -30 -135 -51 69 -173
4685 -173 13 -56 -64 25 3 30 4 -5 -127 -1 -103 24 51 0 139 41 72 84 94 -24 -57 56 27 -41 -5 -46 73
4712 73 -123 -24 -7 -26 62 -8 22 52 51 -68 -96 -105 -58 21 -3 18 33 39 30 -72 19 -97 -1 60 -46 81 -87 90
4740 90 83 9 -54 -15 126 -63 -134 -61 15 -127 -88 -25 -65 80 49 70 18 44 115 17 31 -26 52 56 -18 -92 41 -3 21
4769 21 65 51 8 62 19 30 -31 -29 101 83 103 -46 -84 -70 164 -28 -15 -89 -41 -5 -152 71 -50 40 -121 -287
4795 -287 -22 -137 -46 94 -112 -74 -4 -32 86 103 8 23 152 23 3 33 -72 -4 14 -108 11 23 -115 67
4819 67 -141 48 67 47 13 99 -134 122 -146 86 31 -79 -99 114 49 5 52 127 14 6 11 62 -121 -24 -31 6 161
4846 161 -55 -38 -2 -14 -37 148 25 68 110 18 -14 -23 68 -13 71 -137 -99 42 -61 88 93 -78 29 28 29 144 -42
4873 -42 -98 -9 -37 -30 97 116 -29 -19 24 1 -145 -57 113 -6 -63 18 124 39 -46 59 66 70 -189 -139 -68 -37 65
4900 65 -8 -37 32 77 -19 -35 80 80 81 112 -87 77 -76 -20 -18 -99 31 25 42 -218 78 50 55 -35 -54 165 -1 32
4928 32 -132 18 -26 110 -22 20 -182 6 17 7 47 10 23 17 -24 52 128 1 42 12 4 -77 -3 -200 134 165 -33
4955 -33 147 59 -128 -47 -19 30 -51 25 -14 76 -103 -51 -3 -21 105 -41 49 -43 145 109 17 -32 75 63 33 1 -14
4982 -14 -5 5 54 -22 -29 -71 -17 26 76 0 -46 -21 -1 1 42 -39 -26 12 -67 -142 -12 -106 170 1 -2 2 -5 -68 -123 34 -122
5013 -122 54 75 52 93 -17 92 -129 -104 -14 -105 -2 7 11 -40 -19 -27 73 -25 27 72 -58 -110 -38 82 28 101 -20
5040 -20 49 -146 43 120 -36 6 -4 96 -87 -66 -5 -30 7 184 -69 -42 98 34 -60 0 -11 30 19 28 59 15 108
5067 108 59 -68 0 111 92 -10 -57 -28 105 33 145 40 60 135 -5 -67 -16 43 53 -31 -88 40 -31 79 34
5092 34 129 -11 -28 56 -38 115 115 102 93 49 3 28 -21 -78 124 -37 97 -15 -5 -52 -174 154 -94 -142 -53 59
5118 59 120 -135 -13 41 -7 35 41 57 48 95 54 78 -36 -14 -190 -62 -72 -38 33 -1 -83 -34 -8 17 71 -21 -125 -94
5146 -94 102 80 -60 -5 -106 -28 45 -144 -180 -30 150 149 35 -86 48 -49 -117 14 45 50 -2 67 5 47 30 -1
5172 -1 11 -135 64 130 -12 28 38 -101 88 -91 25 5 -91 -211 14 -88 -115 66 86 -3 -76 12 33 81 -9
5197 -9 103 -123 -97 -110 43 98 16 92 -122 -63 -1 29 -25 47 -53 35 -11 -33 -41 81 115 135 -98 117 61 43 -9
5224 -9 50 2 -72 39 -23 14 -103 72 11 63 -31 -41 37 -116 70 54 46 106 -33 -52 -69 59 -123 0 43 154
5250 154 159 -131 68 -88 -208 -39 -42 33 80 -117 -59 71 -24 -2 -110 145 63 -30 117 36 46 50 117 41 22 20 -80
5277 -80 23 -148 187 -80 49 35 58 3 -49 -131 -40 3 3 15 69 121 1 -18 -17 -3 -13 -113 -9 -31 38 51 -15
5304 -15 99 -11 -116 -59 -149 107 69 -73 63 8 -45 30 58 47 -31 -59 3 -54 -65 70 94 129 39 -25 -55 -61 20
5331 20 100 20 -41 82 21 106 85 38 -23 6 -152 82 43 -27 128 -80 37 -57 49 6 -9 -125 153 -25 44
5356 44 -189 -84 -81 -129 -16 -53 -3 -60 43 -28 133 119 32 36 -65 6 146 116 113 41 -6 33 12 9 -102 -50 118 -100
5384 -100 -81 -111 -35 -45 24 -86 5 21 39 78 -151 -48 82 -52 -48 -48 2 -80 130 50 56 78 19 -66 63 51 -29 171
5412 171 7 160 175 -5 -43 38 39 -40 23 100 11 153 138 -117 160 111 23 -41 -46 46 41 -189 40 -16 135 -6
5438 -6 -231 -10 87 -41 -55 5 76 88 -59 -15 45 79 -180 -48 125 38 -27 -85 -80 92 67 38 68 -9 -57 -43 38
5465 38 -2 125 20 27 15 14 -17 -155 67 -95 50 -82 -23 104 -6 -112 -73 60 -60 55 -6 -5 48 -22 -37
5490 -37 51 26 -27 102 95 -56 -28 54 -126 -244 -414 216 -108 52 90 -134 -24 -114 100 6 115 -113 -31 -29 -10
5515 -10 93 -53 82 -26 48 -50 59 44 7 72 -107 -26 84 8 -71 -17 9 -61 -40 -79 -74 218 -84 24 66 -39
5541 -39 103 -18 43 -112 37 8 -7 20 18 174 19 47 -101 -79 32 61 28 19 42 9 110 -85 5 -35 -35 -79 9
5568 9 -36 0 92 -155 54 28 37 -30 -8 30 -22 18 -31 -30 67 120 -25 20 8 -10 -142 5 69 18 7 -31 -168 41
5596 41 13 -13 -3 38 151 -13 -54 0 14 21 -88 -57 26 -29 -14 104 25 2 -15 -56 11 20 -83 5 -41 -45 -103 -22 103
5625 103 16 57 -6 141 76 129 -95 77 -66 -18 44 114 -58 -23 -95 -130 -346 20 38 322 -237 160 -52 -131
5649 -131 30 -148 -40 85 -219 117 -70 -50 -51 -108 -107 31 -404 -382 184 -19 -64 -180 -160 90 -207 39 20
5672 20 -194 56 -59 -117 128 -412 26 216 105 -255 -79 173 -212 95 -134 189 -8 165 -328 -53 81
5693 81 -80 -11 -225 -164 -15 -125 -233 -127 9 -72 -250 -81 -39 166 335 -245 -48 -118 208 -96 95 -136
5715 -136 -361 -25 47 62 96 34 -156 138 138 -84 -79 51 59 15 102 40 36 27 46 59 3 69 17 -25 110 62 -50 -54 -16
5744 -16 15 0 20 179 84 54 52 86 -1 -152 43 36 18 -4 -37 61 -27 34 -121 120 26 -37 -49 0 -9 100 56 98 103
5773 103 -74 9 122 -5 -17 -193 67 63 92 42 -2 -66 21 -64 -48 -76 -8 -46 -48 -2 8 -7 51 -26 -32 -3 -33 -53 -77
5802 -77 -44 -21 -100 38 -87 -154 109 190 -69 173 -252 -311 -303 -32 245 -125 65 29 166 -200 141 -88 57
5825 57 -76 -54 61 -24 65 -46 52 18 55 -77 25 -41 -71 -43 -96 -49 51 146 30 20 -41 -8 8 -109 -102 29
5851 29 59 98 34 112 -57 16 93 -21 31 -13 75 78 239 -39 -45 71 26 3 -10 -26 -60 42 159 -41 -63 28 11
5878 11 -143 -109 -68 103 5 6 -31 0 -63 98 22 54 -29 -29 12 -22 -34 -23 38 -16 48 36 86 32 -40 53 -3 -3 -32 182
5908 182 -99 68 105 -7 -58 -36 -77 -39 15 -131 -62 -33 -111 -31 121 -68 -70 9 -10 -85 94 -36 46 -49 80 52
5934 52 -42 51 101 84 111 98 114 48 -17 44 58 -129 66 108 -15 70 -17 -132 -38 -85 -11 18 134 33 -49 -1 -6 82
5962 82 145 -78 57 23 42 131 -41 -44 32 -72 27 23 52 81 10 5 -35 -155 -51 2 -24 -44 -7 96 36 92 44 -106
5990 -106 13 181 -2 54 -22 -28 -59 34 -106 54 101 78 23 58 59 56 -77 -9 30 133 133 -179 -29 -48 25 -38 119
6017 119 38 -20 47 63 79 99 -4 88 -38 64 -9 102 -31 32 59 122 -32 -55 -71 -1 -61 -78 -71 -100 -42 -6 6
6044 6 46 -28 71 -65 12 124 40 -18 -48 43 -108 187 -10 -61 235 0 -11 97 77 84 -114 -35 -15 83 55 -4 138
6071 138 -213 42 43 64 81 -147 9 39 -156 20 4 112 -50 134 95 182 13 -25 73 41 -30 -55 24 -88 3
6096 3 -12 76 66 63 64 35 97 88 -19 46 -49 107 -50 -158 -8 56 52 6 -56 -57 -26 -99 67 51 -63 221 -90 -84 -19
6125 -19 84 -20 -52 24 118 -1 -25 -60 63 144 45 -56 -86 0 29 -51 -32 27 48 48 -150 -115 -59 -11 -107 -8 -91 -54
6153 -54 -11 32 58 75 -72 88 23 27 -10 57 -81 -49 -39 18 -19 0 46 79 -79 41 -114 91 -32 46 9 49 175
6180 175 -51 -73 -13 24 41 -14 36 -138 -3 -18 -125 63 57 -27 128 56 37 -7 101 -13 30 83 -50 82 133
6205 133 -86 -27 36 74 -45 45 51 -34 20 82 -22 10 -58 104 49 47 123 62 53 -10 99 -97 -38 23 -8 -64 -38 -14
6233 -14 -20 142 51 38 -59 -50 28 -67 0 130 43 130 53 55 142 87 131 -92 -70 81 14 -49 -13 -47 72 31 119 6 22
6262 22 55 -28 15 1 58 30 90 19 70 18 138 29 96 175 93 240 -32 -23 12 133 37 -100 38 84 162 45 35
6289 35 0 93 -113 101 93 -62 -20 -7 -39 60 27 25 82 68 -46 42 20 95 -140 -60 68 66 -4 -103 -17 37 -61 79
6317 79 -9 60 -3 -21 70 -117 79 -18 -46 136 -106 39 53 -121 -21 -47 -100 32 68 -111 -90 -116 -74 132 -120
6342 -120 -30 116 15 -40 -17 65 13 174 67 29 35 24 -31 35 12 7 10 -82 -78 83 -103 -9 -165 58 -91 -88 38
6369 38 -7 -22 14 -7 -3 -137 -83 -108 111 76 -167 -89 -68 23 -51 57 35 47 8 77 -85 38 77 -35 43 27 -131
6396 -131 -56 61 108 149 -24 12 -87 56 69 13 100 93 82 -22 67 -99 11 -7 -177 -145 -22 -245 44 15 122
6421 122 14 -40 184 -96 -165 -42 -38 -35 17 8 23 193 -9 -36 -135 -1 116 89 10 92 57 -82 57 29 -38 -51
6447 -51 -22 -4 -42 38 47 -162 121 36 21 59 20 96 -111 -13 -28 -19 -29 -106 127 41 -17 79 -86 -106 99 -42 -148
6474 -148 -23 -118 28 12 31 75 -8 -177 -32 27 -91 76 -50 85 18 -41 36 58 119 -112 115 172 15 88
6498 88 -45 56 22 16 -24 -33 -77 22 -51 10 34 -62 52 -73 46 55 17 -8 -176 29 -24 -35 -14 98 -175 53 -5
6525 -5 113 -1 -31 166 -20 37 133 64 -16 -7 31 139 48 34 -71 -42 95 6 91 -16 -142 13 45 -33 -16 18
6551 18 -83 -66 -38 88 57 -10 6 97 0 -145 139 -4 -74 -76 81 -49 -98 -28 -46 15 -101 -17 31 -135 1 39
6577 39 -79 77 -116 98 5 -291 128 -11 24 -76 -48 -110 41 -59 -14 -29 -41 1 -87 -133 121 -82 -71 38
6601 38 -128 119 -31 -54 9 -29 -18 167 -51 38 -49 -24 -109 -7 84 142 -63 46 198 -23 -85 28 -5 -69 65
6626 65 104 -102 -81 27 -2 176 -28 59 -18 108 -51 29 7 45 -64 -83 1 48 -48 -19 91 -3 25 39 47 -9 -162
6653 -162 -108 -8 -50 165 -105 -6 -14 3 62 -32 -20 149 -63 112 27 -30 7 55 -37 56 14 130 55 -31 75 -10
6679 -10 -71 53 19 -66 64 13 20 -48 31 -12 -68 -64 106 0 -13 81 -70 -12 44 11 -83 -88 89 21 15 19 -2 152 112
6708 112 -11 -98 91 62 15 1 -31 52 -73 59 4 -20 -129 49 -12 14 -30 -2 52 -49 48 -36 93 69 13 -12
6734 -12 93 -26 57 -14 -6 61 -47 -16 15 126 68 0 153 -25 -15 23 88 3 40 18 69 9 -123 84 -54 92
6760 92 3 -3 145 23 2 75 87 -3 120 -47 -79 -93 4 52 -49 -11 -39 -20 -43 -33 -123 -118 -55 -50 -15 71 141 58 16
6789 16 -112 -74 4 -104 51 15 -19 -92 56 -54 -75 -7 124 9 175 -28 -108 -7 88 -103 -18 -62 51 -58
6813 -58 2 36 -24 -4 -28 86 -93 33 -15 -12 -104 194 129 -24 -39 96 -109 -112 61 -144 101 29 46 62 32 26 -52
6840 -52 -12 -52 -110 -106 -129 -30 -42 5 -38 -28 67 -37 -72 91 -8 70 175 18 -9 81 -28 -89 70 152 97 30 -4 -176
6868 -176 78 -9 55 -166 -84 5 -50 -47 4 63 -47 -71 -29 75 49 -47 -23 120 -107 87 22 -13 -23 -110 -18 66 -70
6895 -70 57 -81 34 14 -122 -150 -7 27 16 120 -13 1 2 -15 5 -92 -99 -39 -7 111 20 -10 38 -85 -16 -88 -1
6922 -1 -29 -33 -14 -73 116 31 51 -78 -41 -29 -86 47 -34 70 242 -36 14 108 21 -30 -60 -18 -24 83 117 -13 -61 66
6950 66 -138 -51 116 -7 86 66 58 -104 -87 -102 51 -28 31 13 -31 52 79 -66 -52 39 80 118 93 37 148 -69 28
6977 28 24 -13 -82 9 40 18 -42 -97 22 27 -67 10 -96 -15 -41 10 -79 -26 -63 6 -14 6 -21 -17 17 48 -20 3 -97 -198
7007 -198 -29 22 -58 -90 101 88 131 -29 55 12 -2 -108 -50 13 21 36 117 -12 -4 6 40 56 27 86 46 -40 -131 -24
7035 -24 39 -19 26 19 -24 -7 -61 26 18 -24 28 133 52 -28 -67 -20 54 -40 77 55 194 89 28 -93 47 74 23 100
7063 100 59 200 2 -25 -52 114 3 14 49 -19 -106 35 -42 3 14 -25 40 40 160 -179 84 136 14 21 22 -107
7089 -107 -35 24 28 -15 -29 -79 91 18 58 -77 -14 81 27 -14 -10 -42 116 -74 -40 82 -58 95 21 20 29 -52 -84 48
7117 48 -96 -98 -48 -71 15 -60 -5 -22 -13 -82 151 40 -4 151 -12 -48 57 -52 -47 -43 14 3 22 -57 -41 68 -11 34
7145 34 -41 77 55 46 -81 55 -40 86 -87 -110 -54 41 55 -104 -39 1 114 39 -56 -36 140 -106 -149 19 -31 125
7171 125 -33 -23 43 55 33 -81 44 6 -45 -157 79 -12 218 -60 -74 46 6 61 -62 -44 -46 -17 -10 -100 89 -69
7197 -69 -37 25 -66 12 -21 -19 33 -131 -48 77 -60 45 27 -27 98 82 -32 15 115 68 168 55 -81 117 -62
7222 -62 21 93 72 -39 117 -39 32 -143 22 30 -84 -54 19 -36 1 -5 -108 55 101 -42 -66 -72 39 8 -61 79
7248 79 -31 -97 113 -108 105 106 -38 54 -33 14 -24 43 -71 -45 -61 -112 -51 -78 83 173 -1 4 74 -8 9 20 -111
7275 -111 25 57 -23 86 -83 -7 39 8 -122 -98 -50 -53 82 79 162 -65 35 128 53 140 -111 -33 -9 15 57 72 112
7302 112 -107 93 5 48 -64 36 14 -101 77 -25 -9 -85 140 -132 51 0 154 -145 -36 -6 42 64 -28
7325 -28 15 65 73 -23 26 -88 25 34 36 -7 -56 13 -75 -2 -164 -30 -70 -3 2 27 55 36 -41 -31 -70 197 34 5 111
7354 111 17 35 -79 50 3 46 107 16 125 -39 -11 -51 -68 14 -63 -146 -60 19 15 -64 -2 83 53 -46 -121 -56 -20 51
7382 51 102 -50 79 164 -4 -118 -50 76 -36 100 -74 -7 -56 -2 21 36 -71 -31 -17 18 -22 -60 86 -94 33
7407 33 -80 82 34 -91 76 -67 81 -133 -51 -70 56 30 -22 66 -35 7 -58 63 48 117 -15 11 -16 -17 -39
7432 -39 -32 -89 5 38 74 73 -34 28 -116 -2 -18 -164 -130 12 60 -9 -72 -188 7 69 37 -131 -55 103 -92 78
7458 78 -154 -8 -58 175 -3 40 -73 9 -34 93 13 19 33 4 -17 -28 -101 -37 11 53 60 23 -47 -102 -117 7 -31 -43
7486 -43 42 -26 96 3 5 -25 -63 -92 -90 3 32 200 220 50 -3 -44 184 -56 8 194 19 21 -28 59 107 -36 -113 -45
7514 -45 2 165 -1 135 59 -13 56 -177 24 83 15 -51 156 -18 182 -103 -29 -190 54 141 23 -137 -83 136
7538 136 -19 74 -56 -2 57 110 81 85 -6 56 55 18 -8 60 4 51 -19 10 23 30 29 128 -57 -38 39 -197 6 50 47 -50
7568 -50 -53 -45 137 55 -93 -141 1 -95 -71 -21 182 -2 127 11 10 86 36 28 -54 -83 107 -100 93 145 201 52 20
7595 20 -182 142 3 13 -42 28 -22 41 148 -41 31 -110 -58 -32 -83 37 20 -36 3 -33 25 7 76 -48 77 -75
7621 -75 -27 -82 19 -73 -116 70 1 2 -171 -165 102 73 -48 -74 -109 22 -23 6 35 73 -52 37 45 -87 -22 -39 -41 -67
7649 -67 52 63 -9 -20 34 -25 -105 -58 -102 -25 11 36 -50 78 -86 103 -48 11 -72 -1 101 52 169 -93 -30 -79
7675 -79 -83 -74 -63 -38 -54 130 29 62 -63 -20 48 9 105 17 2 55 33 102 71 -90 -82 -53 -96 -151 12 -63 -74 63 13
7704 13 -27 153 48 -12 9 -71 95 76 30 53 -131 23 16 75 -132 42 -46 45 -76 17 53 51 -3 -55 -48 -48 7 -82
7732 -82 -3 -191 -55 -62 -96 59 34 42 -47 -69 68 -50 -115 -24 -26 32 -7 -29 -26 14 -10 25 -8 144 -111 -121 70 -73
7760 -73 62 -78 36 78 18 108 10 -95 80 23 68 -32 -41 -41 -28 -22 -103 32 80 -10 -9 64 73 84 -104 -62 121 -26
7788 -26 -128 -22 121 -45 -5 13 -33 56 29 14 -67 -133 0 24 61 2 57 -55 -51 -15 -40 -57 6 3 68 27 0 39
7816 39 -61 -60 126 -24 -37 -73 78 -42 76 51 41 100 6 64 -3 -113 17 18 -17 -110 -58 -24 -5 203 -39 60
7842 60 6 -27 -15 64 -38 -60 -145 29 -23 -56 18 11 -50 134 74 -50 106 -21 -28 1 -45 31 16 -21 -19 80 105 17 -46
7871 -46 -78 33 -60 102 124 52 -61 -145 -78 -72 -96 24 -144 -10 -57 148 92 90 -77 -22 20 23 -8 -42 -1 33 126 -15
7899 -15 20 -1 -108 14 -20 9 4 -5 41 66 75 -5 34 67 16 -36 -40 -32 -64 12 -71 42 103 40 60 -118 29 11 -77 67
7929 67 50 -99 58 -81 19 68 5 -61 37 167 41 33 76 80 129 -58 4 50 -23 -70 -68 102 -10 100 24 -31 46
7956 46 13 140 78 -25 118 -83 50 76 -12 75 -49 114 -31 5 -6 -14 22 53 -97 71 84 77 -19 51 -114 -64
7982 -64 -44 60 55 139 -67 11 67 99 112 -11 47 149 -24 -98 -26 11 -47 10 36 -88 116 -62 17 -11 -72 -6 -17
8009 -17 -1 -27 -57 -12 -7 18 122 -78 127 -74 -44 121 -42 83 81 -1 13 3 47 72 135 -71 -60 -150 -31 -6 -69
8036 -69 73 5 91 65 -12 103 -150 30 -13 -48 59 57 58 33 37 72 -18 -128 2 1 -25 -11 26 22 29 -85 122 28 122
8065 122 187 -121 0 -29 -33 -25 12 33 143 -133 45 -30 -52 -30 -7 24 -134 4 69 46 91 -72 -64 70 -114 44
8091 44 19 -51 83 101 -17 18 -20 -39 61 32 57 -22 26 38 40 43 -66 71 31 61 -33 56 27 158 57 -72 -25
8118 -25 4 29 -14 -42 46 5 -21 -17 -42 47 23 16 59 46 124 -47 -72 132 -12 -72 -91 -49 -45 79 75 -21 -10 98 25 -81
8148 -81 -40 161 23 13 28 -169 43 58 52 29 -19 -42 21 64 54 19 4 -195 -57 45 38 -44 0 90 7 -22 38 -33
8176 -33 43 103 -19 -76 8 -13 42 86 22 33 -44 -8 53 16 9
8191I
$$ Imaginary data points
##PAGE= N=2
##DATA TABLE= (X++(I..I)), XYDATA
0 0 0 0 0 0 0 0 0 0 0 1 -8 8 -8 16 -16 17 -24 32 -40 49 -61 73 -87 102 -121 143 -167 196 -228 262 -299 344
32 344 -393 446 -505 571 -644 725 -813 909 -1014 1130 -1257 1394 -1544 1708 -1889 2085
48 2085 -2298 2532 -2786 3069 -3380 3725 -4105 4530 -5007 5547 -6164 6872 -7701 8682
62 8682 -9863 11321 -13161 15569 -18856 23589 -31009 72262 -482962 174240 162510 -230836
74 -230836 205072 -248576 252966 -38141 -298307 413795 -203937 -61043 180445 -256166
84 -256166 298572 -179935 -91550 299470 -321097 175112 13919 -184233 306717 -310023
94 -310023 82960 217239 -318321 192382 -61253 -19088 130943 -268957 275141 -72748
104 -72748 -205712 308702 -195564 44049 47183 -155683 256202 -213840 15000 191384
114 191384 -273953 202599 -46985 -109554 221827 -237443 109323 75743 -169567 164863
124 164863 -137704 74800 66341 -212123 240577 -103452 -92484 197734 -171104 108397
134 108397 -29032 -95999 213626 -195388 51015 109786 -175534 143515 -64704 -6741
144 -6741 91413 -162022 149289 -36389 -83135 150971 -149714 83645 28907 -128346 164416
155 164416 -110593 -2415 96875 -128809 114832 -61453 -40213 133432 -146147 71210
165 71210 27623 -94754 105964 -89140 48430 28204 -120941 141855 -69164 -37755 100464
176 100464 -109275 73292 -17706 -52898 111544 -115108 39868 50493 -95205 86332
186 86332 -54580 5164 50426 -91017 86310 -33228 -38833 81458 -82796 53431 2418
197 2418 -68321 96952 -65291 3231 47734 -68636 63832 -37464 -7858 61831 -81400
208 -81400 47133 9470 -40801 52386 -53118 36206 11754 -61985 78207 -39789 -14480
219 -14480 46838 -50180 46547 -22513 -23168 62001 -55952 18706 18967 -35229 40550 -38391 18592
232 18592 25719 -58560 47145 -9201 -16439 27327 -37327 37318 -11628 -31991 54608 -34730
244 -34730 -4371 21966 -22844 26965 -28352 3602 30468 -42666 22239 3105 -15172 16902
256 16902 -25201 24260 288 -32384 34911 -13013 -7495 13085 -17715 22947 -16949 -8098
268 -8098 29669 -25273 3463 7187 -6530 11187 -19473 12513 9704 -24404 18060 -2040 -5518
281 -5518 7131 -13383 18679 -6005 -14048 20021 -8139 -1313 2787 -3266 11352 -12883 916
294 916 14574 -12631 1225 2853 2349 1859 -11870 12973 1991 -13000 9047 2415 -3128 -2178
308 -2178 -328 9003 -6410 -5537 10257 -1866 -4447 622 3938 444 -7667 3997 5322 -5698
322 -5698 -3168 4562 2145 -4945 -2282 5559 549 -7779 2566 6379 -6161 -4062 6283 414
336 414 -4031 -2256 4384 1996 -8891 3953 4279 -5532 -425 933 3816 -3422 -5239 9053 -2013
351 -2013 -5591 4506 -1035 2057 -4632 -460 9482 -9580 -51 6693 -3780 1203 -3798 4732
365 4732 2927 -10652 8523 1837 -6864 4697 -2596 5430 -3188 -5414 12157 -7452 -1375 6062
379 6062 -5034 5478 -5575 876 8858 -11479 5102 2919 -4882 5763 -8116 7343 1745
392 1745 -11632 11874 -3263 -3675 4319 -5552 8966 -6946 -4117 13207 -11493 1957 4084
405 4084 -5396 6867 -9959 5260 5747 -13577 10055 -1814 -3626 5617 -9195 9657 -2605
418 -2605 -8812 12913 -8081 860 2270 -6117 11252 -11260 655 11323 -13554 6020 879
431 879 -3022 5778 -10774 10223 315 -11683 13874 -6969 -145 4812 -8791 11561 -7566
444 -7566 -2699 11461 -11582 6479 -619 -5186 11268 -11955 4815 6203 -11188 9592 -5454
457 -5454 1959 5136 -12888 13727 -3144 -9038 12605 -7592 2532 -101 -4401 11814 -12959
470 -12959 3467 9493 -13953 9175 -1997 -2763 6743 -10637 9278 -1520 -8178 11939 -9417
483 -9417 3188 3648 -10035 11972 -7450 -1922 8849 -10623 7910 -3467 -3577 10557 -12975
496 -12975 6171 4336 -10441 9115 -5582 2205 2776 -10226 13435 -6831 -5003 12392 -10470
509 -10470 4194 798 -4749 8722 -9949 5078 4100 -10518 10764 -5814 -938 7782 -10922
522 -10922 8622 -1092 -5672 8224 -7877 5800 -420 -7457 12543 -8475 -1338 8031 -7891
535 -7891 5569 -4175 973 7010 -12677 8960 2197 -9380 8620 -4504 1974 1064 -6637 10528
549 10528 -7131 -1586 8325 -9475 6531 -1662 -4457 9174 -8378 2775 2673 -5382 6812
562 6812 -7353 2988 5356 -11271 8321 -464 -4832 5327 -5489 6038 -2648 -5637 10661
575 10661 -7581 -396 5013 -5589 5392 -4874 486 6091 -9047 5771 -36 -3798 5931
588 5931 -7142 4687 2062 -7621 7328 -2780 -442 2355 -5210 7774 -4812 -3263 8886
601 8886 -6910 1521 1656 -2443 4827 -6862 3968 3494 -8037 6352 -1695 -1548 3648 -5706 6011
616 6011 -1418 -4332 6880 -4995 1882 905 -3935 6633 -5158 -476 5120 -5489 3335 -1777
630 -1777 -267 4126 -6943 4870 1462 -5790 5195 -2465 743 694 -4159 6216 -3837 -1577
644 -1577 5279 -4890 2454 -463 -1955 4580 -5415 2321 2089 -4563 4096 -2817 659 2445 -5153
659 -5153 4657 -1116 -2696 4014 -3415 2339 -414 -2830 5170 -4080 181 3084 -3495 2934 -1923
674 -1923 87 2778 -4637 3379 177 -2995 3759 -2502 1332 737 -2968 4129 -2452 -479 2614
689 2614 -3085 2486 -1297 -1019 3269 -3714 1643 979 -2545 2696 -2298 1024 1264 -3162 3162 -1065
705 -1065 -1306 2316 -2016 1719 -835 -1478 3038 -2810 549 1477 -2130 1881 -1552 393 1532 -2898
721 -2898 2286 -239 -1460 1887 -1804 1262 -168 -1880 2694 -1682 -201 1377 -1616 1491 -1185
736 -1185 -193 1989 -2461 1155 467 -1113 1328 -1388 1028 374 -1765 2063 -739 -610 1021 -1091
752 -1091 1143 -887 -566 1838 -1682 285 701 -682 1000 -1309 553 875 -1755 1289 -70 -548
768 -548 670 -979 1240 -277 -994 1478 -760 -161 366 -500 864 -784 -4 1006 -1155 593 213
785 213 -357 278 -804 749 -49 -1052 996 -225 -287 186 -224 831 -626 -216 956 -601 127 172
803 172 -42 351 -616 548 334 -720 341 109 -225 118 -302 590 -256 -613 521 14 -140 -256 65
822 65 387 -596 41 556 -304 -219 -41 315 26 -345 458 122 -438 223 102 -28 -233 219 265 -415 -200
843 -200 188 157 -161 39 340 6 -372 91 223 -95 -300 277 321 -302 55 349 -35 -356 -124 330 -46
864 -46 -478 348 2 -419 -78 175 344 -476 160 397 -360 -112 28 70 -107 -308 453 -59 -404 205 -120
885 -120 176 -151 -174 534 -272 -169 525 -137 -207 -46 239 262 -633 259 374 -497 180 74 179 -68 -225
906 -225 464 -256 -282 577 -354 -10 -4 -109 482 -306 193 145 -294 329 -274 264 230 -649 479 192 -349 189
928 189 -227 330 -144 -346 716 -270 -266 448 -190 123 -281 239 299 -726 573 -12 -469 412 -265 53
948 53 112 -437 421 -296 43 248 -442 465 -264 -213 576 -310 10 71 -243 230 -518 258 333 -748 474
969 474 10 -104 215 -308 365 -171 -227 504 -393 72 326 -268 294 -272 52 227 -443 522 -52 -122 427
990 427 -575 376 204 -509 373 -248 102 137 -184 571 -390 -133 703 -605 178 9 -125 342 -282 347
1010 347 -1 -562 577 -207 -183 315 -540 398 -129 -129 453 -611 270 50 -380 446 -382 74 440 -507
1030 -507 258 -87 164 380 -503 573 -46 -468 716 -259 55 32 -266 566 -468 12 530 -654 376
1049 376 1 -327 262 -447 284 147 -392 342 -151 112 70 -363 424 -269 -388 545 -247 122 -10 -171
1069 -171 541 -620 46 371 -482 228 -168 160 280 -472 480 43 -438 455 -192 11 1 -402 450 -382
1089 -382 -56 190 -353 227 -175 -206 396 -486 144 248 -412 286 -244 263 78 -499 558 -93 -133 338
1109 338 -219 159 -153 -180 469 -357 33 252 -175 230 -203 91 300 -383 291 -44 -108 246 -145 159 109
1130 109 -325 275 -157 -70 188 -239 130 -218 -92 397 -266 73 14 -251 275 -219 70 228 -287 250 -146
1151 -146 -43 221 -251 310 -10 -106 303 -9 -19 91 -247 330 -116 -103 312 -257 212 62 -168 136 -292
1172 -292 306 72 -231 293 -23 -114 190 -240 148 -275 -135 285 -204 176 -131 -348 57 -63 145 91 -319
1193 -319 204 98 -84 227 -83 294 26 -42 308 -96 52 39 -235 65 -15 -6 177 -194 61 110 -88 220
1215 220 -207 -30 93 -178 165 -83 -118 134 -59 105 -14 -136 172 -146 140 -31 -52 249 -139 13 227
1236 227 -93 68 31 -56 -17 -96 115 -50 -154 134 -31 -66 126 -136 137 -168 -64 106 -65 13 -24 -54 -15
1259 -15 -156 113 151 -124 39 -20 1 164 -142 58 21 -124 -53 -75 -195 40 45 116 -36 -13 74 -68 -42 5 44
1284 44 -92 -71 171 40 -9 37 65 -100 -47 14 82 83 -74 115 -116 -32 -117 -54 35 40 -48 -65 104 1 -26 36 -26
1311 -26 -113 69 -30 -51 38 17 -57 -16 30 47 126 28 94 -103 -5 -24 -78 -2 143 93 -65 15 -90 45 -7 -23 -97
1338 -97 33 37 -88 -23 149 -36 -25 30 48 -53 -102 -147 8 -6 -34 -5 73 -104 -93 91 21 -11 61 54 -18 -83 -3
1365 -3 5 -14 -9 -25 19 -41 117 -10 35 -18 -31 23 -43 -39 -78 -36 54 -83 52 9 -163 -108 63 -21 -9 -59 -75 47 -94
1394 -94 111 -97 -50 91 -25 94 6 5 9 -10 71 30 -97 20 -23 34 -53 -180 32 -80 71 -176 -150 39 16
1419 16 -29 181 -111 11 91 -54 106 -41 -41 71 -36 126 -34 -201 -61 -114 129 -63 -103 235 -110 108
1441 108 102 -124 107 -128 25 129 -268 23 -25 47 114 -159 -23 22 -218 95 103 -23 124 -95 186 49 -18
1464 -18 260 -101 -11 -15 -72 64 -179 -33 100 -203 291 -16 107 86 -130 135 126 -214 200 -114 48 61 -25
1487 -25 181 17 9 178 -56 13 52 -232 150 -97 -29 115 -95 157 22 -116 154 -168 70 -124 -120 176 -214
1510 -214 96 36 -206 116 -206 -109 134 -255 176 -11 -95 287 -215 206 -15 -221 147 -194 92 73 -313
1531 -313 308 -30 -101 204 -174 162 -77 -152 262 -218 58 75 -268 261 -202 77 73 -290 209 47 -75 277
1553 277 -252 59 -115 -135 294 -85 -7 79 -147 164 -125 37 284 -396 120 147 -240 297 -134 119 203 -224
1575 -224 303 -295 139 299 -246 157 -84 -145 275 -296 156 28 -269 304 -302 125 159 -461 146 -99 -135
1596 -135 213 -228 292 -155 -217 329 -337 146 148 -143 406 -262 -67 243 -550 224 24 -217 279 -274 236
1617 236 -52 -234 280 -160 -55 136 -314 437 -172 -147 450 -498 -48 99 -117 358 -357 265 142 -396
1637 -396 285 -11 -158 289 -326 492 -179 -294 374 -127 38 75 -191 295 -216 -180 364 -423 305 16 -43
1658 -43 414 -381 352 138 -327 266 -113 140 48 -382 372 -278 -209 562 -307 166 28 -146 314 -415 99
1679 99 365 -267 312 -193 92 243 -395 337 12 -361 337 -305 180 18 -290 417 -222 -118 456 -284
1699 -284 58 -157 -35 290 -421 274 120 -310 210 -163 130 153 -386 346 -249 -252 299 -300 105 -32 -59
1720 -59 377 -414 132 173 -260 225 -225 61 122 -383 407 24 -286 174 -185 152 -78 -175 388 -287 -7
1741 -7 51 -230 211 -163 43 289 -403 54 45 -204 248 -201 178 182 -208 325 -21 -175 158 -90 116 -101
1763 -101 -222 337 -218 -37 138 -211 51 -140 12 286 -311 90 -43 -170 138 -129 219 -23 -271 380
1783 380 -14 136 224 -246 198 -39 34 174 -240 117 59 -171 142 -78 22 -31 -198 38 59 40 88 -144
1805 -144 174 -83 -118 124 -125 -120 -14 -177 147 -120 -69 110 -130 99 172 26 -62 -119 -132 84 -97 196 -133
1828 -133 10 0 -208 61 -178 0 86 187 -41 96 -37 -26 -49 -66 -62 -25 123 122 36 0 9 136 44 -188 88
1853 88 65 -26 -151 23 113 13 -208 89 -182 -169 -14 14 80 21 122 7 15 124 75 -69 -99 -50 -98 -24 -81
1878 -81 35 112 55 -11 -4 52 80 -150 59 54 -222 -13 15 57 15 18 27 44 -62 295 -167 -81 122 -216 143 42
1904 42 18 -82 -217 158 80 -132 116 -38 -18 8 -213 50 -56 52 -19 -134 164 124 -138 160 -188 -63
1926 -63 63 -140 140 -178 -17 52 -165 179 59 -50 215 -30 114 -58 -190 107 -142 15 -34 -116 193
1947 193 -81 1 190 -81 3 -67 -27 207 -95 32 100 -249 125 118 -37 -37 -176 151 -41 -169 220 -184 -57
1970 -57 224 58 216 -168 63 72 -137 94 -2 -147 147 -145 -32 223 -90 106 -120 14 146 -225 163
1991 163 -54 -3 255 -270 26 13 62 138 -64 157 76 -153 137 -49 -98 20 -56 150 97 -83 184 -56 62
2014 62 -113 -189 161 -90 -103 163 -75 78 42 -4 83 -375 -3 -35 -273 108 -77 97 -11 -178 192 -97
2036 -97 -68 80 -190 -40 -128 -109 160 -144 10 132 -190 -7 -12 26 96 -157 33 -23 -75 12 -91 111 -99 -243
2060 -243 -19 -62 -35 60 -78 -122 -101 39 151 -123 65 -37 -119 260 -19 -20 79 41 219 -81 -55 210 -138 103
2084 103 -42 -211 142 -38 -18 25 -108 8 -98 -94 95 -177 33 -87 59 100 -215 40 61 -33 176 -153
2106 -153 37 58 -158 99 -116 -74 39 -161 116 -61 -193 -3 -64 121 -12 -117 24 -107 105 -97 -101 122
2128 122 -43 -63 185 -66 -50 -87 -229 122 69 112 -133 -107 29 -90 84 205 -157 -39 35 1 5 -26 -20 122
2152 122 -109 -99 -118 -87 89 -107 67 -9 -96 148 -12 29 38 -50 2 -38 -22 -45 -118 150 -85 96 -30 -68 48
2177 48 64 -97 -40 -77 227 28 -59 110 88 126 21 -54 117 56 -98 82 -180 -29 48 17 -72 -79 -28 -5 -142
2202 -142 105 -53 43 -66 91 29 -62 -104 6 -104 -26 27 6 84 -61 71 -30 -16 46 -6 -33 27 -104 192
2226 192 30 63 62 -116 33 25 -48 61 -28 -72 59 -33 -54 -78 46 -53 -124 34 50 70 175 6 177 23 -79
2251 -79 167 -25 -41 98 -153 60 -7 -60 33 -37 10 49 19 -111 -124 -98 -53 -122 -10 -50 20 14 -58 -36 62 29 -68
2278 -68 -36 77 148 113 129 -65 -2 9 -153 18 146 -35 -49 25 17 6 -79 129 59 -95 80 -40 64 12 51
2303 51 -12 -83 -37 67 -63 -136 55 -6 72 -57 3 -13 -49 110 -43 -127 -96 97 43 -25 -62 51 -107 119 -85
2328 -85 -164 -27 -108 -56 71 -70 -86 -83 83 -113 -58 -58 68 13 4 -71 10 85 -52 -13 60 66 93 200 -33 -25 -49 145
2356 145 73 137 -125 -2 1 -44 5 -94 -114 37 116 3 -40 17 112 -44 8 101 88 97 276 0 -60 -9 -96 12 -48
2383 -48 76 -19 14 61 46 59 -144 -135 32 -33 36 21 -85 -6 35 -78 125 -35 61 -63 -61 -34 -72 -68 -46 7 40 -20
2411 -20 50 -77 -84 44 95 -98 -89 -67 -68 44 -17 121 -83 102 34 39 37 72 40 89 -25 -36 5 -34 62 -54 150 65
2439 65 27 -72 48 -73 2 -103 46 140 -77 76 23 -11 40 -64 13 64 20 -52 -54 -98 64 -103 74 83 -102 13
2465 13 -86 -56 50 37 72 15 67 -77 69 -58 77 24 -12 40 -20 102 -12 70 -13 29 -1 -98 4 -23 9 51
2491 51 -37 -146 -34 -81 18 -61 -100 101 26 -13 32 54 -94 -35 54 -75 -123 -57 28 -15 -71 6 -16 -261 -91 59
2517 59 -76 94 -83 -39 -49 -166 66 -8 -134 -91 -58 -18 -95 -98 97 162 -134 25 -86 25 39 25 64 -95 118
2542 118 23 -183 150 15 -71 4 -103 23 -27 -19 91 -72 65 -49 -196 41 18 158 148 -141 59 71 18
2565 18 -40 -154 19 145 49 149 -78 6 131 -42 55 -94 -145 36 -60 34 43 -100 39 -16 -14 60 -47 -6 18
2590 18 -111 70 -18 72 -19 -246 121 -68 46 -10 28 92 -36 30 102 -160 142 -50 200 165 -34 145 84 -144
2614 -144 -13 25 42 50 -125 -13 -170 -170 33 -169 77 33 -30 108 -197 127 -71 -50 34 -39 -126 125 -154 140
2638 140 -30 23 298 97 -6 71 -89 42 33 -149 139 -104 164 34 21 55 -18 -34 99 -33 -1 -176 185
2661 185 -89 -13 105 -38 -137 28 -29 -52 6 56 182 -168 67 96 7 81 51 54 -27 -51 168 74 -45 -31 29 58
2687 58 177 -5 28 -136 27 8 164 -117 -144 26 6 -77 73 -131 61 44 -150 101 -10 -48 65 -20 16
2710 16 1 64 -167 -37 -125 115 -39 -79 29 70 105 3 44 29 -25 89 -147 -3 13 -44 105 69 54 97 -27
2735 -27 92 32 -135 114 56 50 59 -61 65 52 -135 -44 -75 39 20 5 63 -40 46 -84 2 35 -8 -40 64 12
2761 12 83 -67 42 26 86 43 -69 -98 -13 -85 3 71 -157 -67 -110 72 79 68 -43 29 -39 135 -12 -3 33 -29 29
2788 29 -28 28 -76 -71 -12 -41 -32 46 -32 2 27 31 121 72 97 63 85 113 69 -38 -84 40 15 19 -9 129 -46 -24 128
2817 128 -92 16 -122 40 45 6 -3 -89 71 208 76 167 -14 42 -21 15 79 -18 -35 -46 -95 89 44 69 120 -25
2843 -25 68 -9 13 16 78 -4 119 -62 7 7 -68 49 44 -56 77 91 35 -82 77 171 3 -22 -75 35 28 -7 24 155
2871 155 -98 -62 -115 103 65 41 7 0 -2 -60 13 73 136 -80 12 -6 -45 66 22 -10 148 55 -61 -58 -20 -108 117 97
2899 97 27 99 -49 3 3 -95 34 -5 -24 81 8 -160 88 0 -18 -70 53 -19 59 -61 53 13 61 -17 32 -37 -21
2926 -21 15 -29 109 -22 -21 -49 -17 16 3 17 79 82 -18 -10 -41 31 6 128 11 51 15 77 19 59 105 57 -98 -69 1
2955 1 136 -104 132 84 -134 -3 -2 79 -64 -56 -57 5 -155 26 15 -3 -46 -138 37 -30 47 136 90 -62 76 42 57
2982 57 52 -12 15 41 -71 12 53 57 -67 -84 21 -21 -59 -40 -104 -90 -63 -68 108 20 26 3 48 27 93 -27 -1 -36 23 21
3012 21 -20 71 141 -12 18 -23 -37 90 8 31 -54 -132 53 164 2 79 -8 -54 -106 169 38 -104 27 -241 140
3037 140 -39 -30 -25 -21 14 -26 -48 16 -76 -67 125 -169 -176 -1 -86 2 -103 6 22 -4 216 -52 10 77 -16 76 -78 -131
3065 -131 34 -112 -10 66 14 -137 69 64 8 -22 11 -21 15 -118 -56 -1 47 81 -109 93 69 -154 -46 8 -118
3090 -118 -96 -6 -2 58 -57 -33 117 53 99 -110 122 111 -148 -175 69 -84 -34 -53 -22 47 -34 13 -38 -25 -22 -2 -58
3117 -58 -111 110 37 -32 -112 17 82 35 -22 20 116 -1 -78 -28 -100 61 -80 57 110 -64 56 -112 22 33 35 41
3143 41 -35 31 90 -112 -58 48 -76 73 58 111 -152 -53 64 155 -55 -64 -16 -104 90 -16 -25 99 120 25 19 -41 120
3170 120 -26 -52 -41 -35 155 -64 74 0 -10 44 44 -18 -97 87 91 26 92 -14 -48 78 -85 42 -119 12 133
3195 133 -90 194 2 -82 18 -109 1 107 -12 -48 55 19 -34 37 29 60 2 128 -12 -94 89 -79 -38 -67
3219 -67 -22 -75 14 35 18 -100 143 92 100 -25 -57 97 78 47 -44 84 158 31 75 80 57 34 -1 -148 -31 31 33 -8
3247 -8 8 -40 -140 101 -80 56 -83 -174 -159 -1 -35 -79 -119 70 -20 -34 -24 -195 -96 115 51 -2 88 98 -47 -6
3273 -6 67 36 26 -85 -75 -42 51 -142 138 -57 -35 71 -36 -18 -6 122 16 -37 63 -80 -120 -17 62 6 25
3298 25 18 195 32 50 -21 15 -63 -55 5 22 -28 139 -125 33 131 30 -44 97 -133 -41 150 12 -2 32 96 139
3324 139 -36 -148 -97 48 -22 -150 119 101 17 -43 65 6 118 -31 -78 -40 33 -54 34 83 -19 70 -187 64
3348 64 -24 -52 77 74 59 -86 -119 27 -31 9 -80 23 28 72 112 11 14 -115 110 -99 27 97 -49 38 118 96 -44
3375 -44 69 -83 -68 20 -155 -15 -52 -73 35 103 -95 -10 29 25 -78 -26 38 61 24 -13 38 111 164 57 -69 -44
3401 -44 -139 -39 107 14 29 -18 80 -46 -3 21 33 -58 -58 -9 36 -15 7 -109 -33 29 -65 45 -56 -116 78 -71 -61
3428 -61 91 -54 103 -5 -98 -25 -94 30 -131 8 12 -127 17 -4 20 -9 -38 -126 37 -141 -81 -118 27 73 47
3453 47 -124 29 4 -58 -55 -98 -39 150 48 -41 91 -136 -66 68 -8 -12 22 -41 80 64 -122 -47 -2 -159 8 10
3479 10 -60 89 2 -1 -46 -84 -76 20 26 -61 -35 -47 -61 11 62 18 -139 33 33 -69 -35 12 22 -99 14 17 -59 -114 21
3508 21 0 10 -114 56 87 -24 -18 -99 -43 -46 -44 -174 19 -67 -15 62 -74 4 -25 -72 13 12 91 60 54 75 75 -44 83
3537 83 -178 70 24 28 172 49 116 -53 -170 51 -47 -29 4 -174 116 -68 -17 54 44 -98 36 -25 97 -6
3561 -6 -78 24 76 -14 58 77 -102 -55 55 113 41 55 65 -20 -116 -117 115 -100 -4 34 -84 40 25 67 64 -103 18
3588 18 56 56 71 46 16 17 -41 37 -49 -55 163 -64 64 26 -238 34 -41 26 95 38 84 -41 -76 149 -49 -37 -84 -69
3616 -69 77 -3 170 -116 37 48 79 -81 -171 -30 36 -188 -77 78 -60 46 -46 -79 56 31 66 -51 -105 -10
3640 -10 -27 44 -48 -50 22 -82 12 -5 -91 -56 88 -18 -72 78 9 -84 -151 18 4 -49 -27 -28 -46 43 -67 -45 -36 -196
3668 -196 -73 -66 86 -50 -16 -92 -77 25 9 -62 26 27 -16 93 -64 28 -45 -56 -72 -135 -19 64 45 174 -49 -42 170
3695 170 -5 42 -107 -28 -32 -44 -27 -67 67 -47 -43 113 57 -54 -34 -18 84 107 18 67 -74 75 -36 37 -19 -2
3721 -2 -10 27 -129 18 43 24 42 -5 118 -124 -21 32 -74 30 54 -43 49 115 -88 -10 -32 -15 4 -35 65 5 77
3748 77 25 -47 -5 77 -119 182 -37 1 6 36 39 116 -28 21 28 152 151 -78 101 37 -15 -41 117 59 -36 14 70 -71
3776 -71 86 -9 63 -40 -48 7 -13 -72 55 123 13 31 -45 -16 -1 49 -120 -3 2 27 62 58 -98 -46 -90 -94 27 -5
3804 -5 -115 -4 62 -129 139 98 65 65 69 59 -12 -23 -70 44 83 -46 75 -26 -177 -27 -22 -68 52 -65 -87 -89 15
3831 15 92 -84 -19 114 -1 160 47 -186 -77 -108 87 128 -38 -10 -71 41 -19 -28 96 14 -36 4 -9 -27 109
3856 109 179 9 18 -135 -10 61 -16 54 -73 -143 -28 65 -10 176 40 12 142 26 47 64 -10 3 -77 -26 69 10
3882 10 -135 148 1 59 -84 36 121 -128 -24 65 -59 -239 -53 33 27 -74 50 -101 0 88 -24 -55 -13
3905 -13 79 126 -26 -83 -33 -91 -70 -118 1 12 -71 1 -39 46 -17 26 -6 -60 -91 28 0 -45 8 -64 -118 -28 102 64
3933 64 -108 -23 -91 -27 92 -95 19 59 60 -108 -54 -16 -96 150 -91 17 -42 -5 35 -116 -114 -13 -97 -51 -11 -80
3959 -80 -123 143 73 50 -16 64 -51 -81 -42 17 1 45 -19 -8 35 -2 120 -19 -102 -115 10 47 100 44 51 -29 75 64
3987 64 -61 93 -108 -195 -13 -116 106 9 47 96 117 73 122 -55 62 24 -64 16 -18 -70 35 -76 -142 -83 21
4012 21 -97 99 48 22 -103 -115 -30 20 87 57 92 -102 -71 19 -23 18 48 92 31 -37 -174 31 15 19 -79 -42 -2 50
4040 50 6 -13 5 -37 73 76 48 33 -22 87 69 -52 78 92 -74 33 -8 157 -28 22 7 73 11 34 100 35 -131
4067 -131 -34 32 191 13 -22 -29 -15 10 117 55 48 -147 27 -6 -12 -74 -53 -52 131 49 -105 8 142 -9 -105 14
4093 14 -149 10 31 -12 -59 10 -113 -39 126 -66 -118 46 -88 7 23 -23 66 16 33 69 -77 -77 -46 -95 34 -96
4119 -96 197 -39 76 222 -90 66 -138 -74 -121 145 69 -58 -100 67 65 -9 -18 -98 102 93 -17 -102 -126 22 37
4144 37 45 -67 -162 -16 -63 58 44 -51 59 -127 68 -62 35 90 -70 -3 59 12 -45 24 24 -152 29 70 100 44
4170 44 161 -14 107 102 79 -7 47 48 -120 2 32 22 -79 81 72 67 -60 -104 -96 -26 -94 -26 118 -31 58 136 38 40
4198 40 61 56 62 45 88 80 -56 33 44 -16 25 86 33 115 64 1 -4 -100 42 -38 0 -3 -51 -73 85 -36 145 192 50 8
4228 8 -109 -81 -107 -51 112 -9 37 105 -35 11 50 -46 -77 95 -35 15 -61 -60 -25 -84 -3 -100 196 -18 -13 56 59 -5
4256 -5 -121 -101 15 -1 -40 133 -85 -5 -27 37 9 130 -12 103 2 -32 -119 -75 99 -17 24 12 128 40 19
4281 19 -42 88 10 106 -63 -14 -111 165 36 -26 -32 48 -184 86 -24 -6 74 48 41 -194 -40 -9 82 -77 53 -18
4307 -18 -78 63 -111 -11 22 -36 -13 -103 27 75 89 -21 -195 17 -121 115 -76 -134 73 -46 68 -47 26
4330 26 97 17 37 -47 -69 -163 39 -13 -76 55 -119 112 -18 -72 -150 44 63 110 -98 -93 -63 -7 -131 -8 0 110
4356 110 15 -85 -73 -36 -45 148 134 25 95 42 -2 -93 99 -50 -76 -65 101 35 89 -8 -24 75 -43 101 6 -110
4382 -110 -19 129 184 -81 -42 118 -216 5 147 -101 -77 97 -68 38 109 -27 -90 78 -20 -95 34 72 -75
4405 -75 -9 -20 88 3 -34 -97 -66 -55 39 36 -66 -39 -77 123 -19 -44 48 -57 -10 72 -44 1 41 86 75 -39 38
4432 38 -32 9 -114 15 18 -43 -24 60 58 -64 -109 -16 70 -234 -55 4 -61 29 71 130 -53 10 -61 -3 -53 -102 45 6
4460 6 -9 -43 43 9 -219 84 20 -95 -134 -1 8 -20 -121 22 -69 35 89 -63 50 -78 -39 -30 2 -56 17 79 40
4487 40 -122 -73 62 71 -38 -43 -17 -22 72 41 -107 -75 69 -7 -41 55 13 -114 -77 -67 -24 19 126 -151 -9 -62 62
4514 62 -16 97 -79 -37 -8 13 -1 -37 37 -47 29 39 -3 -24 161 -39 9 -3 -102 49 -72 -58 3 -72 -30 -111 -60
4541 -60 -5 -112 48 -7 -9 -72 -13 -51 -63 55 37 -9 2 -98 33 -73 -25 65 15 31 41 189 -60 8 -73 110
4567 110 67 -15 177 -4 -176 -25 -16 95 32 -55 28 -58 -39 2 40 -51 39 -61 -141 -49 -167 -80 -42 -85 -14 -27 -7
4594 -7 -10 1 -95 73 67 3 -20 -45 -99 -15 24 -202 68 15 8 -44 21 130 5 -48 -89 -80 32 38 -42 148 113 -27 42
4623 42 -149 -3 63 -102 -5 49 36 -30 8 57 38 -74 -71 -51 -37 -30 21 -35 106 77 -26 64 -59 -134 26 18 -19 27
4651 27 91 -37 -33 92 -99 53 -36 105 -27 8 94 70 40 -8 13 114 -91 17 -101 -80 61 -12 39 15 -73
4676 -73 -198 -9 -72 43 10 -49 49 63 -132 155 18 -38 -59 -44 -48 1 57 39 116 38 35 83 6 51 -172 -112 15
4703 15 -12 -39 -62 85 -120 -117 -17 104 31 54 35 5 -101 -7 52 78 45 25 -68 117 6 69 -94 -242 102 -11
4729 -11 102 11 -106 -46 5 41 32 -119 -155 38 -34 -27 29 -83 11 -49 32 83 -98 -80 45 -126 -48 70 52 39 -5
4756 -5 -133 -125 104 -122 -72 142 -55 17 -77 60 -18 -74 -22 -39 13 72 34 209 -77 -154 130 -96 159 -73 35
4781 35 -89 -38 47 -32 2 -20 -116 -35 4 42 22 74 -47 -4 -33 43 3 131 59 -67 7 60 106 18 3 9 -16 -44 -49
4810 -49 18 -114 -76 -77 26 -4 136 110 -7 -1 58 26 -60 -100 0 -125 103 31 -10 -67 -55 32 -58 58 0 40 -16
4837 -16 -21 66 -135 127 5 45 75 91 -12 37 139 47 -108 -39 -42 140 -1 26 49 42 -29 -51 83 -52 67 -65
4863 -65 -138 -74 216 1 -62 61 8 50 -68 -189 -96 7 -68 -3 -55 80 88 86 70 -42 26 121 73 -93 67 -2
4889 -2 -21 -78 -97 -211 12 -92 -75 60 -3 -89 48 0 26 -10 63 -61 -31 -2 12 52 124 152 -47 67 -41 72
4915 72 122 57 -31 -33 -26 50 181 -103 141 42 -68 -42 103 10 4 -8 92 50 52 69 44 -27 -112 -86 -57 39 -18 28 -31
4944 -31 -43 164 0 10 36 -58 -59 161 13 -73 22 21 31 -72 -8 22 3 -138 30 -19 11 -27 -108 -99 3 -73 -26 131
4972 131 4 -72 29 -29 45 -40 21 -28 -62 -9 -8 64 -8 51 -48 41 -66 -60 52 -3 47 16 26 -26 54 -72 -115 117
5000 117 -24 128 -61 -89 -88 4 -39 9 46 -30 -66 -8 -6 33 -13 180 33 -59 -203 -4 23 -17 -62 121 112 47 -126
5027 -126 -78 93 43 119 66 62 46 89 99 3 15 84 -90 27 -33 32 94 16 145 -52 13 -97 111 10 -133 -26
5053 -26 -64 85 -16 -76 -85 40 -200 41 15 45 -119 80 93 -15 5 -74 130 54 -91 5 27 -79 23 -127
5077 -127 -77 11 101 13 126 21 -34 88 0 101 78 -85 105 -61 -183 209 83 29 16 51 198 96 -30
5100 -30 -71 0 47 -63 17 -80 -70 -122 30 4 43 124 -36 -18 0 -25 -63 15 15 49 79 47 -3 43 -6 -45 51 -41 -118
5129 -118 134 -2 30 75 -12 -24 -1 13 55 63 15 9 71 33 70 13 -25 -122 2 -102 8 -93 14 -121 3 114
5155 114 -10 12 14 -27 -20 120 73 -127 -100 55 18 -179 -98 -22 15 -28 51 -29 -48 71 -133 -6 107 39 -78 46
5181 46 115 -51 -51 -28 1 -201 -41 66 -53 -73 136 -13 -34 -122 -55 16 -88 0 -142 -111 -58 -6 54 39 -8 -28
5207 -28 -18 22 131 -3 -58 -51 60 -131 63 -37 84 111 68 -40 57 -81 65 -41 80 -83 -68 37 33 -6
5231 -6 124 45 -73 6 -270 -71 -51 16 106 -80 -47 -48 25 -23 140 134 -27 -179 243 617 -142 69 -40 106 44
5256 44 3 -21 -24 37 -53 1 -11 -45 -95 -35 16 3 13 -33 -45 -41 -109 193 58 -61 -173 -28 47 -1 18 27 26 73 -24 -34
5286 -34 -78 -8 -61 -6 -81 -50 24 1 149 -64 14 111 -8 -50 -152 -140 33 -81 -35 74 -4 -107 -53 -20 -21 -28 -7
5313 -7 -64 16 -69 -12 -33 15 7 18 52 -27 90 -13 91 -115 -89 -30 -102 -97 -53 1 19 9 -62 -38 -13 -4 -103 5 25 115
5343 115 -12 -70 11 3 60 83 85 -228 -76 -4 -21 -55 -33 -47 -54 134 25 -49 104 -62 29 -37 -31 124 -42 -86 14
5370 14 87 72 -30 -48 -57 0 -104 -84 -56 14 15 91 -46 -40 70 92 -21 -60 -31 -28 -125 -119 -25 -13 4 86 4 48 -50 -32
5400 -32 -106 39 21 27 57 82 200 -43 51 -23 -19 -32 54 -130 -99 27 -77 -14 -19 13 96 99 -142 -36 6 -11 -32 92
5428 92 13 15 56 -21 16 -75 41 29 85 66 39 6 -5 -87 17 37 -25 -110 56 74 -96 0 19 -87 -14 3 -86 11
5456 11 -121 90 45 49 -51 -75 -51 0 -167 62 -104 -55 -43 5 -33 -166 187 -53 -107 -56 69 -73 -38 -45 61
5481 61 -42 3 102 0 12 -156 -144 1 73 -17 -78 -56 -79 122 -16 -49 -62 -197 -143 -70 13 88 -121 34 12 24
5507 24 -110 -82 -94 4 192 67 42 109 -173 -31 41 25 3 30 -21 20 -52 18 53 19 -48 56 55 37 6 16 42 4
5535 4 -44 -111 -167 -36 -19 -79 -11 25 -27 70 173 1 -11 19 57 -6 107 35 34 88 -5 19 -5 107 56 -12 -211 -23
5563 -23 -20 17 21 52 86 -81 -79 -4 63 128 49 -130 165 73 -31 22 -29 -67 -77 -74 73 81 117 -78 -13 -94 80 200 50
5592 50 17 14 79 9 -34 -39 38 -137 -61 39 -69 -9 0 -26 88 72 2 -15 -25 -13 -153 -8 40 35 74 47 -103 -50 11
5621 11 10 -15 -158 30 -26 -11 71 -115 -11 -13 -29 54 8 90 -59 109 -67 138 116 -107 189 117 -53 168 200
5646 200 -344 29 -230 4 -47 5 -196 -469 -137 -115 235 290 87 31 24 -43 -90 -256 -131 191 148 -212 -12
5669 -12 -8 42 46 221 26 -210 315 -87 -431 100 2 -121 -449 60 -190 -91 239 164 74 261 127 -366 186
5692 186 59 99 103 -120 78 -307 -26 103 -351 -8 137 156 11 -57 267 -99 132 -194 -41 -61 226 50
5714 50 207 -4 -297 16 65 227 143 289 219 38 -2 19 153 -70 -133 -17 -6 93 1 -134 -52 -54 71 58 -11
5739 -11 52 0 -190 -102 21 -21 -73 106 6 -36 29 -15 86 -67 -43 65 -9 46 -35 97 -16 -35 -126 -149 -43
5764 -43 -50 -55 44 -54 -74 -113 26 -2 40 -15 -54 20 -54 -113 -17 29 103 -66 -9 104 98 28 -88 -5 53 81 19 42 110 -176
5794 -176 14 -25 -75 -19 -75 -73 -55 74 94 -26 -141 -54 -40 -2 -65 84 -201 -156 135 -175 55 70 352 -94 205
5819 205 111 44 1 160 -16 -26 -70 -66 -27 123 -36 -46 -43 26 66 -136 -2 58 12 109 70 12 -85 56 53 -28 28 8
5847 8 -74 -67 128 61 132 -84 -47 -120 55 -27 6 58 46 86 29 5 -77 -30 -47 -84 113 -74 -37 -58 -109 -46 156 -48
5875 -48 70 -22 18 -5 -102 130 65 59 86 -32 -10 23 -67 83 -73 8 81 43 -107 -83 -50 16 -96 -52 -52 -3 111
5902 111 57 -62 -70 -20 30 -84 -104 -81 57 -41 36 -18 -132 -10 -78 8 44 -93 170 16 134 -63 -45 -4 -17
5927 -17 140 -42 -33 -46 53 -30 35 122 87 68 27 -76 -21 69 98 -167 -27 134 -61 97 30 9 11 -130 -35 130
5953 130 39 74 -63 -108 -43 -26 -11 12 28 -35 -62 -29 16 -28 -24 -53 -47 105 -21 -81 -49 -50 -16 -85 20 -57 -79 -1 36
5982 36 36 -3 -39 -2 -25 -78 -90 69 103 16 18 -41 89 109 -159 44 106 -29 -132 67 123 8 60 60 24 138 90
6009 90 24 -35 51 90 62 131 -76 4 34 35 21 110 74 -106 -53 -16 -36 13 -66 -33 79 39 -80 16 25 22 19 -51 20 4
6039 4 -24 -80 -48 99 -91 54 85 -50 76 -47 -103 -55 88 -113 -282 41 -49 96 -81 166 34 25 85 -86
6063 -86 -23 -22 -77 -62 -52 78 -33 -69 114 148 21 90 -32 75 -6 -9 -72 30 -42 36 -26 -180 -5 196 107 124
6089 124 27 -45 88 -80 111 126 -74 -17 -64 -59 46 -64 -36 -47 -68 2 46 14 -60 -18 38 107 104 74 -37 4 56
6116 56 156 42 -20 53 -74 13 37 -127 26 39 70 18 -80 23 35 -73 -42 -27 -49 14 10 29 113 135 41 -55 3
6143 3 -6 3 -140 93 -86 45 -31 64 23 -75 32 25 -82 -60 23 -69 -3 -81 -43 22 31 -13 -4 69 50 -3 34 49 2 36
6173 36 56 -43 -93 -28 18 -8 107 -55 108 -65 37 48 36 93 84 101 -42 1 51 120 40 -3 -1 13 -3 108 56 -163
6201 -163 -23 54 94 -30 48 31 85 174 -25 65 -127 88 -5 -66 -3 97 123 102 -14 15 113 33 108 -24 58 52
6227 52 78 26 6 55 -55 39 -11 -11 18 -94 44 -75 -46 49 -62 73 -29 66 -20 -3 -41 -122 44 84 181 87 189
6254 189 -42 -34 27 -44 0 -108 83 111 -28 -12 31 -49 103 35 19 89 -72 64 -40 3 106 -148 -72 -41 -46 20
6280 20 58 -71 32 -31 -57 -110 -15 -26 -74 -44 -6 75 24 62 37 167 9 -98 -25 39 -17 -4 -82 56 22 49 7
6307 7 27 10 62 -5 57 31 100 22 -31 -35 61 16 -40 -1 -50 111 11 -22 39 -88 5 -104 16 31 96 58 -65 79
6335 79 95 -58 -93 -54 -96 -83 -59 -68 -71 55 74 84 -9 -126 -25 169 -62 -42 -41 -79 3 -31 33 -14 74 27 -89 -24
6363 -24 -44 -36 49 136 -42 59 -50 209 82 -30 -19 -116 -123 86 -119 -122 16 -84 14 -26 -14 57 -3 117 58 -48
6389 -48 -86 -55 -59 -65 170 58 83 -6 49 86 -31 87 35 -38 -111 -4 31 0 54 74 -121 -35 70 -51 -52 -16 113
6416 113 -72 -70 5 57 -7 -50 85 70 166 6 42 13 22 -9 -21 108 51 -84 3 -83 130 29 -51 7 15 -57 -32 -71
6444 -71 -4 -15 -2 24 -51 -160 100 -9 19 -80 -120 0 -41 -18 -83 -15 68 16 -10 15 -79 18 -96 -33 -34 104 4
6471 4 -12 -17 -84 82 40 -1 -23 -9 -91 183 -53 -48 100 -114 -100 36 69 -65 -30 62 48 40 -118 9 -8 35 0 -20
6499 -20 49 -4 94 -47 51 -14 2 -12 8 100 -99 -97 29 -6 -4 -46 105 -33 -17 -37 130 27 -2 -20 -19 28 57 -59
6527 -59 75 -44 26 -36 -4 31 34 -39 19 57 -33 70 -83 63 -13 94 -145 -10 70 -143 0 -18 -85 261 -17
6552 -17 -35 39 -41 71 -122 47 61 -26 64 143 22 -107 -44 22 -27 51 73 -15 -58 15 4 -87 -22 -60 -17 48 23 -15
6580 -15 12 -22 -30 -48 -28 27 -76 -18 -26 101 -22 177 3 -57 -58 -76 27 24 -90 -28 -28 117 -95 -1 100 2 -96 -37
6608 -37 -33 28 83 -53 -28 14 6 -90 -16 43 105 -121 -4 155 103 -76 -126 -142 -96 43 -25 91 -153 62 -71 -2
6634 -2 -80 68 -75 13 62 18 -21 75 185 27 142 -91 68 0 -82 3 -49 -103 18 25 -16 -39 -11 12 49 78 52
6661 52 -63 6 -58 46 -9 -3 46 6 -32 107 -118 -45 59 44 56 81 65 142 68 -12 73 113 14 68 -30 -71 29 -79
6689 -79 -2 -61 65 -76 0 -50 28 179 21 87 -4 -88 -11 -11 -56 -45 3 6 41 126 -9 34 -49 12 26 59 77 -92
6717 -92 52 -64 -57 -74 -113 83 -69 -28 -60 81 10 203 -105 -111 0 69 -76 -40 24 40 -117 73 32 -104 -62
6742 -62 40 45 -89 9 9 -177 -54 124 -14 71 -30 118 90 -93 -108 22 -71 59 -11 11 -49 24 164 11 -120
6767 -120 67 -34 -1 6 -100 29 -139 97 22 -40 45 148 -76 146 101 -42 -55 -64 -20 -199 -13 -12 -25 4 9 -81
6793 -81 -144 0 12 97 -44 87 -55 38 27 67 132 4 -105 39 -57 141 156 -29 -95 79 35 24 7 51 -2
6818 -2 -154 -50 66 -12 -179 -3 -18 -19 -47 23 28 -29 -34 -56 -6 44 -78 -37 65 91 -96 11 13 50 32 64 140 5
6846 5 79 176 141 -24 62 82 -24 -107 14 -84 -53 -3 62 -24 36 -22 -37 4 43 58 -89 -123 10 -3 -27 66 -17 -64
6874 -64 68 23 -73 -47 96 -37 22 -55 -56 30 -57 112 68 -32 46 -34 -125 -96 66 65 20 -54 -69 -20 -111 -6 93 -112
6902 -112 89 -84 142 30 -86 -78 4 100 25 26 67 8 -29 113 -114 54 26 -29 64 38 14 83 71 57 -16 -64 118
6929 118 137 -27 26 -46 -72 -85 -59 -81 -76 25 39 -157 44 43 -12 84 -3 -32 53 34 82 69 64 -64 -198 22 -44 84
6957 84 -41 -89 72 -51 32 78 28 -77 48 -32 -47 -159 -137 6 136 114 149 23 -76 37 81 -34 -109 -37 -23
6982 -23 -133 124 -18 46 39 0 -29 -51 -49 -40 89 49 62 16 -98 -55 -14 6 31 -30 -170 -77 -61 -57 45 68 -28 102
7010 102 97 -52 35 45 34 42 65 -34 67 37 -99 -63 45 2 63 -31 6 66 33 35 -53 -53 -66 15 205 -67 54 37
7038 37 -75 -75 -168 94 -75 21 69 -84 -91 -84 -32 43 -40 49 -44 -62 -26 -22 -29 -21 11 65 -21 -18 -70 -18 -55 135 -78 20 14
7069 14 -35 74 26 -161 1 40 -51 -44 38 77 69 48 41 19 -12 -10 44 -4 88 60 -130 226 80 -67 -36 -38 -54 61 16
7098 16 -102 54 92 85 -66 33 -45 80 79 106 25 65 13 22 6 4 29 16 -52 53 -57 -156 -41 122 14 -27 -130
7125 -130 -46 23 -72 11 134 -70 -14 38 -59 24 21 -117 -39 -45 -10 71 -7 53 16 54 -61 108 96 43 14 -19 82 131
7153 131 28 45 54 17 -14 -33 3 79 66 -5 -6 74 -44 77 -11 45 -8 93 -42 81 -13 82 92 16 -34 -41 -2 40
7181 40 -104 -65 -1 21 -10 -188 -8 -170 49 -143 -43 62 62 -74 -41 -37 -84 -47 29 -23 40 -59 49 63 -87 -47
7207 -47 72 -98 24 -89 -25 -7 -43 -44 16 -150 113 16 -25 82 -13 -6 13 -20 -21 -32 -198 -27 -20 -37 57 16 -91
7234 -91 -76 86 -39 -82 -42 -30 46 -24 -15 -106 -113 48 43 -70 26 -16 -16 90 71 -78 2 -7 -8 13 48 -16 -16 -12 8 -144 87
7265 87 40 59 -75 -38 -120 38 47 78 -55 104 -1 -59 35 17 24 17 -128 -26 109 35 178 -29 -38 51 80 -25 -82
7292 -82 -26 -29 23 81 -93 63 -65 -64 -107 -3 72 -5 -52 -105 94 96 -25 6 84 -35 -13 -23 -175 59 -103 103
7318 103 -21 31 -18 -127 -17 -89 -111 -43 -38 -58 46 36 49 -17 -25 80 -13 -2 -9 -17 24 -26 -49 78 -40 -79 -95 -83
7346 -83 -34 -34 -62 2 124 58 -16 84 45 201 29 68 -3 -59 -56 35 48 -25 -34 -69 81 45 -13 -98 80 -28 -8 70
7374 70 -62 -92 -76 -49 -89 154 69 -113 -198 -124 -60 23 -48 -6 9 -62 -108 -49 20 -27 125 7 -89 57 47 143 -172
7401 -172 -123 -24 42 -44 -66 -9 91 7 -95 -60 36 -102 -28 -37 22 161 10 -42 -55 32 81 -42 -23 118 -33 33
7427 33 -91 -78 140 67 3 90 18 67 68 23 -132 8 -23 29 18 52 -104 84 -4 -4 38 62 152 30 54 34 47 -133
7455 -133 15 -1 28 -87 -1 93 36 65 -13 39 -53 125 -69 20 41 36 -115 -73 -34 -23 -17 -46 33 4 111 -47 -77
7482 -77 -31 -8 68 175 51 -73 -46 -94 -161 21 47 6 57 14 -149 0 -60 -33 -34 -77 47 -67 -127 10 39 12
7508 12 -28 36 37 -42 112 41 -65 39 -50 108 -4 -36 -166 30 9 26 94 -8 37 -105 34 -44 -48 -51 127 -56
7534 -56 56 -37 129 15 -85 -9 -132 65 55 -85 -62 -71 61 26 -27 -15 -36 -95 98 27 -5 203 -3 -17 -1
7559 -1 29 54 -66 -82 -20 11 32 -2 -30 -27 -113 -31 -30 90 -94 38 41 -9 12 -42 -133 -88 30 -67 -53 46 -129 -41 -80
7588 -80 25 -37 20 -63 -19 85 -165 -77 -85 54 -51 1 -1 45 139 -105 0 -5 18 48 -1 83 -12 23 23 -70 66 -40
7616 -40 -161 -32 -23 29 23 107 -18 68 46 32 2 21 -6 -66 -2 -163 98 6 29 -36 25 -73 12 -117 -33 -88 -154 -28
7644 -28 -48 6 54 25 -7 -1 -49 79 -129 73 -17 115 130 31 -8 42 -64 -22 18 -213 -16 -74 63 -43 -13 -17 45
7671 45 79 -44 107 -19 27 -250 11 -36 -59 122 12 -8 37 30 54 -55 8 22 93 60 -18 52 -111 105 -98
7696 -98 -24 14 -77 36 -20 -34 -16 57 -26 39 25 -31 -11 -90 75 50 -173 15 46 -24 -76 -11 -8 54 11 -100 9 -6
7724 -6 -119 -16 71 -173 -2 -162 23 -72 -157 130 16 92 72 56 11 113 -2 -9 59 28 -112 140 2 -11 83
7749 83 35 3 -32 -64 -93 -97 -192 113 52 20 -96 12 18 26 -38 -62 -61 -9 18 -59 -47 -1 17 159 -98 -24 64 -21 -10 -32
7779 -32 169 31 13 28 41 -40 -4 -26 -21 -104 26 27 178 -36 91 -74 32 26 -171 85 81 66 44 -56 43 177
7805 177 13 -28 -47 -48 41 38 -21 30 -59 -8 12 60 -19 -27 147 104 141 80 -76 101 -29 39 40 -73 -50 92 -17 -62
7833 -62 -65 -85 48 52 153 106 78 -113 154 30 40 -23 18 12 58 -23 -25 -10 -41 38 46 -16 76 -44 27 76 -39 -77 -39
7862 -39 46 138 -36 -93 -18 -132 -62 74 98 44 63 -128 143 74 -122 35 -33 -148 -73 -33 -70 119 26 -81 2
7887 2 -95 -17 -29 -118 36 76 -33 -122 67 39 3 -38 3 39 22 -1 65 73 15 -63 27 46 39 1 76 -38 -32 -53 -17 15
7917 15 -28 -1 37 42 -79 46 9 -32 58 105 -12 66 24 45 -55 205 1 -206 13 -86 84 -88 102 -68 5
7942 5 -79 174 -40 233 -64 32 144 23 -62 59 -6 -128 -37 -102 -59 -133 -28 -31 63 -87 118 116 -111 171 100
7967 100 -28 -42 14 7 72 -31 146 116 69 88 29 -14 4 85 -72 -34 -59 -33 74 84 -74 -45 107 -86 31 36
7993 36 -53 -128 -92 -87 -13 140 -79 48 -84 28 -70 18 78 -150 8 -119 112 -101 39 9 -78 -78 -45 143 174
8018 174 8 -56 41 -18 145 36 -16 -51 -5 -145 18 -45 -97 21 -36 41 52 -2 4 39 78 -18 -58 28 -12 12 62
8045 62 -16 -32 9 -27 -48 63 -80 0 25 -90 41 28 58 125 108 -69 169 -164 1 40 10 -75 109 -6 -29
8070 -29 62 109 20 44 -108 2 -48 32 -10 -14 106 -163 140 118 34 19 -119 23 34 -42 38 40 112 64 219 38 -20
8097 -20 -65 117 75 -61 106 30 71 103 47 3 76 41 -62 -76 -56 12 57 -35 -92 -20 -60 -21 195 -66 -20 52 37
8124 37 -60 -48 -20 140 6 61 -5 -131 25 -52 25 -17 18 -31 -70 99 -49 11 77 23 -105 53 46 13 3 54 60
8151 60 11 84 -32 -14 19 94 -63 75 33 -52 -79 103 19 88 -25 116 24 -34 61 -86 -63 6 -6 131 27 -67
8177 -67 -77 30 -153 -106 -55 -46 23 -24 -25 -18 39 -35 69 34
8191C4
##END NTUPLES=NMR FID
##END=
