##TITLE=1H_Pr AmPrCl 
 CDCl3, 8 sc, 
 8.04.2021
##JCAMPDX= 6.0         $$ Bruker NMR JCAMP-DX V2.0
##DATA TYPE= NMR FID
##DATA CLASS= NTUPLES
##ORIGIN= UXNMR, Bruker Analytische Messtechnik GmbH
##OWNER= root
$$ XWIN-NMR		Version 3.5
$$ Thu Apr  8 13:19:35 2021 Russian Standard Time (UT+4h)  she@DPX200
##.OBSERVE FREQUENCY= 200.131506
##.OBSERVE NUCLEUS= ^1H
##.DELAY= (6, 6)
##.ACQUISITION MODE= SIMULTANEOUS
##.ACQUISITION SCHEME= undefined
##.AVERAGES= 8
##.DIGITISER RES= 18
##SPECTROMETER/DATA SYSTEM= spect
##.PULSE SEQUENCE= zg30
##.SOLVENT NAME= DMSO
##.SHIFT REFERENCE= (INTERNAL, DMSO, 0, 15.7039)
##AUDIT TRAIL= $$ (NUMBER, WHEN, WHO, WHERE, WHAT)
$$ ##TITLE= Audit trail, XWIN-NMR		Version 3.5
$$ ##JCAMPDX= 5.01
$$ ##ORIGIN= Bruker BioSpin GmbH
$$ ##OWNER= she
$$ F:/spectra/data/she/nmr/H-F/1/audita.txt
$$ ##AUDIT TRAIL=  $$ (NUMBER, WHEN, WHO, WHERE, WHAT)
(   1,<2021-04-08 13:17:52.00 +0400>,<she>,<DPX200>,
      <created by zg, POWCHK disabled, PULCHK disabled
       configuration hash MD5:
       00 E9 B6 7A A2 85 ED C7 34 08 36 98 17 FE 4E 26
       data hash MD5: 16K
       B7 70 70 B5 F6 74 9B B6 59 23 F4 91 86 9A 8A 99>)
$$ ##END=
$$ 
$$ hash MD5
$$ F5 03 25 93 44 8B 62 5E BD A2 B8 98 3A AF C4 57
##$RELAX= 
##$RELAX= 
##$RELAX= 
##$RELAX= 
##$RELAX= 
##$RELAX= 
$$ Bruker specific parameters
$$ --------------------------
##$DU= <F:/spectra>
##$EXPNO= 1
##$NAME= <H-F>
##$PROCNO= 1
##$TYPE= <nmr>
##$USER= <she>
##$AMP= (0..31)
100 100 100 100 100 100 100 100 100 100 100 100 100 100 100 100 100 100 
100 100 100 100 100 100 100 100 100 100 100 100 100 100 
##$AQSEQ= 0
##$AQ_mod= 1
##$AUNM= <au_zg>
##$AUTOPOS= <>
##$BF1= 200.13
##$BF2= 200.13
##$BF3= 200.13
##$BF4= 200.13
##$BF5= 200.13
##$BF6= 200.13
##$BF7= 200.13
##$BF8= 200.13
##$BYTORDA= 1
##$CFDGTYP= 0
##$CFRGTYP= 5
##$CHEMSTR= <none>
##$CNST= (0..31)
1 1 145 1 1 1 1 1 1 1 1 1 1 1 1 1 1 1 1 1 1 1 1 1 1 1 1 1 1 1 1 1 
##$CPDPRG= <>
##$CPDPRG1= <>
##$CPDPRG2= <>
##$CPDPRG3= <>
##$CPDPRG4= <mlev>
##$CPDPRG5= <mlev>
##$CPDPRG6= <mlev>
##$CPDPRG7= <mlev>
##$CPDPRG8= <mlev>
##$CPDPRGB= <>
##$CPDPRGT= <>
##$D= (0..31)
0 1.2 0 0 0 0 0 0 0 0.06 0 0.03 0 0 0 0 0.0002 0 0 0 0 0 0 0 0 0 0 0 0 
0 0 0 
##$DATE= 1617873471
##$DBL= (0..7)
120 120 120 120 120 120 120 120 
##$DBP= (0..7)
150 150 150 150 150 150 150 150 
##$DBP07= 0
##$DBPNAM0= <>
##$DBPNAM1= <>
##$DBPNAM2= <>
##$DBPNAM3= <>
##$DBPNAM4= <>
##$DBPNAM5= <>
##$DBPNAM6= <>
##$DBPNAM7= <>
##$DBPOAL= (0..7)
0.5 0.5 0.5 0.5 0.5 0.5 0.5 0.5 
##$DBPOFFS= (0..7)
0 0 0 0 0 0 0 0 
##$DE= 6
##$DECBNUC= <off>
##$DECIM= 32
##$DECNUC= <off>
##$DECSTAT= 4
##$DIGMOD= 1
##$DIGTYP= 9
##$DL= (0..7)
0 120 120 120 120 120 120 120 
##$DP= (0..7)
150 150 150 150 150 150 150 150 
##$DP07= 0
##$DPNAME0= <>
##$DPNAME1= <>
##$DPNAME2= <>
##$DPNAME3= <>
##$DPNAME4= <>
##$DPNAME5= <>
##$DPNAME6= <>
##$DPNAME7= <>
##$DPOAL= (0..7)
0.5 0.5 0.5 0.5 0.5 0.5 0.5 0.5 
##$DPOFFS= (0..7)
0 0 0 0 0 0 0 0 
##$DQDMODE= 0
##$DR= 18
##$DS= 0
##$DSLIST= <SSSSSSSSSSSSSSS>
$$ [...]
##$SUBNAM2= <"">
##$SUBNAM3= <"">
##$SUBNAM4= <"">
##$SUBNAM5= <"">
##$SUBNAM6= <"">
##$SUBNAM7= <"">
##$SUBNAM8= <"">
##$SUBNAM9= <"">
##$SW= 16.9725357007746
##$SWIBOX= (0..15)
0 0 2 0 0 0 0 0 0 0 0 0 0 0 0 0 
##$SW_h= 3396.73913043478
##$TD= 16384
##$TD0= 1
##$TE= 0
##$TE2= 300
##$TE3= 300
##$TEG= 300
##$TL= (0..7)
0 120 120 120 120 120 120 120 
##$TP= (0..7)
150 150 150 150 150 150 150 150 
##$TP07= 0
##$TPNAME0= <>
##$TPNAME1= <>
##$TPNAME2= <>
##$TPNAME3= <>
##$TPNAME4= <>
##$TPNAME5= <>
##$TPNAME6= <>
##$TPNAME7= <>
##$TPOAL= (0..7)
0.5 0.5 0.5 0.5 0.5 0.5 0.5 0.5 
##$TPOFFS= (0..7)
0 0 0 0 0 0 0 0 
##$TUNHIN= 0
##$TUNHOUT= 0
##$TUNXOUT= 0
##$USERA1= <user>
##$USERA2= <user>
##$USERA3= <user>
##$USERA4= <user>
##$USERA5= <user>
##$V9= 5
##$VALIST= <valist>
##$VCLIST= <CCCCCCCCCCCCCCC>
##$VD= 0
##$VDLIST= <DDDDDDDDDDDDDDD>
##$VPLIST= <PPPPPPPPPPPPPPP>
##$VTLIST= <TTTTTTTTTTTTTTT>
##$WBST= 1024
##$WBSW= 4
##$XGAIN= (0..3)
0 0 0 0 
##$XL= 0
##$YL= 0
##$YMAX_a= 191585
##$YMIN_a= -178400
##$ZGOPTNS= <>
##$ZL1= 120
##$ZL2= 120
##$ZL3= 120
##$ZL4= 120
##$ABSF1= 10
##$ABSF2= 0
##$ABSG= 5
##$ABSL= 3
##$ALPHA= 0
##$AQORDER= 0
##$ASSFAC= 0
##$ASSFACI= 0
##$ASSFACX= 0
##$ASSWID= 0
##$AUNMP= <proc_1d>
##$AZFE= 0.1
##$AZFW= 0.1
##$BCFW= 1
##$BC_mod= 2
##$BYTORDP= 1
##$COROFFS= 0
##$CY= 11.3945322036743
##$DATMOD= 1
##$DC= 2
##$DFILT= <>
##$DTYPP= 0
##$F1P= 15.9154993809931
##$F2P= -4.1035820241983
##$FCOR= 0.5
##$FTSIZE= 0
##$FT_mod= 4
##$GAMMA= 1
##$GB= 0.15
##$INTBC= 1
##$INTSCL= 1
##$ISEN= 128
##$LB= 0.24
##$LEV0= 0
##$LPBIN= 0
##$MAXI= 10000
##$MC2= 0
##$MEAN= 0
##$ME_mod= 0
##$MI= 1.114404
##$NCOEF= 0
##$NC_proc= 0
##$NLEV= 6
##$NOISF1= 3.799351
##$NOISF2= 2.8
##$NSP= 1
##$NTH_PI= 0
##$NZP= 0
##$OFFSET= 15.70392
##$PC= 1
##$PHC0= -11118.88
##$PHC1= 9.40092
##$PH_mod= 1
##$PKNL= yes
##$PPARMOD= 0
##$PSCAL= 0
##$PSIGN= 0
##$REVERSE= no
##$SF= 200.130013532006
##$SI= 16384
##$SIGF1= 3
##$SIGF2= 2
##$SINO= 400
##$SIOLD= 16384
##$SREGLST= <1H.CDCl3>
##$SSB= 0
##$STSI= 0
##$STSR= 0
##$SW_p= 3612.71676300578
##$SYMM= 0
##$S_DEV= 0
##$TDeff= 0
##$TDoff= 0
##$TI= <>
##$TILT= no
##$TM1= 0
##$TM2= 0
##$TOPLEV= 0
##$USERP1= <user>
##$USERP2= <user>
##$USERP3= <user>
##$USERP4= <user>
##$USERP5= <user>
##$WDW= 1
##$XDIM= 8192
##$YMAX_p= 0
##$YMIN_p= 0
$$ End of Bruker specific parameters
$$ ---------------------------------
##NTUPLES= NMR FID
##VAR_NAME=  TIME,          FID/REAL,        FID/IMAG
##SYMBOL=    X,             R,               I
##VAR_TYPE=  INDEPENDENT,   DEPENDENT,       DEPENDENT
##VAR_FORM=  AFFN,          ASDF,            ASDF
##VAR_DIM=   8192,          8192,            8192
##UNITS=     SECONDS,       ARBITRARY UNITS, ARBITRARY UNITS
##FACTOR=    0.0002944,     1,               1
##FIRST=     0,             0,               0
##LAST=      2.4114304,     0,               0
##MIN=       0,             -178400,         0
##MAX=       2.4114304,     191585,          0
$$ Real data points
##PAGE= N=1
##DATA TABLE= (X++(R..R)), XYDATA
0 0 0 0 0 0 0 0 0 0 0 0 0 8 -8 8 -8 8 -16 16 -24 24 -32 32 -40 48 -56 64 -78 88 -102 114 -133 152 -169 192
34 192 -216 242 -272 305 -341 379 -422 468 -518 573 -632 697 -769 849 -934 1029 -1133 1249
52 1249 -1377 1519 -1679 1862 -2070 2310 -2591 2926 -3330 3831 -4468 5312 -6482 8216 -11035
67 -11035 16376 -29897 131971 191585 -178400 15384 113020 -58207 -42769 86506 -1977
78 -1977 -32684 -37746 27541 82612 -15558 -29878 52455 30784 -77367 23918 86814 -52200
90 -52200 -32683 32939 9394 -7150 24142 -8506 22290 -17877 -53604 74101 9480 -59861
102 -59861 26785 8862 -52076 29425 30232 -26955 -1357 -39064 10242 33678 -25305 -18027 3129
115 3129 -27715 -16565 46946 -19277 -35054 21726 -12108 -31515 45100 2369 -77010 40346
127 40346 6485 -64994 42748 29687 -59293 5193 29640 -32264 18137 10679 -16468 1962
139 1962 -16238 5812 28843 -2067 -20704 11369 -2877 -432 29717 3273 -19138 3317
151 3317 17461 -3546 23990 6134 -29888 17272 14306 -9972 21394 10801 -21202 13245
163 13245 9303 1066 21735 -11981 -10493 14115 -2200 1075 15879 -8294 -6082 8396 -7989
176 -7989 7568 13691 -17935 -10049 16405 -13724 -15033 32371 -5081 -45651 13677 21462 -24703
189 -24703 263 9411 -20503 -10031 6190 5813 -4152 -23992 -3859 13072 -17357 -4728 16033
202 16033 -12292 -20485 9126 8094 -7942 -318 -5983 -5609 1395 587 1123 6998 -9926 -12791 19747
217 19747 3113 -8649 9462 4930 -10068 3752 14247 2779 1489 -8844 7801 9215 -4643
230 -4643 10030 10239 -8325 -4096 23718 2781 -2795 9130 -131 -2992 6564 10133 -4548 5850
244 5850 -4696 -1396 11627 256 7 660 517 -6969 8616 1792 -2396 -1205 -9246 4486 -1257
259 -1257 -1971 -3280 205 -12666 -4508 12129 -8506 -4680 -1142 -2062 -10860 4891 1055 -12859
273 -12859 -1946 -8839 524 -2888 -1245 -3412 -2568 -5509 -2756 9789 -8494 -142 -3011 -2864 -334
288 -334 2176 1534 -6632 3572 -6225 6050 5249 127 283 1995 3369 -3152 12905 -2057 -841
303 -841 2090 1308 5711 2836 6182 -1887 5715 -1909 8161 6151 -2731 4988 128 4413 897
318 897 9169 -2168 -1211 2695 -1792 4818 -314 3311 -4725 3539 -327 1197 4595 -6570 -944
333 -944 -3865 619 -3389 1642 -3439 -4544 313 -4955 4165 -5285 -3256 -3858 -1592 -3339 -2651 2559
349 2559 -9018 -2788 -3295 464 -4177 -1875 -506 -5524 762 -2717 3562 -3330 -4182 -982 -600 -896
365 -896 -1189 4913 -4034 1145 1539 2791 2204 -1420 1529 -709 3370 367 4500 2616 119 2002
381 2002 3012 5835 409 3480 954 2564 3105 2786 4584 885 846 274 4298 1960 1783 1609 1565
398 1565 2419 -1300 3991 3168 -2933 -3890 2533 1298 -3695 1297 1582 -3131 -3836 3056 402 -5671
414 -5671 -3536 320 -1055 -4529 -971 2534 -4125 -8565 907 1688 -7727 -4753 2177 -3936 -5874
429 -5874 2637 1557 -5297 -4159 1595 -1453 -3386 -1831 -663 -432 -3284 -992 2219 2285 -3637 296
445 296 3712 -465 924 2997 1508 -3533 3482 2070 -725 2864 1847 848 3139 7193 -2497 3261
461 3261 8171 -1646 -3234 5918 6153 -5485 3088 5089 838 -238 3022 5595 -1469 -2282 13
476 13 8784 -3132 -4704 7742 1323 -8068 -332 11805 -8788 -8703 6334 2560 -7193 -2298 5642
491 5642 -5900 -2433 -1583 2377 -2650 -8215 808 1436 -3866 -9234 4499 485 -8644 -3106 4994
506 4994 -1316 -10851 7004 521 -7310 -1970 3364 -1656 -4483 2403 -3719 1853 -193 1202 292
521 292 112 196 -1335 8556 -2887 -3438 3196 5060 -451 265 3230 -1060 6960 -2468 2380 5489
537 5489 -1145 429 4969 4658 -6284 5435 5900 -385 -4041 5487 5932 -5931 3819 2208 1978
552 1978 -2411 -236 4540 956 -3094 -2945 6104 -3175 -989 870 6 -3492 -3705 8186 -3620
567 -3620 -8596 68 5593 -6110 -3607 1974 -5870 561 -1797 -440 -4462 -2384 740 -1873 -1401
582 -1401 -4254 37 -1229 149 -4603 -80 -53 -4183 3506 -2433 -430 809 -776 -31 3293 -1085
598 -1085 -3932 4070 165 1728 -448 1026 1631 -387 5150 1774 -905 373 4729 1229 1725 695
614 695 224 4937 -203 1932 2187 1053 746 1763 3248 413 -645 1900 4442 -2859 979 2828
630 2828 -2601 778 1519 -479 -1840 -236 1118 1063 -2641 -1868 713 -1382 635 -2215 -2889 -834
646 -834 -1314 -1466 -2165 -3500 -1440 -625 -1694 -177 -2343 -1573 780 -2466 -2855 -600 -2252 -1793 -1226
663 -1226 -1304 453 -1363 -664 634 -855 -6 -256 -1311 550 616 -722 1527 -371 575 2893 732
680 732 -433 101 3042 1657 450 728 3270 874 1065 4033 -329 1347 2349 2673 537 5 3181
697 3181 1439 608 450 3438 -785 1756 1834 -303 1569 -481 1678 -1111 -320 -357 486 -615 -622 1123
715 1123 -1743 981 -2121 43 -1254 -1957 -1104 -2446 -163 -2789 -23 -2002 -864 -1813 -949 -109
731 -109 -3839 238 -2135 -727 -1780 -242 -807 -2254 248 -1959 708 -2608 671 -624 -707 631
747 631 -1325 1430 -1728 1393 -483 921 409 311 2285 -482 2489 -870 3150 201 811 1890
763 1890 480 2479 -193 3524 -420 2275 1177 1185 1416 -329 3694 -945 1831 367 1867 473
779 473 -180 1872 -856 1707 -885 1989 -1358 231 749 -1370 640 -2046 1241 -2345 56 -1147
795 -1147 -655 -291 -2392 423 -2923 -1 -2536 -473 -1206 -2234 157 -2059 -32 -2879 -60 -2013
811 -2013 -1249 -1233 -1609 257 -2562 735 -1247 288 -973 -99 397 -1325 999 -1425 1339 -918 417
828 417 619 672 1068 -594 2149 -212 1311 514 1682 497 142 2529 264 2225 103 1919 1581
845 1581 690 1422 1611 1709 -547 2684 386 580 646 695 1416 -433 780 49 884 -647 295 129 -814
864 -814 259 -558 642 -1196 -16 -449 -1295 -312 -1168 -1358 -668 -846 -2380 361 -1329 -2271 -223 -1257
882 -1257 -1573 -1063 -1216 -1171 -770 -1559 -889 -357 -1046 -894 -303 -225 -1543 -815 1115 -443 -1936 886 600
901 600 -683 249 447 543 -211 353 1785 591 -725 2112 1463 523 1324 326 2265 677 -205 2447
919 2447 1332 -937 1504 2883 -432 1251 1017 1398 577 747 1489 -397 1259 632 715 741 31 -1397
937 -1397 1920 909 -3384 1728 -577 -643 -133 -607 -989 -719 -406 -1209 938 -2510 -535 -825 -327 -840
955 -840 -2767 933 -1752 -1768 -450 292 -2432 -1156 800 -1489 -90 -2665 1417 -1371 -1291 584 -1439
972 -1439 100 -563 488 -404 1234 -2134 1891 1890 -3065 2115 681 147 -42 2389 -170 264 2239
989 2239 219 1534 -174 2408 -549 1991 1673 -1088 3038 -261 703 1757 1951 -1290 2070 1278
1005 1278 -857 2478 -2061 1291 312 755 -318 -475 1059 -115 647 -1419 1375 -2080 127 400
1021 400 -2108 139 -1149 1115 -2169 -616 -338 -462 -1581 -1267 128 -2255 398 -3107 371 -219
1037 -219 -3083 1019 -756 -1761 -1081 1774 -3063 -812 544 -1350 196 -1753 976 -352 751
1052 751 -527 20 955 -656 716 -244 512 -941 2599 -121 -778 2703 222 1058 779 1020 531
1069 531 1816 147 853 1617 -629 2662 320 716 1361 1165 252 -169 1562 -198 771 -100 842 501
1087 501 530 370 -365 749 -959 628 -627 -1577 -55 195 -1341 -1085 1102 -1463 -89 -630 -1445
1104 -1445 -266 -939 -1003 -1143 -774 -1669 -27 -1007 -1590 -221 -347 -1061 -1266 -91 -1097 -721 -568 -1115
1122 -1115 -147 -274 -648 -115 325 -450 497 131 -820 620 987 -658 170 1137 603 747 348 315 978
1141 978 1251 582 638 365 330 1548 659 239 904 1730 171 622 1237 177 1569 433 766 263 646
1160 646 58 616 230 -667 1351 -420 -387 -144 751 -573 -363 128 -1145 337 -848 -601 -823 -265
1178 -265 -667 -666 -441 -1618 611 -932 -929 -794 -386 -722 -1150 51 -1737 54 -1209 -771 -309 -735 -366
1197 -366 -800 324 -1572 325 -412 -574 -161 -216 626 -641 1087 -928 772 85 187 1172 130 871
1215 871 -121 1516 -593 1525 620 180 1455 96 1252 -39 1592 148 1177 773 332 1463
1231 1463 -647 1466 -110 919 8 815 548 -742 1399 -561 510 -387 811 -402 6 342
1247 342 -1258 590 -1387 149 -919 -380 -779 -1000 52 -1764 360 -1296 -127 -822 -675 -512 -1300
1264 -1300 196 -1562 28 -1180 -17 -951 -938 -87 -1007 530 -1202 538 -642 -104 64 -597 401
1281 401 -1111 633 -517 935 -507 501 670 -343 1012 -8 1117 111 769 554 358 1010
1297 1010 194 1070 442 1051 351 1010 603 373 1355 25 954 115 1073 166 496 609 130 630 -393
1316 -393 721 -36 513 -281 -162 161 -437 75 -575 287 -1052 -76 -396 -834 -386 -992 -271 -1019 -345
1335 -345 -420 -527 -746 -366 -588 -926 -302 -1446 -382 -455 -667 -68 -875 -582 -436 -179 -408 -225 -661 550
1355 550 -370 -503 307 -347 134 688 -245 72 515 75 836 267 32 565 466 825 605 497 704 836
1375 836 569 1230 319 197 1206 198 553 454 133 813 769 24 574 325 78 859 -194 411 -103 -545
1395 -545 933 -318 -445 -143 -307 -359 524 -613 -631 139 -1131 460 -874 -827 -693 -715 -107 -646 -901
1414 -901 -618 -82 -1314 561 -1263 -1417 528 -1028 -91 -275 -713 -379 655 -528 -578 -489 -1064 660
1432 660 -904 717 -109 -448 1341 430 362 274 358 -200 1419 -602 251 831 -453 1878 305 543
1450 543 288 842 697 932 -187 215 1369 -623 1890 -81 -182 1035 69 1212 93 67 -195 1216
1468 1216 -190 747 -290 -751 1136 -840 931 -1233 -600 335 -304 -735 -574 -155 -1550 941 -1476
1485 -1476 -360 -31 -1324 422 -812 -933 -1087 -346 -1081 -31 -716 -779 63 -1219 1420 -1077 -1057 265
1503 265 -580 182 -450 -604 -487 747 -634 1001 -931 -793 1525 -702 414 -224 -148 789 750 169
1521 169 573 501 -200 1623 -255 708 588 62 1093 301 947 421 97 317 1211 -153 351 431 -606
1540 -606 1423 -119 -356 362 -208 224 503 -518 -541 715 -395 297 -804 -552 540 -573 120 -642
1558 -642 -414 -444 66 -667 -383 -591 -634 156 -1238 226 -456 -1139 -39 -356 -524 -255 -706 -790 316 -835
1578 -835 -221 -279 -958 550 -110 -596 77 345 152 344 -187 -69 418 -85 515 109 113 397 319 602 99
1599 99 280 932 541 -44 1079 123 191 938 498 432 657 101 470 697 -316 539 135 52 748 483 55
1620 55 -53 302 82 64 -337 6 -282 -113 -140 -646 288 -342 238 -146 -872 -457 103 -672 -674 23 -945 -74
1642 -74 -545 -526 -27 -201 -412 -741 -194 -890 202 -580 -649 -138 -356 -54 -900 266 -288 264 101 -90
1662 -90 169 -80 480 -287 304 -171 448 182 -288 584 480 572 137 772 -98 641 580 15 838 231 1045
1683 1045 -3 665 156 326 529 -185 714 -91 729 104 879 48 101 960 -270 546 -469 17 -361
1702 -361 340 -128 -254 503 -906 490 -621 -77 -298 -309 -158 -837 69 -1312 176 -834 -213 -55
1720 -55 -378 -200 -469 227 -1019 327 -851 -525 -154 -665 -100 -442 295 -426 543 -215 -121 263 -242 433
1740 433 -107 634 -499 306 197 -36 576 21 626 -60 751 209 432 542 295 832 -14 603 -17 618
1760 618 6 386 474 109 786 -66 467 95 130 -185 34 62 49 693 -427 231 -105 58 -120 -214 85
1781 85 -444 258 -144 141 -140 -271 -495 -600 -238 -848 119 -566 -279 -73 33 -328 -435 -166 -529 20
1801 20 -718 -196 -225 -466 -272 -317 -134 -299 -180 -15 -43 -101 63 171 -142 246 -155 111 -20 142 210 45
1823 45 602 594 254 207 500 178 257 370 200 249 422 514 336 342 319 546 386 458 219 247 306 153 160 -88 -90 -131
1849 -131 312 -14 88 -1 32 9 -33 43 -109 -93 -237 -163 -213 -369 -293 -555 -177 -491 -443 -111 -174 -282 -418 -244
1873 -244 -614 -217 -496 -534 -490 -229 72 -170 -155 -586 -86 -57 -83 -39 -215 243 -323 509 118 35 -11 47 364
1896 364 73 155 -408 666 429 285 -110 282 377 -58 682 64 606 167 391 397 114 538 -220 658 215
1917 215 227 216 440 197 -81 279 -631 383 -314 295 229 -50 12 -83 449 -124 92 -693 90 -197 -343
1938 -343 14 -825 263 -463 -114 -543 -616 24 -311 -9 -548 34 -681 -140 -115 -605 -34 -744 421 -395
1958 -395 373 -400 -31 -31 -366 269 -785 -80 -283 218 -30 -49 127 43 398 -53 447 -302 583 230 472
1979 472 453 -98 915 279 526 -95 526 24 470 651 25 598 -22 732 524 112 100 -89 152 96 306
2000 306 -507 148 -288 157 73 -589 84 -157 319 -58 -246 -386 -148 -202 -417 -141 -734 151 66 41 -43 -460
2022 -460 -33 -341 -200 -670 -478 -757 21 -263 -387 241 -236 56 -96 -20 -205 -631 127 163 -86 -300 127
2043 127 -185 320 -63 -250 297 166 394 166 18 -107 508 373 130 399 -77 555 294 192 192 132 170
2064 170 408 261 114 269 248 290 -148 435 267 -229 -170 17 -78 -87 -86 36 703 -3 -219 128 -305 -177 -267
2087 -267 -560 -373 16 -28 84 -102 -133 -19 -523 -184 -169 -288 -450 -273 -219 -395 -332 -439 -375 -712 136 -188
2109 -188 -256 57 -200 -92 -183 -343 -255 130 -118 208 -221 -290 295 65 -25 -26 205 224 186 231 -3 386 20
2132 20 654 5 354 95 172 262 -59 228 248 385 -72 212 138 -103 404 127 601 -101 113 -224 11 198
2154 198 -181 -8 -124 256 -483 272 -201 17 71 -340 -8 -319 125 -314 -280 -316 -279 -174 -340 94 -622
2175 -622 58 -402 -182 -72 -178 117 -349 93 -443 108 -37 -50 28 -405 310 -406 88 -257 329 -99 -13
2196 -13 24 104 551 -189 355 -7 306 233 -17 446 -409 432 -29 544 34 172 366 185 500 179 398
2217 398 102 123 -41 155 430 -372 392 100 322 -129 339 -157 -143 270 -367 -39 -272 144 -269 -50 -304
2238 -304 -273 74 -539 -61 -451 77 -272 1 -270 -375 45 -481 325 -514 -323 -170 -324 3 -105 -47 -390
2259 -390 -92 -420 -38 -64 -183 -99 -159 14 -238 35 -138 -270 144 -264 -23 -13 266 91 476 370 203
2280 203 268 -136 204 -160 253 107 108 71 325 373 159 333 170 132 252 155 82 150 -53 196 123 -182 177
2303 177 -124 307 53 -15 288 -69 77 -186 -129 -46 -149 -498 -266 -56 -383 -131 -325 -41 -287 -339 -63
2324 -63 -364 -453 -41 -291 -265 -29 -480 -322 -146 -387 -88 -11 -154 46 145 -259 87 -314 4 -34 107 27
2346 27 -37 -103 -11 147 40 124 -72 89 136 246 574 -51 54 340 -42 189 198 -41 163 397 48 409 7
2369 7 89 182 -222 257 142 -198 13 295 -7 274 140 -128 144 -440 83 46 -83 -80 -170 216 -74 -265 45
2392 45 59 -373 10 -9 -281 3 -360 -116 -198 -537 -395 18 -334 -44 -27 -444 126 -402 9 -173 -562 -8
2414 -8 -111 -153 -76 260 -161 59 81 -150 260 -510 153 -117 224 189 134 329 243 325 211 417 -13 440 350
2437 350 72 339 327 619 -219 -16 144 405 -66 156 133 -244 590 -12 191 -12 87 -10 38 236 39 144
2459 144 -62 47 -210 -434 -21 -464 332 -47 -90 -360 -19 -80 -14 -147 -301 27 -371 197 -443 -255 -107
2480 -107 -265 375 -91 -223 -398 103 -176 -211 -132 -546 -126 -146 -88 -31 -218 -8 -34 -118 -18 122 89 252 122
2503 122 193 -24 60 124 340 165 13 138 238 344 -197 38 503 204 127 59 50 107 79 118 237 18 80 50
2527 50 -130 387 57 118 1 120 166 -50 65 -163 -30 -101 124 -88 -230 33 -136 13 -12 -271 -225 -175
2549 -175 -276 -187 -119 -207 79 -44 -146 -173 66 -8 -37 -118 -17 -35 -608 32 -139 -122 -170 -76 -222 -213 -3 -109
2573 -109 -164 -132 82 38 55 80 250 402 -98 292 317 253 40 60 285 64 204 28 135 30 20 -109 73
2596 73 156 233 316 -7 236 137 82 176 98 182 -29 -37 -75 -89 -177 232 103 -48 85 -30 48 -141 240 -3 -107
2621 -107 117 -379 -56 -243 -70 -225 -286 -328 -461 34 -535 246 -359 178 -103 -127 -50 -187 41 -232 58
2642 58 -172 4 -125 -189 53 44 203 127 259 16 272 11 91 273 36 236 -113 185 228 284 512 -124 121
2665 121 286 48 -125 109 277 -7 -25 -277 152 -95 158 -100 179 124 -148 252 -32 178 19 203 -247
2686 -247 0 36 86 227 1 -95 -215 -16 -162 55 -325 -493 40 -462 -199 -88 -300 -96 -181 -199 -74 133
2708 133 -258 101 -244 -174 111 -125 -122 -222 99 14 12 -28 5 170 -7 172 28 117 108 -55 169 186 82 113
2732 113 -20 65 389 53 23 73 91 347 -50 185 45 130 212 35 468 244 329 -99 303 194 73 -165
2754 -165 118 -232 23 -117 -270 -41 -25 -58 117 -174 -52 -145 -183 -55 36 -196 -69 -76 -123 -35 -70 -80 -181 -77
2778 -77 -187 41 -195 -229 -242 -129 -268 -298 -253 -105 70 113 -96 -205 240 -15 -191 -139 -142 44 -16 -20 -13 37 117
2803 117 35 -90 -45 110 -95 155 -203 -51 -3 219 -110 231 -76 -104 190 46 285 -21 218 293 333 191
2825 191 214 103 100 -78 -19 110 -310 -116 89 -87 -25 27 -124 7 -35 -126 91 158 -177 -132 -106 -249 98 -195
2849 -195 82 -179 -134 33 -264 -15 -396 -43 -443 -147 -152 -5 -141 -307 45 -234 -39 5 -118 -127 -43 -214
2871 -214 -30 15 -358 279 -80 36 -198 75 100 236 69 -316 337 -86 138 243 131 322 -179 434 87
2892 87 225 -224 249 76 123 154 108 694 -5 253 229 13 254 -109 163 -1 183 -23 350 -33 288 46
2914 46 -173 317 -108 230 -175 -105 -77 118 -40 -330 116 -296 -45 -113 -167 -73 -76 387 -280 -71 -181 -19 -208
2937 -208 42 -169 -227 -54 -276 103 -319 6 80 45 94 110 69 -103 152 68 -42 26 15 154 78 62 202 130
2961 130 338 82 250 135 246 -19 273 -338 143 274 -81 -26 -53 -1 139 113 -401 244 212 -52 272 -111
2983 -111 239 215 -282 51 -59 -31 18 79 8 201 -293 -57 -159 -63 -49 -252 -215 -356 -84 -101 -16 -349 -112
3006 -112 -232 -225 5 87 42 -61 -128 -169 -34 -163 335 -158 -135 55 -15 -65 16 -167 62 140 1 -162 192 -169
3030 -169 14 -101 -82 109 187 167 112 188 -26 41 -214 231 -13 131 354 -40 176 231 122 134 153 113 185 47
3054 47 12 331 107 190 -53 96 195 -147 -77 -204 -85 -178 -163 42 -106 -83 -148 -222 -193 92 -129 -31 -118 -173 -102
3079 -102 -213 -217 -151 187 0 -15 -56 -158 -209 -107 143 -362 66 -176 -142 93 -177 -93 68 -6 -309 28 -264
3102 -264 206 6 -70 -147 15 227 -11 271 113 145 118 57 103 -202 272 -255 226 191 21 111 -127 54 172
3125 172 158 22 290 227 -31 205 -5 86 -6 140 21 89 71 -154 -62 39 25 8 -58 -89 -158 -118 -296 119
3149 119 -263 205 -18 -61 -139 -91 166 -84 -187 -197 -109 -355 -76 -102 -422 -16 -215 73 -60 -6 24 100 -26
3172 -26 -86 243 -181 -64 -14 52 -114 -170 -124 181 -79 -36 217 -77 311 -61 142 93 -143 6 160 173 -120
3195 -120 -63 6 66 -126 131 115 104 103 21 36 427 -3 62 -118 56 -29 91 74 160 -137 -197 12 95 51 -34 -37
3221 -37 -35 -29 214 160 -197 4 117 -285 -35 80 -106 -131 -322 -110 -147 -121 -148 -184 -15 73 20 -84 -137 77 62
3246 62 -119 -30 -402 -382 141 -94 254 -14 162 -141 127 14 -191 167 -253 -25 146 120 9 179 114 -199
3268 -199 151 -130 204 161 111 -132 70 52 -35 304 212 223 153 -20 80 -8 35 -300 26 -96 18 -125 -396
3291 -396 -83 146 187 -107 -50 -35 -43 -300 -176 -222 -116 -295 -67 12 -166 -188 -413 -123 32 -101 -154 -195 -236 -270
3315 -270 76 -166 -33 -155 31 -100 -42 -115 -255 61 8 190 43 -315 67 -177 -112 4 -93 311 311 -57
3337 -57 -11 -30 -1 177 105 172 58 38 138 -90 73 70 157 59 86 -89 416 437 10 208 73 312 -1 197
3361 197 -28 -69 -83 -217 54 -223 143 121 149 -93 -62 -63 -14 -24 -218 149 -322 -185 67 16 49 78 92 -413
3385 -413 -79 -91 -25 -84 -34 123 -157 -77 -124 -295 -73 -8 -4 -101 -108 -318 126 -202 -107 -91 112 118 -61 100 -194
3410 -194 154 232 -22 11 -23 134 104 259 -40 102 152 70 245 -103 -30 -103 241 -198 -155 -324 -120 195 -161
3433 -161 324 22 231 66 170 73 50 -173 246 -298 -41 315 112 -37 38 15 -23 24 -86 -77 63 -241 226
3456 226 41 -24 -52 -171 -158 -196 35 138 -68 -155 63 -132 -349 -8 -63 -227 -158 -121 -160 -224 118 142 -223 -397
3480 -397 218 -216 199 28 -222 -34 75 47 -255 -60 -123 285 -32 238 94 298 285 -18 86 134 189 -8
3502 -8 90 73 197 -67 57 206 -156 -47 130 116 9 -99 -56 -153 46 -262 24 24 104 -46 117 50 157 92
3526 92 -77 -438 -88 -107 40 -84 -256 -113 -166 -179 -243 152 -233 1 -74 43 -70 -88 -28 -82 -145 -85 27 -180
3550 -180 -28 -89 -69 18 28 -17 -84 148 114 -57 -1 -20 -156 -35 94 191 37 -19 -1 -69 -132 -11 65 125 -1
3575 -1 382 -58 100 -54 74 186 -190 -128 -57 132 4 74 -114 37 210 -98 -97 27 -251 -147 113 -155
3597 -155 22 -107 -201 248 189 -113 -107 -34 79 16 -23 -61 135 -29 -14 -159 151 -142 -233 87 -104 -216 -50
3620 -50 -148 -205 -6 288 -138 -21 -49 223 84 230 405 -243 260 -112 44 116 290 -21 95 -52 105 75
3642 75 -6 249 108 -3 279 -132 113 28 63 120 257 171 -56 -29 300 218 -144 296 -44 243 247 -2 93 298
3666 298 217 -74 72 33 -23 -63 -130 169 -223 -262 8 144 -60 -42 -188 102 28 -74 71 65 -30 44 -74 93
3690 93 -64 -115 -230 -82 -171 150 -171 -288 5 -103 -198 -59 -76 -215 -22 7 15 -39 171 -7 60 83 113 28
3714 28 77 106 88 -83 218 -11 -57 110 132 -83 77 185 95 377 -81 190 -371 13 77 12 92 88 71 84 -298
3739 -298 181 -67 -82 143 69 1 -16 4 14 -22 1 -30 -289 -34 -20 -19 18 106 -177 21 -144 6 -154 135 -83
3764 -83 30 -130 -49 14 123 33 -32 -28 -93 -301 -132 -241 16 -9 -3 10 27 262 -27 23 -111 65 -56 18 -290
3789 -290 -241 -24 184 -34 38 288 13 -151 71 171 22 118 -39 -38 -63 -152 -301 194 -317 -111 -99 -64 200
3812 200 190 -33 -146 212 -217 -103 -337 121 -14 198 320 26 70 -85 76 72 -61 -1 -198 132 149 102
3834 102 -242 131 -74 -86 238 59 81 -34 266 -66 -88 -2 26 215 -81 -149 -437 49 -120 -347 -204 -37
3856 -37 -126 -271 219 -43 5 -36 97 83 -183 35 78 -116 39 -133 -44 13 -33 -29 161 135 163 -11 101 4 205
3881 205 238 -160 106 270 89 -109 282 46 -130 14 -121 88 192 192 -181 -241 -277 -116 61 53 107 -45 245
3904 245 22 -135 -39 -171 -160 -96 118 146 -46 -82 -75 -45 -281 -94 128 -112 -112 -202 17 -38 -159 -342 19 21 -203
3929 -203 -188 186 95 185 -1 -13 39 67 130 90 65 89 21 -64 54 315 137 188 126 51 68 223 190 68 -74 -168
3955 -168 89 48 88 254 62 234 -156 158 -148 -107 -41 -270 23 -52 -36 -101 -63 -158 2 -159 212 166 -237
3978 -237 45 -262 3 132 -53 -12 -198 -251 -166 80 84 37 14 -14 17 -123 -51 -325 120 16 -199 -83 -61 11
4002 11 0 -228 -62 8 -236 -116 202 101 127 49 160 -74 -91 -51 -133 -272 -93 -60 -31 -250 53 6 -135 90
4026 90 110 306 -220 8 221 -74 85 -118 -150 297 -200 4 156 196 43 -179 -2 122 86 -73 -356 -179
4048 -179 -45 -354 -157 291 -203 -3 451 159 -180 159 -203 -182 -254 9 77 -202 -78 151 164 -115 -86 -30
4070 -30 -46 71 -197 -260 -296 -31 -71 59 43 -79 -167 -168 94 -234 -19 -135 -47 -48 133 -27 -211 -83 -350 27
4094 27 141 -84 -7 -5 258 234 262 -95 118 140 -25 -65 -111 79 199 54 -78 133 61 316 -6 132 241
4117 241 -1 149 -285 -218 -151 3 -94 -18 179 77 69 -30 29 39 102 44 -94 -97 -392 28 -43 68 109 137 33
4142 33 -186 181 -48 24 -224 -15 -31 40 165 159 188 -110 -84 -140 82 -180 116 72 52 157 -113 49 -17 -23 145
4167 145 -57 -176 -5 43 158 273 -78 107 71 -26 -186 -17 -21 212 111 98 172 134 100 65 27 81 208 58
4191 58 -82 -47 -241 -148 -155 -112 -88 -10 50 56 100 -61 144 -80 -41 -248 -323 -121 -51 -203 -48 -31 -48 -267 55 22
4217 22 -44 -11 -43 42 -146 77 102 -320 82 -126 -157 -154 -149 -38 -104 -41 97 -34 -310 -175 -86 -111 -84 166 3
4242 3 171 317 -6 81 -97 16 -162 -18 97 116 30 -43 87 -124 -19 -3 88 135 178 -3 32 66 -160 147
4266 147 247 -94 -164 -45 -173 -255 1 -88 -120 -124 -29 67 -66 12 -155 -45 -87 25 6 -132 -112 10 52 -292
4290 -292 139 -138 -221 -90 -234 20 -133 120 64 -21 -5 -77 -93 -56 45 -171 -35 -150 -99 -107 25 -24 -59 -9
4314 -9 -199 93 -55 115 -221 -118 45 104 16 34 115 -45 148 243 115 -91 45 234 66 142 48 -77 -23
4337 -23 192 0 -54 13 163 -21 -196 -28 128 -124 29 -78 167 -113 48 250 29 134 186 229 -418 94
4359 94 -197 -186 85 -152 -219 130 88 -131 95 -119 -65 -6 42 3 11 -13 58 50 -67 69 -105 -49 17 -61 157 101
4385 101 235 237 -235 -119 -130 107 154 -142 173 -88 -121 -145 158 68 -164 69 99 115 252 -23 98 86 -13 -55
4409 -55 -37 30 -28 188 90 36 123 -69 109 -159 105 -26 125 96 360 218 6 393 -91 59 -321 -131 -1
4432 -1 259 47 -179 253 -117 -73 -7 -4 -180 -11 263 -253 -60 -114 86 -155 -107 -89 -233 79 -248 26 -80
4455 -80 -15 118 334 -313 -245 20 -161 109 -127 -125 -162 49 12 -64 115 141 77 -204 60 29 -14 -37 70 -111
4479 -111 -46 -57 -78 6 124 338 -88 -105 111 -74 165 -33 10 -284 -153 -410 -79 63 -223 -233 -160 -109 -147
4502 -147 -164 -310 -17 -8 35 -244 -24 163 62 59 -43 -154 85 146 -93 58 -91 68 -161 -60 -197 -25
4524 -25 82 -46 11 -101 33 267 -195 0 78 -131 120 45 -75 153 -124 -141 -92 123 -95 -62 296 -65
4546 -65 63 -99 -99 105 -151 -69 16 202 131 -257 -134 -36 73 -77 50 -75 -34 155 -126 156 266 -67 -4
4569 -4 184 -67 -68 58 74 100 0 67 -26 -47 -106 -58 136 154 -189 -83 -90 -82 44 -114 75 0 216 -176 153 -51
4595 -51 -160 -68 -115 -34 -99 22 -207 201 -114 -173 -2 -32 90 -161 -8 350 57 40 -65 -58 -38 -80 35 49
4619 49 -161 -107 -67 33 -130 -25 -32 31 2 -173 149 -55 -174 177 127 33 165 -94 -28 106 191 82 -189 180
4643 180 15 -59 120 -28 -173 31 -95 61 246 130 -29 8 110 35 99 -61 -41 -128 -125 35 145 -165 -30
4666 -30 -112 -8 -2 -116 30 -44 -18 -44 9 13 103 -14 183 -120 -60 25 14 -83 -143 35 -169 -89 23 -93 -123 -102
4692 -102 -128 86 148 -157 -120 92 -45 53 -64 21 -48 46 45 -29 -289 18 98 37 -197 132 147 57 216 -203 -306
4717 -306 94 -154 -71 -31 15 -45 -245 -89 -10 34 -138 -5 8 -51 -72 -187 38 -17 -1 116 84 -150 2 -154
4741 -154 10 112 129 -79 169 -188 20 -10 17 -152 -14 -220 -49 235 64 43 15 15 -59 -151 -236 53 -32 147
4765 147 -186 43 -184 -234 -10 -14 78 -48 -171 128 24 174 -107 -14 8 -146 -36 -209 -11 -136 -41 -94 -10
4788 -10 -109 -127 -28 -61 5 223 -68 52 -139 -36 -77 171 3 63 -2 -15 -103 138 -155 237 -75 168 10 -103
4812 -103 49 -41 -236 -84 -155 56 -145 49 -125 13 -25 -186 110 -114 145 -150 -52 -111 -100 109 25 29 -95
4835 -95 251 -67 -252 222 -47 46 92 -209 104 127 -25 73 -181 -4 71 15 86 -40 151 -140 -252 -11 13
4858 13 -113 36 79 -68 -83 -78 -91 161 -132 246 -50 151 68 -28 -40 -110 -5 -112 92 76 113 -77 -181 -22
4882 -22 -37 -197 10 -39 154 121 217 -70 -45 81 -230 -112 -142 -259 323 148 -259 -74 70 -52 -760 -24
4904 -24 67 331 36 233 -349 308 -15 32 556 118 -140 -80 262 -49 -51 37 71 -89 -92 -35 -46 -24 108 -64
4928 -64 229 -163 -82 -233 -113 -68 -89 38 56 -47 -167 -126 -205 -66 -50 87 135 -26 40 186 275 -87 -78 25
4952 25 -29 123 91 -93 -59 -104 106 63 -75 -57 -67 -46 -51 -76 128 -2 78 21 133 26 -311 -74 -115 30 -102
4977 -102 148 -13 -117 -67 -222 16 -63 -313 -180 -10 -69 155 -175 -14 89 25 -107 58 -159 20 -130
4998 -130 -48 -140 265 -20 -112 -89 -119 78 22 -113 -49 121 9 -5 -103 68 134 -106 162 -191 -65 139 -14
5021 -14 76 -56 157 -29 -39 2 67 -188 12 -76 -81 79 -76 -106 -82 81 -211 159 16 107 145 -141 122 -168
5045 -168 78 18 13 -57 4 27 -8 -75 -155 29 -261 14 -53 30 214 -42 -242 -63 115 -31 18 -88 -12 61 -233
5070 -233 -95 -84 59 -145 33 145 22 148 38 -23 -197 30 236 -35 46 -132 17 73 71 89 -89 -132 83
5093 83 165 32 -123 66 -31 -71 256 169 -130 151 156 15 13 26 47 -23 109 -111 196 -209 17 -346 -129 102
5117 102 -106 -128 74 44 75 -54 -12 -169 -124 -46 144 -156 -15 -323 142 76 -142 -208 85 -98 -63 54 -171
5140 -171 122 76 51 -284 -60 154 108 240 91 -51 85 121 63 44 222 71 220 164 -88 85 -248 43
5162 43 -82 56 152 -41 45 18 87 205 -302 -212 12 38 -116 -31 105 79 -305 -159 -69 -271 -78 84 108 -25
5186 -25 -2 59 60 -177 12 -93 -72 -97 -112 -166 136 -48 54 47 257 32 30 -74 221 -53 153 -60 10 -197 -187
5211 -187 156 -23 75 -11 144 77 -81 -61 -63 73 -64 157 -172 165 -182 126 -73 -88 -26 -10 30 -236 7
5234 7 -10 88 71 189 143 -175 29 36 52 53 -101 31 27 92 -58 -23 38 68 41 32 -21 -12 -23 91 18 -241 -66 -46 89
5263 89 5 -55 43 -252 -208 19 -176 292 -166 45 102 1 105 201 39 -24 108 -148 98 8 -106 -194 68
5286 68 -100 -50 -133 106 -100 -103 204 -163 191 209 -117 -61 103 -165 -230 -20 53 -13 -105 59 136 -147 114 -98
5310 -98 -170 -11 44 34 54 -32 103 104 -21 187 -128 -23 36 69 111 -87 123 -34 -82 -28 -195 74 171 -103 -175
5335 -175 -32 48 136 -130 -34 23 80 34 43 207 -113 -171 -138 85 103 -196 -86 -3 4 68 -143 -74 -128 98 -184 -269
5361 -269 37 -16 61 -134 -130 -54 15 10 -5 -11 -15 47 199 -193 79 86 -132 53 47 106 177 -109 209 163 37 690 -161
5388 -161 197 118 221 -29 154 -36 -249 42 37 -44 167 89 75 21 -115 -16 -8 -2 -181 -128 76 0 75 3 -191
5413 -191 -252 94 -109 -136 213 61 -86 -56 -73 -104 -234 90 -10 -106 -121 -36 -30 119 355 54 -103 10 -42 -75
5437 -75 -40 177 174 -273 53 263 209 -31 -342 -121 -69 153 130 -28 -6 -69 -72 -96 -171 139 -115 7 113 23 169
5462 169 123 82 164 -71 50 -42 -236 -141 234 28 78 204 -139 3 289 -25 -72 265 58 17 140 -13 168
5485 168 -95 -103 39 141 67 74 -43 204 10 159 -55 -121 -1 103 -172 97 -42 -128 -12 -80 178 11 53
5508 53 -381 -128 -305 72 -160 -15 200 23 215 10 -78 -63 0 192 49 58 92 36 -4 60 1 -100 26 238
5532 238 226 31 -106 -60 91 127 69 -163 -49 -20 -38 -110 -311 -159 -48 -176 40 42 -199 -210 -60 154 56 -104
5556 -104 126 -135 40 -105 12 75 -31 96 316 -3 84 10 187 -157 81 0 -27 -15 -8 -143 55 -39 46
5579 46 -197 -142 0 125 237 -187 13 74 -70 57 -152 12 68 -5 224 -90 -6 24 -41 57 137 142 -161 99
5603 99 53 45 119 53 -116 -37 256 -128 89 66 75 139 -46 22 116 -120 29 149 -67 209 -147 -97 292 -133 44
5628 44 92 165 36 22 -1 38 -212 20 197 65 -16 -144 70 -36 182 -196 -28 -54 30 91 -300 44 -7 306
5652 306 -276 21 -131 89 -115 21 -81 -164 -12 -123 189 157 122 6 -141 -25 168 -39 18 -92 -264
5673 -264 35 26 47 -34 -95 36 -43 -89 -157 150 103 -91 179 33 -24 -54 121 165 89 178 -60 144 16 -296 -55
5698 -55 -28 -97 -191 -143 17 -85 65 101 -23 -3 58 103 83 8 199 -51 166 19 -132 -81 2 -56 23 -140 179
5723 179 94 66 61 31 128 37 156 100 221 54 29 146 89 178 -111 -70 153 -282 12 34 -72 -170 59 -316 83
5748 83 31 -109 159 84 34 -162 -26 264 73 -116 -276 -25 53 2 -8 -144 30 -90 41 191 160 78 -156
5771 -156 -13 42 -93 -57 53 -28 10 74 -252 -134 192 -2 -29 28 116 -7 48 45 23 43 7 115 -7 17 -71
5796 -71 -269 -1 155 257 -32 83 94 69 -28 156 146 281 20 28 141 -56 100 -6 -192 -113 198 76 -15
5819 -15 -138 -206 -74 11 -12 178 108 -146 65 -19 -108 20 43 22 120 100 -314 -63 232 -188 -172 -219 27 72 -101
5844 -101 -66 59 -26 209 -51 67 213 -221 76 -261 133 63 147 -61 288 264 -126 63 59 -208 -87 -103 64
5867 64 110 -76 67 -59 -223 15 -306 78 58 49 -75 1 -69 -58 -208 89 -66 254 -122 10 5 -118 83
5890 83 -41 110 74 157 22 68 47 -105 51 -162 -99 7 -85 65 30 -40 6 62 111 118 31 -30 -112 -129 34 -10
5916 -10 -32 93 -82 -82 -27 102 -184 111 -131 0 74 -75 156 282 56 242 -126 63 143 75 197 80 239
5939 239 245 164 -85 135 501 49 219 8 -128 -20 -66 250 81 26 198 -33 0 -232 42 -25 -128 -196 61
5962 61 209 -76 -168 -39 -98 72 75 -190 198 73 -178 -144 2 -5 -83 320 -125 -83 134 11 111 108 -3 -213
5986 -213 43 -82 228 -12 -55 164 -6 -134 -71 111 1 -71 227 -8 19 -57 -131 96 -100 33 -27 -207
6008 -207 12 -91 97 -69 181 30 -72 221 28 21 -112 -84 -118 111 143 -60 -133 110 -280 110 -115 -138
6030 -138 100 -91 307 -23 -170 49 128 -136 -175 45 -114 -99 99 142 -167 -155 -80 234 -169 -21 -116 22
6052 22 -111 -73 211 45 164 53 -52 -157 2 114 -10 -61 273 -147 -129 -205 17 218 -52 -34 -56 255
6074 255 86 -101 138 -153 -124 -162 -297 -144 -62 -120 51 -228 -3 -165 250 106 15 111 91 -4 26 305 62
6097 62 67 -18 -18 73 -145 -69 9 -23 75 2 -31 -98 -72 -140 82 -45 -93 55 -16 9 -78 18 -177 -201 149 82 4 318
6125 318 95 94 -124 -245 -24 137 181 -305 -221 -30 104 23 448 132 82 94 165 -118 195 106 189 -181 -26
6148 -26 55 -197 35 18 -85 -53 8 255 -76 -5 94 34 -36 -174 292 -77 -224 152 114 228 -71 -173 -122 40
6172 40 -40 -152 -200 -170 -78 28 -123 -15 57 -148 -79 66 120 60 97 -19 -27 -100 183 -19 80 23 8 32 -168 184
6198 184 -77 39 -69 -43 89 11 -71 -224 28 154 -7 130 34 71 -55 214 222 -35 -135 139 244 262 -161
6221 -161 16 -68 112 -58 -126 133 -35 55 209 21 59 27 65 297 -70 91 75 -45 -97 -116 5 132 120
6244 120 -103 -46 254 121 -186 79 25 -200 130 1 182 -21 -19 139 173 -289 -4 -107 -270 -29 -198 135
6266 135 167 67 -250 -42 -104 39 105 -37 -74 -94 -101 -45 83 -61 -2 80 111 41 211 -71 4 93 22 -121 358
6291 358 -158 -141 -108 72 63 -72 -15 178 -153 -57 -90 26 40 -21 125 -21 187 231 175 184 298 75 132 36 48
6316 48 82 -17 76 128 -123 48 -105 -56 -25 202 -24 -161 -145 -1 -1 22 -41 30 -115 -103 -173 96 68 -61 -273
6341 -273 -199 -96 -150 -42 -43 104 -253 164 18 -12 -48 22 -286 238 108 -193 46 57 133 277 198 106 -234 501
6365 501 426 -159 -217 -108 -446 -365 -168 615 -107 -407 160 787 784 -279 419 -175 -33 -199 134 -25 -110 -145
6387 -145 -112 -254 -86 -314 72 -98 270 178 346 -85 0 -197 413 160 375 169 -338 383 -428 -192 -95
6408 -95 218 -15 -258 -503 -106 -418 -325 -159 390 -189 175 -213 176 247 -66 -199 -151 -160 320 40 -112 187
6430 187 -372 -474 -40 -192 32 334 439 203 -184 170 190 155 -105 -269 -182 474 34 430 420 -118 155
6451 155 145 -125 -214 175 124 -281 639 190 517 133 -271 -297 -25 252 -47 -421 226 -417 -118 1000 18
6472 18 331 -60 -508 63 78 -200 321 -192 -168 327 -286 66 -302 -24 -9 -138 177 580 4 -867 105
6493 105 -122 77 -335 389 406 -345 334 85 -609 5 -232 -106 151 -59 137 -702 316 122 -522 271
6513 271 -223 -122 -66 -243 -390 117 -202 -81 331 -168 -27 577 -645 -367 -126 -150 -128 105 375 -352 -303
6534 -303 -493 -16 228 -155 -331 -14 59 -35 -272 -199 518 270 -123 67 55 -366 319 -21 -353 319 -560
6555 -560 83 -91 -498 -52 131 -85 136 -577 104 302 314 38 46 -91 -118 -229 11 13 -63 150 205 400 9
6578 9 -88 -267 118 90 143 -121 -65 -1 -48 61 -85 -438 2 -368 -353 185 -105 231 18 105 -237 6 -83 280
6602 280 -9 -174 204 93 -319 -123 11 58 -177 202 168 291 -173 -35 -30 -398 107 18 -92 -146 36 199
6624 199 178 14 -316 -254 577 -82 -306 -104 -320 -39 44 299 200 -24 64 -27 -262 366 55 -153 14 358
6646 358 -84 -50 -16 -158 206 -28 98 -185 -159 83 -45 -53 -43 120 -54 -38 153 -89 -53 182 44 -81 102
6669 102 -51 -145 -145 -209 97 298 110 7 -28 57 -25 -38 195 -67 -142 167 140 -28 -105 85 -61 -144 -10 -109
6693 -109 137 176 131 -200 -150 16 110 38 -113 -6 -44 -233 25 -102 139 98 258 83 16 -170 314 236 0
6716 0 209 111 -63 122 272 172 8 96 -97 -204 288 10 263 70 -31 223 -157 123 17 133 114 107
6738 107 145 -108 -122 115 -222 -236 -142 -126 -237 -278 36 -123 204 148 -139 -204 42 93 -15 -100 -43 -201 13 378
6762 378 146 -270 -172 89 43 -414 -186 17 40 51 -102 -323 76 360 290 -178 312 -298 49 176 -232 138
6784 138 332 46 -21 137 -17 -269 -157 -137 -725 771 -49 -273 -95 802 -240 106 378 -264 270 123
6804 123 -270 294 34 583 -123 -205 88 62 -21 -120 15 259 -54 296 -12 89 -224 84 -311 -109 178
6825 178 -226 231 -603 -26 13 -140 -138 -467 -472 -664 314 -16 118 -40 -471 -187 81 -189 205 66 -141 -65
6847 -65 80 -318 -412 -31 250 -162 -503 -607 138 -283 -34 -74 -420 -169 -123 -123 755 -35 -733 -33 -88 364
6869 364 -71 -349 501 31 -402 -423 -436 -27 -20 -416 -467 220 -401 91 -238 383 -37 754 575 100 447 -88
6891 -88 -126 -119 -143 -97 -52 -209 -4 281 328 -177 -113 724 49 4 38 36 161 258 139 161 6 -113 -222 52 904
6916 904 210 200 77 118 -326 -26 -381 207 -268 -471 719 -207 -415 -85 301 335 415 23 132 100 313
6937 313 313 0 -20 125 96 215 -381 35 -50 66 -71 -180 -619 -413 90 343 -38 -35 376 -279 -315 111 399
6960 399 -395 486 467 24 658 247 -310 -129 552 -413 -61 89 458 68 130 -84 263 125 244 -151 -241
6981 -241 -141 -142 -165 -94 -197 64 -107 -27 -38 176 268 -150 -122 13 -55 144 36 26 -27 -80 -39 32 -423 81 -113
7006 -113 158 98 242 152 -5 -113 235 -152 26 14 282 -79 -101 -37 32 -168 -95 -94 54 -32 -90 -166 -199 35
7030 35 104 -72 130 189 -103 9 -133 129 -209 45 -13 94 33 266 -4 -295 130 -35 -174 -362 -12 126
7052 126 -230 -7 -180 141 -302 -117 -55 112 5 -99 -30 44 47 -71 61 -50 72 34 57 -153 -44 31 34
7075 34 -98 87 -130 34 159 -81 201 -77 -26 41 60 -23 -10 -54 -165 123 22 135 -60 116 38 217 -21
7098 -21 -62 -126 -53 -130 -10 -134 61 -109 227 -176 72 10 72 121 -128 205 25 -6 -32 -35 56 49 81 -128 132
7123 132 -194 91 188 -315 100 -88 -49 190 31 106 4 -1 100 -236 -72 -110 -4 52 -256 -7 -76 -208 -92
7146 -92 -85 -91 181 -32 16 8 -34 114 -114 -55 -22 44 -20 250 -171 51 80 142 90 149 11 24 -44 -25 141 55 -82
7173 -82 68 -96 -110 33 -124 89 -163 -88 -146 -182 22 99 -163 -84 -153 186 153 131 -193 122 -226 -273 265 -91
7197 -91 -54 108 -53 -118 242 -245 6 -132 43 67 38 -38 -130 243 77 113 165 129 35 -14 -136 -33 110 90
7221 90 203 -83 -67 185 46 119 -11 -233 -109 -82 99 -129 49 7 -31 -45 -89 -87 -22 -266 -252 -25 109 -250
7245 -250 5 47 -212 -90 -57 114 112 -56 311 497 185 -287 -62 382 600 361 -140 -113 -189 112 120 3 75
7268 75 -67 -74 -41 -167 83 31 -201 -88 -180 243 -53 259 -107 -27 -51 -160 7 -150 210 99 128 -34 -69
7291 -69 25 -45 -70 -77 -184 -157 -309 0 126 52 -169 49 -60 78 35 14 27 181 -233 -79 79 -92 -38 -234
7315 -234 148 -250 -125 -61 45 -67 -41 -77 -144 -161 -333 -52 -123 144 56 -158 -81 79 -178 -162 -19 -141 -85
7338 -85 -25 -15 -82 155 -176 19 56 -156 -162 -29 -93 -16 165 45 88 -56 -197 117 156 54 88 51 -101 -15 -89
7363 -89 -50 88 -15 205 58 -13 -16 -110 99 -193 0 -177 -218 -62 -192 -104 205 -14 150 -27 76 125 75
7386 75 100 -229 -6 300 -148 123 71 88 -53 415 90 60 -65 95 131 -92 -264 -97 -82 -224 -146 41 -62
7409 -62 163 -25 220 -190 -90 -106 184 -89 -103 -66 4 72 -37 169 43 -134 -136 144 -95 -33 -123 -42 -6 -136
7433 -136 -142 120 -119 -14 40 -271 -1 43 219 -134 80 80 -235 38 17 153 -121 4 -134 87 -194 -130 -171
7456 -171 108 -50 -105 24 -114 -93 -231 185 114 -100 117 -200 -58 30 152 83 60 378 -7 -310 -20 -227
7478 -227 -472 -768 73 -281 803 39 -6 249 -331 442 -494 238 -92 331 545 307 248 60 -386 -68
7498 -68 159 10 23 103 43 15 -99 -2 33 12 -95 -114 -32 -22 60 34 -137 -29 -353 -111 40 -184 -147 -1 47
7523 47 -166 -153 63 288 -330 82 199 227 221 53 243 6 170 -211 369 69 100 -78 69 69 258 14 -392
7546 -392 327 119 135 221 -347 -192 273 -353 -301 -135 -28 -225 -99 -360 -260 239 62 349 -156 144 257
7567 257 -158 54 264 -490 -389 24 -328 505 -187 -296 -288 342 332 48 386 299 76 95 756 -224 -64 -447
7589 -447 46 639 -613 972 632 -177 244 -251 240 213 -318 116 42 -29 42 -18 172 -183 21 14 -43 57
7611 57 51 15 139 -48 203 10 20 166 58 -135 -50 1 20 88 -89 -150 -24 -243 -41 -77 76 -100 277 15
7635 15 -201 -5 41 -141 -20 128 -81 50 46 -46 149 118 38 217 20 101 166 119 -35 -148 4 -294 -101
7658 -101 17 80 31 -51 54 -139 -266 -33 181 -93 7 -137 62 -118 -105 -233 -29 -23 -65 -305 28 131
7680 131 140 79 -46 12 -259 -68 161 -55 68 203 295 271 47 34 178 -104 -167 -72 -140 -45 -5 31 51 -69 -79
7705 -79 8 -70 -114 81 -9 135 95 -179 194 -94 -118 361 -26 19 -95 55 15 -164 20 -24 -10 -65 -39 97
7729 97 -53 -36 -143 -22 16 -137 124 -157 -42 13 -217 -28 -116 -148 169 -127 -196 -38 128 -106 61 66 -21
7752 -21 18 -114 -134 -36 -90 -117 -139 -84 167 80 144 -123 54 24 -97 -135 -97 35 64 23 -105 -83 63 106 67 -153
7778 -153 85 -65 -58 -79 -216 20 42 -189 237 129 145 74 -276 188 -7 19 -25 81 -47 44 0 73 -173 -53
7802 -53 9 -15 -51 -125 12 -83 -108 55 -128 245 5 -12 40 59 72 156 2 -106 -187 156 -19 43 -42 -46 259 -156
7828 -156 169 -120 9 48 -66 43 177 -89 -43 -305 130 64 -3 -51 -22 31 200 62 141 -57 -94 134 61
7851 61 65 59 -253 -58 49 202 -141 105 127 -53 2 144 49 -207 -162 102 -229 140 -226 -218 -102 -149 172 141
7875 141 -47 46 139 -267 -221 79 -40 -126 83 102 -83 66 110 -39 79 179 37 143 -9 124 10 -102
7897 -102 -71 -8 282 300 76 -4 14 99 -19 278 -2 192 -166 -161 -128 238 228 -2 76 11 13 -121 25 95 -55
7922 -55 -130 -200 -109 113 -5 15 120 51 46 74 -48 57 -12 210 -155 -13 -105 135 35 -95 -4 -101 222 -67
7946 -67 14 -104 -13 -100 176 -6 -154 -18 67 133 95 0 151 -82 142 152 -115 -102 -191 98 123 46 157 17
7970 17 -177 175 74 276 -125 152 -232 119 -4 -21 106 67 -69 -75 -98 -46 113 114 -18 146 -167 -76 -87 8
7994 8 88 -167 72 157 -27 -88 -111 29 26 7 313 -201 173 27 -127 -316 -97 -105 226 -162 269 -80 166 -179
8018 -179 179 -201 -36 -109 -157 41 17 -127 -8 143 -99 68 304 290 869 -135 -298 35 109 201 876 65
8040 65 573 359 -392 48 201 -236 272 377 295 291 -97 -254 836 276 -221 -218 -132 -103 -256 148 -110 104
8062 104 -84 -208 257 270 761 276 -114 287 236 -225 171 36 99 241 -148 -1 -17 320 679 -304 -594
8083 -594 173 -419 -115 -37 462 57 -140 58 -36 -8 -418 -53 -572 861 588 136 -694 -60 234 -10 20
8104 20 383 -77 -181 -63 -549 83 73 -257 227 -180 47 -354 -139 -320 -25 387 -17 657 319 38 49
8125 49 -272 -105 388 -109 217 244 -3 -19 211 333 182 -2 29 -99 31 -56 8 299 215 -263 140 -43
8147 -43 91 -549 167 10 185 1 -125 277 76 -93 -155 56 110 -201 79 22 -64 -97 -86 -449 101 -88
8169 -88 85 -30 33 73 -7 214 28 -170 -98 -314 42 15 -154 -213 -73 -352 16 8 -320 94 -3 -12
8191a2
$$ Imaginary data points
##PAGE= N=2
##DATA TABLE= (X++(I..I)), XYDATA
0 0 0 0 0 0 0 0 0 0 0 0 0 0 -8 8 -8 8 -16 16 -17 24 -32 33 -40 48 -57 71 -80 94 -105 121 -143 161 -185 209
34 209 -239 266 -302 337 -377 424 -471 522 -582 644 -712 788 -872 960 -1057 1167 -1285 1416
52 1416 -1560 1719 -1898 2096 -2322 2580 -2877 3223 -3633 4127 -4738 5514 -6539 7964 -10097
67 -10097 13683 -21275 75424 -150522 -91379 163281 -54341 -69069 73562 18610 -68076
78 -68076 -3017 21176 77247 -22577 -54504 28605 29801 -67145 -10415 86569 -50600 -65449
90 -65449 40920 14238 -23862 4926 -6552 -15389 1326 -53143 47059 31167 -80311 6919
102 6919 28945 -47645 5826 42019 -44189 -15995 -11625 -2388 42376 -25499 -26923 9824 -3801
115 -3801 -13259 40648 -387 -47921 23541 10150 -25800 28408 25218 -66970 21765 53099 -56673
128 -56673 28576 53770 -51585 -9613 53753 -19812 380 29756 -21360 5440 4432 7627
140 7627 29865 490 -22966 10272 14699 -4756 22529 2399 -22768 1314 23033 -859
152 -859 3148 9594 -31476 7450 24481 -15231 3805 10159 -26064 -47 16332 -12011 7245
165 7245 -10185 -21658 12486 583 -9775 6805 -9593 -17433 6081 -5908 -5061 8511 -17933
178 -17933 -16831 14631 -3572 -20086 20569 2293 -44981 7044 34147 -23471 -12101 16537
190 16537 -14435 -9165 14731 6308 -4560 -14885 -1615 21745 -5260 -8108 19481 -3318 -16210
203 -16210 13844 18189 -6977 -332 3496 -432 8321 6587 3577 5505 -1046 -8382 19869 12766
217 12766 -12258 8259 9604 -6526 2088 16460 -165 -3915 -4577 3044 13107 -6558 2717
230 2717 7330 -7979 -7638 17337 4307 -16432 4030 -2530 -6684 632 5573 -9069 -5347 -915
244 -915 -8431 9193 -3452 -7984 -3495 -2694 -7072 604 2718 -12394 -2562 -9282 960 928 -6315
259 -6315 -3064 -2820 -4324 -6505 13729 -5030 -9618 2314 -890 -4555 862 7878 -12452 1140
273 1140 1293 2650 6151 -479 2960 -1065 3318 -436 12012 -2017 -3418 6504 -1106 6889 3550
288 3550 6314 -3438 5430 3303 3781 10914 -2760 2296 995 5843 -2066 7804 2902 -7725 6353
303 6353 234 5595 301 2378 -3512 63 1045 -826 6250 -9298 753 -990 -627 -1189 -249 -2448
319 -2448 -10162 2355 -4952 515 -2712 -2896 -4305 -3261 1549 -6257 1888 -8652 -4755 -1860 -2057
334 -2057 -1152 -2748 -398 -6991 2586 -3116 1494 -1030 -6136 1040 -1844 2308 -2630 4062 -4402
349 -4402 -1851 3670 1845 2270 -1620 5186 -1907 3901 2841 3092 2286 -3713 4663 2892 4299 1375
365 1375 6259 1031 344 6467 2030 4037 -1546 2413 1498 3177 2791 1588 3495 -2109 1912 1400
381 1400 3665 -1029 -902 1161 -1345 1697 -1042 949 -2797 -2864 -1633 447 -124 -3083 -750 -2645
397 -2645 -769 -3751 -1704 -299 -6312 -5758 411 1159 -5703 -1700 369 -4334 -4994 1007 447 -6845
413 -6845 -3450 1107 364 -3311 -1211 2368 -2549 -6421 1796 5204 -4502 -3069 5662 1374 -3368
428 -3368 4572 4622 -2866 -2084 4542 2887 -1205 1924 2924 3178 657 2334 4946 3942 -330 707
444 707 6565 1223 962 2996 2146 -1765 2194 4777 -1415 2950 2296 746 1647 4490 -1769 -2322 6310
461 6310 -3562 -5491 2698 5087 -6693 -2087 5128 -3384 -2207 -1090 2036 -4274 -5154 -1021 3505
476 3505 -2633 -9958 4683 195 -9212 -3737 8500 -6140 -13321 6820 2779 -7140 -4725 6049
490 6049 -3799 -5261 1299 -33 -458 -7527 2255 3631 -1859 -5416 3829 6171 -7484 -214 6503
505 6503 3179 -8188 5703 7366 -7356 1416 5461 2830 -3552 4777 1878 1870 4755 452 3489
520 3489 -5 3227 -525 6524 896 -5155 5981 4407 642 -2354 4552 -1071 3230 259 -3057
535 -3057 6013 -3055 -1335 2100 2904 -6527 -523 6186 -4260 -4500 298 5840 -8210 -1479 2644
550 2644 -3382 -2724 -3989 2923 -2386 -4908 -4721 3526 -1797 -6058 1731 -2611 -2116 -4556 5477 -1349
566 -1349 -10294 858 5589 -3142 -6721 4888 -3083 -109 1812 -1448 -353 -1934 4102 -9 371
581 371 -1011 1576 2554 1166 213 -91 5114 -1563 4220 2621 -817 4117 740 1906 3133 2008
597 2008 -3441 5040 3249 -82 1937 356 3615 -198 3217 1772 -2318 36 3377 1293 -1950
612 -1950 954 -1730 3054 -482 -2160 1450 -1550 -762 -710 875 -1941 -2786 -591 1598 -3953 -3720
628 -3720 2388 -4340 -2046 626 -2583 -3090 -1387 146 -895 -3093 -3527 1010 -1380 -1315 -1483 -3544
644 -3544 -152 -392 -1025 -1039 -1604 -134 1301 -359 748 -147 -1300 2196 -328 -1497 1694 690 6
661 6 1755 1227 2407 1022 389 2719 805 913 1429 691 1529 2780 688 1978 1981 390 3538 878
679 878 -283 761 2893 1995 -583 131 1899 1195 -1192 2101 -1008 -1183 1393 159 -393 -1991 901
696 901 -290 -1512 -1477 840 -1465 -2235 852 -2910 -628 -2243 -1306 -1796 -2689 -789 -1464 -560 -2332
713 -2332 472 -2530 -1029 -1239 -2383 104 -3021 -203 -1567 483 -974 -390 423 -1234 843 -1308
729 -1308 1853 -2366 784 1365 -552 1616 -183 2394 -703 2238 652 2009 1029 593 3024 -542
745 -542 2748 292 2403 911 1272 2133 409 2704 41 3185 -302 1463 611 808 1692 -1659 2678
762 2678 -543 1420 -748 1060 66 -1221 1295 -1846 701 -2238 1054 -1311 -1474 352 -1625 184
778 184 -2868 625 -2291 -601 -1240 -1706 -763 -2935 966 -2937 -594 -2066 -489 -967 -1934 486 -2321
795 -2321 249 -2552 311 -1271 -596 365 -1513 1185 -2120 1479 -955 386 -714 174 1337 -1061
811 -1061 1874 -371 2460 -63 1069 1738 450 1645 198 2230 -587 2183 789 1403 1885 413
827 413 2811 627 2468 203 1889 911 54 1295 340 1287 -969 1935 -158 204 512 -348 945
844 945 -1393 475 -444 87 -2069 140 -114 -2171 51 -1211 -40 -2139 -1024 -896 -1271 -1395 -1539
861 -1539 -22 -2211 -426 -1030 -667 -1406 -1624 -212 -1633 -599 -1134 -1173 -475 52 -1320 312 619 -1870
879 -1870 671 391 -696 174 138 34 503 173 272 1182 263 764 1509 1113 396 535 2294 1487 -845
898 -845 1669 2319 -116 1443 1462 1288 623 752 1914 810 -368 1528 1991 -489 932 185 853 598
916 598 -854 1380 685 -1580 -329 1904 -1795 -931 527 -723 -601 -1492 131 -1779 -1024 -78 -1158
933 -1158 -854 -904 -1533 -672 932 -4135 -263 347 -2568 -293 -1389 -941 -1115 7 -1469 426 -1264
950 -1264 -1317 846 -1056 102 -2027 1178 384 -1524 1100 705 -947 -900 2715 -144 647 -260 1025
967 1025 1771 -1382 2630 173 891 1139 1563 764 1166 551 326 4098 -2907 1469 2690 -584 896
984 896 1349 1318 -1280 2590 61 433 -27 635 359 -747 2230 -2433 1135 -24 -1251 979 118
1001 118 -1489 -1013 1675 -3083 976 -1800 -1504 949 -1668 -836 -1762 567 -1220 -925 -1658 -369 -1253
1018 -1253 -2443 1424 -2724 -252 -465 363 -646 -1699 790 -1002 -233 -1436 1010 -1185 412 -463
1034 -463 -355 2641 -2031 1482 1270 -513 59 2444 -412 -948 3309 -478 1184 281 1686 1897 628
1051 628 1404 33 1982 -155 1038 910 606 654 1510 1663 -1720 2502 382 101 536 72 425 179
1069 179 101 -896 1588 -1337 828 412 -1742 568 -539 -500 -1547 106 -1131 -635 -408 -860 55 -1222
1087 -1222 -498 -1306 -407 -1463 -1026 -319 -2130 -302 -135 -1045 -1758 962 -821 -1070 198 -1313 -81
1104 -81 -424 -647 -338 182 -366 578 727 -920 844 875 -47 -358 1235 299 -96 1009 347 580 1185
1123 1185 521 706 1321 135 1058 1186 51 1084 1398 232 652 1507 724 775 840 272 843 746 74
1142 74 -87 497 -155 1010 37 -756 314 805 -661 -912 358 -868 -76 -179 -911 -355 -493 -541 -845
1161 -845 -246 -1606 389 -727 -1594 -388 -626 -762 -1695 -65 -1498 -376 -699 -920 -221 -651 126 -1001
1179 -1001 76 -1033 317 148 -1236 294 -223 772 -642 675 -354 391 666 -249 1075 -119
1195 -119 871 -68 1213 499 961 1588 -274 1409 198 1193 80 842 685 401 1569 -399 1533
1212 1533 136 865 285 669 275 59 1533 -960 1273 -151 524 -90 33 307 -757 828 -1347
1229 -1347 654 -1106 -99 -383 -1020 -163 -1027 387 -1766 144 -984 -954 -493 -1143 -229 -1518 162
1246 162 -1727 -114 -851 -1091 -125 -1298 105 -961 721 -1084 453 197 -767 135 -740 879 -930
1263 -930 795 -456 -55 445 -204 1240 -500 1316 72 1371 81 418 965 -173 1147 -155
1279 -155 1270 495 1083 594 698 900 170 1500 -596 991 290 751 424 180 1021 -333 992 39
1297 39 457 40 109 134 -437 284 -745 459 -819 -470 -373 -668 -105 -1005 53 -1137 -109 -1174 -593
1316 -593 -683 -981 -136 -1031 -317 -956 -223 -726 -320 -858 -839 -100 -999 -72 -771 -53 -251 -655 -57 -350 -71
1337 -71 -116 35 -494 413 236 184 918 -7 553 223 579 524 567 127 612 686 749 969 -63 1020 494 416
1359 416 1158 362 592 925 481 437 737 -59 430 621 303 565 121 621 460 289 281 0 -939 86 -432
1380 -432 -334 -70 -418 -178 214 -492 -515 -315 -1028 -273 -419 -1186 -442 -1401 -2 -347 -1319 -483 -471 -887 -10
1401 -10 -379 -1424 398 -935 -79 -227 -1054 55 -401 157 -215 -428 -276 635 -672 511 445 -1074
1419 -1074 1438 201 258 609 -183 282 794 463 -551 984 -215 1284 545 488 1310 13 2065 520
1437 520 56 285 498 -83 944 256 -724 1617 -491 1032 351 -232 456 157 661 -62 -125 -759 953
1456 953 -858 134 300 -1574 661 -514 32 -592 -763 -556 139 -211 -1122 -60 -1240 476 -780
1473 -780 -605 -366 -1711 661 -226 -822 -523 217 -1043 485 136 -1335 970 -1020 475 67 -939
1490 -939 -30 211 389 324 940 -384 896 -198 1136 589 -833 1489 160 841 610 189 107 1424
1508 1424 584 41 631 -766 2094 -28 66 661 -277 834 429 208 43 871 -568 928 463 -377
1526 -377 665 -647 470 -275 -112 -348 -404 -2 329 -205 -856 285 -1375 482 -321 -1416 275 -657
1544 -657 -520 -183 -582 -1312 358 -571 -714 -267 -1401 351 -561 -484 -74 -620 -258 -92 -323 -516 -118
1563 -118 -359 256 -484 -104 622 -463 578 286 -159 79 157 2 774 380 -136 1028 -185 894 1084
1582 1084 -316 534 810 526 439 414 200 766 516 488 519 321 555 478 274 174 189 591 439 -645 370
1603 370 126 -638 79 -82 -92 -128 -216 -249 180 -664 -386 -205 -1020 -153 -370 -522 -861 -320 -203 -617 -817
1624 -817 -463 -243 -450 -126 -773 -143 -495 -124 8 -679 -358 -202 -200 -744 184 10 -147 173 -352 739
1644 739 104 203 21 341 243 238 539 -173 545 74 491 51 450 728 218 1092 208 691 575 620 109 292
1666 292 384 237 897 -295 696 433 553 57 6 217 -179 631 -314 576 -45 -60 95 -359 -126 -465 324
1687 324 -889 9 -149 -14 -170 -519 117 -1094 85 -1229 -178 -543 -672 -78 -782 62 -707 207
1705 207 -827 -291 109 -788 -2 -677 201 -560 203 -576 128 351 -437 527 -386 449 -297 233 -128 103
1725 103 572 -361 329 166 710 62 396 251 497 895 -312 829 126 470 291 515 391 47 985
1744 985 -477 537 97 386 355 41 332 -272 721 -470 97 -257 88 462 -14 16 -370 370 -713
1763 -713 78 -306 -332 -109 -638 -137 -547 67 -460 -38 -572 -691 -158 -641 -153 -634 -151 -742 -43 -178
1783 -178 -565 12 -715 -283 -570 57 -291 -27 120 -402 106 -132 198 -308 -120 -327 186 225 13 444
1803 444 -48 513 144 491 659 634 423 189 559 276 342 241 407 420 199 358 304 365 256 659 136 260
1825 260 50 33 129 -325 162 -332 182 310 -65 -5 84 48 -187 -32 -124 165 -291 -54 -266 -377 -224 -348
1847 -348 -297 -247 -247 -356 -138 -348 -243 -439 -327 -357 -460 -142 -749 -369 -481 -206 -255 17 -247 -167 31 -279
1869 -279 43 -148 73 55 45 179 -312 108 123 352 -139 215 133 317 605 247 308 -206 577 271 351 319
1891 319 217 416 279 668 41 201 81 468 601 49 224 -81 392 -68 187 -214 -58 356 -196 61
1911 61 -310 -5 -513 405 -21 -388 -255 -384 -4 -651 -69 -665 -355 75 -387 35 -764 -199 -429 20
1931 20 -844 -302 -172 -547 141 -806 46 -400 172 15 -206 -148 -261 331 -123 422 -617 50 325 -88
1951 -88 571 -247 470 -211 614 313 78 143 0 659 -122 584 -329 381 545 502 659 -135 414 180 775
1972 775 -133 182 -44 200 804 -570 444 -223 109 33 -76 -135 -119 273 -21 205 -599 45 -175 -341
1992 -341 0 -897 -180 -557 137 -244 -16 -608 -444 -76 -370 132 -906 -314 -283 -214 -133 -775 -306 -310 -98
2013 -98 -317 53 -621 176 315 -490 15 -299 -21 -35 -65 -282 -4 58 -116 584 -283 499 306 104 211
2034 211 125 412 145 224 406 352 16 498 628 69 586 102 414 286 394 533 56 53 286 315 -159 153
2056 153 -83 60 325 -98 65 -41 21 -173 -76 -277 -61 -70 -178 -31 -349 -289 -248 -441 67 -163 -242 -347
2078 -347 -35 -71 -248 -509 -269 -334 -130 -340 -274 -186 201 -20 -185 25 -291 115 -440 -67 23 -250 -93 119
2100 119 -4 -115 62 33 349 -51 220 409 213 493 229 210 -44 63 328 395 456 -21 279 -41 423
2121 423 371 94 121 224 444 58 102 177 396 69 93 84 -94 161 -9 219 -361 -62 -177 -25 -319 -133
2143 -133 257 -400 -4 -351 57 -134 -415 66 -410 -40 -511 119 -764 -151 -13 -347 -63 -375 60 -509
2163 -509 78 -291 -130 -60 -153 -179 -279 253 -122 189 -236 -134 331 -361 272 -65 418 -287 185 353 95
2184 95 286 -74 543 -152 193 437 521 101 196 555 26 565 -168 509 274 240 208 -188 449 -185 514 -41
2206 -41 458 105 28 63 -56 561 -140 244 -105 -262 -300 -147 -157 -393 189 -570 52 -231 -217 -206 -271 -131 -407
2229 -407 -192 -615 -184 -57 -448 -159 -313 112 -427 85 -248 -230 -70 -351 75 -102 90 -443 76 -59
2249 -59 46 96 1 290 100 60 127 -5 -113 364 165 151 400 111 306 33 204 134 217 392 71 460 155
2272 155 215 220 434 171 383 39 -193 209 -270 231 256 28 -50 326 4 -340 -156 -230 -118 -423 -46 -31
2294 -31 -238 -31 -270 190 -264 -12 -48 -45 -373 27 -215 -372 -38 -394 -195 -74 -229 -315 -180 -235 -319 -13
2316 -13 -299 -57 -202 -215 -89 -359 -233 35 102 73 154 -3 148 -100 143 -31 -26 215 88 67 146 446 -96
2339 -96 137 276 -121 603 170 182 106 200 336 129 149 -139 294 -156 420 -37 237 5 -59 280 -246 -4
2361 -4 63 7 61 146 -199 -150 -122 -339 51 -359 -98 -97 -283 109 -58 -164 -559 17 -356 -32 -148 -363 45
2384 45 -390 155 -428 -291 -105 155 -217 -3 -25 -142 210 -748 107 10 -89 -59 -109 17 -186 67 -56 244
2406 244 45 172 360 -232 452 -311 248 273 342 297 -108 125 336 30 -326 252 129 175 431 -40 226
2427 226 69 243 77 275 -1 160 -36 42 375 -217 395 167 -131 74 73 54 -257 33 -333 -56 -510
2448 -510 -17 -78 -500 185 -315 46 -221 132 -324 -371 -136 -224 5 -491 -240 -247 57 -241 -221 236 -235 -15
2470 -15 -230 23 -233 1 -183 -26 109 -337 310 -211 225 -29 -64 -61 392 203 -90 258 -74 315 28
2491 28 61 193 152 189 155 304 37 110 2 301 204 -145 352 -167 360 254 -110 -139 -66 94 4 -125 2
2514 2 18 -155 188 -61 -342 -206 8 46 -221 -52 -175 -4 -27 -100 -165 -90 -276 -114 -288 -174 -239 -4 -163
2537 -163 -353 -175 -17 -212 -15 -192 44 109 -75 17 10 44 -164 -117 -163 160 -24 114 17 41 310 113 -63
2560 -63 -13 237 193 139 373 213 91 23 138 138 391 42 50 -50 115 124 115 265 359 251 184 76 322 157 12
2585 12 -113 -53 -171 240 128 -43 32 181 4 99 6 190 4 -26 -50 -78 -137 -103 -466 -233 -254 -329 -164 -193
2609 -193 -116 -59 55 -387 18 -134 -149 192 -526 -95 -253 46 -104 157 -37 83 -85 -162 207 -45 44 241
2631 241 272 146 -3 209 29 344 92 178 105 -69 103 156 393 -137 437 118 264 97 413 273 -173
2652 -173 346 -32 397 80 209 335 140 531 -13 263 42 14 -170 -127 -133 228 3 -117 256 -13 112
2673 112 -210 61 -88 -254 156 -460 30 -315 -106 -23 -284 -144 -286 -200 -53 -115 -228 -244 -108 -343 95
2694 95 -222 8 -504 142 -177 -217 83 -106 2 -214 130 -120 13 5 -87 86 45 269 -3 108 -43 134
2716 134 181 5 314 194 285 97 299 -1 299 231 -5 141 32 139 -208 13 93 -190 71 139 69 127
2738 127 17 41 142 122 96 120 -245 -40 -252 -164 -252 170 -432 -30 -28 -231 -164 -245 -176 -211 -305 -156 -206 -188 -119
2763 -119 -287 -263 -22 -247 -201 -164 -125 -317 -128 204 -218 -161 18 -67 -103 -177 -23 159 109 27 247 -19 114
2786 114 90 75 119 17 -105 28 5 49 177 -5 -36 157 146 -26 75 359 76 68 89 48 204 63 41 -117
2810 -117 91 -252 158 -35 176 -34 40 172 -79 174 -280 -33 74 -109 33 -192 -106 -233 -6 -41 -230
2831 -230 -193 -114 24 -504 15 -282 -47 -363 -190 -490 47 28 19 48 -360 63 -74 178 82 -204 37 -168
2853 -168 7 71 513 10 98 67 -24 221 16 56 116 57 133 85 53 -49 355 120 287 -92 262 421 43
2876 43 291 12 159 20 397 121 35 14 120 197 -235 9 -173 116 131 48 110 -100 67 100 -53 -428 -26
2899 -26 0 65 165 -290 0 -152 -153 -96 -75 -344 -166 357 -469 10 -240 -51 -281 -231 -51 -181 -83 12 -73 -229
2923 -229 45 -51 155 72 -409 124 -256 -112 -34 159 -4 -100 153 -116 58 -278 309 -18 210 132 36 393
2945 393 -94 178 358 32 -52 132 204 -7 364 -214 382 142 0 76 10 140 41 -40 -224 72 -261 67
2967 67 173 -96 181 -200 -53 129 -13 -304 145 -243 96 34 -267 247 -276 -135 -2 -213 -109 -118 29
2988 29 132 59 -399 42 -192 -130 -61 -304 -66 51 168 -50 -130 -92 173 -225 -228 158 -152 19 204 2 193
3011 193 -65 -66 222 134 150 112 72 -68 111 -61 58 162 85 313 246 257 94 -113 346 217 34 150 -45
3034 -45 -64 -261 71 190 104 -183 -116 -50 22 155 -27 10 55 137 -11 -200 265 16 82 -211 52 -87 -319
3057 -319 19 -56 -57 -99 -95 -235 -163 -304 -441 -12 -328 -85 -296 -83 -405 -93 -157 -130 13 23 -65 -194 194 -52
3081 -52 152 81 -168 26 -169 175 109 -33 -34 179 5 -49 36 -213 224 242 62 -120 -48 243 221 302 10 -118
3105 -118 -113 355 187 347 349 196 28 -238 50 71 179 -12 8 127 229 -103 -57 215 -173 263 70 -67
3127 -67 125 27 62 -309 71 -43 -95 113 -153 -154 -395 -31 -184 -257 -237 -256 -398 -174 -30 -66 297 -67 -3 74
3151 74 -84 17 -102 -130 -14 94 -190 -119 25 -95 37 -61 69 150 168 56 -226 189 187 311 53 188 101
3174 101 290 34 182 276 85 227 -75 177 87 92 40 -45 237 -130 96 108 114 -442 28 -39 -111 48 -248 -67
3198 -67 -57 -116 -103 164 233 -106 60 23 -148 -168 -191 60 -265 -106 -75 -124 -88 11 -197 -168 -130 -85 39 -261 264
3223 264 34 -182 -2 -288 -67 -155 -159 -247 145 3 -27 -180 21 72 -140 159 -94 125 -158 206 -73 -107
3245 -107 30 42 2 65 222 7 91 142 182 -28 114 374 -90 210 153 48 -59 -44 -188 -190 87 -133 -61 -138
3269 -138 -29 164 15 -82 -12 59 122 86 134 22 -39 -251 30 -270 25 -295 76 -120 -335 -273 -62 -102 -231
3292 -231 -94 -102 56 0 -3 167 -120 -66 -117 265 -43 -112 197 79 9 -81 195 -157 179 -117 -145 36 8 -30
3316 -30 59 -2 70 201 -44 219 49 96 36 197 24 -93 62 171 -40 86 -172 193 -119 -12 1 -57 211
3339 211 203 -176 78 32 84 116 -147 190 -13 78 176 -51 -116 -182 50 -192 -80 104 158 55 -227 -339 50
3362 50 -379 -37 155 -260 236 116 -132 -18 -326 -142 -63 -253 7 42 47 -37 317 -80 176 -80 -70 -34 30
3385 30 28 -62 -96 -138 42 -24 334 16 -156 131 119 45 -218 111 49 155 300 13 214 311 197 -336 -151 103
3409 103 -50 -218 -2 -41 316 360 -201 119 26 188 46 -77 59 -199 24 96 -114 -87 -273 96 -200 -63
3431 -63 -38 46 -7 -11 -159 -97 -160 -114 -51 205 -94 -306 -66 -71 329 -133 36 -95 85 -26 -121 -360 -30 110
3455 110 74 -299 105 -144 -23 -160 -30 17 -92 -105 93 -36 -82 -201 30 62 -282 -115 158 -19 42 29
3477 29 114 267 57 -99 -36 331 -16 157 -60 217 79 72 162 59 196 193 303 77 -141 150 1 -182 -155
3500 -155 171 100 182 -37 197 -182 -142 -215 -63 197 -160 -182 -178 61 -78 -77 -32 -88 -187 -158 -28 132 3 137
3524 137 -358 -5 -541 0 86 200 -162 203 -73 45 258 82 240 -25 -175 -81 -30 219 87 190 12
3545 12 291 44 -96 163 -145 41 205 359 46 165 82 37 185 92 40 121 190 -76 17 -54 -34 27 67 229
3569 229 113 189 137 73 136 -108 -11 -18 45 -100 90 -187 77 249 128 115 -54 8 90 22 -18 15 -70 -238 -81
3594 -81 -53 2 -52 53 -10 -296 -118 -88 222 -89 58 0 53 11 57 116 14 -100 -48 12 -109 -40 241 38 87
3619 87 -24 7 -138 122 90 167 108 -279 265 47 301 -75 -63 -267 209 0 165 75 44 247 95 283 -214
3642 -214 29 88 -150 -107 -56 173 -37 129 -44 -89 115 -11 -142 -19 164 56 44 31 -14 23 37 50 -133
3665 -133 -199 -25 -152 -242 -206 -41 -166 36 -310 -258 -19 -77 -300 -106 -144 84 -38 15 -277 -224 87 91 131 -4
3689 -4 -14 157 9 -107 -43 203 221 46 243 -27 -124 2 52 115 113 -72 244 48 -81 79 -15 28 -65 117
3713 117 100 25 47 -66 235 236 78 -119 76 13 -150 132 -173 -154 -99 176 -220 272 -175 -324 199 -17 -196
3736 -196 -79 -59 -84 -8 -168 -136 -353 161 84 -302 -145 -133 -40 -86 -144 -97 -33 -26 -345 -101 -285 -218 -17 -93 89
3761 89 -17 -17 159 -86 -42 -147 -59 -133 -153 32 292 3 -101 183 76 55 50 136 9 127 55 -158 271 121
3785 121 205 -62 248 15 36 96 199 4 -14 -178 -55 158 -128 -20 -19 -77 263 75 -10 -18 138 -130 56
3808 56 12 -80 -75 -71 -304 -8 -27 65 -41 -70 -21 -66 15 -152 -67 -264 -239 -75 -128 -7 118 -98 41 42 -150 -286
3834 -286 -43 -117 -70 120 -66 34 226 77 -38 105 101 10 7 -11 188 9 142 -51 -19 281 206 127 -17 -11
3858 -11 -77 -6 -47 109 220 -57 130 59 -63 57 168 32 -115 -29 -109 87 -113 122 54 130 -122 28 -95
3881 -95 22 -91 -158 -123 49 212 96 -15 212 -102 -314 -102 -200 53 -95 -154 -114 -54 -220 -170 -45 48 115
3904 115 -346 -291 -171 14 94 248 -55 37 -48 27 172 -185 14 140 80 -5 186 144 191 -19 53 -65 -112 23
3928 23 -26 96 292 -161 175 188 97 38 34 32 15 50 111 26 -268 118 -52 74 -71 378 29 49 368 14 123
3953 123 -168 -61 17 -228 124 -70 65 -96 88 160 -181 -81 -148 -50 -92 37 -68 -130 116 -191 -249 221
3975 221 -169 -178 -20 15 -127 -141 208 143 -24 -76 -293 181 35 -96 90 38 -2 -34 -10 81 -276 76 -35 -79
3999 -79 -209 -49 45 -137 126 54 -192 232 53 -69 501 122 -53 183 101 -134 -173 -68 158 63 278 -36
4021 -36 5 -60 -96 113 -92 -61 -70 170 -65 -37 55 27 294 125 -269 -36 -12 156 -178 -330 74 -137 61 53
4045 53 -54 -268 -391 -210 -23 -283 -338 273 -459 -106 -285 -472 215 -262 -104 -191 201 198 219 -6 -60 -250
4067 -250 29 7 91 -77 4 25 -16 236 11 -53 -26 -21 -103 -40 -71 5 -254 -51 65 -113 264 149 -254 21
4091 21 72 26 127 -158 85 257 102 4 -187 43 66 -67 -179 83 19 136 -151 -261 111 -127 37 -89
4113 -89 -161 53 180 -114 145 -22 -186 -299 -332 186 -262 -20 49 194 167 6 164 27 -42 -78 105 -68
4135 -68 -11 113 -215 -132 -166 115 -248 -63 -86 -312 35 -14 -2 -129 128 -186 42 135 -63 -121 70 -151 -25
4158 -25 -218 -52 67 -113 -45 38 -73 10 75 208 -15 -244 266 -17 20 -80 57 -243 63 -70 -9 119
4180 119 -76 234 -46 34 -15 -22 -39 -100 374 -136 -76 -50 -224 99 10 -2 -131 -111 -139 -240 -78 -115 9 65 -153
4205 -153 -110 130 -157 4 90 134 196 95 45 -166 -148 -38 73 84 -97 0 -32 -187 6 -18 -68 65 88 5
4229 5 130 46 -20 297 109 240 -187 -281 194 -6 106 4 123 -39 -5 272 40 -79 129 196 -181 67
4251 67 -88 -11 -97 -111 -183 -36 41 169 -14 -63 -38 -219 204 18 -125 -63 88 -12 74 -455 -48 12 -237 -152
4275 -152 -156 -54 166 -166 52 -111 189 87 140 222 123 108 46 85 105 3 -69 42 -131 -105 58 32 -105 -64
4299 -64 -84 109 317 252 71 160 -76 -88 74 44 137 122 -126 26 -23 117 139 -127 -126 198 -65 -94 39 9 -43
4324 -43 -222 54 -167 76 -68 152 28 115 33 -113 -26 -29 -79 202 -294 -173 167 -6 166 89 53 -295 283
4347 283 170 -249 38 72 -225 -70 11 118 100 -31 -56 45 -49 157 49 -24 127 58 63 258 -63 85 127
4370 127 -114 48 -47 58 -153 -318 -62 -75 32 -106 41 -2 -122 -101 -85 174 276 -81 47 -31 -9 384
4392 384 -198 -3 77 -97 -48 -7 -77 146 107 -45 293 133 168 -66 -43 129 32 -68 170 -296 -29 69 -222
4415 -222 -16 85 44 97 169 -21 85 -106 70 -82 -269 -94 120 36 -42 97 -91 -4 -85 -158 15 207 -82
4438 -82 -117 -322 112 73 -115 134 -54 17 -277 -110 -226 -92 28 -30 -154 -103 138 -250 153 -126 140 -155
4460 -155 138 38 -139 11 67 171 -14 102 59 -145 274 11 325 13 -252 -47 101 57 -275 67 92
4481 92 85 53 88 -26 -16 13 -118 -114 1 -101 -98 109 -4 -163 -177 -137 -58 -66 80 86 -75 43 14 -266 -51 -50 84
4508 84 74 13 11 -80 -194 88 33 164 -75 -24 78 39 29 -142 -58 -9 -39 -20 220 11 59 68 101 105 -134 260 -19
4535 -19 -36 75 169 54 -110 -42 101 -80 21 -30 285 14 41 -14 8 39 -14 42 232 35 50 85 -62 60
4559 60 215 84 147 161 -45 2 165 0 -190 -4 -162 188 -94 -80 -146 93 -9 98 58 -134 95 -91
4581 -91 -123 -53 139 -140 -90 -363 83 118 -8 240 -116 -113 -132 15 -6 31 199 -213 128 163 -30 -69 -4 14 24
4606 24 51 262 33 -217 99 115 9 -4 85 -101 -275 -74 -117 94 2 -97 7 -23 425 43 -14 99 106 57
4630 57 134 58 14 -103 155 141 32 -270 -146 -36 142 -46 28 98 -173 -101 -93 -163 -6 -173 140 -60 75 28
4654 28 -229 39 -40 128 -19 98 -142 -150 -118 -65 -20 306 34 82 -44 7 -109 113 -62 -43 222 -134 127
4677 127 45 195 -91 -72 -172 97 -17 -5 140 -262 -64 -14 -145 7 -126 249 196 -33 -183 81 -24 140
4699 140 213 219 105 15 -14 36 44 -167 -6 14 79 -243 -25 -20 -141 -66 144 -221 264 80 -274 -261 -75 173 99
4724 99 90 -204 233 220 66 -98 -85 35 49 37 -298 200 -132 88 -137 -171 109 28 -56 22 -121 -34 -144 -205
4748 -205 90 -268 -69 189 -22 -87 -66 -133 -65 -120 9 -194 -8 -96 -91 -10 227 7 -224 63 -91 -151 -10
4771 -10 172 -100 219 211 -222 152 7 198 -31 88 173 245 33 -23 -24 146 175 -101 -193 -232 -67 -112 -192 -61
4795 -61 86 186 43 -83 -249 37 27 -45 64 147 -105 -357 113 -258 86 -172 -91 169 -17 -154 21 59
4817 59 -186 41 183 -14 139 182 126 34 -105 34 41 215 -16 11 -145 -139 103 -44 259 -109 -139 -25 -447
4840 -447 6 13 41 38 30 118 107 -67 108 -298 154 -28 -22 -8 271 -12 51 -76 -35 -100 -26 -15 49 -205 117 -42
4866 -42 -188 142 176 188 -118 -55 1 82 -38 26 -150 162 -50 -87 236 71 19 176 77 -143 -121 84 -125 59
4890 59 23 -143 -96 -92 222 49 -401 60 -20 -222 216 -82 131 -33 -103 116 444 174 -458 -313 -846 -317
4912 -317 -804 105 -10 28 -89 -187 266 -249 80 102 83 52 63 9 -223 -60 137 -212 -66 20 -24 -83 65
4935 65 -9 -138 -138 -212 -50 -392 -143 21 -78 40 84 177 82 -15 5 166 158 27 -179 -235 -127 8 -80 126 -4
4960 -4 -69 -359 -105 -52 -155 32 32 -172 -16 -92 52 110 -32 -70 -44 52 -15 95 135 -175 133 86 -240 189 -113
4985 -113 286 88 178 108 -17 -83 -68 -14 84 29 18 84 -229 -205 -27 117 -74 -4 -110 101 118 -115 26 -2
5009 -2 126 -111 136 -35 -23 -15 183 -56 -156 17 158 -287 135 142 235 27 289 276 -108 79 189 -1 192
5032 192 137 -85 -86 84 72 192 -75 -59 -211 -271 62 -157 42 104 -142 -477 -175 98 -45 129 138 -14 -24
5055 -24 2 125 8 -90 -37 -1 34 -4 -88 -167 -79 -172 29 14 -34 -55 -21 -215 131 41 117 77 -8 115 -24 104
5081 104 115 -55 87 -176 9 113 -146 105 -188 -108 43 -160 -214 -176 106 -139 203 -134 -69 -121 23 189
5103 189 -71 36 -66 -173 11 191 -85 -43 -27 203 -381 -64 70 108 127 276 -41 -104 112 -239 -57 19
5125 19 -235 -26 -92 -33 -252 -176 158 -47 -256 -326 -13 32 -212 -192 12 -85 -101 6 281 -17 324 10 151
5148 151 -39 -127 157 251 -97 -24 -29 54 139 45 31 60 -73 169 -115 39 -214 55 22 107 240 40 -312 32
5172 32 4 -180 8 193 -30 -361 106 24 278 174 69 5 -152 126 156 -32 -226 -36 -192 -144 59 296
5194 296 85 -51 -96 111 -175 -128 -71 -166 16 30 7 -314 -125 126 29 -65 -86 87 165 160 38 176 -57 -163
5218 -163 9 -33 30 15 -39 174 335 42 64 -96 15 117 72 65 2 58 -33 65 126 -155 -125 295 -173 265 20
5243 20 -127 -11 100 -61 -46 -121 166 -124 -206 -76 -122 -98 -82 -23 -11 -235 -52 24 -102 64 -226 24 198
5266 198 -190 -73 -70 -99 71 -299 -103 105 133 133 55 164 155 -193 227 -44 93 86 64 -154 65 319 -7 -89
5290 -89 27 -115 -47 -89 23 209 -125 -197 4 53 -32 41 58 174 134 87 -2 274 34 5 -139 6 -302 64
5314 64 -54 -37 -39 -133 -80 -292 51 -154 -38 -246 -17 264 -49 -164 2 126 104 124 138 -74 -41 -31 -58 -312
5338 -312 -214 64 -196 25 -126 179 157 -123 -114 -123 37 141 -194 -146 -105 -98 79 34 150 -12 -193 -135 -152 -74 3
5363 3 151 22 -94 23 230 -122 -79 156 -29 -69 -186 87 180 4 84 156 176 12 80 -36 26 62 -84 -327
5387 -327 -113 207 -89 -1 -24 18 237 -139 -119 100 0 39 173 244 91 182 -72 -178 136 -73 -126 -14 -21
5410 -21 -176 33 98 32 8 -83 320 76 108 86 96 -33 -15 98 6 -9 -28 -215 -32 -87 -213 -147 -8 -57 -100
5435 -100 64 -125 192 -277 -140 19 125 123 -39 52 177 -30 149 26 228 88 101 -333 -164 45 245
5456 245 122 -8 161 128 238 76 -128 -53 -187 103 53 256 45 22 39 -72 78 83 139 55 7 -111 -74 -51
5480 -51 -37 -219 -70 34 -55 -55 40 -22 180 -68 194 -162 -137 -96 58 -158 -152 27 -98 -77 -155 -89 62 -142 166
5505 166 181 109 10 -156 -119 -18 -13 237 -88 106 -14 136 142 -98 4 94 63 21 -53 -25 198 -9 159 53
5529 53 46 -31 121 -150 -29 46 -194 71 9 8 -35 -75 157 78 -134 50 -96 -59 -50 -208 -36 -126 -192 6 1 79
5555 79 -106 184 -89 52 11 -72 96 26 8 46 -146 182 36 -3 -87 -29 -73 -150 -85 148 13 123 149 -20
5579 -20 -96 -255 57 116 -89 -102 86 101 0 -2 20 27 99 47 -191 58 -45 115 -82 -126 117 -215 27 -82
5603 -82 156 -69 44 54 10 2 63 84 17 -21 -76 -179 175 71 189 -240 155 35 103 -27 -181 291 -82 26
5627 26 -248 15 -407 -103 -234 -72 26 -37 36 87 53 18 -151 -85 119 -109 10 93 -142 111 274 -314 177
5650 177 16 269 92 96 142 0 92 179 79 186 254 -13 82 80 215 -19 250 -19 -47 155 84 207 26 76
5674 76 9 35 116 95 73 -185 7 -87 144 -182 -150 0 -28 11 -67 112 78 222 -48 -73 -38 -142 137 -46 -93
5699 -93 91 -43 120 95 64 -191 161 -110 89 285 104 -11 -56 -62 -176 -70 3 103 71 -9 81 77 34 -196
5723 -196 -51 -54 136 -99 -48 -67 -154 63 -11 -95 154 -15 -27 81 -221 -66 59 16 51 -60 -42 -44 -84 -45 4
5748 4 -153 73 142 -97 -50 -31 -161 -104 75 -1 102 -117 -26 -175 38 267 -40 34 -233 182 -195 -312 -23
5771 -23 -146 -17 -135 60 187 -279 49 -215 -86 -132 162 315 -123 -38 153 -23 169 -136 -10 -38 36 134
5793 134 -38 154 -6 134 203 78 56 18 149 95 -22 -102 81 -84 -21 79 -19 -16 74 65 -115 -83 -206 -54
5817 -54 173 210 47 8 55 -82 193 51 21 -268 -264 4 283 58 -85 209 -21 -123 -60 16 72 53 -105 42
5841 42 -102 -63 -95 -101 19 -39 23 33 115 -19 -13 -87 211 4 -29 -127 233 -72 -24 156 -105 -68 -26 -11 -22 49 -340
5868 -340 -8 19 -65 -132 -97 190 0 -16 285 131 -205 -161 106 -235 -41 135 -201 24 165 -82 -314 83
5890 83 133 208 -46 217 293 54 -109 -172 -193 121 -137 183 88 55 -109 -7 13 76 54 69 47 64 16 -45 91
5915 91 59 8 -25 -52 -37 69 -61 25 -271 -113 -102 212 -60 -34 -61 -147 -180 54 -56 -49 72 -59 180 -199 154
5940 154 -166 185 138 -29 102 49 -169 -206 30 -107 105 164 -168 11 64 -69 -40 -117 42 90 89 256 -2
5963 -2 -30 84 -74 149 106 13 49 -149 -189 13 8 -65 -39 31 -32 -123 116 132 139 33 -58 67 98 -80 170 109 -96
5990 -96 246 -20 -211 126 128 -2 -29 84 6 202 69 41 -102 125 -44 22 -158 -2 230 -133 -1 -8 22
6013 22 -20 -65 90 28 54 160 -124 31 -107 142 299 -54 28 35 63 -158 -218 -19 150 -163 -66 -89 141 -155
6037 -155 -65 62 -44 9 248 84 4 23 -11 -220 38 -83 -80 134 -131 229 -66 59 -48 -74 58 -92 141
6060 141 133 -172 86 -62 80 78 185 176 272 -126 -166 280 3 31 49 -315 117 -42 -104 -10 310 193 -16 38
6084 38 -250 -108 -150 -160 -42 -141 -117 -138 -190 114 97 -134 -3 -53 -62 101 -59 26 13 -157 -302 -102 -19 80 -62
6109 -62 -36 39 72 89 85 85 56 78 33 -52 144 -206 -210 -54 -125 69 -285 -65 19 -74 78 -38 -194 -238 -128 -208 -5
6136 -5 128 68 0 36 154 -133 -66 -23 -172 -138 -228 -56 16 23 -163 55 -199 -152 160 209 63 -86 -81 -214 53
6161 53 118 -343 -14 165 -160 80 -56 -87 -106 -189 5 -147 -77 64 40 110 99 231 57 26 100 237 -53 85
6185 85 -89 -477 -99 39 139 66 -152 -17 -41 -15 -92 137 -9 129 -205 75 56 -99 -201 17 130 15
6207 15 1 98 2 137 6 120 129 76 -154 -216 61 -147 30 -127 -148 43 206 150 -31 -197 -30 330 61
6230 61 58 241 -103 -172 154 64 -209 -33 -94 72 41 75 196 -117 -79 54 -166 150 138 -220 80 -6 91 199
6254 199 -60 -231 -116 -16 -36 -181 -183 -51 221 -72 -72 -121 19 102 -117 153 -101 221 -33 69 -68 -44 -193
6277 -193 -197 52 26 238 -108 117 22 17 -209 -282 -14 118 -56 -174 -126 75 164 43 -123 239 123 -199 62
6300 62 171 -6 138 -93 -221 -163 -243 134 -26 -121 -108 -57 183 89 -265 -64 -39 -40 46 71 8 -255 131 140 -71
6325 -71 83 54 126 90 -31 55 -307 -16 37 95 205 99 -131 -265 -111 71 59 -183 -171 22 77 -126 -146 -207
6349 -207 24 20 -98 -217 62 202 207 -192 280 -446 -88 226 23 34 39 -119 327 128 33 -218 -469 252 -195
6372 -195 14 -998 -496 -809 461 -41 47 4 -42 -36 45 106 -208 373 -57 -225 94 -421 -41 -274 -112 -474
6394 -474 174 57 -366 -811 -272 -391 -299 41 482 536 -8 24 -219 79 -448 -169 223 466 -227 -464 -44
6415 -44 249 -494 240 -1 -150 129 310 57 166 7 -171 88 -135 58 -221 -297 -98 -106 -246 -50 292
6436 292 -110 152 123 -339 -163 -174 240 215 -300 578 340 37 74 124 -160 4 -50 146 -333 33 123 12
6458 12 95 -175 286 -440 114 73 345 -83 -40 216 210 157 476 277 548 188 302 -285 -318 277 -126 -351 -113
6481 -113 76 229 17 -146 135 79 119 667 120 -60 -63 51 -489 -6 143 -335 147 -264 113 272 -229
6502 -229 -17 -488 -416 190 143 -190 -32 -223 -301 -192 -84 83 -349 -162 -224 28 -163 -96 -29 60 20 436 -479
6525 -479 523 -90 -12 480 430 268 -404 142 -3 186 64 572 282 218 85 54 103 -6 -288 -89 -218
6546 -218 354 157 -326 -108 195 -188 529 -81 -445 305 56 429 209 -247 98 -180 -279 -65 56 -144
6566 -144 -36 -382 175 64 125 -252 -162 -31 162 -15 -373 65 91 -38 -69 -84 -216 -328 13 -290 30 -304
6588 -304 -230 -225 -36 357 128 -190 175 -144 -41 -278 -34 -66 394 -292 -72 186 228 -305 -104 85 -140 272
6610 272 271 384 -126 -47 -336 189 -486 -33 235 -25 152 -138 -28 -141 125 -20 -143 -1 177 -24 64
6631 64 -61 221 72 -434 -158 -93 -101 -2 -285 -86 -163 -184 3 -97 322 -144 -48 -7 -162 -72 -59 -123 78 -56
6655 -56 -152 45 200 -54 11 106 -49 -70 -17 -69 60 -28 -109 158 -187 132 6 -89 73 142 -185 -45 -30 -92
6679 -92 -106 -126 83 -14 -133 -196 -70 -71 6 -24 -117 -125 -103 84 107 121 44 106 246 -153 8 92 175 -180 -79 -112 111
6706 111 -104 112 -144 -184 228 -214 -220 3 -164 -111 60 108 152 -177 -130 232 -68 -40 -49 138 16 -94 294
6729 294 74 -40 300 -79 -77 159 -177 -68 140 -34 -121 -119 -171 175 -216 170 14 -60 -99 56 191 119 -279
6752 -279 -85 393 -59 -99 -103 -43 -77 -81 191 9 -171 150 -94 -18 -440 258 -9 -216 26 -11 118 -82 42
6775 42 53 145 -271 21 64 -30 -243 -122 54 -205 -397 181 -61 -627 639 -432 775 247 529 -39 -595
6796 -595 -14 -291 -556 -37 -172 -327 18 73 160 -3 -122 -452 -109 -9 -395 -66 246 61 -102 115 -33
6817 -33 276 38 423 -168 -247 120 -55 57 101 -146 -171 -431 430 -36 132 96 -200 -214 -52 345 449 -372
6839 -372 -120 -425 -487 -38 339 589 -56 -74 125 31 517 412 -167 -233 -157 -295 266 -20 123 642 92 239
6861 239 187 -517 -114 659 443 88 -432 -472 46 92 -516 327 -206 -288 -80 261 -302 -6 394 -36 676
6882 676 423 -660 69 -43 428 404 10 47 -77 -392 -457 13 -137 108 277 106 218 -167 -214 151 338
6903 338 500 -32 -221 52 -99 -101 275 9 -240 -229 -103 -19 181 255 -72 -393 -118 -143 -123 -128 -438 349 -52
6926 -52 -599 522 -189 -61 112 147 -419 125 -331 421 229 -376 87 336 133 29 -83 620 563 143 -333
6947 -333 -469 641 291 114 101 -123 -293 -633 269 117 235 36 -74 -33 -127 -593 -383 79 -390 -492 -404
6968 -404 -286 20 -268 -11 394 679 84 -174 -114 2 -189 -436 152 -185 98 -170 93 -192 215 316
6988 316 -127 -16 13 113 168 -326 230 -72 -187 112 -107 -201 -26 140 -217 -90 -77 58 -21 -77 -1 -217
7010 -217 -364 -130 -114 15 29 54 293 -26 82 35 290 -135 202 163 -27 101 -67 -136 59 -149 -76 -39 80
7033 80 109 73 14 -216 -39 59 176 -214 207 86 -295 59 244 -61 -89 38 -72 -17 -180 -10 -132 -182 27
7056 27 -140 328 -82 118 47 -19 219 136 1 -72 143 56 77 -221 33 57 -88 46 133 -171 -119 -193 -112 8
7080 8 236 106 -106 -142 252 25 -222 1 -35 -75 -193 124 35 55 232 118 -16 86 24 -166 -169 -60 17 -122
7104 -122 -121 -187 48 -39 58 -136 -48 82 233 -222 41 16 -14 153 -292 -45 31 -105 66 -19 91 -24 132
7127 132 -26 -104 -143 -148 270 93 81 65 -199 -33 50 38 188 -105 -7 39 -21 -71 -181 14 88 -99 -33 29 -47
7152 -47 229 -77 -171 31 -27 -92 -64 -9 -95 -117 -14 -69 -24 -6 44 -159 156 -344 -210 -46 133 40 59 -28 25
7177 25 65 -98 6 -8 17 74 243 -59 -156 65 107 -48 -168 -134 50 40 80 -349 -116 47 -103 219 38
7200 38 -19 210 -153 -168 120 -30 190 20 246 -127 -135 -197 -255 191 361 -151 -97 35 24 8 150 -301 206
7223 206 -34 -162 202 -55 -89 -144 -2 16 167 162 -76 -34 78 163 120 -121 -99 -77 -154 281 16 -109 -99 -119
7247 -119 -33 270 -257 -90 515 36 -5 311 -289 -222 -126 -138 -333 -217 -490 -96 149 -69 138 99 -25 101
7269 101 9 93 61 -187 -173 -17 -39 -244 81 179 -76 -47 110 44 -31 -112 -78 59 127 -84 -53 182 12 -85 -204
7294 -204 308 -118 -109 153 238 4 -6 110 -90 13 -112 -175 -190 108 30 183 -28 -212 -98 91 12 -135 -195
7317 -195 -184 -17 63 145 76 93 80 -79 187 -300 -89 -34 34 209 39 189 211 -127 -219 80 26 95 -31 -92
7341 -92 103 27 0 -98 112 60 295 -39 -97 26 134 41 -113 -384 52 -27 -35 33 261 -87 51 20 68 44 223
7366 223 44 -155 68 -171 205 -323 11 -82 113 -282 48 201 135 33 -90 50 -67 113 -148 -102 78
7387 78 26 254 2 18 -3 75 76 18 -142 134 153 -45 -238 -3 -127 40 -291 -133 77 -150 -318 116 -109
7410 -109 -21 -74 -51 -105 6 -98 -392 73 11 18 -368 -198 -116 60 -104 -97 -198 4 -116 -136 -229 -179 10 -13 -28
7435 -28 -83 -71 147 -85 120 -104 -89 -78 130 47 -91 -5 117 -89 59 122 -15 15 136 82 -171 5 -71 -153
7459 -153 42 171 125 61 -80 -235 -79 -103 14 -186 -43 51 26 -205 -95 -112 -331 -449 241 80 -175 -245
7481 -245 -512 -136 -747 -119 -260 -69 349 155 -571 -60 -58 -51 -87 206 -39 -40 -8 -430 251 -493 202 -10 -316
7504 -316 -41 -351 64 -187 43 -147 37 -71 35 -287 187 -138 -195 -25 38 45 259 -94 109 87 -373 107
7526 107 315 -227 91 225 -127 -42 -148 129 22 106 419 112 -347 -39 239 -318 -116 92 334 -44 -3
7547 -3 140 -310 -523 404 250 -214 168 -501 -301 563 320 200 -182 -284 254 -340 181 411 194 -71 150
7568 150 -306 210 573 149 244 164 -83 343 240 -195 314 -349 157 23 -579 -137 165 393 26 392 -74
7589 -74 1076 202 -230 315 194 -214 -198 -284 -314 -342 -213 -381 49 -189 -137 265 -39 -73 -69 166 -46 -166 -164
7612 -164 104 84 68 -86 147 11 159 193 167 43 -79 141 90 -22 69 128 -132 -86 -227 138 -79 -161 -142
7635 -142 117 84 -71 297 179 39 8 -22 -69 -8 -27 -13 186 178 -146 -98 91 -35 21 -138 30 -96 -142 -107
7659 -107 -72 133 -137 48 51 -106 -282 86 -130 53 -70 -190 11 -222 -75 92 -32 4 199 86 -251
7680 -251 239 28 301 179 147 49 -49 -24 1 -82 64 139 -57 -208 18 -36 -52 -183 33 -75 -143 -55 -296 -4
7704 -4 -308 -5 155 -93 -111 93 57 -190 177 -147 -255 104 -50 64 133 191 -42 8 44 101 3 -190 -124 -2
7728 -2 -170 -60 -7 -25 158 -343 128 109 -90 -254 -216 -5 11 -68 -153 -39 13 -30 24 -308 130 25 -267 17
7752 17 -23 -225 -64 -18 316 99 -36 -230 -62 -182 58 35 -13 -35 -95 126 101 216 -60 45 42 37 -31 59 -32
7777 -32 111 168 41 235 -175 -109 -6 6 -56 -72 28 -49 128 -35 4 424 -225 -142 16 -248 -28 67 -42
7800 -42 11 -8 26 -23 96 17 146 -219 -43 -129 127 65 59 -30 7 137 61 104 119 8 21 -84 -138 -22 -195 119
7826 119 -117 80 -48 -177 242 172 3 39 -48 102 -86 26 14 280 -119 204 -83 263 -21 -235 26
7847 26 74 49 -21 -75 65 -94 -251 66 -135 -8 74 9 43 190 -37 83 -196 90 -286 -25 79 108 -7
7870 -7 10 4 41 -55 -94 -80 76 63 -44 -76 -4 -230 -66 -196 74 148 -5 -157 130 -61 194 -115 -156 -207 -125
7895 -125 -53 42 17 -211 -191 -58 -36 10 -30 175 -223 115 13 -24 -30 75 -156 -25 32 75 -23 -199 22 -104
7919 -104 58 -44 -57 -111 146 100 57 120 274 69 -111 -198 58 -206 35 62 52 -99 -155 132 171 -161 65
7942 65 0 51 -23 100 158 -102 -84 34 -111 77 -178 4 -103 127 -253 -23 -59 -124 230 10 101 -141 105
7965 105 25 39 -17 13 327 58 73 50 71 196 -71 -179 108 54 72 70 -134 -78 204 67 -146 210 75 215
7989 215 -22 48 12 54 36 -48 184 143 -131 -152 173 118 -137 46 -33 -124 -113 102 -33 -68 162 63 -34 49 -13
8014 -13 108 -266 19 4 -153 -29 -121 67 10 83 21 32 -26 128 -112 4 -295 232 128 -172 261 -75 -48
8037 -48 940 110 -338 170 4 -243 331 224 -589 -104 242 -316 -252 -85 292 498 -125 305 248 391 170
8058 170 118 -340 -35 391 426 -86 -603 131 86 -381 188 459 1105 -110 391 623 15 -50 238 71 -159
8079 -159 350 103 150 10 37 255 -2 -358 581 -133 -223 -277 130 144 -315 11 59 -127 742 131 -364 929
8101 929 627 510 37 -38 -122 -356 70 215 -356 -120 643 -223 135 217 -283 47 -339 480 347 646 -381
8122 -381 -133 109 11 -105 76 -269 -101 195 258 240 -100 -25 -41 397 -392 269 -195 -479 251 -338 155 19
8144 19 -78 59 -317 291 360 65 -46 38 -89 48 -70 171 46 39 43 108 19 65 275 -2 108 -105 -260 173
8168 173 -161 238 -46 324 10 -1 40 147 -54 121 145 34 -72 227 84 -66 183 -261 -223 393 -63
8189 -63 -49 -163
8191a63
##END NTUPLES=NMR FID
##END=
