##TITLE=1H_Pr AmPip
 CDCl3, 8 sc, 
 4.06.2021
##JCAMPDX= 6.0         $$ Bruker NMR JCAMP-DX V2.0
##DATA TYPE= NMR FID
##DATA CLASS= NTUPLES
##ORIGIN= UXNMR, Bruker Analytische Messtechnik GmbH
##OWNER= root
$$ XWIN-NMR		Version 3.5
$$ Fri Jun  4 13:11:30 2021 Russian Standard Time (UT+4h)  she@DPX200
##.OBSERVE FREQUENCY= 200.131506
##.OBSERVE NUCLEUS= ^1H
##.DELAY= (6, 6)
##.ACQUISITION MODE= SIMULTANEOUS
##.ACQUISITION SCHEME= undefined
##.AVERAGES= 8
##.DIGITISER RES= 18
##SPECTROMETER/DATA SYSTEM= spect
##.PULSE SEQUENCE= zg30
##.SOLVENT NAME= CD3CN
##.SHIFT REFERENCE= (INTERNAL, CD3CN, 0, 15.7039)
##AUDIT TRAIL= $$ (NUMBER, WHEN, WHO, WHERE, WHAT)
$$ ##TITLE= Audit trail, XWIN-NMR		Version 3.5
$$ ##JCAMPDX= 5.01
$$ ##ORIGIN= Bruker BioSpin GmbH
$$ ##OWNER= she
$$ F:/spectra/data/she/nmr/H-F/1/audita.txt
$$ ##AUDIT TRAIL=  $$ (NUMBER, WHEN, WHO, WHERE, WHAT)
(   1,<2021-06-04 13:10:33.26 +0400>,<she>,<DPX200>,
      <created by zg, POWCHK disabled, PULCHK disabled
       configuration hash MD5:
       00 E9 B6 7A A2 85 ED C7 34 08 36 98 17 FE 4E 26
       data hash MD5: 16K
       08 AE B1 B0 91 81 69 B3 18 63 60 0C F4 3E 43 EE>)
$$ ##END=
$$ 
$$ hash MD5
$$ 49 CF 47 93 68 5A AA 16 61 B2 C1 45 5A B8 47 44
##$RELAX= 
##$RELAX= 
##$RELAX= 
##$RELAX= 
##$RELAX= 
##$RELAX= 
$$ Bruker specific parameters
$$ --------------------------
##$DU= <F:/spectra>
##$EXPNO= 1
##$NAME= <H-F>
##$PROCNO= 1
##$TYPE= <nmr>
##$USER= <she>
##$AMP= (0..31)
100 100 100 100 100 100 100 100 100 100 100 100 100 100 100 100 100 100 
100 100 100 100 100 100 100 100 100 100 100 100 100 100 
##$AQSEQ= 0
##$AQ_mod= 1
##$AUNM= <au_zg>
##$AUTOPOS= <>
##$BF1= 200.13
##$BF2= 200.13
##$BF3= 200.13
##$BF4= 200.13
##$BF5= 200.13
##$BF6= 200.13
##$BF7= 200.13
##$BF8= 200.13
##$BYTORDA= 1
##$CFDGTYP= 0
##$CFRGTYP= 5
##$CHEMSTR= <none>
##$CNST= (0..31)
1 1 145 1 1 1 1 1 1 1 1 1 1 1 1 1 1 1 1 1 1 1 1 1 1 1 1 1 1 1 1 1 
##$CPDPRG= <>
##$CPDPRG1= <>
##$CPDPRG2= <>
##$CPDPRG3= <>
##$CPDPRG4= <mlev>
##$CPDPRG5= <mlev>
##$CPDPRG6= <mlev>
##$CPDPRG7= <mlev>
##$CPDPRG8= <mlev>
##$CPDPRGB= <>
##$CPDPRGT= <>
##$D= (0..31)
0 1.2 0 0 0 0 0 0 0 0.06 0 0.03 0 0 0 0 0.0002 0 0 0 0 0 0 0 0 0 0 0 0 
0 0 0 
##$DATE= 1622797832
##$DBL= (0..7)
120 120 120 120 120 120 120 120 
##$DBP= (0..7)
150 150 150 150 150 150 150 150 
##$DBP07= 0
##$DBPNAM0= <>
##$DBPNAM1= <>
##$DBPNAM2= <>
##$DBPNAM3= <>
##$DBPNAM4= <>
##$DBPNAM5= <>
##$DBPNAM6= <>
##$DBPNAM7= <>
##$DBPOAL= (0..7)
0.5 0.5 0.5 0.5 0.5 0.5 0.5 0.5 
##$DBPOFFS= (0..7)
0 0 0 0 0 0 0 0 
##$DE= 6
##$DECBNUC= <off>
##$DECIM= 32
##$DECNUC= <off>
##$DECSTAT= 4
##$DIGMOD= 1
##$DIGTYP= 9
##$DL= (0..7)
0 120 120 120 120 120 120 120 
##$DP= (0..7)
150 150 150 150 150 150 150 150 
##$DP07= 0
##$DPNAME0= <>
##$DPNAME1= <>
##$DPNAME2= <>
##$DPNAME3= <>
##$DPNAME4= <>
##$DPNAME5= <>
##$DPNAME6= <>
##$DPNAME7= <>
##$DPOAL= (0..7)
0.5 0.5 0.5 0.5 0.5 0.5 0.5 0.5 
##$DPOFFS= (0..7)
0 0 0 0 0 0 0 0 
##$DQDMODE= 0
##$DR= 18
##$DS= 0
##$DSLIST= <SSSSSSSSSSSSSSS>
$$ [...]
##$SUBNAM2= <"">
##$SUBNAM3= <"">
##$SUBNAM4= <"">
##$SUBNAM5= <"">
##$SUBNAM6= <"">
##$SUBNAM7= <"">
##$SUBNAM8= <"">
##$SUBNAM9= <"">
##$SW= 20.0188882624521
##$SWIBOX= (0..15)
0 0 2 0 0 0 0 0 0 0 0 0 0 0 0 0 
##$SW_h= 4006.41025641026
##$TD= 16384
##$TD0= 1
##$TE= 0
##$TE2= 300
##$TE3= 300
##$TEG= 300
##$TL= (0..7)
0 120 120 120 120 120 120 120 
##$TP= (0..7)
150 150 150 150 150 150 150 150 
##$TP07= 0
##$TPNAME0= <>
##$TPNAME1= <>
##$TPNAME2= <>
##$TPNAME3= <>
##$TPNAME4= <>
##$TPNAME5= <>
##$TPNAME6= <>
##$TPNAME7= <>
##$TPOAL= (0..7)
0.5 0.5 0.5 0.5 0.5 0.5 0.5 0.5 
##$TPOFFS= (0..7)
0 0 0 0 0 0 0 0 
##$TUNHIN= 0
##$TUNHOUT= 0
##$TUNXOUT= 0
##$USERA1= <user>
##$USERA2= <user>
##$USERA3= <user>
##$USERA4= <user>
##$USERA5= <user>
##$V9= 5
##$VALIST= <valist>
##$VCLIST= <CCCCCCCCCCCCCCC>
##$VD= 0
##$VDLIST= <DDDDDDDDDDDDDDD>
##$VPLIST= <PPPPPPPPPPPPPPP>
##$VTLIST= <TTTTTTTTTTTTTTT>
##$WBST= 1024
##$WBSW= 4
##$XGAIN= (0..3)
0 0 0 0 
##$XL= 0
##$YL= 0
##$YMAX_a= 77162
##$YMIN_a= -39316
##$ZGOPTNS= <>
##$ZL1= 120
##$ZL2= 120
##$ZL3= 120
##$ZL4= 120
##$ABSF1= 10
##$ABSF2= 0
##$ABSG= 5
##$ABSL= 3
##$ALPHA= 0
##$AQORDER= 0
##$ASSFAC= 0
##$ASSFACI= 0
##$ASSFACX= 0
##$ASSWID= 0
##$AUNMP= <proc_1d>
##$AZFE= 0.1
##$AZFW= 0.1
##$BCFW= 1
##$BC_mod= 2
##$BYTORDP= 1
##$COROFFS= 0
##$CY= 11.3945322036743
##$DATMOD= 1
##$DC= 2
##$DFILT= <>
##$DTYPP= 0
##$F1P= 15.9154993809931
##$F2P= -4.1035820241983
##$FCOR= 0.5
##$FTSIZE= 0
##$FT_mod= 4
##$GAMMA= 1
##$GB= 0.15
##$INTBC= 1
##$INTSCL= 1
##$ISEN= 128
##$LB= 0.24
##$LEV0= 0
##$LPBIN= 0
##$MAXI= 10000
##$MC2= 0
##$MEAN= 0
##$ME_mod= 0
##$MI= 1.114404
##$NCOEF= 0
##$NC_proc= 0
##$NLEV= 6
##$NOISF1= 3.799351
##$NOISF2= 2.8
##$NSP= 1
##$NTH_PI= 0
##$NZP= 0
##$OFFSET= 15.70392
##$PC= 1
##$PHC0= -11124.57
##$PHC1= 15.40101
##$PH_mod= 1
##$PKNL= yes
##$PPARMOD= 0
##$PSCAL= 0
##$PSIGN= 0
##$REVERSE= no
##$SF= 200.130013532006
##$SI= 16384
##$SIGF1= 3
##$SIGF2= 2
##$SINO= 400
##$SIOLD= 16384
##$SREGLST= <1H.CDCl3>
##$SSB= 0
##$STSI= 0
##$STSR= 0
##$SW_p= 3612.71676300578
##$SYMM= 0
##$S_DEV= 0
##$TDeff= 0
##$TDoff= 0
##$TI= <>
##$TILT= no
##$TM1= 0
##$TM2= 0
##$TOPLEV= 0
##$USERP1= <user>
##$USERP2= <user>
##$USERP3= <user>
##$USERP4= <user>
##$USERP5= <user>
##$WDW= 1
##$XDIM= 8192
##$YMAX_p= 0
##$YMIN_p= 0
$$ End of Bruker specific parameters
$$ ---------------------------------
##NTUPLES= NMR FID
##VAR_NAME=  TIME,          FID/REAL,        FID/IMAG
##SYMBOL=    X,             R,               I
##VAR_TYPE=  INDEPENDENT,   DEPENDENT,       DEPENDENT
##VAR_FORM=  AFFN,          ASDF,            ASDF
##VAR_DIM=   8192,          8192,            8192
##UNITS=     SECONDS,       ARBITRARY UNITS, ARBITRARY UNITS
##FACTOR=    0.0002496,     1,               1
##FIRST=     0,             0,               0
##LAST=      2.0444736,     0,               0
##MIN=       0,             -39316,          0
##MAX=       2.0444736,     77162,           0
$$ Real data points
##PAGE= N=1
##DATA TABLE= (X++(R..R)), XYDATA
0@%%%%%%%%%%%%%%%%%Qj6J6j6J6j6K4l2L2l3M1m8N6o4P2q5R3j04J20j36J52j68
39h8J87k10K33k57K85l16L48l86M27m68N16n69O27o91P62q43R34j036J153j289
59f81J450j642J877k172K559l084L836n024P179j2291M5617L9538q4567J852L3169
74B7616n94k6181j915P056o192l716J0353p364O934N145j2845k883k03r28N708
89ij0735K471J1320n101Q21P234M513M503p025J002n79n960P715o149j2948R700
105G73o94m649O851J548k195m649M92J118j2290M770O812j5346K324J3052J466
120f17J489j425N249J512j0608N761L831j1013j011M076J858l940n28J2232o145
135G21j1230J2884k010j1299O036K401m377m208N030R794o175M27Q561m727J069
$$ plain form
0 0 0 0 0 0 0 0 0 0 0 0 0 0 0 0 0 0 0 8 -8 8 -8 8 -8 16 -16 16 -17 24 -24 32 -32 40 -45 48 -56 64 -72 80 -88
39 -88 99 -111 122 -135 150 -166 182 -204 223 -245 271 -298 329 -362 400 -443 491 -545 608 -681
59 -681 769 -873 1004 -1168 1391 -1693 2143 -2881 4298 -7993 37624 77162 -7405 -5553 27616
74 27616 27022 841 -1074 5982 -210 -3926 6427 -937 5997 11142 -1703 -4586 -4789 -5717 -9
89 -9 -10744 -8273 3047 -2054 -1233 6001 10514 15017 7992 8994 8415 2455 10170 4021 -8927 773
105 773 79 -4570 2281 3829 1634 -3015 -2523 -1405 -13695 -8925 -2113 -17459 -15135 -2083 -617
120 -617 872 -553 4696 6208 -4400 1361 5192 -5821 -6832 -2756 -898 -4838 -5366 6866 721
135 721 -10509 2375 365 -10934 -4898 -2497 -6874 -11082 -6052 3742 -2433 -2006 6555 1828 2897
150B897J974m258L653l472l959M182r44L379O34k596M933k711k328L463m892O4
166A9j295l692O741j840j462Q872j999l974L125L124k20q501J867O988q855j75
182a277O302k485J447o95j750K291l136J410j313o124L506kl320L611l94K910
198I81p2l169O328j965n131L458k368j263R16j575L547j112o42L926m032J770
214d03J111o104K728n51m656L332Q13N44n7q66N934k105k979M847k605j690J442
231a265k877M167j028k090N739j173j291K584j399N78k310j187L073m973Q23N134
247B505m113K090K962j452K096k485J061J820m844J987L14k095L858k206J033
262B531L483l824J358Q71k123Q83l544k49K259l687K507J759k168K828j707R12
$$ plain form
150 2897 4871 613 4266 794 -3165 1017 73 3452 4086 1490 6423 3712 1384 4847 -45 19
166 19 -1276 -4968 1773 -67 -1529 7343 5344 1370 4495 7619 7399 -1102 765 7753 -1102 -1277
182 -1277 5025 2540 3987 3292 1542 3833 697 2107 794 -5330 -1824 -1826 -5146 -1535 -1929 981
198 981 909 -2260 4068 2103 -3028 430 -1938 -3201 -2285 -3860 -313 -1425 -2067 1859 -2173 -403
214 -403 708 -5396 -2668 -3219 -7875 -4543 -3730 -3186 -3243 -4109 1825 -280 -3259 1588 -1017 -2707 -1265
231 -1265 -4142 25 -1003 -3093 2646 1473 182 2766 1367 1945 -365 -1552 1521 -3452 -2629 2505
247 2505 -1608 482 3444 1992 4088 1603 2664 4484 -360 1627 1941 -154 3704 1498 2531
262 2531 6014 2190 3548 4419 2296 3179 -365 -614 1645 -2042 465 2224 56 2884 1177 2089
278B089J744m891J932P99m934K464L82Q2J023k015L097L2l404L342k097k165J637
295h83l917J567J551k615L475j084o65K907j740Q77o26k486K692l185p97N007
311G8k655L13K195j251K310j673o35K693m049J65Q11j685L323j981n34M974k869
328d70p2L321k532L07j344P1K557l286J467K543k997K891L08o63K569l672k4J756
346B730l541J805L61j024J842j381J608J455k783K892j063l461L034j939m0J278
362A773k533K444N74k570L580q22o78p23k703L119j700k730L598j537q17K150
378D25j106K021q39k360K511j919q75J418k175K032j201j265M606j955j257K940
394A001k343k93K5r62J267k202O58J960k545K247J532k149K075j758o3J995l054
$$ plain form
278 2089 3833 -1058 874 1673 -3261 -797 -415 -333 690 -1325 1772 1804 -1600 1742 -355 -2520 -883
295 -883 -4800 -3233 -1682 -4297 -822 -1906 -2571 336 -1404 -527 -1153 -3639 -947 -4132 -4929 78
311 78 -2577 -2264 -69 -1320 990 -683 -1318 1375 -2674 -2509 -1698 -3383 -60 -2041 -2575 2399 -470
328 -470 -542 2779 247 554 -790 -719 1838 -1448 19 2562 -435 2456 2764 2101 4670 998 974 2730
346 2730 -811 994 1355 331 2173 792 2400 3855 1072 3964 2901 -560 2474 535 495 1773
362 1773 -760 1684 2258 -312 3268 2446 1768 1045 -1658 1461 -239 -2969 629 -908 -1725 425
378 425 -681 1340 501 -1859 652 -1267 -2142 -724 -2899 -867 -2068 -3333 1273 -682 -1939 1001
394 1001 -1342 -1635 -1610 -2572 -1305 -3507 -2849 -889 -3434 -1187 345 -1804 271 -1487 -1550 445 -2609
411b609J293Q34j716J878n77J514J464l455K131J337l382J708m83n08J115k187
427a643K628J012j964K043m9p22R30k157K210k39l462K855J71j133K123j402J374
444B575K85k307K253j086j701J357k030J175P42j749K870j262j079K668j418p63
460E30P48j582O81j415k39K646k469Q13J374j884J481q01r44J532k434p89J779
477i73p01L48q28M64K616l394J179K379l278N75Q0j083J713j466P03J965k348
494b049J867m7o32J642k243J67J092k847K354O95k013J863P0P15M92j775K226
511A577q39j834K051j392P8J637j605J729j17j113K850j149j257O97p81J198j449
528B81j043L266k010l27K017p15R19l44k024K680j682j449J642n12M14n63l11
$$ plain form
411 -2609 -1316 -482 -2198 -320 -897 617 2081 -1374 757 2094 -1288 420 -63 -571 544 -1643
427 -1643 985 1997 33 2076 2027 1305 2235 78 2288 2049 -1413 1442 1613 480 2603 1201 2575
444 2575 2860 553 2806 1720 19 1376 -654 521 1263 -486 2384 1122 43 2711 1293 530
460 530 1278 -304 377 -1038 -1277 1369 -1100 -287 1087 -797 684 -117 -1061 471 -1963 -2752 -973
477 -973 -1674 -1326 -2154 -1690 926 -2468 -1289 1090 -2188 -1613 -1533 -2616 -903 -2369 -1666 299 -2049
494 -2049 -182 -229 -861 781 -1462 -1295 -203 -3050 -696 -1 -2014 -151 -81 634 1126 -649 1577
511 1577 738 -1096 955 -437 -359 1278 -327 1402 1285 172 3022 1873 616 1313 532 1730 281
528 281 -762 2504 494 167 2184 1469 2388 2044 20 2700 1018 -431 1211 699 1113 550 239
545B39K203j820K54J723l391O07J381k185Q27j008o2J569j666J367Q14j452P21
562A21j383N40J127l128J783J168k875J675P00l31M88j595J220K53k503K189r79
579a530j162J384j309J945O80k283J950L48j594J350r19Q45j84j440K247j058
595g30l66K872j659J33O05j396K006r75j441J710j098L0J185m88J359j293J05
612E59J960k526M98J772k286R38j04o13J781j090K98J228j697Q72n37M3J039l090
630i55P21K064k147P62P55j340J462r34L03M71j621J145r77p03J654j567Q38J038
648I69k024J207N31j417P14p69j33p8r72J702m64j391J857q35n0O31j175J380
666c17l19j780J786p34l48J239n43J121p25n66K175j454q77J500j686Q72J07p49
$$ plain form
545 239 2442 622 876 2599 -792 -185 1196 -989 -162 -1170 -1232 337 -1329 38 852 -600 121
562 121 -1262 -722 405 -2723 -940 228 -2647 -972 -272 -603 -115 -1710 -490 -237 -2740 -551 -1530
579 -1530 -2692 -1308 -2617 -672 8 -2275 -325 23 -1571 -221 -1140 -295 -479 -1919 328 -730
595 -730 -1096 1776 117 250 855 -541 1465 490 -951 759 -339 -309 876 388 1747 454 559
612 559 2519 -7 491 2263 -23 915 811 198 1979 889 1187 2415 718 1590 1053 1096 2135 -955
630 -955 -234 1830 -317 445 1200 -140 1322 388 691 1162 -459 686 -291 -994 660 -907 -69 969
648 969 -1055 152 683 -734 -20 -789 -922 -1000 -1972 -270 -734 -2125 -268 -1103 -1153 -522 -1697 -317
666 -317 -636 -2416 -630 -1364 -1712 -473 -1016 105 -620 -1186 989 -465 -1342 158 -1528 -656 -549 -1298
684a298K034j385n6J809j062L58o23o8J346j596m0K010j517M14J085j207J587
701A791l83l90Q46j915P48N77r57N00n69K27J344j764J332Q38k204J316m62n99
719B76M58j190J368L24j580J591k31k9M74j711J057J86j929J564m60j419J282
736C1o55N72L23j640K177p88j351J028j053N8N35r52J629o58j275K381r86p3L02
755c95r90J386j261n30J453j176R4R45q36P16j21l79J491j686J32J017j167M89
773h18J24J21R69j135P68J327j831J106J15n80J80q03O06Q98j755J336L64p34
791B58J021p75N93L86j950J139M56j498J242l67M10M25j129J444N3j270R47p23
809F62m08P96q78Q97l90j152J884n95o58Q45r00J78l73p75J760r80r06J210p33
$$ plain form
684 -1298 736 -649 -705 1104 42 400 -223 -291 1055 -541 -581 1429 -88 326 1411 204 1791
701 1791 1408 1018 1864 -51 697 1274 317 817 248 475 1819 55 1387 2225 21 1337 875 276
719 276 734 -456 912 1236 -344 1247 1016 987 1461 -250 807 993 -936 628 168 -1251 31
736 31 -624 -52 271 -1369 808 20 -1331 -303 -1356 -1298 -763 -1715 -86 -744 -2019 362 -624 -697 -395
755 -395 -1385 1 -1260 -1790 -337 -1513 -1419 -474 -1310 -594 -715 -1094 397 -1289 -1157 -140 -1307 -818
773 -818 -694 -573 396 -739 29 1356 -475 631 746 166 346 -457 149 1047 -708 628 992 258
791 258 1279 504 1097 1483 -467 672 1128 -370 872 505 915 1340 211 1655 1708 438 1385 662
809 662 254 1050 172 1069 679 -473 1411 816 158 1003 103 281 -92 -867 893 -87 -993 217 -516
828e16N43J44r76J889j816m02J616j520J50l7k85J408j318j24J660j461O8K90
846f87r37J287j064J94J221j811O95J063j196J183n37j24Q34j290O83O33r96N88
864b61L6l49R55p38J163j10j620J310M4r84Q96n78M58L29p50J514j24p33O83m13
884G28Q1K59j019J391p30q98J506p48N79J0p02J165j035n25J330j214j49L47n97
903b21J321p81j59J061r98l96R60r58O36m61m29R69j169M53R24j151J28J59l75
922d87Q31j366r3J075j754Q27M70m31N58p31N69O82j591R85L48r86N21o07N29
941f51O67j292J270m2j024J158o35J82L66j273R90no76J001j97j64O25l18Q26
960H08n10p78J510q47p59J335p56O76j45o19J374n88m26J085r45K56k59o82J662
$$ plain form
828 -516 27 171 -805 1084 -732 -1134 482 -1038 -888 -925 -1210 198 -1120 -1244 416 -1045 -977 -687
846 -687 -1624 -337 -1401 -1207 14 -1797 -1102 -39 -1235 -52 -589 -713 121 -1169 -486 147 -849 -261
864 -261 -225 -574 381 -357 806 696 -924 386 430 -554 342 -236 222 551 -199 1315 1191 458 1141 728
884 728 809 1068 49 1440 710 -188 1318 570 1149 1159 457 1622 587 62 1392 178 29 376 -221
903 -221 1100 319 160 1221 223 -173 787 -171 465 4 -425 544 -625 -172 752 -399 -271 -112 -487
922 -487 344 -1022 -1115 -40 -1794 -967 -497 -928 -370 -1101 -532 150 -1441 -456 -108 -1094 -573 -1180 -651
941 -651 16 -1276 -6 -48 -1072 86 -549 -367 -1 -1274 -284 -289 -965 36 -161 -325 300 -18 808
960 808 298 -480 1030 183 -576 759 3 679 534 -85 1289 701 275 1360 415 671 412 -270 1392
979A392j110j06J150j036K30P66q24P92r94K15Q99j370J74N08o27R78n96j9R79
998A401j503L30M08r41L69k39o0L61j186J058L23j015Q02j17n52L40n18M00K81
1017e8j345J024K09q72M83k31O49R7j362J568r07o29P88l68J96K37o84J288j67
1036h4q76J019m47J76j23n87J178m65q54J835p97k42Q44l68M09o69r7J014j164
1055b98K26P99q43R50m70k00J318j492K94J040j302O50L0m58N36r01O79R97j149
1074D06O72k56o47Q56q92M96K22j468P66P19n34L09m42K11M3j109J127L0j473
1093i64J185n09k73P05j157J263Q6j210J086p00r2J88q33R50l74n88J281m91m97
1112i44O79k00J51j69o44R51o48m38J208p22J04J42l55J444j142k21J250j088
$$ plain form
979 1392 282 176 1326 290 520 1286 462 1254 260 475 1374 4 178 686 59 1037 441 422 1401
998 1401 -102 228 636 -305 64 -175 -235 126 -1060 -2 321 -694 108 -9 -561 -221 -739 -339 -58
1017 -58 -1403 -379 -170 -1042 -559 -790 -141 -44 -1406 162 -745 -1374 -586 -954 -758 -521 -1205 83 -84
1036 -84 -960 59 -388 -212 -335 -922 256 -209 -1063 772 -25 -267 577 209 618 -51 -148 866 -298
1055 -298 -72 727 -116 834 364 164 1482 -10 284 1324 22 672 702 244 780 -121 558 1555 406
1074 406 1078 822 175 1031 139 635 857 -611 155 874 340 649 207 418 461 -648 479 509 -964
1093 -964 221 -288 -561 144 -1013 250 336 -874 212 -488 -580 -392 -1225 -275 -649 -1237 44 -447 -944
1112 -944 -265 -465 -314 -483 -1127 -176 -824 -1262 -54 -776 -672 -530 -885 559 -583 -804 446 -642
1130f42l0P25o05N86k43J77P63j147O99J89j006R65n60n5Q59j121O01P30p30M27
1150E82j80K00O51j158O66k1o46O37jp30Q99q96Q72m3p45P61k35n50L85m15K73
1171C06j13o55J633n96p67J068p18K70J19r96Q13j38r10P94n25j86N14l10P34
1190C37o20o00J279r47j43K34k43J78k51N8P80j028M75K48n40M70j41n27J121
1209A40j198L49P54q37P05j84l4L61p96N65N63j483P16J31k49Q15o29K23O84j004
1229d08Q06M61j006M49no2R5j052J284J38o30Q38o38L55M47r67O05Nr88R46j14
1250E59l37M46m08P21j37q87J046o12k80O89p99K00l7l74J258r47m13J132o60
1269A60P6j42m53O30q40K7Q83o54k82N35j69L71p48R6P61r06j4M45l19M39o56
$$ plain form
1130 -642 -672 53 -552 34 -209 -32 731 -416 283 472 -534 431 -129 -184 675 -446 155 885 155 582
1150 582 402 602 1253 95 761 740 94 731 730 0 899 3 875 832 87 848 613 63 448 33 306
1171 306 193 -462 1171 575 -192 876 158 428 547 -449 364 226 -684 110 -415 -601 -87 -397 337
1190 337 -283 -883 396 -551 -694 -460 -703 -525 -776 -718 62 -966 -491 -243 -783 -313 -454 -981 140
1209 140 -1058 -709 45 -792 -87 -271 -305 56 -740 -175 388 -1095 -379 -248 -497 318 -311 -88 596 -408
1229 -408 398 859 -147 302 297 235 330 -722 562 700 70 908 270 625 1072 105 710 715 -273 673 559
1250 559 222 668 260 981 844 -43 1003 391 111 800 1 201 164 -210 1048 101 -312 820 160
1269 160 236 94 -359 271 -569 -542 341 -313 -595 -60 -229 142 -606 -510 251 -655 -669 -224 -543 -104 -760
1290g60l1J060j301M97M97r80K71J11j70P13p86L02M00q12P54K14l18O98q20N80
1310A19Lp58N85J22n27N13l45L23K94q23J129n31j57N63n18M01j66n07J061j01
1330F80n14R00n84P0k01j15M97l96l44J157j102J36N52k86L43n06k71R06j051
1349a29J87N35q67L94j83K33Q39j211M09M42r41O76j50m70K85o29L39M85r60Q44
1369A28k67l52M24l83l2O97j219N74J41m33N00n3J35J62q55O62O4n79N67l96q8
1390f03K27l68O71mo67Q55k96k02N21o81N05J68o97O50l41k14R63p45P10l41l12
1411b01J084o51l74P63j030P94Ll7L83p23J06Q32q11L74j05m06P70p77K30N56
1431G80p74J67N06n57P01m53j88N98j156O57K99r06N38K25p34J033j004N97J83
$$ plain form
1290 -760 -791 269 -1032 -535 -38 -1018 -747 -636 -806 -93 -879 -577 -177 -989 -235 -21 -339 359 -461 119
1310 119 122 -636 -51 71 -456 57 -288 35 329 -494 635 104 -53 510 -8 393 227 -280 781 680
1330 680 166 1066 482 552 351 236 733 337 -7 1150 48 184 736 450 793 287 16 922 -129
1349 -129 58 593 -274 120 -63 170 1009 -202 207 649 -292 384 234 -236 49 -580 -241 244 -716 128
1369 128 -139 -491 -67 -450 -482 215 -1004 -430 -289 -722 -222 -275 -140 22 -833 -171 -107 -686 -119 -515 -603
1390 -603 -376 -744 -73 -77 -744 111 -185 -387 134 -547 -42 126 -571 79 -262 -476 487 -258 452 111 -201
1411 -201 883 232 -142 621 -409 385 388 351 734 11 117 949 138 512 407 1 771 -6 224 780
1431 780 6 173 679 122 823 370 182 780 -376 281 580 -326 212 437 -297 736 -268 329 512
1450E12q28M16k50j23J71k52M92J20r82R41k27k41M30p04R6K59n48Q77k93p90
1470i24N63l16L24R6l54M72l18m18P64l02j52K38l08N54k24l55Q49m69K5M11n30
1491c74L62l38L7P69p65n5R11m81K19j13j64L27k17K60K55m83K7J29k33N27n64
1512C6R7O32p54M89J10l08L90n71N64Q3j042O88K96n22R4j73K82J20r25O37J03
1533C26m47K36J47k68L38n86N56m2n69P18n43M2n1k47N97l79m78N72q0k79M07
1554c0k84R7k16l17O77n16j91P15n72J58K58l63P65q42J49P10r03L98K04l92N13
1575A8k38m4L24l77o1N24m10K32l62L90K17o12Q42j2o76M47j14K5L30p24L90L25
1597D34n80M65q6p3L42l98L76km74N62k11l08L65k18Q5J00m01O41m98r1L01j62
$$ plain form
1450 512 -316 100 -150 -273 -102 -354 138 258 -724 217 -10 -251 179 -525 -429 -170 -718 159 -134 -924
1470 -924 -361 -677 -353 -257 -611 -139 -457 -875 -111 -413 -565 -327 -635 -81 -305 -660 189 -280 -255 156 -374
1491 -374 -12 -350 -313 456 -309 -364 547 66 285 172 8 335 118 378 633 150 177 306 73 600 36
1512 36 133 765 11 500 610 302 692 121 685 768 -274 414 710 188 282 109 391 511 -414 223 326
1533 326 -121 115 262 -6 332 -254 302 260 -309 409 -134 -92 -143 -390 207 -172 -650 -78 -158 -437 -30
1554 -30 -314 -217 -433 -750 -73 -589 -780 -65 -637 -479 -221 -584 181 -661 -512 198 -705 -307 -103 -495 18
1575 18 -220 -264 60 -317 -378 146 -264 -32 -394 -4 213 -399 443 431 -245 202 88 113 443 -281 109 434
1597 434 -146 319 233 160 502 104 480 478 4 566 355 47 412 194 279 379 -22 619 121 30 331 169
1619A69j20NJ19L42l28l78O03k43M0P5m24L08m01l74P79q23K71K64j55N69m00
1640a02n05P29l03l96R02n51l9o0j51M94l90J98L15p80K42O6q0M82r24M29M55
1661C1r27O59K60l51K88j92J19J76n76M74J82o27O53l62K56R9l96M68N0n66N16
1682B34k15L74k65k45Q80l53n83J043l47m41J32j90L60o4l23P72o47l33Q96l82
1702C03Q6N3o54Q83l85m46N18m24J73J36k95J32l01L05L92p17L40J1m02N31m43
1723b04k14N91n98L42K60m93K65k27J08K3l76M28J42p08M37j05j40K75l51L21
1743b24J59n84L99J08k70Q0l33N78O5p02R30j59k75J56j06J39K44l15M83k74p19
1764f20R14l66K02O8k32P45m70l52N57k96l2K4k03N17k94k06P10n48J7L65k59
$$ plain form
1619 169 49 54 173 515 187 -191 412 169 209 284 -140 168 -233 -607 172 -651 -380 -116 -271 298 -102
1640 -102 -607 122 -181 -577 325 -226 -265 -325 -476 18 -372 -174 141 -639 -397 -331 -411 71 -853 -424 31
1661 31 -896 -237 23 -328 -40 -232 -113 63 -513 -39 143 -484 169 -193 63 162 -234 234 284 -282 234
1682 234 19 393 128 -117 763 410 -173 870 523 82 214 24 384 320 -3 769 122 -211 685 303
1702 303 389 442 -212 671 286 -160 358 -66 107 243 -52 80 -221 84 476 -241 99 110 -292 239 -204
1723 -204 -418 173 -425 -83 177 -316 -51 -278 -170 -147 -523 -95 47 -661 -224 -329 -469 -194 -545 -224
1743 -224 -65 -649 -250 -142 -412 -332 -665 -87 -22 -724 206 47 -228 -72 -178 -39 205 -110 373 99 -620
1764 -620 294 -72 130 198 -34 711 241 -111 446 150 118 142 -61 456 162 -44 666 118 135 500 241
1785B41L63l86j87N93n82J07M19l50K12l43j4L78n51L24J75l00L0J13k49L44n36
1806a99L37J41o96M40J35m83M52k08Q2K64n75M76j48k55M12n08k34M32n89Q76
1826A52m07l41M58l87J87N2k47N43k02l66K66J34k87L54l84L14L5m11N94j59n3
1847a55P1n5OK86m31O81o25q8M84O7Q8j06l47O02l95q0L22k84J50O3j23L39k20
1870B50o6M08n63L33L07p84L69j80k4M28n51N49q5l00K35k62K72o9n13N28R1n75
1892b02K00L18m25J40j26K03K1l40N19l58j71l1r4K46K27p77N08j5j31K63m33
1913d58L44j6j50O00o64l23P38k74j00J5J57J64m98K37pj07k1L72j53QN3j37P17
1936D97j037L63M64n48J02K54l06N81m36N7M66m42n1K93k94K79k57J66L10n39
$$ plain form
1785 241 604 218 31 624 42 149 568 218 430 87 73 451 -100 224 399 99 129 242 -7 337 -199
1806 -199 138 279 -417 23 158 -325 127 -81 1 265 -310 166 18 -237 175 -333 -567 -135 -724 152
1826 152 -255 -596 -138 -525 -338 -286 -533 10 -192 -558 -292 -158 -445 -91 -475 -161 -126 -537 57 -102 -155
1847 -155 -84 -139 -133 153 -278 403 -222 -310 174 241 329 223 -124 478 83 3 325 41 191 254 131 470 250
1870 250 184 592 29 362 669 -115 254 74 50 478 -73 476 391 91 326 64 336 267 -246 282 373 -202
1892 -202 -2 316 -109 31 -95 108 129 -211 308 -50 -221 -252 -346 -100 127 -650 -142 -157 -288 -25 -458
1913 -458 -114 -130 -280 320 -344 -667 71 -203 -303 -288 -131 33 -465 -228 -235 -342 -363 9 -144 -136 -83 -220 497
1936 497 -540 -177 287 -261 -159 95 -211 370 -66 -9 457 15 -36 257 -37 242 -15 151 461 -78
1956g8L92J18m73L28k21M21j04k10L44k96n3L20m63K13K25o58N50j37l79N53p2
1977C20p0j78k73O63n36O5L33o05J09N40l01j10O5j30K38l73J81J44m82O9L70
1998C9k47M99o07O6K11l25K10N9l81M16l46J1N21n97K94K90n76J52k25K82L99
2019A45p41M11J70m38M13j1m9L26p74N40J18n93M56P2l23O49n82J29L26m69N51
2040C26J8l40Q5j08N36k13j35K25k24LJ57k8j33J07j48J34k44j1J38k53K45J55
2062B92k69J23j69J57N33n97j54J93k22J07j72K18K40r2m24M94n41L87m70L24
2082d2L2k27j76N11j49l9O3j89J9l4QJ36o5R0r4k53J36k01N45P2k39K0n4j33J6
2107b47k54K24J27l86N34j74j2R2K8R8J28n86M46j90j84O03l17p8L28k98L14m5
$$ plain form
1956 -78 314 432 -41 287 66 487 383 173 517 221 168 488 25 238 463 -195 355 218 -161 392 320
1977 320 250 72 -201 462 -74 -9 324 -281 -172 368 67 -43 22 -108 130 -243 -62 82 -400 -331 39
1998 39 -208 291 -316 -250 -39 -364 -154 -95 -476 -60 -406 -395 126 -471 -177 113 -463 -311 -536 -254 145
2019 145 -596 -185 -15 -453 -40 -51 -100 226 -548 -8 110 -483 -27 45 -278 371 -211 -82 244 -225 326
2040 326 344 4 89 -19 517 304 169 394 170 173 330 302 169 276 128 262 18 7 145 -108 137 292
2062 292 23 146 -23 134 667 70 -84 109 -113 -6 -178 40 280 188 -236 258 -283 104 -366 -42
2082 -42 -10 -237 -413 98 -51 -90 -27 -216 -197 -231 -223 -87 -152 -62 -156 -409 -273 -474 71 143 -96 -76 -130 -263 -247
2107 -247 -501 -277 -150 -536 -2 -176 -188 -96 -68 30 158 -428 18 -172 -356 247 -70 -148 180 -118 196 151
2129A51k13L48N7k19KP2k5p0m8N19l25k92O63n22O5J05l23O43m79rM03n82K68
2152A89J94k69L60l22l42N37m13K45j29OJ86m68J60L68k74p0L12m89L33l37J63
2173f0Q2l87L73J19k93L16k55l04L87k73K08o7l94L93l0k11K98j78K90m3k38K00
2195f7j78j53J58Q4J42k77k10N58L19o48L83j70j35M31j02J87l59j77L28j83L1
2216c8P6K29j43M4j86N65n68L3J17RL22m94L57K7l10J88L0l28L83q8j94J47JN3
2240B32K11o07L98J6K7j98l36M83J94o38K45J51m44N69n71K54J29k40n4L26l33
2261a86M08l43R3P7l81L82k64j31N81n16J34Q9j88K64m52K23K93j73l53M00m01
2282d44M22n0j26K27m87J14L57j30q7J29j9K29j41j55N05l80jM9k74L34j04o8
$$ plain form
2129 151 -62 286 343 124 126 198 173 103 55 574 249 -43 620 98 163 268 -55 588 109 100 503 -79 189
2152 189 383 114 474 152 -190 347 -66 179 50 56 242 -226 -66 302 28 -42 270 -219 114 -223 -60
2173 -60 22 -365 8 127 -166 150 -105 -409 -22 -295 -87 -154 -548 -155 -185 -396 -98 -276 14 -29 -267 -67
2195 -67 -245 -398 -240 -156 -14 -291 -501 57 376 -272 111 -59 -194 237 135 322 -37 -214 114 -69 -38
2216 -38 38 267 124 168 -18 547 -21 12 129 138 460 -34 323 350 40 228 258 -70 313 225 31 178 179 232
2240 232 443 -164 234 250 277 79 -257 226 420 -218 27 178 -266 303 -268 -14 115 -125 -179 147 -186
2261 -186 222 -121 -28 49 -332 50 -214 -345 236 -280 -146 -57 -245 19 -433 -210 83 -90 -443 -43 -444
2282 -444 -22 -72 -198 29 -458 -344 13 -117 -204 -75 -94 135 -6 -161 344 -36 -37 12 -262 72 -32 -100
2304a00K96l09n5K01l2P3j13K55J00j64L8k07j25L36r9J5J37k27K92k22j92L17
2326B15j90J18j64k46M08oO1J4j94j39L69k59K59j50m34N68j79j41M03k52q7J89
2348A63j95K7j11k6J78Q4j15r8m06O87k89k79J01K14n0Q7l08L36k83j00K82l1
2370a32k21K89q7J96n2j48O1j41J08J84l67K24o7J0J27l04K47K14l49J72J92k31
2392g5R7j44J27K87o11O21k2k86L67j22o9kj89J10K42j00j00k80M38k02l43N96
2414C40j17j51L61l45L6J66n36L45m4j17L24r1m7q5l14M67j94j48N51o21J44K57
2436A81l5p0R3j98J6J30k06L44l90q5l3l0J82q3OK18l43K05Q6k14J0j14L87j11
2460e4l22N71k71k87L14Ok27L55k54O4L07o04L65j16K14j00J08N6k40m3J91J58
$$ plain form
2304 -100 196 -113 -168 33 1 74 -39 216 316 152 190 -17 -142 194 95 110 247 20 312 90 -102 215
2326 215 25 143 -21 -267 141 135 196 210 16 -123 246 -13 246 96 -338 230 51 -90 313 61 -26 163
2348 163 -32 -5 -116 -142 36 120 5 -93 -499 188 -101 -380 -279 -65 -115 -28 -336 0 -283 -383 -101 -132
2370 -132 -353 -64 -151 45 -7 -155 -94 -235 -127 57 -310 -86 -153 -143 -16 -320 -73 141 -208 -36 156 -75
2392 -75 22 -122 5 292 -319 302 280 -6 361 239 170 168 -21 89 331 231 131 -149 289 87 -256 340
2414 340 223 72 433 88 124 290 -246 99 55 -62 262 171 124 39 -275 192 -2 -150 401 -220 -76 181
2436 181 146 76 169 -29 -13 117 -89 255 -135 -220 -253 -283 -101 -184 -178 40 -303 -98 -12 -226 -216 -330 57 -54
2460 -54 -376 195 -76 -363 -49 -43 -270 85 -169 -105 202 -402 -37 -153 61 -39 69 125 -115 -158 33 191
2482A91k81L57l95rM67l91L62N2m97L93k76L54l2m14M34l40n5N33l13o8mP9M3
2505A90p0k41J88q2M3K24m21K88j13j4K24k03R8O9r0j41K44j13J53m45K32o0n7
2528i7Q0L24l77J38l42K16kl34M53L2k94L62o13L97J31l11M6J9l73L96p8J6r4
2551c05k4M64l21j9pqL63r1k8R3m77J7N82l23O5J76j45J66j01j08L25k41k9N92
2575F16q10K80J9LM50n02J14j1q2K7K02l06J97j21k64M13l60J28K39l26L30r5
2597A41p8K12r8j65J09l6J4K46k51k2j88K21l2j05K61l40J42J82l39J75r0k56
2619b97J55j4q9L19l13M26j44r5J86k43p4K29o4J20l73l8J92k17O9K20j69P3J87
2642D6j27l2P7k57M09l06j90N70k44L80m50j04O31n10R6j94K96n4r2jJ34j80q1
$$ plain form
2482 191 -90 267 -128 -137 330 -61 301 353 -144 249 -27 327 295 -119 315 -25 -80 453 140 72 68 147 190
2505 190 120 -121 67 -15 28 252 -169 119 6 -8 216 13 111 180 90 -51 193 80 233 -212 20 -40 -97
2528 -97 -17 307 -70 68 -274 -58 -60 -394 59 91 -203 159 -454 -57 74 -237 -191 -172 -545 -149 -227 -211 -305
2551 -305 -329 135 -186 -205 -212 -220 143 52 24 117 -360 -343 239 -84 -19 157 12 178 77 -31 294 53 24 616
2575 616 -194 86 105 108 558 56 170 159 77 104 306 0 197 76 -188 225 -135 -7 232 -94 236 141
2597 141 63 275 177 12 121 85 99 345 94 72 -116 105 73 -32 229 -111 31 213 -126 49 -41 -297
2619 -297 -142 -156 -245 74 -239 187 43 -52 134 -109 -183 46 -18 102 -271 -309 -117 -334 -265 -45 -214 -141 46
2642 46 -81 -113 -36 -293 116 -190 -380 190 -54 326 -124 -228 403 -107 -11 -205 91 37 -55 -56 78 -102 -183
2665a83K03k7L18l78L27k08R8J9p6Q7pk66J31lj27K13J10J71r4j62RJ74l81J13
2689F1L1j95K90j8o8J08k06k25N21k92K77n37N4M04k00R2j17k1N6j70o9L15k93
2712b02J54N9j54J37J02n73L16J08j04O9j35K50k44k02L98j51j77M93m44K15j55
2733b40J40O1j17j30L94l75K79K10n91M07j09Q5J20k43L51k73k94N73k32j8Jk07
2755b08O51m31p2J23m8Q0j09K30k04J80O3r3j25n7K41j19M44m52k15K56n3j62
2777h0K18n8N2p5K5o1J15l95N77k51l03L67l76N04k85Q4J37m29J44J6j93J88J56
2800G7k01K99l38K55j04j11M55l64j71J26r3K17j94p6J38P3O4l27K46j55J71l76
2822c89J98J02n3k5j8l2K51k22J73K18l01J80k52j7L55j46J46l00P1J75j79K69
$$ plain form
2665 -183 20 -7 311 -67 260 52 150 169 93 180 173 -93 38 35 -92 121 231 402 308 146 155 329 -52 61
2689 61 92 -103 187 169 101 209 3 -222 299 7 284 -253 -199 205 5 97 -20 -41 15 -155 -224 91 -202
2712 -202 -48 11 -143 -6 96 -477 -161 -53 -157 -88 -223 27 -217 -419 -21 -172 -349 144 -300 -85 -240
2733 -240 -100 -39 -156 -286 108 -267 12 222 -369 38 -71 14 134 -109 242 -31 -325 248 16 -2 -1 -208
2755 -208 443 12 -60 63 15 95 -14 216 12 192 255 162 37 -20 221 102 546 94 -121 135 82 -80
2777 -80 138 80 132 57 82 21 136 -259 318 67 -236 131 -245 259 -26 58 195 -234 -90 -74 -267 -79 77
2800 77 -124 175 -163 92 -12 -123 332 -32 -203 -77 -170 47 -147 -223 -85 -12 52 -275 -29 -184 -13 -389
2822 -389 -191 -89 -142 -167 -185 -217 34 -188 -15 203 -98 82 -170 -187 168 22 168 -132 -61 114 -65 204
2844B04j24j4P2p9j78N60k12j12p2j5J46j29j90N05m07J67J30l01L41p8k47L75
2866C42m69L52j53j24q0J49K31J29m28K14k5J28j18p3j58L5J2j89N80n00M1j55
2888b59K37J4j86m2M91n67K61r8p0J59J16j66J81k16L71l56m8KJ29q9J79j60J34
2911A7r9o0J06Nj33K96j81J51n3l64L41m0j72Q9J29j51K43k13J66l63L1K69J83
2934A97J3J6r3J15l45Q5K58j78l52K97N8O3k75nL78k34L2K44j04j68J10k75K79
2957A16k52P5J19J57m4j04nM16o34K72p7k18L11k17L86n29M5L74k64j02J30J2
2979c3j31K47k63M32k52j67L1k87K37p0R5k10K38j72K19O4k40L8m3nJ42O9n1O3
3003d9j1Q2k2k99L68k14K86k12j40J85j96L14o8k51M14k5k48J91k24J49L29l45
$$ plain form
2844 204 80 66 138 59 -119 441 229 117 45 30 176 47 -143 362 -45 122 252 -49 292 214 -33 342
2866 342 -127 225 72 -52 -132 17 248 377 -51 163 138 266 148 75 -83 -48 -36 -225 355 -145 -104 -259
2888 -259 -22 -8 -194 -236 255 -312 -51 -149 -219 -60 56 -110 71 -145 226 -130 -178 -176 -47 -136 43 -117 17
2911 17 -82 -142 -36 -31 -164 132 -49 102 49 -315 26 -14 -186 -97 32 -119 124 -89 77 -286 -255 14 197
2934 197 210 226 133 248 -97 -12 246 68 -284 13 71 134 -141 -146 232 -2 30 274 170 2 112 -163 116
2957 116 -136 -61 58 215 171 67 62 478 -156 116 39 -179 132 -85 301 -228 -183 191 -73 -175 -45 -33
2979 -33 -164 83 -180 252 0 -167 -136 -423 -186 -256 -161 -371 -133 -305 -86 -22 -262 -224 -267 -272 -130 -61 -112 -49
3003 -49 -60 22 0 -299 69 -145 141 -71 -211 -26 -222 92 24 -227 187 162 -86 105 -119 30 359 14
3025A4j10R8Q3N7j85J29Q5p0r9m9J61j7k00k03N32l45l3N21j35k62O8j54K72j65
3049gp1K72k15M42m52K32Q1l32J72j29j7J6p8oJ80j00Q9p9Q0NN0m06L32k48J10
3074g9j5j59K34j57L46n3k03L4k36J32J61j70p0M08m04M68l21l0K28j81q9o0K48
3097C2k35K95k23k6K82J62k44j16L83k78J2j0M9j83M29m37J24K17j99q0J80m9
3119H5R4l42J08J55j85J73K61m85L4L7K80n7k77j83K94P5j32J51j25L12l11N6
3141A8k66J57o4J53J24M4j70j23O3j93K62q1J05N1o3O3k31j9J63r8J17n5n9j26
3165b28J41k79M61l52N9K10P1j26l33K87P1k30N15k69J1M5j53J99j50M0J93j78
3187EK0J04j05j09M0J27K17l95J32O5j02j68K73k41j25J50J23L53k44j8ok33K11
$$ plain form
3025 14 -96 2 85 142 -43 86 171 101 2 -47 114 97 -103 -306 226 -119 -152 369 234 -28 40 -114 158 -7
3049 -7 -78 194 -21 421 -31 201 282 -50 122 -7 -24 -8 -86 -92 88 -12 77 -2 78 83 133 -273 59 -189 -79
3074 -79 -94 -253 -19 -176 170 117 -86 -52 -288 -156 5 -165 -235 173 -231 237 -84 -114 114 -67 -156 -216 32
3097 32 -203 92 -131 -157 125 287 43 -73 310 32 44 34 83 -100 329 -108 16 233 34 -46 134 85
3119 85 179 -163 -55 100 -85 88 349 -136 -102 -65 215 158 -119 -302 -8 67 -65 86 -39 273 -38 18
3141 18 -248 -91 -155 -2 122 166 -4 -127 -64 -257 5 -76 29 80 17 80 -151 -170 -7 -105 12 -43 -102 -228
3165 -228 -87 -366 95 -257 -198 12 83 -43 -376 -89 -18 -248 267 -2 9 54 -99 100 -50 -10 183 5
3187 5 25 129 24 -85 -45 82 299 -96 36 101 -1 -169 104 -137 -262 -112 11 364 120 102 96 -137 74
3210G4l19L8J60J53k13R4J51k33L72l15r6K36k2O8j47K29k04m1O9j1R4N1l70K16
3234C4P3j08p1r6J64n3o6P7J2j14R3P5j5j10j51Q1L09l09P4L39j72l33j7K0M5
3259b19K02K03j30k98K76o0j2J23J0j9j0k29J33J83m77L07j59N15k92j59K46j88
3281e4J30L7l3J02n9m4K6j12o3kNpJ42O4p0KO6K29k59k63L73j39j81J51J75k96
3307h0J39Nk6k6L5j63K2K60l89P8J91j79M60k29k30M15j81j86M25k43j90j26J55
3330f3J76j35J04m9K5o5j93K97k35K1K42j8l39O0J12j46J25M4M6k26o7L42M5p
3354I6N0k06j77K33J15j00l3l2k2l3j31P2L34j35l41L34p5p1J83M5k50L34Pj0
3378A87k33J29j73J96J51k43j3K55j28p8J16J30m38K58J47j75J35jk08J56k0j22
$$ plain form
3210 74 -245 -207 -47 106 -107 -13 138 -95 277 -38 -134 102 80 148 1 230 26 -15 54 43 137 188 -182 34
3234 34 107 -1 -72 -168 -4 -57 -123 -46 -34 -148 -55 20 5 -105 -256 -175 134 -175 -101 238 66 -267 -284 -264 -219
3259 -219 -17 186 56 -242 34 -26 -38 85 95 76 66 -163 -30 153 -324 -17 -176 339 47 -112 134 -54
3281 -54 76 113 80 182 123 79 105 -7 -70 -72 -67 -74 68 132 62 64 130 359 100 -163 210 71 -110 41 216 -80
3307 -80 59 64 38 12 47 -116 -94 166 -223 -145 46 -133 327 98 -132 283 102 -84 341 98 -92 -218 -63
3330 -63 113 -22 82 33 58 -7 -200 97 -138 -117 125 107 -232 -172 -60 -206 -81 -37 9 -217 -284 58 103 96
3354 96 146 -60 -237 -4 111 11 -22 -54 -76 -109 -240 -168 166 31 -310 24 -51 -122 61 106 -144 190 197 187
3378 187 -46 83 -90 106 257 14 1 256 128 50 166 296 -142 116 263 88 223 222 14 170 150 28
3400B8J22K6N5Lk99J87j63K29k00j69L07rj28j22M9L21N4n00J99k40K30J71k18
3423f7n7K16m10L93p4j0K24l97J78j55K10j8K63o18J88Q7p6n4L2M01m25L4R3p4
3447a16J07%l49L98j31j39J49k7R8J25k42K11oj5L39n04R4J82l5o3j54lO5J57
3471A41j50K10l1J0%k51q5K92j26j17l2L22j18k01J16k5J52J09k22L04k83j43
3493a28M30k30j46J05Q0R4k09J88p9o1k54J58k21L05j52Q6K7P0p2p2j79K49J62
3516A51k97J62k01L66o9k52K21j2p8p6l8M5K19k45P0r6J46k16J34jR7O2k85J48
3540d5j32L39m27K69K48l29l6L78n57M24k81j37K96P6Nk15K95J9k14J05K65m25
3562g9J64J81k36J56Q8k72K71j85r3n2R6k2j40L48j40JL5j70q3L07k74K66j85
$$ plain form
3400 28 150 176 231 234 -65 122 -41 188 -12 -181 126 117 -11 -133 -84 237 291 -209 -10 -250 -20 151 -67
3423 -67 -124 92 -318 75 1 -9 215 -182 -4 -159 51 33 296 -322 -134 -47 -123 -177 -145 256 -169 -135 -42 -116
3447 -116 -9 -9 -358 40 -91 -230 -81 -108 -10 115 -127 84 78 63 402 -102 -8 174 139 76 -78 -81 -16 141
3471 141 -9 201 170 180 180 -71 -156 136 10 -107 -139 183 65 -136 -20 -45 107 216 -6 298 15 -128
3493 -128 302 72 -74 31 111 205 -4 184 105 44 -210 -52 -273 32 -120 -34 -7 63 -9 -81 -260 -11 151
3516 151 -146 16 -185 181 112 -140 81 69 -9 -85 -123 -78 141 -104 -34 -130 16 -200 -66 -67 30 92 -193 -45
3540 -45 -177 162 -265 4 252 -77 -113 265 -292 132 -149 -286 10 86 91 -124 171 190 -24 81 346 -79
3562 -79 85 266 30 186 274 2 273 88 -5 -57 39 17 -123 225 85 86 121 -49 -132 175 -99 167 -18
3585a8p3P3m8o4M44j82k87K15k15L47K0l51L80j99j59K81j37K2r7Oj1J01K2nm66
3610d01J89J57r2J70Q3l21J08J04j26qK20p9m1m2j96L27Q6j78j54J11j57M75l14
3633g9O8J81k06J10pJ59k94M5Q9j35K72O6o7k26M2j70K27k47K47r2L17k94k4J71
3657A53q7j09K11j85l5R4J5n6j36K21Kr5k37j5L74kn2m0K26r2j89K13k83K55l52
3682b01K13J64k76K70k01l2P8r6N3K3M8q3n1r7q2K14J73j72p8L6J29j3k2R7l40
3707b46K60k64N23j80k22L16j17k89K47j95J64j39J94k1o7m6P2J33n4Q4k09K82
3729B26l46O8L59k37N3k73K25q4k9O4N8K3RJ06k35K59k29N1J90n14L75J24k50
3752gJ73m5k18K00j99L16k61J42J12L4j60M4n3n9K09m82J52K28Q6q1j95j33K71
$$ plain form
3585 -18 -91 -18 -66 -130 314 132 -155 60 -155 192 212 -139 241 42 -117 164 27 49 -48 -42 -53 48 70 65 -401
3610 -401 -212 -55 -147 23 106 -215 -107 -3 -129 -137 83 4 -37 -79 -275 52 138 -40 -194 -83 -240 235 -79
3633 -79 -11 170 -36 74 67 226 -68 -23 66 -69 203 269 202 -24 18 -152 75 -172 75 -17 300 6 -18 153
3657 153 66 -43 168 -17 -52 42 57 1 -135 86 88 -7 -244 -259 115 113 61 21 247 155 -34 179 -104 151 -201
3682 -201 12 176 -100 170 -31 -63 15 -81 -28 -5 43 -40 -91 -188 -270 -56 117 -55 -133 -97 32 19 -3 94 -246
3707 -246 14 -250 273 93 -129 187 70 -219 28 -167 -3 -142 52 31 -36 -82 -10 123 69 153 -56 226
3729 226 -120 -52 307 70 123 -150 75 -9 -38 26 84 107 116 222 -13 246 17 68 258 -256 119 243 -7
3752 -7 166 121 -97 103 -96 220 -41 101 213 247 87 131 78 19 228 -254 -102 126 212 131 -64 -197 74
3775G4j48J76k05J43J9k17L20j01j53J87J72j61l96K63l6l8j3R4Q1j07N2j97K63
3798G2j56k9l4J03q6K74k08L1J08j30J25q9K14j36j80J34j00j78L72j0j77J51
3820G1l9j32R0K03n6k05J78q8k84J39L65j94Kl71M24J11j46J2j2j42J01o2K8p7
3844h4K73Lj99J47k65L18k57jJ57p1m6K95o00R5J91P5R0O3j14j74M5J79j31n7
3868f8Q6J5m6N9P4k12J70j58j99K70O7p6P0q0o0R5lk11J08N7k64L44Lr3J05j3
3894D0j23j82K53o2M4q7K2J87oR5l9j00K9q6K58q2O4j63n0J03l59N85l31K7j9
3919A8J13j19O4J07N7j78k65L39j11M0J98k95J60l3k16L5K81q3j98M6J8J38l20
3942b04M32l70j85M42j47j26K29J62j30l9n6j07k31R7K81j67J01O3l5N7j60J52
$$ plain form
3775 74 -74 102 -103 40 59 -158 162 61 -92 95 267 106 -290 -27 -63 -101 -114 -20 61 -46 6 -191 72
3798 72 -84 -113 -147 -44 -130 144 -64 -33 75 -55 70 -19 195 59 -121 13 -87 -265 107 97 -80 71
3820 71 32 -100 -10 193 137 -68 110 22 -262 -123 242 48 50 -321 103 214 68 80 68 -74 27 -35 -7 -84
3844 -84 189 192 -7 140 -125 193 -64 -65 92 21 -25 270 -330 -235 -44 31 121 184 70 -104 -59 120 -11 -68
3868 -68 18 33 -13 46 120 -92 78 -80 -279 -9 58 -18 52 -28 -88 7 4 -207 -99 -42 -306 38 41 -52 53 40
3894 40 -83 -265 -12 -74 -30 -117 -95 92 86 181 142 42 71 -15 243 161 225 62 12 115 -244 341 10 37 18
3919 18 131 12 76 183 240 62 -203 136 25 65 263 -32 128 95 -121 -86 195 112 -86 -40 -22 116 -204
3942 -204 228 -142 -327 115 -32 -158 71 233 103 64 8 -99 -330 -233 48 -119 -18 45 10 67 -93 59
3964E9P5r2%J57k52J22k88Q0L40j63l3k48K56L8p5Ol9j98N61l17M2K52k34J17
3988A66L7l18L77j23j02j37r0M12N4j86K23j52k23J01r2n6N9j65L43m8q3K00k91
4011i4L16j49N5J45l62J25J00j69r8K44J12k08j86k2Q4K28j97j47L32j61l5J13
4033B6Rl4p1L10l33O7o8N2K63k97P1l6K80l68K39j36L7n1n9J43k52K63j16J14
4057E3J7M9j31R9j33n8k5o7p5J00n1K8J39P9r2J04M6o5r6M4q0p9K64k76P2Q6J70
4084A22j55O5j80K32j37L90l96K7J40K46j82j44kj01j81J50L24k83j08J26Q5J12
4106A50l25P2QJ11j29K06n3P1k32Q2O1J37m9k5J10n3k56N21k57j46l6J5J81j55
4130IO3k08J94o0qj7O2N7j90M5p2rO6j78J50k4J70k82K11o5M4j2J56k38J81k41
$$ plain form
3964 59 134 42 42 199 -53 69 -219 -139 201 38 5 -243 13 51 -24 -18 -57 -255 306 -11 31 283 49 166
3988 166 203 -115 262 139 37 -100 -190 222 276 90 313 161 -62 39 -53 -109 -50 -215 128 80 -3 197 -94
4011 -94 222 73 128 273 -89 36 136 -33 -131 113 225 17 -169 -191 -107 121 -76 -223 109 -52 -87 26
4033 26 35 1 -70 240 -93 -26 -94 -42 221 -76 -5 -41 239 -129 110 -26 11 -40 -99 44 -208 55 -61 53
4057 53 70 119 -12 87 -46 -104 -129 -196 -271 -171 -222 -194 -55 24 -68 36 82 17 -79 -35 -115 -194 70 -206 -134 -48 122
4084 122 -33 32 -148 84 -53 337 -59 -32 108 354 172 28 26 -75 -256 -106 218 -65 -173 -47 38 150
4106 150 -175 -103 -95 16 -113 93 40 111 -121 -39 22 159 110 85 195 142 -114 407 150 4 -32 -17 164 9
4130 9 72 -136 58 -2 -10 -27 35 92 -98 -53 -125 -134 -68 -246 -96 -120 50 -232 -21 -86 -42 -54 102 -136 45 -196
4156a96L0m8K28l54K22J15n9k4J83l2j88K82k91L57k47l6j41J57L2M9j6k56J74
4179e9Q3q4n4P4P8M4j1k07L6n0j2J22j34J4K44L3r9p5J74n9K5r6K13k30J81K98
4205D49n27J82l27J98J07O8K7k37L43q9m82L87L93o20n1J39R6j23j02JK53Q8k00
4228b7P2J7j55K53L7j62j60K67l50K52k5j16j6K26k14J78j98q2K22O6K1k90jO4
4252a21J65k05R1m3Q7k17K70l1NN8k11K57J16k46RR1Q9j75J33j0N2n8M1j10M3
4277H0o8Q5pJ3j64L8J37j80r7L16mq5J89k11p1O3q0jP6n4R6J74k15j8J80k02R7
4304H7j71o5J4p4L53k68K39L8r0l19K18K59m11O1M1K87o7j30j40j78K44J15l06
4327b63L42j65J06L2j3j28j39J54K07j01Qp3r9J51qM6k22M40l06j28K01k05J94
$$ plain form
4156 -196 -166 -214 14 -340 -118 -3 -62 -86 97 65 -123 159 -132 225 -22 -58 -199 -42 -10 39 23 -233 -59
4179 -59 24 -60 -114 -40 38 82 71 -136 -100 -150 -162 -40 -174 -160 84 117 18 -57 117 58 83 -13 200 -30 151 449
4205 449 -78 104 -223 -25 82 150 177 -60 283 194 -288 99 492 -128 -179 -40 56 -67 -169 -168 85 173 -27
4228 -27 45 62 -93 160 197 35 -125 142 -208 44 19 -97 -113 113 -101 77 -121 -203 19 85 106 -184 -185 -121
4252 -121 44 -161 -70 -113 -26 -243 27 -4 1 59 -152 105 221 -25 -16 75 164 -11 122 112 164 106 147 37 80
4277 80 12 97 90 103 -61 -23 114 -66 -163 153 149 64 253 42 -29 34 -46 -47 29 -25 71 245 30 12 192 -10 87
4304 87 -84 -149 -135 -209 144 -124 115 153 63 -256 -38 221 -190 -129 -88 199 132 2 -138 -316 -72 43 -263
4327 -263 79 -86 20 52 39 -89 -228 -74 133 32 40 -33 -132 19 11 57 -165 275 -31 -159 42 -163 31
4350C1k57N50k01k47K3J87P1j38l9O3r5O5j61J97K3j97K03L59m66O6J2l78J80
4373a49K03j00k8M2N5M6N6q8j3K84j45j19K1j01n0K3J9PJ15J32j37o3J0k74J12
4398a42J04K4k37J54P4j13O5j8j29K84j23J02j68L6M9P4j5n0O3k06q4K42K73j48
4422A11k54J97p9k88K88P2k93M18k42j79O3L46k10r1K37j47L33m77J38N8k3K36
4444B14j97J37k58M0K16m66M16k30K01m2J51j91J60l11n9K55j2j06K13q5l2R8
4466A12j35J74l47K44N4l7k12j06K53O0P5L7j75M05m28J57L7l88K90q0k1J06r3
4489a8L8M6n0K3Q4k59L30l81O9M10k75J33r7k55L70k89L76m02L58l46m0K14m5
4512fql08K24K43l34n7L08n0j20L12j05J7j16J24P2k52k55J10K64p0J23j1r2n0
$$ plain form
4350 31 -226 324 123 -124 -101 86 157 19 -20 43 -52 13 -148 49 72 -125 78 437 -29 37 49 -329 -149
4373 -149 54 -46 -74 -32 23 69 125 37 24 308 163 44 65 -36 -86 -63 -44 -37 78 210 73 10 20 -254 -142
4398 -142 -38 -14 -251 -97 -23 -136 -71 -89 -218 66 -57 45 -123 -87 -38 36 21 -29 34 -172 -256 -14 259 111
4422 111 -143 54 -25 -313 -25 47 -246 172 -70 -249 -186 160 -50 -141 96 -51 282 -195 -57 1 -22 214
4444 214 17 154 -104 -64 152 -314 102 -128 73 31 182 -9 151 -160 -219 36 24 -82 131 46 14 112
4466 112 -23 151 -196 48 102 65 -147 -253 0 60 135 172 -3 402 -26 131 168 -220 70 -10 -31 75 -18
4489 -18 20 66 16 39 123 -136 194 -187 -118 292 17 150 53 -202 168 -121 255 -147 211 -135 -175 39 -6
4512 -6 -14 -322 -98 145 -189 -246 62 12 -108 204 99 116 0 124 196 -56 -311 -201 63 -7 116 105 13 -37
4536c7j17K13L8k49L23j39q0L8Lj21L10k18k92M65lq0k7o9k9N5o3k0J80rl6j11
4562g5J35J41l2Jo3m9j45j22J77j42nJ32L22k56L6m3K6Q7p5k34L46j66l21K73
4586e2J05oj08J23m47K05J42J45j38J6L1m50L96NO9j15J95k80l5j22M02r1J49
4609A39k77K34j25J38J1r8K35l44K37r5k45n1L29nrj31L10m71K00J60j9l4Jj05
4633a5j97J97j6P8j75j0J5K7MJ40j9k48K05p4K09k68J62k22mJ67K03j84j58K25
4657D2j73J70J9j89R2q9LN6l1J18R0k8j32J05k5j07J45j7J98k58k1j7Q8k40j06
4682c07L15J04l5M0k2J07j91K5j02k4J51l7o6j2K37k98L59j14K0j48oj6J53k80
4706a47R1K16k10n4j2J26j41J82j17J57Oj37rJ52mj03J26j1o0k58J21J61p0J1
$$ plain form
4536 -37 -154 59 97 -152 171 32 -48 -10 -7 -128 182 -36 -328 137 134 54 27 -42 -71 -16 -79 -99 81 72 36 -75
4562 -75 60 201 169 170 107 58 -87 -209 -32 -174 -179 -47 275 19 55 12 38 125 50 -184 162 -4 -325 -52
4586 -52 53 47 -61 62 -385 -180 -38 107 -31 -15 16 -434 -38 -33 36 -79 116 -164 -199 -321 81 -10 139
4609 139 -138 96 -29 109 120 22 257 -87 150 55 -190 -241 88 83 74 -57 253 -218 -18 142 123 89 90 -15
4633 -15 -212 -15 -31 47 -128 -138 -123 -96 -92 48 29 -219 -14 -88 121 -147 15 -207 -211 -44 159 -25 -183 42
4657 42 -131 39 58 -131 -39 -128 -125 -69 -100 18 108 80 -52 53 28 -79 66 49 247 -11 -32 -49 39 -201 -307
4682 -307 8 112 77 117 95 202 11 36 -66 -90 61 24 -42 -54 183 -115 244 130 150 2 -4 -20 133 -147
4706 -147 -56 160 -50 -104 -116 10 -131 51 -66 91 97 -40 -49 103 99 -4 122 111 51 -207 -86 75 5 16
4730A6j24j26K07k05J99q5Q7K32k34n3J92M7j99J6Q6M7r0J10j40N2LJ23p2K9j61
4755d3P1JK10l24K19m5k02L48j52j38k08L93k91K83j13J38j26Q3l09J66M8J55
4777A64k89L32j72J39k13R5R1m67K67K4j62K27l67K91J03o1O4j13K90l77K22j63
4799g5J35k29K26j02K08K5k22o7M23l11J63j39n0q7R8J06N7M0j6p5k0p5q1J78
4823A10k00J29M7j00m6m9K45j01Q9j52K15k32k9J9m0R0N2K53n35N18r3m30K64
4846B4K4P8j37L3P7k71j45L00J35n5N1K0j52Q1K93k95P4j6k34L8J15k88K66K30
4870B46j94j74K05q1j28L83k83O3M1j00N6J81l4j24Q4r4P1J10k52J03k26K87k49
4893a09K74j48o4R4j09Q4k80L85j42J42j07J17n8J36k37P0m7J91j41r5K85l53
$$ plain form
4730 16 -108 -234 -27 -232 -33 -118 -31 201 -33 -86 106 153 -46 -30 56 103 13 123 -17 35 38 161 89 118 -43
4755 -43 28 29 239 -85 134 89 -113 235 83 -55 -263 130 -161 122 9 147 21 104 -205 -39 9 164
4777 164 -125 207 35 174 -39 56 147 -320 -53 -29 -191 36 -331 -40 63 2 66 -47 243 -134 88 -75
4799 -75 60 -169 57 -45 163 188 -34 -101 322 11 174 35 -15 -102 -4 102 159 199 183 108 88 13 -68 110
4823 110 -90 39 86 -14 -60 -109 136 35 124 -28 187 -45 -74 -55 -95 -5 47 300 -235 283 190 -240 24
4846 24 48 126 -11 22 99 -172 -317 -17 118 63 114 134 -18 63 356 61 135 119 -115 -77 38 -250 16 246
4870 246 52 -122 83 2 -126 257 -26 37 78 -22 34 215 181 57 141 47 118 228 -24 79 -147 140 -109
4893 -109 165 17 -47 47 -62 22 -258 127 -15 127 20 137 79 215 -22 48 1 192 51 -44 241 -112
4915a12K57l33M25j65m0j0O8M2q1K41k73j16K4J89l47L61k33j10N02j75j75J31
4937G0k99K98j72J50J9p6o6k9J41N3K5k45J60j72Q1J66o5Km7rn2J96l84l5L14
4962B4J57l57K49q8p8MM1j39J5j1L0L00j95J56k72J54o9J8R1J0p3k3OO9OP8K05
4989C08k31oj72J55R1j25J59l72M00n8k51J41rJ82l46J08k17K32J03jL7j66L26
5012B88k44RK9k19J72J47r2R2j16k2j81K00Q9l08K34Rj46Q7K08n06J13L00l79
5035b36L43Q2j70K24l39J74m30J79J59j75K07r6N3J63j2k80K81O5l42P0J35N7
5057A12j91J91o1J75m50K40j0J14J25k86J25J80l76K63j45Lr5j06J07K00j72L6
5079b1L2k46J95J91j29K02Lk18L4J10j5q6O2q9NJ60l13K03r2L9Q6l17L33J1j20
$$ plain form
4915 -112 145 -188 237 72 32 22 90 132 51 292 19 -97 -73 116 -231 130 -103 -213 289 114 -61 70
4937 70 -229 69 -103 47 66 -10 -76 -105 36 89 114 -131 29 -143 -62 104 39 41 -6 -15 -67 129 -255 -290 24
4962 24 181 -176 73 -15 -93 -89 -48 -187 -172 -183 -153 147 -48 108 -164 -10 -79 -61 30 40 -33 -56 -50 19 25 103 308
4989 308 77 71 -101 54 145 20 179 -193 207 149 -102 39 30 212 -134 -26 -243 -11 92 91 128 -38 288
5012 288 44 53 82 -137 35 182 90 182 66 44 -137 63 152 -156 78 87 -59 28 236 -270 -157 143 -236
5035 -236 107 189 19 243 -96 78 -352 -173 -14 -189 18 -78 -25 138 126 -154 127 192 -150 -80 55 112
5057 112 -79 112 51 226 -224 16 6 120 245 -41 84 264 -112 151 6 9 -86 -192 -85 115 -57 -21
5079 -21 11 -235 -40 151 22 224 227 9 43 153 138 52 114 25 30 190 -123 80 -12 27 113 -204 129 140 20
5104B0j9l0n8p3J57M7j53j29L91j85M5L48l64J88J87k21k1k72L5J36n7r3P8l55
5128c98K81M9J76N7n7k05J77k79M27k62M3j85Q6k7K30k09J08r3O4R9L2k22R8o9
5152g9j29J21O0j98K53J09J9k43K21k22m4N6Q4J87k22R9k43n7L57J02j99J47l16
5175a37L28O4r3k60K79j24Kl7K43l17k31JK36J66o9R7j17p9K68k66R9N1J57j63
5199I8j71K85l18l6J91Jp9nL8k68N5L32p0j63J95J05p5k60L26J1l62J44L8k82
5223b70J61L0K25oj43p8n6R4Q6l3q5J44n9L5k11K92J2j83K42p1k40Mm8M2J50l3
5249Aq6L39k83o4K28j79J65j42r4R0K7K8J87j00j81O7J4o7l7M3q2J98k61J53K13
5274A77m15K75Q1K0j0n5J17k04m6J09k73K50k02K05R1m18K68J47l15K60j2k11
$$ plain form
5104 20 1 -29 -87 -160 -3 44 -109 -238 153 -32 13 361 -3 185 372 151 130 -142 -107 29 -28 -121 -43 -398
5128 -398 -117 -68 108 165 108 -97 80 -199 228 -34 9 -176 -90 -117 113 -96 12 -81 -17 82 114 -108 -10 -79
5152 -79 -208 -87 -27 -225 28 137 156 -87 134 -88 -132 -76 8 195 -27 72 -171 -228 129 231 32 179 -137
5175 -137 191 255 162 -98 181 57 59 22 265 -52 -283 -282 -46 120 51 148 31 -48 220 -46 53 104 261 98
5199 98 -73 212 -106 -142 49 50 -29 -34 4 -264 -209 123 53 -110 85 190 115 -145 181 192 -170 -26 12 -270
5223 -270 -109 -79 146 140 -3 -81 -137 -43 43 10 -75 69 10 45 -166 126 138 -45 197 126 -114 -110 -158 -116 34 1
5249 1 -85 254 -29 -93 135 -44 121 -21 -115 -25 2 30 217 117 -64 3 17 -50 -87 -44 -126 72 -189 -36 177
5274 177 -238 37 118 138 128 73 190 -14 -60 49 -224 26 -176 29 120 -298 -30 117 -198 62 50 -161
5296a61N1K09j33P2Q4k22K38p3j12qqK02m07R3M06j87o0j11K3K50j90k18K79R5
5320A12N8j88k23L02Mm1nj56j41K48Pn0p9n0J54J23j07P1n3k76L64Kk22Q0J31
5345F5o1R7k85J27p0J40R8j35k4m3J9Q8L6Q2j51j10J21k58L93k2J51j36rj19R
5370Cj85K57j47J61k44J97j07m1K72k95R4j54RN1L25j94o1L7l8j85L17p4k2K65
5394B41k26j52O2K46j26k17M9K20K37m72k47K73k8K47j79J30q0q7N4m4O6K27j15
5417G9J08l77J78L2k27L48Qk75J97N6k89Q4J91r4Q1l8j22L1n5j34P3K53k11P9
5441b4J65j38K57j78l9k2q9M9j13J8L95m62J2K96l39M10j78n8K98l52R2m8j8J14
5465D8K3k34R4K60j79pJ2J62k78K91j02k6k30oK55P1k58k2J76r9K24PJ4k74N2
$$ plain form
5296 -161 -110 99 -34 38 122 -100 138 65 -47 -55 -63 139 -268 -175 231 44 -16 -127 -104 146 -44 -262 17 112
5320 112 170 -18 -241 61 65 24 19 -137 -278 -30 -23 -73 -152 -202 -48 75 -32 39 -14 -290 74 76 -146 -66 65
5345 65 4 101 -184 -57 -127 13 111 -24 -48 -91 -72 16 52 134 -17 -127 -6 -264 129 107 258 122 113 -6 3
5370 3 -182 75 -72 89 -155 42 -65 -106 166 -129 -35 -189 -180 -129 196 2 -59 -22 -60 -245 72 -2 -24 241
5394 241 15 -137 -75 171 45 -172 -123 97 334 -138 -385 -112 -140 107 -72 58 -22 -109 -55 -99 -33 194 79
5417 79 187 -190 -12 20 -207 141 149 -126 71 127 -162 -78 113 19 100 62 -60 -29 -84 -218 -145 108 -103 -24
5441 -24 141 3 260 82 43 21 -68 -19 -132 -114 281 -181 -169 127 -212 198 20 -38 260 -92 0 -48 -66 48
5465 48 71 -163 -69 191 12 5 17 179 -99 192 90 64 -166 -172 83 154 -104 -126 50 -49 175 182 196 -78 -26
5490b6l1J9O3O6j23j10K39m3J0M9k0l73M59J26k63K18j24j66N5J52k9k12O9l0
5514b5J99k35K9K65l83N30m18J93l40J03j7l6m1RJ13j30J83K03m02k4J83o1K82
5537A80j41q8r8K93j12J83m75J80J0J32j63Q1M5J54j55q6O7m1J29k88K06L00k20
5560I3P4j71j2j03K56j37J54l32m9L38l04L78k34J45l50M61k59n4J35P8k75L10
5582A42l0Q1l4k7j69n4l4J67M2k94J60R4P0m35K61j68K42j30L06j76j6J84k58
5605g6m1m8K18o7k5O1k52L87m01K63m8o1P7J56k5j9j32j21K56r0J19j12J06j09
5629A6J77o9o5K1j8j61J51k57J31K01k33J77j33P1pjN6j14J9J32r2J88o4j84J34
5654G6k21Q8P3j78n5P3K87p0r1J36M5k43K87k38J16l04L0L5j6P0J21J25m3j13
$$ plain form
5490 -26 -57 -38 25 91 -32 -142 97 54 64 113 93 -280 179 305 42 260 136 -30 25 177 148 -64 5 -25
5514 -25 174 -61 -32 233 -150 380 -38 155 -185 -82 -99 -135 -176 -167 -54 -184 -1 202 -200 -224 -41 -102 180
5537 180 39 -49 -147 146 34 217 -258 -78 -68 64 -99 -18 27 181 26 -60 7 -34 95 -193 13 313 93
5560 93 167 -4 -16 -119 137 0 154 -178 -227 111 -193 185 -49 96 -254 207 -52 -106 29 107 -168 142
5582 142 112 193 159 132 -37 -91 -125 42 84 -210 -50 44 114 -321 -60 -228 14 -116 190 14 -2 182 -76
5605 -76 -117 -165 53 -14 -39 22 -230 157 -244 19 -29 -90 -13 143 118 99 -33 -154 102 12 131 19 125 16
5629 16 193 124 59 80 62 -99 52 -205 -74 127 -106 71 -62 9 2 1 57 -57 -38 94 2 190 126 -58 76
5654 76 -145 -57 16 -162 -217 -144 143 73 -18 118 163 -80 207 -31 85 -219 -189 -154 -170 -100 21 146 103 -10
5678a0M1J20p7l82L56r7o7j18L15jJ63J8k80j1k1O0J1j93N16m34L4R2q3K87l90
5703a51L35k45L73o46O7L03j60o2O0%n3N3M4J49o5p0K34l81J37QK27k91K12n2
5727B6J29o3k05O3K14j61l05M33k16j03J50K97k43m3O0m6j08J09J43k38K2J31
5749D6J22k05j86L50j2m06N32k59K31l0j74J26l70L10J65k47N0Pl11K05oJ35j49
5772g6J81k57K22Lk60J31K00k57N1J68j0%o2m8J06LJ1j08j04J8N1O6n1l4P3l4
5798a7K09j61o5j68J33J9K7R9m3J03j13nj13K9N9K24j12k20K52m2M7j42j95J47
5822d8j06M2J83r7J52j44j56L73j86j3J68k8l93K18pR3j27n6K73k64L1J50K28
5845B86k70o7J31o1k06J42J07k46QM46l65K59j66J28j47k18J57k2m9K15j9nj79
$$ plain form
5678 -10 31 151 74 -308 48 -49 -116 -234 81 80 243 261 -19 -30 -51 9 20 -173 343 -91 -57 35 -48 239 -151
5703 -151 184 -61 312 -334 -267 36 -124 -186 -126 -126 -179 -126 -82 67 2 -68 166 -215 -78 -70 157 -134 78 26
5727 26 155 92 -113 -50 164 3 -302 131 -85 -188 -38 259 16 -27 33 -13 -121 -12 131 -107 -85 46
5749 46 168 -37 -223 127 115 -291 241 -18 213 183 9 135 -235 75 240 -7 43 50 -261 -56 -62 73 -76
5772 -76 105 -152 70 73 -187 -56 144 -113 -62 106 96 96 34 -14 92 95 106 -2 -106 -88 -37 29 -22 -56 17 -17
5798 -17 192 31 -34 -202 -69 -50 -23 76 33 136 23 18 -95 -66 -7 217 105 -115 137 95 142 0 -195 -48
5822 -48 -154 -112 71 -26 126 -18 -174 199 13 0 168 140 -253 -35 -42 51 -76 -132 141 -123 -92 58 286
5845 286 16 -51 80 19 -187 -45 62 -184 -176 270 -95 164 -2 126 -21 -239 -82 -104 -153 62 43 38 -141
5868a41J55j67J68r5j56R5J69j2j7l31M88k96K26J00m30M63j84j97M04k25k31
5889b14L14p2L8k33K80j61k25R2j9K60p3J29J32j74j60p4L50l97O7K49q0n7K93
5912B65n26K91j84J6m6lK04p4j75K04l3O8m8n0J93j72J61r9J10j71P5J50k02%
5936d6J08%mj04Mo1K67Ql00K38j70J46r2k87M37l62L60o8j58K3L1K16j92j49J49
5961fJ60j60K0j71m3J74j99J21J50k30M5J63k2l71M39p4q9Q1K37j58o5j17L72
5984B57l12J24P1k64J55J7j04K2K1q9J25m88K56L49l8K9On5j06k29L30q2K38j47
6008H6j88J62k05K44l81J99J92j30K85j99j13o9O9K04j73j84J45p8J87j02j08
6029a57k5M90m40L32l96J30J35k73L23L8m44J85K96k38J21kp4J26q2Lq3K65M1
$$ plain form
5868 -141 14 -153 15 -80 -236 -141 28 16 -1 -332 156 -140 86 186 -244 219 35 -162 242 17 -214
5889 -214 100 28 66 -167 113 -48 -273 -181 -200 60 -13 116 248 74 -86 -160 190 -207 -140 109 29 -28 265
5912 265 -261 30 -154 -138 -184 -187 17 -57 -232 -28 -61 7 -41 -91 102 -70 91 -8 102 -69 6 156 -46 -46
5936 -46 62 62 58 -46 -42 -103 164 172 -128 110 -60 86 -6 -293 144 -218 142 74 -84 -61 -30 186 -6 -155 -6
5961 -6 154 -6 14 -157 -200 -26 -225 -104 46 -184 -139 24 2 -369 70 -4 -93 -12 225 67 2 -115 257
5984 257 -55 69 140 -124 31 48 -56 -34 -13 -102 23 -465 -209 140 102 131 137 82 -24 -253 77 -5 233 86
6008 86 -102 60 -145 99 -282 -83 109 -21 264 65 -48 -117 -48 156 -17 -201 -56 -134 53 -49 -157
6029 -157 -182 308 -132 200 -196 -66 69 -204 119 157 -287 -102 194 -44 77 75 1 127 45 48 -35 230 271
6052B71m84L07Jj43K32l7j37N6j83J10j14J14J73j78N1J5p7J6j44k83N55M9j93
6075b3K19k84K30j51K94l23J08J37J0l30K1J05j03K47l7l36JK31j97K65j12J21
6097I3j05N5L66k85j88N4J89k91J88k02j2K15L7k70O6J17kr2J34J44n9l74K60
6120C8o3J3l11K15K98k89J66k05o6L33k51O9N8k84L72l9J81l94K58j23j50O7L20
6143B13j28k68O2M7m2J71m3j02J55L1j71Q7j9k31L32q8j19jL1K49j55o8j39K29
6167C3p2L3RJ03q3n5l3p4P5L7j83J87K53k85L8n5l9j3J92j02j09k3K11l36M30
6192A39%l32J41N4N8j7R3j83p1L79M1j31k61r7M72k45M3k8q0j21n9J99N2M8P8
6217A72r4p8k45J22L86k26j17K52k03J98j47P9j05k66L14j19l6J76p8m4L33k11
$$ plain form
6052 271 -213 94 95 -48 184 147 10 66 -117 -7 -121 -7 166 -12 39 54 -23 -7 -151 -434 121 170 -23
6075 -23 196 -88 142 -9 285 -38 70 207 217 -113 -92 13 -90 157 120 -216 -215 16 -181 84 -28 93
6097 93 -12 43 409 124 -64 -10 179 -112 76 -126 -138 77 114 -156 -90 27 25 -67 67 211 152 -222 38
6120 38 -25 -12 -323 -108 190 -99 67 -138 -204 129 -122 -53 5 -279 93 54 235 -159 99 -24 -174 -107 213
6143 213 85 -183 -121 -74 -116 55 12 -90 65 96 -75 12 -7 -238 94 6 -113 -114 -83 166 11 -57 -196 33
6167 33 -39 -6 3 106 23 -32 -65 -139 -64 -27 -210 -23 230 -55 -17 -72 -111 -124 68 -34 -143 -166 45 -291 139
6192 139 139 -193 -52 2 60 43 136 -47 -118 261 302 171 -90 -187 285 40 83 55 -25 -146 -205 -6 46 94 172
6217 172 78 0 -245 -123 263 37 -80 172 -31 167 20 99 -6 -272 42 -77 -113 63 -15 -59 274 63
6239F3k82K27j8P6L9j63M0Q6J6j87j49J20J6J24L1j88K03Qk12P5J59K8kL6j51
6264em7k8K27j99L33l85J69k56M60p0m15j2K81j07m0J35l06L91r8J4J47k8l91
6287b30K04R5m8m1J30j89P3Q6k43K79J12j74J59J26m21m3j09K95j28J98l71J24
6309a16J66ql98r9N33MJ02k44q6K90Ll98L66j45p1J5Q0J43j02j2L79m47K43k32
6333c4q2K95k65K12K9j16j84J12k4Q4J14j5j29J97k05OL5o7J96l28K80k28J20
6356Cj11j2L27P5m53J31R0J89j84j10J95Nj83K37m62L40k9J28j92j31N1Q4J49
6379A37p5k15L34Pj79K16m71M38j32rp4k0l0Q5O5j4j13L5pM2j6K5P1k33J93J32
6405A92jk28M6j55J54P0j92R9M2L5k61J36J00J00l09K66Q5l7o5j36J69m9m9l3
$$ plain form
6239 63 -219 8 -10 66 105 -58 -18 68 84 -103 -252 -132 -116 8 39 -149 54 62 -150 -75 84 112 110 146 -5
6264 -5 -52 -80 147 -52 281 -104 65 -191 269 199 -216 -228 53 -54 -94 41 -265 126 28 42 189 161 -230
6287 -230 -26 69 21 -20 110 -79 -6 80 -163 116 228 54 213 339 -82 -125 -234 61 -67 131 -240 -116
6309 -116 50 42 -356 -455 78 82 184 -60 -146 144 147 -251 115 -30 -101 -86 -6 137 35 23 402 -45 198 -34
6333 -34 -116 179 -86 126 155 39 -145 -33 -57 27 141 126 -3 194 -11 -5 30 -37 159 -169 111 -117 3
6356 3 -108 -120 207 282 -171 -40 50 239 55 -55 140 145 -38 199 -263 77 48 176 -16 -147 -96 -12 137
6379 137 62 -153 181 188 9 225 -246 192 60 51 -23 -43 -73 12 77 63 -50 -15 -22 20 4 29 100 -133 60 192
6405 192 191 -37 9 -146 8 78 -114 -15 27 62 -199 -63 37 137 -172 94 179 142 77 -59 110 61 12 -21
6429b1K44k0k69K26N1k10Q7k02K16k75J50l9j34j07M11L5j74j76L85k25j45K83
6451I1p4N5m2J14j39N6M5n4J92m75K70k5J00o5J22j75L9J52l26K99k29r7l8K40
6475C6j40J92ML1k21M9n7K34k63J56l6J26P4j21M1l16J58k5J64l92K45K47j74
6498A2pq3J08k74J10J07o1k89N93k92L1K53N7m54P4P3M9j4p8N7k36L40R7j82J02
6523I3k13l2K25J35m82N77l12J93l68M09m7p5j07j6L7q4Jl3R2j53L29k95K41j94
6547g9l7K7J80k38K07J7q8L0J09j21k4J78l1j43j79J67n8J1R7o0J99j90Nk67M28
6572A40j96j28L54k11M8m89P55l79J11NmP2j09j34L09j56m4M9O0j12P6L06m11
6595h8J68k74K47JK45l48J70j38j3P5K9M9k88K26n1j85K04k95N44j15l52L21j27
$$ plain form
6429 -21 223 203 -66 160 211 1 88 -114 102 -173 -23 -62 -196 -303 108 143 -31 -207 178 -47 -192 91
6451 91 17 72 30 144 5 61 106 52 244 -231 39 14 114 49 171 -4 35 187 -139 160 -69 -166 -204 36
6475 36 -104 88 92 123 -98 -49 -106 128 -135 21 -15 111 185 64 105 -211 -53 -78 86 -306 -61 186 12
6498 12 5 -78 30 -244 -134 -27 -88 -377 216 -76 -45 208 265 -189 -115 -42 7 -7 -85 -28 -264 76 173 -9 93
6523 93 -120 -152 73 208 -274 303 -9 184 -184 225 178 103 -4 -20 17 -67 -66 -99 -7 -160 169 -126 115 -79
6547 -79 -116 -89 91 -147 60 77 -11 19 128 7 -17 161 130 -13 -192 -25 -83 -72 25 -35 164 -26 -21 -288 140
6572 140 -56 -184 170 -41 7 -482 273 -106 5 10 6 78 -31 -165 144 -12 -56 -7 53 -59 17 323 -88
6595 -88 80 -194 53 54 299 -49 121 -17 -30 45 74 123 -165 61 10 -175 29 -266 278 163 -189 132 5
6618El02N13k07Q0j66J13k87L0L34J06m30M72j81k58K07P0j2J91k56J1l2j56K78
6641A23k91j4J70K7Rp1R4J9j20K5j1k40L13J09j32j90J35J25k6q2L00m11J06j34
6665a67r1K81j72L8J3K3M7K06j48j63P4J68l44L62j36M6n8j56J26K9M7J51k09
6688c3K10l63J74q0n7J37K34k23J12j1l13J47r1K37l07L69m2m66L43r5K13j73
6710g8K26k7r6j18K96k67l73N37l30R0K02j31K55l57M72l48R6j10n6K75r5q7o8
6733i2J94o9k30K25j0j36J28M0m43M39Pl3J49j31J4n6M4k04Q5Q8J72k33l9K20
6757A29N3k4j01K06k25n6j94K30j6K91l16J5j12l2K99j31j76J81l65L43L0j11
6779h2J19P7k0q1J28J69M9l19m3j27J00J05K14k19R6k41L24l09j1K40j95NM1l6
$$ plain form
6618 5 -297 216 9 89 -77 36 -251 -221 113 219 -211 261 80 -178 29 99 87 278 22 33 1 -155 123
6641 123 -168 -182 -12 15 24 -47 47 66 -54 -29 -40 -280 33 142 10 -180 -45 80 54 -28 272 -139 -33 -167
6665 -167 -258 23 -149 -111 -98 -75 -28 178 30 -133 -59 109 -235 127 -9 37 -21 -177 -51 -22 25 176 -33
6688 -33 177 -186 -12 -92 -149 -12 222 -1 111 100 -213 -66 -157 80 -227 142 100 -366 -23 -118 95 -78
6710 -78 148 121 25 -93 203 -64 -437 100 -230 -140 62 -69 186 -171 301 -47 49 -61 -117 158 63 -24 -92
6733 -92 102 33 -197 28 18 -118 10 50 -393 46 53 20 169 38 52 -4 40 -164 -79 9 181 -52 -91 129
6757 129 182 158 57 263 38 -18 -212 18 2 293 -23 -8 -120 -152 147 16 -160 21 -344 -1 29 -82
6779 -82 37 114 94 13 141 310 359 40 -3 -130 -30 75 289 70 166 -75 249 -60 -71 169 -26 -21 20 -16
6803a6L6j64J82K45m10L17j91J7J04k35j83O42l97J17k5n7j1J20k66N6L5j25K22
6826A3j13J97l8J2j29J17n6k58M81k97k6NQ5j16J3M2rQ2j9Q7j5k27K99j05m2j25
6852a42K56K76n60K31r9P5j1J15j09k82O9R0J19n7L6K81m33J65J0j78K39m33L34
6875hq4n5Q0P9j5k14J13k2J81j64l1op9N36l49J07Mk38J59j16J92j19P5r6j2J90
6901A08l10j6R5L16k94K32j68j69Q5N5J4Q3K29k85J84l59K72l4k04j4J98j28L8
6924g2K31Ql58K61j2r0L9n6K31k85P0p6j15K18j05j52M44j91P0K24k92p0j05L0
6948a53K08n8k4m5J29r6j10J73l1P1J14J51j41j02nk50M3K09j25q7j16L67l32
6971b10L72j4k08O4J22Pk29m0J36Q6k00K73p9l7R7j1n9j24o4J03Q4j95J50J46
$$ plain form
6803 -16 20 -144 38 283 -127 190 -1 16 120 -115 -298 344 -53 64 39 -18 -29 91 -175 -119 -84 -209 13
6826 13 -100 97 59 71 -58 59 3 -255 226 -71 -97 -92 -7 -123 -110 -68 -77 5 -14 73 58 -169 130 25 -17 -142
6852 -142 114 390 -170 61 -38 37 26 141 32 -250 -181 -91 28 -29 7 288 -145 20 30 -148 91 -342 -8
6875 -8 -92 -147 -67 12 -3 -217 -104 -126 55 -109 -140 -146 -225 311 -38 69 73 -165 -6 -122 70 -49 26 -70 -82 108
6901 108 -202 -218 -123 193 -101 131 -37 -206 -121 -66 -52 31 260 -25 159 -200 72 38 -166 -180 18 -110 -72
6924 -72 159 167 -191 70 58 -32 7 -49 182 -103 -33 -109 -224 -6 -111 -263 181 -10 60 284 -8 -78 -183 -153
6948 -153 55 -3 -27 -72 57 -39 -149 24 -7 64 178 329 188 86 81 -169 -126 83 -42 -129 -245 122 -210
6971 -210 162 148 -60 4 126 133 -96 -136 0 86 -114 159 80 43 140 129 70 -54 -118 -15 69 -126 24 170
6995A70K9r4k83O4R1r9K23j87PL19l40J77q8K34j94k50L64j40O8l9j23J81j01
7018a1j19J04k11M90j14p9r4l6km3R1n2L8K29j17k15q9L54k08n0K03j4k05J40
7042a0J82j41J30l19M7Q0J18q5L8j93L36l98J16K77l62J86KJ77j86k2N4k54M16
7065A89l95k3J43J00J07r4l7o1r9L41k09J52J7k1Q1N7m47L69j63l05J11L07l27
7088b07J58L60l46J4j64J62J39k73R6J93k9q0r9k27J93L33k32M7j19J90J28m1
7110A96j98om57O43j31p0j8J96l71J16O1J84M8k79k2L32j82J72j02l19J12O5Q5
7133E5o0M08m88J32k00R3O3m9J06r6J70j33N1q3N5k89J29L18k37Ln8P3n1P4k73
7158b87N81l22O8J34o7r0o2K66m25K09j6J72l70%K97j59K26k48P0n3P2o0j37J62
$$ plain form
6995 170 199 105 -178 -114 -23 -122 101 -86 -79 240 -100 77 -11 223 29 -221 143 3 71 32 -91 90 -11
7018 -11 -130 -26 -237 253 139 60 -34 -70 -72 -115 -24 -76 -38 191 74 -141 -230 124 -84 -134 69 55 -150 -10
7042 -10 172 31 161 -158 -111 -31 87 2 40 -153 183 -215 -99 178 -184 2 4 181 -5 -27 27 -227 189
7065 189 -206 -229 -86 14 121 27 -10 -71 -170 171 -38 114 131 110 191 248 -199 170 7 -298 -187 120 -207
7088 -207 -49 311 -35 -21 -185 -23 116 -157 -61 132 103 23 -76 -303 -110 223 -9 38 -81 109 237 196
7110 196 -2 -8 -465 178 47 -23 -41 155 -216 -100 -39 145 193 -86 -108 224 42 214 112 -207 -95 -30 55
7133 55 -5 403 -85 47 -153 -60 3 -46 60 -36 134 1 52 -31 24 -265 -136 182 -55 -52 -110 -37 -88 -14 -287
7158 -287 294 -28 40 174 107 17 -45 221 -204 5 -11 161 -209 -209 88 -71 155 -93 -23 -76 -4 -64 -201 -39
7182c9J82L4j70P7k35K94M0k36K7j7J62p1p4n0J49k78J87m7j18r8R2M3K64j68
7206e0J59q0n3j88L45j1l41J82m5mk1J50L1j55j17M88m41K7Q3K69q3k47K84l04
7230a22J11J57j1N4j33j42J86j66l9J20j46K86j99j67L21j27K54k37K1Oj24J08
7252A1K07o3l09N6J22M5k1q1O4j69J58L1l07L30j84k4J87Qj0o8J95k72j42K66
7276C0L1N7K0K21m76J15J1PL01k79qq6k50K73J55j22M9p8J15L6j21Q7l28J61J21
7301D2n1J7n4L6l0j97K66j94J57k63M00J82l43l3J18k26K56j67L14l62L52k70
7323e0j51n9L2J31J53k74K62M7j77K74l48M05k30N1J51n53M32K3j42K62j83P0
7345A26l9nr5M4l3q5J20L63k96j70q6K59l5p5m8k30O0K73l82N91k11Q6j56j64
$$ plain form
7182 -39 143 177 7 84 -151 143 183 -53 -26 -43 119 48 -26 -76 73 -205 -18 -65 -183 -281 -189 -146 118 -50
7206 -50 109 29 -24 -212 133 122 -219 -37 -82 -86 -107 43 74 -81 -198 290 -151 -124 -41 228 145 -102 182 -122
7230 -122 -11 146 135 189 56 -86 100 -66 -105 15 -131 155 -44 -211 110 -17 237 0 21 27 -97 11
7252 11 218 155 -154 -98 24 69 48 -33 31 -138 20 51 -256 74 -110 -134 53 61 51 -17 178 -94 -236 30
7276 30 61 118 138 359 -117 -2 9 16 317 38 30 -56 -306 -33 122 0 49 -29 86 122 1 88 -240 -79 42
7301 42 -9 8 -46 -10 -40 -237 29 -165 -8 -271 129 311 -32 -65 53 -173 83 -84 230 -132 220 -50
7323 -50 -201 -260 -228 -97 56 -218 44 91 -86 188 -160 245 15 66 217 -336 96 119 -23 239 56 126
7345 126 87 82 -13 31 -2 -87 33 396 100 -70 -156 103 68 -7 -55 -285 -225 48 -334 257 46 132 -24 -188
7369a88R0n0K55k9j65P3J50k00j03J75J08j15j96K53j25J07R9l44K93J9k67K72
7391A12k86J80n0M7j26N8O2N0q4K05l55K60qj57p9m6J08L09l38K2K10j18l5J3
7415d6K19j43l53L27J24n0J11n06K68j24K40m0p2J42l72J56J05N6M8k90J27O1
7437a2J8J63k16O1o5j36k4K82l3qk10J90l5L3n6N2Q6kO8j97rQ2k4O2k82J37j49
7464b24N24l78m6P4N4n0n4R4j51J15j22L13k95j6J84j85k29K43K97j70M7o7N9
7487A7Q2k34L74j12m38L78r1N1M1k7o9Rp5K8J88j60l0J20n0R0n0n7k25J87J46
7512I3j49j37L64K06m26M5J27l7j04m9j53L41j28L9j08K73k04LM37n42M03m59
7534a65L80j57k78K44J96k46J55j4j60k0J2l6JM7K51m94K90N6j88P9NJ28J9m8
$$ plain form
7369 -188 -98 -148 107 78 -87 -14 136 -64 -167 8 116 1 -195 58 -67 40 139 -205 88 107 -160 112
7391 112 -174 6 -44 3 -123 -65 -3 47 -37 168 -187 73 65 -92 -171 -217 -109 200 -138 -116 94 -24 -59 -46
7415 -46 173 30 -323 4 128 78 189 -317 -49 -173 67 27 -45 97 -275 -119 -14 42 90 -200 -73 -12
7437 -12 6 169 -47 14 -51 -187 -211 71 38 30 -180 10 -25 8 -48 4 90 88 156 -41 -50 32 8 70 -212 -75 -224
7464 -224 300 -78 -124 -50 4 -46 -100 -6 -157 -42 -164 149 -146 -162 22 -163 -392 -149 148 -22 25 -42 17
7487 17 99 -135 239 127 -311 67 -24 27 68 41 -28 -19 -94 -66 122 -38 -68 52 2 92 42 -15 -240 -53 93
7512 93 -56 -193 171 377 -49 -4 123 86 -18 -67 -220 121 -7 32 -76 197 -7 -4 433 -109 294 -165
7534 -165 215 58 -220 24 220 -26 129 115 -45 -65 -53 -89 -88 -41 210 -284 6 62 -126 -47 -42 86 105 57
7558E7kj30m8R4M4m7k59N2K89K0j97K26L4J6j1k9j60M1j2j96J64P6q3j97K00J00
7584D2J55j37n0j64l8K75k30J35P7j32L5k5L4pj95J73P7%o5R7P0k2j48N7j6K37
7610B35l63o0P1K73k07k8O3j51K61m7j87L21l02J69m8L9N9j60k67K48M1N7k08
7633a91L0K87J75k91Qn5L3k33J85J48j49K67k44J12K7K25j93j54J05m6L2J00q8
7656I0m3L1j3k54L42j43Q8N7k13j50j5J61L78m22J13j70J24J92k81J28j8k85L84
7679H1%N6k83J46j70J3M9l4M7OL60l63P3J02J08j24j82j03J85J3M4n6K1k22K94
7704F1J53l71M14m96N07q6k42N02k74k99J78j6n1O7l9j24M5R0r3oK83j50j68Q9
7728b6R4k87J70J29j62R9O1q4l5K68j60mj68K86j24j61K28or0K5k62K69J03q0
$$ plain form
7558 57 55 -75 -123 -29 15 -32 -291 -239 50 70 -127 99 133 149 138 109 -51 -10 -22 -218 -54 22 -61 -258 -58 42
7584 42 197 60 10 -154 -192 83 -147 -12 65 -67 -32 -57 -23 -30 -225 -52 25 25 -40 57 127 105 -43 14 -2 235
7610 235 -128 -188 -117 156 -51 -79 -16 -167 94 47 -140 181 -121 48 0 39 98 -62 -329 -81 -40 17 -191
7633 -191 -161 126 301 10 18 -37 -4 -237 -52 96 -53 214 -30 82 109 334 141 -13 92 46 78 178 90
7656 90 47 78 65 -189 153 10 98 155 -58 -208 -223 -62 316 -106 7 -163 -39 153 -128 0 -18 -303 81
7679 81 81 137 -146 0 -170 -157 -108 -142 -95 -89 271 -92 -19 83 191 67 -115 -218 -33 -20 24 -32 -11 -233 61
7704 61 214 -157 257 -239 268 182 -60 442 168 -131 47 31 -20 47 8 -116 -71 19 -74 -80 203 53 -115 -26
7728 -26 68 -219 -49 80 -82 17 78 -6 -41 227 67 63 -105 181 57 -104 124 118 28 53 -209 60 163 83
7752H3q5O8o6O9k50pL21j80j28K08O8k54M77l21p5J99q9kk15R1K9j11r8M10r7
7777D5K3K52l14p1O8J64j58j38K54l4q7J52j56K63j15k93J60K69k18l25N0R1K81
7800A63n31K08O2K84m08L24j9j96P7k29J98p7N3L1M9nO1j18o7O6J27j0K11m90
7824b36J97Q4J37k08n0L34l81R1J20j54j4L06m10K62k44J23K2R2j99o8j1K87P1
7847A51l97J31J6k0mK00j9p0j37j0Q3o7j67K67K19j10j47LK84j79j34K59m9j21
7871a8j82J37n4O6p5j70K02K71j97j15R7l52K06M16k73oJ66l50M79j99k6l7O5
7894E1R0l34K44P0k54L61l88J85J81l4%j77j58K97j88O8k96r0M27O0Q7k56J99
7917A45k25N1O6l0K5j28J09J22j94O3J32j58K8j20J37k4P0j93J17k16L09K1k34
$$ plain form
7752 83 -2 66 0 69 -181 -188 133 -47 -175 33 101 -153 324 3 -72 127 38 36 -179 -88 -59 -170 -268 142 45
7777 45 68 320 6 -65 3 167 9 -129 125 91 4 156 0 263 148 -145 15 284 66 -259 -209 -118 163
7800 163 -368 -160 -98 186 -222 102 83 -113 -36 -265 -67 -144 -91 -60 -11 -16 45 -73 -140 -74 53 43 254 -236
7824 -236 -39 45 182 -26 -76 258 -123 -32 88 -66 -80 226 -184 78 -166 -43 -21 71 -128 -196 -207 80 151
7847 151 -246 -115 -99 -119 -123 77 58 -12 -149 -159 -76 -143 -310 -43 176 66 -81 -78 206 27 -107 152 103 -18
7871 -18 -200 -63 -117 -51 -126 -296 -94 177 -20 -135 -38 -390 -184 232 -41 -47 119 -231 248 49 23 -14 51
7894 51 141 -193 51 121 -133 228 -160 25 206 172 172 -5 -163 134 -54 14 -282 -372 55 115 202 -54 145
7917 145 -80 -29 37 7 32 -96 13 135 -59 4 136 -22 6 -114 23 -1 69 -124 -7 -223 86 107 -127
7940a27qJ95k92N3M69l50l4N3Q4K44m89L49Lk13q6L4J14l8P5l35L78k12O1M1O4
7965C3j60M05r2k57J62l6n8j6p6J55N1n2j45p5L79k25K7L2o6j03R5k1m3l8o6M46
7991B56j45j78r7M69l38n5N4J22m8j91J30oKN6n1K43k82j57J64K58k39j53K17
8014C1J23k24l6J53N2j36p8J29o5J20m4j03N1r4J12j99J33J79q2j26q2L7Q2q6
8038a53K44q5k8O1j36l1J69j83J74K75k62Q9j20j90L73k45L33k84M4M7l3j25p7
8061a43K38L8j30j28j93L28o0j19L22m75L73j07N8j55K51m09J08J80j39M33K3
8082B94l88L38j80j08M4K43j09k19Q9K12j36k3o6k7K54l62J9J68m8j88J59j14
8104a48J51P2J4q1O0j81N1K64r7Qq3k10K27k5J12l33M06r6j79J27j90L76l38j2
$$ plain form
7940 -127 -135 60 -232 -179 290 -60 -94 -41 43 287 -202 147 150 -63 -149 -115 -1 -39 36 -299 79 -133 -72 -31 33
7965 33 -127 278 186 -71 91 55 -3 -19 -95 60 111 59 -86 -161 218 -7 20 52 -14 -117 -22 -43 -86 -124 -190 256
7991 256 111 -67 -164 305 -33 -88 -34 88 40 -151 -21 -27 -25 31 -20 223 -59 -216 -52 206 -33 -186 31
8014 31 154 -70 -106 47 99 -37 -115 14 -51 69 25 -78 -27 -121 -9 -208 -75 104 22 -104 -186 -149 -67 -153
8038 -153 91 6 -22 39 -97 -128 41 -142 32 307 45 134 14 -176 197 -48 285 1 45 92 59 -66 -143
8061 -143 95 133 3 -125 -318 10 -50 -169 153 -322 51 -56 2 -153 98 -311 -203 -23 -162 271 294
8082 294 -94 244 64 -44 0 243 134 -85 4 216 80 57 -9 -36 218 -144 -125 43 -5 -193 -34 -148
8104 -148 3 75 89 8 68 -113 -62 202 105 113 30 -180 47 22 134 -199 207 111 -68 59 -131 245 -93 -105
8128a05J32J35k77J91o7k39L10m3m6L4l5K2m1K03q6k18P6J2o8J03j77J69j16K40
8152A09J48j59j72N7L2J73l59K56j53L03k76j33o5q8L25P8RM0n05O47l99K26j96
8175a02J92M6M1j78J2R6Q9j08Qj00j39P9K6J70k0k76
$$ plain form
8128 -105 27 162 -115 76 9 -230 80 37 -9 25 -10 12 -29 174 88 -130 -54 -42 -110 -7 -184 -15 -131 109
8152 109 257 98 -74 -17 15 188 -171 85 -68 235 -41 -174 -239 -327 -2 76 85 125 -380 267 -132 94 -102
8175 -102 90 136 177 -1 11 107 196 88 96 -4 -143 -64 -38 132 112 -164
8191a64
$$ Imaginary data points
##PAGE= N=2
##DATA TABLE= (X++(I..I)), XYDATA
0@%%%%%%%%%%%%%%%%%Qj6J6j6J6j8K6l2L3m1M8n6O4p2Q4r4J07j22J38j55J74j97
39a05K19k44K74l02L35l72M09m52N00n50O07o70P37q11Q96r90J093j213J347j500
59g92J682j896K153k473K880l417M167n295P209j1339M0799m4627k8367O0794
73B1478j0386k5771n715J8714l878l115R349p51l984Q193j3473l268O592P66N232
88a7k663k350J5016m186l630P085M75k270p660n014K814o335L800Q7j2562R327
104h083P590p323N753J845n413l031n02L838o017J600J2907r757O8J7526m86m644
120E871j707j80J638j0292Q00P804j0295j439Q238J088j672j984P804j863j3699
135i888J0407M811j3455O134O279m221r87N112Q840m784n655Q521m627m367L508
$$ plain form
0 0 0 0 0 0 0 0 0 0 0 0 0 0 0 0 0 0 0 8 -8 8 -8 8 -10 16 -16 17 -24 24 -32 32 -40 44 -50 57 -65 73 -82 92 -105
39 -105 114 -130 144 -158 177 -195 214 -238 262 -288 319 -351 386 -425 471 -519 574 -639 708 -792
59 -792 890 -1006 1147 -1326 1554 -1863 2304 -2991 4218 -7121 33678 -10949 -39316 21478
73 21478 11092 -14679 -20394 -1680 -5558 -8673 676 -75 -4059 4134 -9339 -12607 -6015 -5249 -17
88 -17 -2680 -5030 9986 5800 2170 9255 9730 7460 -200 -5214 -2400 -8735 -4935 -4848 -17410 -8083
104 -8083 -493 -7816 -2063 -218 -5631 -8662 -9164 -5326 -11343 -9743 3164 -6593 -6525 11001 10515 5871
120 5871 4164 3984 5622 -4670 -3870 3934 -6361 -7800 438 1526 -146 -2130 5674 3811 -9888
135 -9888 519 5330 -8125 -1991 4288 67 -920 4192 13032 8248 2593 11114 6487 2120 5628
150E628m399M79K14m710N377J071l27J864m469K202p05n531M077k311k272L021
166g91k630N726K596m806O693r70p402K622K159j479o888k32Q701o000l728R090
182B661k367k257J035l509K204j671j221J441m322L352L896l881L701J656o04
197A14J389m546L487Q23p565L639Q35k518K929n86J536J760l362L331j862k508
213c104L450m953R45L667m149L459L556j539J249j274L507k12n767M174k72l954
229a217L113j288J605K040l526M021L28m637K440j057j249l65k156M039j796j488
245a193O791k715j188M013k784p7j142j683K489l596r2L268k831K559K65k250
261a66L892l590k151K784l359M53q69j226L989k005K50L806l154R59L43j931K232
$$ plain form
150 5628 1229 1708 1922 -2788 2589 3660 3333 5197 728 2930 2225 -3306 771 -1540 -3812 -791
166 -791 -3421 2305 4901 95 6788 5818 -1584 1038 3197 1718 -5170 -5402 3299 -2701 -6429 2661
182 2661 294 -1963 -928 -4437 -2233 -3904 -5125 -3684 -8006 -4654 -758 -4639 -938 718 114
197 114 1503 -3043 444 1267 -6298 -2659 -1824 -4342 -1413 -1999 -463 1297 -2065 1266 -596 -3104
213 -3104 346 -4607 -3662 5 -4144 -685 2871 1332 2581 1307 4814 4602 -1165 3009 2737 -1217
229 -1217 1896 608 2213 4253 727 4748 5076 439 2879 1822 573 208 -1948 2091 295 -1193
245 -1193 5598 2883 1695 5708 2924 2847 1705 22 2511 -1085 -1177 2091 -740 1819 2084 -166
261 -166 3726 136 -2015 769 -2590 -2137 -3006 -4232 -243 -2248 -1998 1808 -1346 -387 -44 -1975 257
278B57m028k04L782m547J430L519j846J486j620P68J619m752K063M75l864L099
294b363j234K90L828k410J903J474k736K644j348j297J350k700K113N02k166N169
310C019r44k453L406j646L80R5k774K773j992j603L271r39J808K88k280M371j537
327C243k816L545k236j484P08j143L513j780q14L615k811L53J608k577J414k150
343A88k198L440k491M27K001k020J825j70r41K402l104N48P34m101K640M89j964
360b295K226j644J187J657l360J910L51k774P42j770J532J120l554L637P56k577
376b856K578m24j98J58k798K352k18j747K040m71L72R73j802L473j43l692K928
393E25r72j709J819j177J327j10q16L448j654L9K752l008J014k61j586K581j750
$$ plain form
278 257 -3771 -3975 -193 -4740 -3310 209 -1637 -151 -1771 -1003 616 -4136 -2073 -1598 -5462 -2363
294 -2363 -3597 -3307 521 -1889 14 1488 -1248 1396 48 -1249 101 -2599 -486 16 -2150 3019
310 3019 2075 -378 3028 1382 1762 1857 -917 1856 -136 -1739 1532 593 2401 2689 409 4780 3243
327 3243 427 3972 1736 252 960 -183 3330 1550 736 4351 1540 1893 3501 924 2338 188
343 188 -2010 1430 -1061 -634 1367 -653 1172 1002 61 2463 -641 -93 641 -3460 -820 -331 -2295
360 -2295 -69 -1713 -526 1131 -2229 -319 32 -2742 -2000 -3770 -2238 -1118 -4672 -1035 -279 -2856
376 -2856 -278 -702 -900 -742 -3540 -1188 -1406 -3153 -1113 -1584 -1212 -239 -2041 1432 1289 -2403 525
393 525 -447 -2156 -337 -1514 -187 -297 -1113 2335 681 720 3472 464 1478 1217 -369 2212 462
410D62q82L401k161J077Q78j018J870k938L6K397l275Q32J108j736J830j203J059
427A737K180k879L04J272k096O23j129j95J944l248J646K054k453J541n36p35
443C0R92k547R88L25k626J905l79l98K285j915J336M60k782K140p14j851J690
460a061r26K74k9p62L214j604j234K357j682m4O73k246K197j084j406L120q15
477a058K0O70n32K154j673j117L378k982p15K078r98J210L1m31K133j661N9J386
495A952j803J257j085j100K464k091J033K217k334P52J278p72M47j616Q37O18
511B054k918K201M62j535K051j350N08J187k166J399k8l157J408k98L73R7j454
528a166K719n77j854K451p47q77J64j856J661Mk452K303Nq44O65q72J794j188
$$ plain form
410 462 -420 2981 820 1897 2775 1757 3627 689 725 3122 -153 679 1787 51 1881 678 1737
427 1737 3917 1038 1342 2614 518 1141 12 -183 1761 -1487 159 2213 -240 1301 765 30
443 30 1022 -1525 -537 -212 -2838 -933 -1312 -1710 575 -1340 -4 456 -2326 -186 -900 -2751 -1061
460 -1061 -1987 -1713 -1742 -2504 710 -894 -2128 229 -1453 -1497 -824 -3070 -873 -1957 -3363 -243 -1058
477 -1058 -1038 -368 -900 1254 -419 -1536 1842 -1140 -1855 223 -775 435 466 35 2168 507 566 1952
495 1952 149 1406 321 -779 1685 -406 627 2844 510 1262 2540 1768 2215 599 1436 2054
511 2054 -864 1337 1799 264 2315 965 1473 2660 494 1893 1865 -1292 116 -182 191 288 -1166
528 -1166 1553 976 -878 1573 826 -51 113 -1743 -82 -78 -2530 -227 -222 -1066 -401 -1273 521 -667
546f67j481K117k332o06K929k144J4J142o98J500o39n03J939j948L75l55m02J946
564A87k533P13K810k641N52K078j317K21j183L80J068k275J798P10j937J656j46
581A41Q72J306k516Q23J678k466R93Q9m39O98j086J463N58j500K155j050j484
598B35J534j476O02P49k476J846N5r91J985p11j00N2j322K435j885j385K577j964
616b40l2J117j011J062k04j118J634j531m89Q18p46P56k146J37L113k029m01J339
634B9j081O10j28j075J435j756M01Q08j083J366j29p39J791j952L5J670j934O20
652a112J30j350J069q1P02P25j828J862L36j394J390j049J02J237j910J367O93
669H89j410J638l61M00j97j178J757m70k127J962o94l08J123j000J052L85j089
$$ plain form
546 -667 -2148 -31 -2363 -2969 -40 -2184 -2170 -1028 -1726 -226 -865 -1368 571 -1377 -1002 -1357 -1759 187
564 187 -2346 -1633 1177 -1464 -912 1166 -151 70 -1113 -733 335 -1940 -142 568 -1369 287 141
581 141 1013 2319 -197 626 2304 -162 831 920 481 1179 93 1556 2114 614 2769 1719 235
598 235 1769 293 895 1644 -832 1014 1069 78 2063 1352 1252 1304 -18 2417 532 -853 1724 -240
616 -240 -272 845 -166 896 692 -426 1208 -323 -812 6 -740 16 -2130 -1993 1120 -909 -1310 29
634 29 -1052 -442 -570 -1645 -210 -1966 -1565 -757 -1840 -474 -603 -1342 449 -1503 -1468 202 -1732 -1112
652 -1112 -982 -2332 -1263 -1344 -642 83 -1745 117 453 -941 449 -600 -498 739 -1171 196 889
669 889 -521 1117 756 1156 959 -219 1538 1068 -1059 903 209 -99 1024 24 1076 1461 372
686C72J554l18j231Q81j119J197o20j263K854j220p55J519j124K25L87j385R60
703I14j066o06J359q91L15N9l80J234r60k93J553k321J19R69r17J70k06M24J241
722G17j839Q46P68j705J155j275K1J112j935O49J249j777J260K55n02R55j568
739a614Q10O43j707R50K36q21J367r38J326J29j481J856l63j371J236m71o5M06
757A28j446J829l36m64J369q23j34R76j126J295q00r62J827r15k04J277p66J062
775A787p91n68J701j628j37J015j001L5Q2k96J657j266l50J144j084L86n4n78
793E4J014j819N56J159j234N71Q5m49Q80r94K16P99j855M17N01r32R76q44L56
812e43M35r96J049K29j623J019n29p7M01j035J450L8j551J557j92l57Q32j042
$$ plain form
686 372 1926 1608 377 1258 139 1336 716 -547 2307 1087 332 1851 727 952 1339 -46 914
703 914 -152 -758 601 -290 25 84 -296 938 -22 -315 1238 -1083 -964 5 -912 -742 -948 -524 717
722 717 -1122 -276 492 -1213 -58 -1333 -1312 -200 -2135 -1486 -237 -2014 -754 -499 -1001 -46 -1614
739 -1614 -804 -161 -1868 -918 -682 -1503 -136 -1074 252 381 -1100 756 393 -978 258 -213 -278 128
757 128 -1318 511 175 -289 1080 257 123 1099 -27 1268 468 -494 1333 418 214 1491 725 1787
775 1787 996 428 2129 501 364 1379 378 413 495 199 1856 590 240 1384 300 686 632 54
793 54 1068 -751 -195 964 -270 301 386 -63 817 -177 39 838 -1017 -600 -99 -1031 -55 -899 -543
812 -543 -108 -1104 -55 174 -1449 -430 -959 -1036 -635 -1670 -220 -182 -1733 -176 -368 -725 107 -935
830i35O79m57j341K081o26p74J412r12P94j30n62J660j140r89J507q96N01J85
848E7n07J462p94o40K084j282K37L61p86P75p99J86J342j480K67Q99j055Q56k53
867I30l35Q66j700P19P56j326O05K55jO30j118R15M91j613R03n20k43M35j196
886e47Q12M38j769J599J03r06M48r02O39k41q08J176j96r58Q67m74M81M71j138
905i05R93o90r62J498m56m75N22p26J001m55n54J552j297j56J025j324R97l58
923g70o25J403j334N36J209o71M76k56j45R69j301J92R60j214M09K62l96J304
941A008j079L29J323j785N81L96p57N64m82O7J042j303R79P10j053O05m07J21
959H59K30j056J059m91p23J178j93m05M87q42J011l39j040R11q2p47J15m30J054
$$ plain form
830 -935 -256 -713 -2054 27 -599 -1373 39 -873 -79 -209 -771 889 -251 -1240 267 -629 -128 57
848 57 -450 1012 218 -422 1662 380 617 978 192 967 168 354 1696 216 483 1382 327 1183 930
867 930 595 1461 -239 480 1236 -90 515 770 769 1399 281 1196 1687 74 977 457 214 649 -547
886 -547 265 703 -1066 533 636 -270 178 -724 -85 -326 -1134 42 -154 -1112 -245 -719 -238 233 -905
905 -905 88 -602 -1564 -66 -522 -997 -475 -1201 -200 -655 -1209 343 -954 -1110 -85 -1409 -412 -770
923 -770 -1395 8 -1326 -790 419 -252 224 -32 -177 792 -509 -317 643 -571 -162 100 -296 1008
941 1008 -71 258 1581 -204 377 773 16 580 98 165 1207 -96 883 1593 540 1145 738 859
959 859 1089 33 1092 601 -122 1056 863 458 945 103 1114 775 -265 646 564 -183 -68 -498 556
978E56k92r51J472o07o71Q77o81K12k66q83J453p09n63J205q51K27J52n13J189
997C56j167o03J204j017K93K20j32M84o20J02J343j552N80M73j124P34k57qR49
1016B58j367N73J025r67M27J29k81L35j136R00M92j319J285j01l57P79o70M62
1034D67N28j389J014J4o84R65p47P92r0j275J673k20p28P48n15J75K30q12P81
1053I27j41j144J153j97J1K32p21J012p88p51J478j048j85N24k44L62m38m52J340
1072I30j416J23P66j135N57k66m38J117j423M06J015p13O8M5k05L91q27M63O03
1091F1j251Q86k8n70R83n71K10O86j480L80M11p11O11m66L09N40r21J298j42j213
1111i78J232l07j12M90p73N81j61m38J227l78l38Q08p07P02k74j048J412n85n46
$$ plain form
978 556 264 -687 785 178 -493 384 -297 -85 -351 -1234 219 -490 -1053 152 -699 -472 -320 -833 356
997 356 -811 -1414 -210 -1227 -934 -714 -846 -362 -982 -880 463 -1089 -509 -36 -1160 -426 -683 -691 258
1016 258 -1109 -536 489 -478 -51 78 -203 132 -1004 -104 388 -931 354 253 -104 675 5 467
1034 467 995 -394 620 634 -50 915 168 960 870 -405 1268 1048 320 1068 553 728 958 146 927
1053 927 786 -358 795 598 609 841 120 1132 344 -407 1071 23 -162 362 118 480 42 -410 930
1072 930 -486 -363 403 -732 -175 -441 -879 238 -1185 -779 236 -477 -409 -364 -569 -178 -1005 -542 61
1091 61 -1190 -304 -332 -902 81 -490 -280 406 -1074 -694 -283 -994 -383 -849 -540 0 -921 377 235 -978
1111 -978 254 -53 -165 325 -448 133 -28 -466 761 383 45 853 146 848 574 -474 938 353 -193
1130a93O70j38L38Q2n90R03p71k12J380j153J20q2k34J123j048n0J160r70K5N11
1150H71r11P94o15m39J076j421O06P02q76P29n68j61R87j131J89K52q46N15N8
1169a89R8J88j091Q56M44j290Q61k96n66P42q89L78M80q36P75j47m23O69k61N58
1189F1k93j038J604l13j051Q83l15k3O86p27Q42k62m28Q86p59q5N73q74J171o24
1209h6l41J434o58R1M82j181O09m5k45R72r79m5O96n12P46l34m00J073j122K63
1229D18P15j262N83R3m26N46o81M96N42j264N80M87q72N75l95j32K58p68O27N20
1249F40o95M14k37K30K6j107P73n0j292J407n28k78Q58r58O43R7j237J153k39
1268c80l76M58p49Q87k68m81R81l71l49N82q12P83j16n84Q31m89n28R78l58L61
$$ plain form
1130 -193 477 339 677 759 169 1072 301 89 1469 316 436 354 120 1243 195 145 1305 335 360 871
1150 871 -40 754 139 -300 776 -645 -39 663 -213 516 -52 -213 774 -357 -168 84 -762 -247 -189
1169 -189 -91 97 -994 -138 306 -984 -123 -419 -985 -243 -1132 -754 -274 -1110 -335 -482 -905 -236 -497 61
1189 61 -232 -1270 334 21 -1030 -147 -462 -485 201 -526 316 54 -374 512 -247 -332 241 -633 538 -86
1209 -86 -427 1007 349 440 922 -259 350 305 60 1032 53 8 704 192 938 604 204 1277 155 418
1229 418 1133 -129 454 547 121 667 -14 482 1024 -240 340 827 -45 530 135 3 261 -507 120 640
1249 640 -55 359 122 352 378 -729 44 -6 -1298 109 -419 -697 161 -797 -154 -57 -1294 -141 -380
1268 -380 -756 -298 -1047 -160 -428 -909 72 -299 -648 -66 -878 -95 -211 -795 36 -453 -981 -3 -361 0
1288@k3n25R44r28J66J145j303L04L43j60O58n70J63O82r36M12K28l69M99n29
1308B01J07P05j098M45O15r09P56l25QO03q45L20J00q00R82m76l41O57n44N56
1328G17J02q36P63k06p78L83m25N36R6n60O00k75l94N15k99j23J69n08N43k95
1348b75o07P64l09q0M53n09N53l35n15J000r10p8P08n56N33k01n33J098o59r0
1368e48N94o41J41K07m82P48q25J49P95p82O27L41l86K36n74O1Q18r17N39K94
1388C95m47L81l69J48M93q05P48m8n59O15j59j33J51l75N87M5o54J093l96m6j90
1409D75m02M67K4o08M81k06J90J3l68K31L2n25P82m51k08L48m67L10j20k41O54
1430D11n69l55J077r63R7k9k63M67m43K5M66m00J94K44o58P58n03n3N36p67L02
$$ plain form
1288 0 -23 -548 396 -532 -366 779 -524 -220 123 -37 621 51 214 896 -40 372 600 231 730 201
1308 201 308 1013 -85 360 975 66 822 497 505 1108 263 583 683 -117 865 389 48 705 161 717
1328 717 819 -17 746 540 -238 145 -280 256 352 -208 392 117 -277 238 -61 -184 -15 -523 20 -275
1348 -275 -882 -118 -427 -507 -54 -563 -10 -345 -860 140 -770 -848 -140 -696 -163 -364 -897 201 -458 -548
1368 -548 46 -595 -454 -247 -729 19 -806 -657 138 -644 -17 324 -62 174 -400 -339 479 -438 101 395
1388 395 -52 329 -40 108 601 -204 544 496 -63 552 393 260 411 36 623 668 14 1107 711 665 475
1409 475 73 540 564 -44 437 231 421 434 66 297 329 -196 586 135 -73 275 -192 118 -2 -243 411
1430 411 -158 -513 564 -399 -302 -331 -594 -127 -570 -545 -79 -479 -285 -41 -699 59 -444 -497 39 -728 -426
1451d26M45o72N40l31l1M19o38N93J57p93L16j93J61M45o85N69N56j185P65o8
1471e6j97N56o33M00N2o08Q14l11p7M75k00J51No03J009n89m52O77j04k66O75
1492G18n47P29k42p07R56m04k74L30n36O72n35j95P44o00K14P7m10N16n37k45
1512b76O60q50N09K17m75K13k60K28L23n83J07K88o02K69Q7k23J07m52J69Q06
1532B62p86J79L12m18L28j81K35q2p43O57L4n34M61k09J5K66l37O09j34p64P80
1553e0o8l34M78l99L58J25n72O48j11l07J97k53L83k63J63N10l08j69P73p27N43
1574F17j72l02O83n02k85M21m54K57Q5J5N48o40k13P28m50p1L57n37K84p2j7L24
1596F04j64j92K59m88J70j33m0M06q32L13M77q30N67o8m06L18n22L37M44p85R59
$$ plain form
1451 -426 19 -653 -113 -444 -475 -56 -694 -101 56 -737 -421 -614 -453 -8 -693 -124 432 -753 12 -56
1471 -56 -253 303 -330 70 122 -486 328 17 -60 415 215 366 371 -232 777 188 -264 413 309 43 718
1492 718 171 900 658 -49 907 503 229 559 23 695 160 -35 709 109 323 400 -10 506 -31 -276
1512 -276 384 -466 43 260 -215 -2 -262 -34 289 -294 -187 101 -501 -232 -145 -368 -261 -713 -544 262
1532 262 -524 -345 -33 -451 -123 -304 -69 -151 -894 -237 -203 -737 -276 -485 -470 -204 -541 68 -66 -830 -50
1553 -50 -118 -452 26 -373 -15 110 -462 186 75 -232 -35 -288 95 -168 -5 505 197 28 801 74 617
1574 617 445 143 826 324 39 460 6 263 348 363 911 271 58 786 336 265 622 85 369 297 280 604
1596 604 440 248 507 19 189 56 16 422 -410 -97 380 -450 117 49 -357 -39 -561 -224 220 -565 394
1617C94p32j23L23k91M13J1o15P38k24l95K52k02j36K30k89N17l64l11N12j54
1637d46K76Ok09M12l33l93O90j35j45K82l08L46k52NO70p55J13K78m77M61N3l24
1659a85R45p95J34M42l94J44R8o1J1l91K04O37p24L72L22n60K99l82J90N20q87
1680f1L79K89n32M60o00L45R9m19N47J66j005N63j55J3L13p29M91k68l33R14k25
1701B52k79K5n34N39J25q71O21O4l63R8l18M72Rk16L57l34l43M90l15J41k7k98
1723g05O74l22n6K43m32N35j07j67M43k60j3O36r53M3O31n19L59j25o9Q18j152
1744d98O67K43o10L54j07J86J72n89N49K26p67N87J67n88N05m28K04L57k98L46
1764F78l82n8J88M3j92J08p30Q33k04k74M91k97P2Q5l00K79j54l11N30m71L8j04
$$ plain form
1617 394 -338 -461 -138 -429 -16 -5 -620 118 -106 -501 -249 -451 -587 -357 -646 -129 -493 -804 -292 -446
1637 -446 -170 -164 -373 39 -294 -687 3 -132 -277 5 -303 43 -209 -204 466 -289 -176 102 -375 86 139 -185
1659 -185 760 -35 99 541 147 291 389 328 339 -52 152 789 65 437 759 199 498 116 306 826 -61
1680 -61 318 607 75 535 -65 280 379 -40 507 673 -332 231 76 89 402 -327 164 -104 -437 477 252
1701 252 -27 -2 -536 3 128 -743 -122 -58 -421 -323 -641 -169 -160 -376 -19 -353 -696 -206 -521 -380 -407 -705
1723 -705 -31 -353 -409 -166 -598 -63 -170 -337 106 -154 -167 469 -484 -441 190 -329 30 -95 -164 654 -498
1744 -498 169 412 -198 156 49 235 407 -182 367 593 -174 413 580 -8 497 69 273 630 332 678
1764 678 296 238 426 469 277 385 -345 488 284 10 501 204 276 361 61 340 186 -125 405 -66 -28 -132
1786a32o9K23j74j71N11m48q5O31m72K30o66J36L27l0m25M82k94M2L51n12N90
1807D5o16Q5O65m87Q5l32l5N58l77Q4M66o72N04j28k14M96n72L37L62o74J48L58
1829H6k2J33l87L64k2l55M53J90r04P00p5P7M8m89O44J25p09O29k55r6K04j31
1851B08J29p7l0K33j24l92P95o08K49j91PJ65j36j38J60k70L35m1p7J79m45K27
1873A58K44n60J7K42k13J57j12m0L28l50j46M51p45O88m73rM12n67K72L86n75
1894d35J87J3N0L00o32L66P0l39K36j63J75R9k80j15N13n73N23j73k09K70o7K9
1916a55K22m25N93J53n22K49j08M3K31n49N40k48l6N17k12j04Jj40O52n98j99
1937i5R03p02k3J98k63M67r9m47O06l20j75K45pml40J63L94k90j67L22p61Q60
$$ plain form
1786 -132 -201 22 -152 -323 188 -260 -345 286 -186 44 -622 -486 -159 -189 -614 -132 -426 -384 -33 -545 45
1807 45 -571 -486 179 -308 -223 -555 -590 -32 -409 -325 141 -531 -27 -155 -369 127 -445 -108 254 -420 -272 86
1829 86 64 197 -190 174 152 -203 250 440 -464 236 161 238 286 -203 441 566 -143 486 231 135 339 208
1851 208 337 260 230 463 339 -53 742 134 383 192 199 364 228 90 250 -20 315 274 197 376 -69 158
1873 158 402 -158 -141 101 -112 45 -67 -107 221 -129 -275 176 -569 119 -354 -363 49 -518 -246 140 -435
1894 -435 -248 -235 -185 115 -517 -151 -81 -420 -184 -347 -172 -73 -353 -468 45 -528 -5 -178 -387 -117 -184 -155
1916 -155 67 -358 235 388 -134 115 7 50 281 -268 272 24 -12 505 293 189 190 50 702 104 -95
1937 -95 808 106 83 281 18 485 386 -61 545 225 50 295 288 284 -56 107 501 211 44 366 -395 465
1959D65k73j61K74n12J15N20o99O0M74m42M18m63J99L57o17K94o2k59J56J1J04
1980d1m0k89P1J72m22N70n01K28L29o62M90k65l36P34m34%M20k86J27m98j74R53
2002A46k51q7K41n10P12l93m9L00j42j46M03o09M36J61j88N30o29j58P82l02j77
2023G0L71m35K32N0j00M25m59mN2R5J25k66m5L66m47J63M09m20p5l3K69K9j96
2046A76o1K35m84L07k41J71R1l24L9K55o30N24m9p3J54n87N09M0l85K07R1o01
2068f36O51n05J50J67k66L91K6o25N46j21j23L02l71Q0r9K22K64k82k5L0k06N07
2090G7k22O6K85n47J67L02j25J34k20K60O5l12p4M66l50J06q4J40J64k52J42J40
2112C28j11k29L37j56J76l33L15J71p49L03K03k71L26k96K88J89o91N52m07j65
$$ plain form
1959 465 192 31 305 -207 -92 428 -271 -211 263 -179 239 -224 -25 332 -285 9 -53 -312 -156 -145 -41
1980 -41 -81 -370 -299 -127 -549 21 -480 -252 77 -585 -95 -360 -696 38 -396 -396 24 -262 -135 -633 -807 146
2002 146 -105 -192 49 -461 251 -142 -191 109 -33 -179 224 -385 51 212 24 554 -75 -233 549 247 70
2023 70 441 6 238 288 188 613 154 150 202 297 422 156 111 477 30 193 602 182 107 74 343 372 176
2046 176 115 350 -134 173 -68 103 194 -130 -91 164 -466 58 9 -64 90 -497 12 52 -333 -126 -35 -636
2068 -636 15 -490 -340 -173 -439 -48 -22 -647 -101 -222 -345 -43 -414 -334 -433 -211 53 -229 -254 -224 -430 77
2090 77 -145 -79 206 -341 -174 128 3 137 -83 177 242 -70 -144 322 -28 78 -6 134 298 46 188 328
2112 328 217 -12 325 169 345 12 327 498 -251 52 255 -16 310 14 302 491 -200 352 -55 -220
2132b20L65k40m1L32m73M34K97o08K97o9q3J3l27L28r9J07K5j00k34K01j25J71
2154d9p1l04M54l41j86L27O8nj98P1L00l23P8K32l84J23j04p4K17j78J53L00l15
2177b09k04J45k3M04l95K70K19m40K68p9k8K34l51J11N28m80J23O7k61L76k75
2198@l3M56n85K70K37m76M16j6j98K81j36k8K5k54N44k63k64K55j56J23j97j09
2220a08N87l34l0O1k66J52Q0k53M47m42K87J51m21J35J11l58J00J0j22N51n41
2241b03K23o1j15J09j35k72M28k86N2L49l30M7M7J31P5j75l07L77m23M24j9l19
2263c83M29k46J95o7n23M70J86j56kPJ65O9k96R7J00l32M80p4n4J3m72N66O7l79
2287a40M44J3k18J88j84M2o0j6N28l53om4k11l3J12q1K19j98p5N91k46r3l04K11
$$ plain form
2132 -220 145 -95 -136 196 -277 157 454 -154 143 74 -9 4 -323 5 -94 13 38 -62 -296 -95 -220 -49
2154 -49 -120 -424 30 -311 -497 -170 -102 -107 -305 -234 66 -257 -179 53 -331 -208 -312 -386 -169 -347 -194 106 -209
2177 -209 -413 -268 -291 113 -282 -12 207 -233 35 -44 -72 162 -189 -78 450 -30 93 160 -101 275 0
2198 0 -33 423 -162 108 345 -131 285 269 71 352 216 188 213 -41 503 240 -24 231 75 198 1 -108
2220 -108 479 145 115 176 -90 62 142 -111 336 -106 181 332 -89 46 157 -201 -101 -91 -213 338 -203
2241 -203 20 -41 -156 -47 -182 -454 -26 -312 -260 89 -241 -194 -147 -16 59 -116 -423 -46 -469 -45 -64 -383
2263 -383 46 -200 -5 -72 -595 -125 61 -95 -97 -90 75 144 -152 -55 45 -287 193 119 65 78 -394 172 239 -140
2287 -140 304 317 99 287 103 145 85 69 597 244 238 194 -17 -50 62 -19 200 2 -73 518 272 179 -125 86
2311H6R6k40M8O32p77K78K43l75J66m65N42K59l31o8j56k04M50l77P2L16l05J90
2333H0Lm35L84j83j09K66l14M59q4l92K89j3k74K21l47N17p4l14L01o7j82K75
2355Gl21J10L16l82M27j46k00K33j10k6J25m11N76k45m7K02j2j62j4j03N37l86
2377c2J38J26j63K8J71k71K84j30k42M62k84j62L07j35Q8k89J21N65n96J77q6
2398G7Qk09L70j82k0r8P1K23k75J6K88l09K57l26K78j86l99M38j27j96L49k67
2420b19K58k6j17K38j94j81K75l22j57L54j52K00q5J06J87m15L9J81k18K56j36
2441a28l03O56m20m31Q83m24K44J12l87K23k31K50K98l57J27R1q4P2n0m05M46
2462A82l19K23j47J82K25l82P6J50k27K04j77M27kl51N7J61n53L93J90m21M10
$$ plain form
2311 86 182 -58 -10 622 -155 123 366 -9 157 -308 234 493 162 94 -62 -266 184 -193 -121 195 -110 80
2333 80 83 -352 32 -151 -260 6 -308 151 67 -325 -36 -49 -323 -102 -449 68 -6 -320 -19 -86 -268 7
2355 7 -314 -204 112 -270 157 11 -189 44 -66 -92 33 -378 198 -47 -94 108 96 -66 -80 -183 354 -32
2377 -32 106 232 69 97 268 -3 281 151 -91 371 87 -75 232 97 185 -104 17 582 -14 163 77
2398 77 85 -124 246 64 44 -54 17 240 -35 -19 269 -40 217 -109 169 -17 -416 22 -105 -301 48 -219
2420 -219 39 13 -104 134 -60 -241 34 -288 -445 -91 -243 -43 -128 -22 165 -250 -211 -30 -248 8 -128
2441 -128 -431 225 -195 -626 257 -167 77 189 -198 25 -206 44 342 -15 112 203 119 191 141 -264 182
2462 182 -137 86 -61 121 346 -36 40 190 -37 167 -10 417 415 64 121 282 -271 122 312 -109 301
2483C01j67r1K22k34L2P8k65j03M16Mp9j77J54R1l17K93p1j00M61m15r2N9j87
2506a87J55r6l06L67K2j89K03l43L61j17j95K2p6P0K47q5L88m71L49ol73M7O1
2529a52M8M9P9j35L03k16J68J23n56L01Lk52M65m02K23j37K10k03p1M81l24J9
2551B4oJ75m01L26l42J46J76j46L06n2j97Q7K47l34M20j79j87K22j34k31j2J62
2573G0K19k93M9n8j34N69k11m61M05P2k09K79l34J22k78Q8Q3K24l16J84m22K20
2595a32Q7J06j70j18j64M35k71O8K91l88K30n07K19L62o3j40Q4jOo6N0J73k73
2618a82M7R0o3K20M8n57K12J73r4J46k26M26n05%L11j40N3j51N3J55J28j33L45
2641C56m23j0N8k40M53k88L18k5j42P6j8J31k7p2k06M94j52k28Q7l64N43k47l05
$$ plain form
2483 301 134 43 265 31 63 141 -124 -227 189 193 114 -63 91 182 -135 158 87 -13 448 33 -59 0 -187
2506 -187 -32 -128 -434 -67 -45 -234 -31 -374 -13 -130 -325 -303 -379 -309 -62 -147 241 -230 119 113 -260 -213 -152
2529 -152 -104 -55 24 -111 192 -24 144 267 -289 12 15 -237 228 -174 49 -88 122 -81 -152 329 5 24
2551 24 18 193 -208 118 -224 -78 98 -48 258 206 9 96 343 9 429 250 63 285 151 -80 -92 70
2573 70 289 -4 45 -13 -147 422 211 -250 155 227 18 297 -37 85 -193 -105 -22 202 -114 70 -352 -132
2595 -132 -45 61 -109 -227 -391 44 -227 -159 132 -256 -26 -533 -314 48 -15 -155 -71 -72 -66 -132 -82 91 -182
2618 -182 -135 -45 -108 112 160 -397 -185 -12 -106 40 -186 240 -265 -265 46 -94 -41 -192 -139 16 144 11 356
2641 356 -67 -77 -19 -259 194 -94 224 199 57 133 115 246 219 147 -59 435 283 55 142 -222 321 74 -231
2664b31K56J59j99P3p3J81o7k46K31k01J37R9j67J41J40k33J19k04J63J37l70
2685a55r2J1L36K4l57J85j13j40K01j60J57J55j74k6J59l13J35KK12k12m7K79
2707F7j6m32K06R6j79L26k17K60k06n3R2k47J93L7L7J96r6k81L41l69Q2O06m19
2730B4j78L46m13L85Pm78N67m99M41J58k87P6p3n3M49l49k96L01J15j45K3m8M97
2753E70o26r4L09j20J18l1r3J2J89P4j40j36P3%j8m7J9j3n5l02K77j88K78o7o
2778a7j90K26j48m1Lr7K86l81K02L12j25m1k28OK53j83kL07k52J5j91K56rk39
2802b78R5P7j4K05j90J79L5j23k02M28l11j30K86n0k21Q9J86J98k68pK41M1k36
2825C0j32Q3K42m67K79J02r7J73m3K6o7k85JL26r1o1pJ15J7j92K05j65K17O0l86
$$ plain form
2664 -231 25 184 -15 58 -15 166 99 -147 84 -117 20 119 -48 93 233 0 119 -85 78 215 -155
2685 -155 -247 -236 100 124 -233 -48 -161 -301 -100 -260 -103 52 -122 -148 11 -302 -167 -165 47 -165 -212 67
2707 67 51 -381 -175 -79 -258 68 -149 111 -95 -148 -56 -303 -110 -73 -36 160 64 -217 124 -245 -163 443 24
2730 24 -154 192 -221 164 171 -307 260 -239 202 360 73 149 76 23 472 123 -173 128 243 98 121 73 570
2753 570 -56 -150 159 39 157 126 33 45 234 308 168 32 105 105 87 40 59 46 -9 -311 -34 -222 56 -11 -17
2778 -17 -207 19 -129 -170 -167 -264 22 -359 -157 155 30 -11 -239 -233 20 -163 -165 142 -110 -95 -286 -30 -39 -278
2802 -278 -183 -106 -120 85 -105 74 109 -14 -216 212 -99 -229 57 7 -214 -125 61 259 -9 -16 225 266 30
2825 30 -102 -19 223 -244 35 137 40 213 170 196 129 -156 -155 171 80 19 12 127 144 -48 157 -8 209 269 -117
2850a17m0K15j40J73L9Lj39J92l72J76m8K09j57p4P7j42k05M71o6q4j17j30K84
2873Hj71j90M48r0j64J06J02Q3m15R5K82j98m1J02j68O5L8J4K32n7k79L60l18
2896a56J07J94k82Q9P4k10J43r8n9K13j78P0k9K10l5j80J56p9o0K47k95K48Q3
2919A73k96P8J34K3J53k09rj31L6M11m35K43k7J19k43j40Q3O4J69k75L50j19j65
2942a3J52j47K36l39J25J34k7l38J78j5K88n78K65J72l8n2P3j63k0m5rJ25l5j89
2966b60K73P5k02j91M6K71J9Q7K5k01Q5q2J1M2n1k31M05k67J52r8N4j33J80j33
2990a24J26l4L3K64l83L34l49J87L07l06R9k73K07R9k73J91l6J35j80K35k77j32
3012a50L20k51K91n0k21K29k76J7J73m53L20j0J57k34o8K85J18j86R1j11k07L91
$$ plain form
2850 -117 -157 58 -82 91 130 133 -6 186 -186 -10 -58 151 -6 -80 -3 -145 -350 121 55 -29 -146 -276 8
2873 8 -163 -353 95 5 -159 -53 49 132 -283 -188 94 -104 -145 -43 -211 -146 -108 -94 138 81 -198 162 -156
2896 -156 -49 145 -137 -48 26 -184 -41 -139 -198 15 -163 -93 -122 88 53 -127 29 -50 -110 137 -158 90 173
2919 173 -123 -45 89 112 265 56 47 -84 -48 363 -72 171 144 263 20 -120 -37 27 196 -79 271 152 -13
2942 -13 139 -8 228 -111 14 148 121 -217 -39 -54 234 -344 -79 93 55 3 76 -87 -107 -152 -161 -36 -71 -260
2966 -260 13 88 -114 -305 -259 12 31 118 143 -58 27 -55 -44 -2 -53 -284 121 -146 6 -92 -38 -171 9 -124
2990 -124 2 -32 1 265 -118 216 -133 54 361 55 154 -119 88 187 -86 105 69 204 24 259 -18 -150
3012 -150 170 -81 210 160 -61 168 -108 -91 82 -371 -51 -61 96 -138 -206 79 197 11 102 -9 -216 175
3034A75l93J20K10k12n5L7J64o4M2M4k71QL61k67mj3o4k59L78J3j20JJ30J65j98
3059g2L3j1R4j52P1n1j91L35k25p0j8J03R0p0J43l22N41N8l17L5K1rJ23k38K17
3084A18M8k21L19j4k59j03P4R6N6j15K89l22O3J37k22P9k27M23r8M7j65J17j07
3107A3J18k71n0L37J0r4J00l74J52L7p0K62l74N43j52n0k3j00K2J17r2lJ04k25
3131f3k37L77O6l30p1J43J62l91K18K55l23N3K61L5j10k08L6Q8J26J87m77L49
3153A46k23j35J78k1k64L30k1j03l7J86K8L0k43k8J33m4K53k47J60p0j05n0K16
3176F9k00M65l17J48o7L3n1M2k15L38l30p6R3K31J23k84j0J13n7Q2J38k77OJ24
3200A21k17K78p6m6K92m84J36L87l90o4k4Q3J09k56M73j39k85M8n5J33J09l14
$$ plain form
3034 175 -218 -98 112 -100 -155 -118 46 -18 24 68 -203 -195 166 -101 -105 -118 -182 -441 -63 -50 -170 -169 -39 126 -72
3059 -72 -39 -50 44 -108 -37 -88 -279 56 -169 -239 -257 -154 -64 -134 9 -313 228 286 -31 4 25 16 139 -99 118
3084 118 166 -55 264 250 -9 -112 -38 58 114 -1 288 -34 29 166 -56 23 -204 219 121 168 3 120 13
3107 13 131 -140 -190 147 157 63 163 -211 -59 -22 -92 170 -204 339 187 137 114 14 36 153 61 58 162 -63
3131 -63 -300 77 143 -187 -258 -115 47 -344 -126 129 -194 -141 120 155 45 -163 -127 -39 87 274 -203 146
3153 146 -77 -212 -34 -55 -319 11 -10 -113 -150 36 64 94 -149 -177 -44 -88 165 -82 78 8 -97 -147 69
3176 69 -131 334 17 165 98 131 80 122 -93 245 -85 -161 -68 163 286 2 -8 105 48 130 268 -9 -3 121
3200 121 -96 182 106 60 352 -132 4 391 1 -63 -87 -4 105 -151 322 183 -102 -54 -109 24 133 -181
3222a81K99k72M7J3K66k74k1J68o9o0m6O3j72O9J49j11p7N2O8K06o2k58K60q9
3246c2j35J83j65j97J37P6L36m9k71J60l05K51k18K65q4j59K79J2l45K86j51P8
3268d8R8l78L96K02j36k2K8j76K84l09J01l8LN6K44k12k53K03R3L5l08L24j85
3291Bj29K77l1J40n6m99M90j76j86k7J23J44K6J37k87K66Qk24rJ63k6j86O0J01
3315A01K1k16k4J51k90K41Qj14k48M18k02k39K19j1J15Q2j8l2k3R6j33J07J00
3338A09o1pj61l8N4N7j11K15n8N6J04j24j04J90j13O4J7j05J98k13l9J33j80K84
3362A67m8j07K89l16NQnJ05oj80K52m5n2j41Q9K14l11K6L14k58J46j71J76l26
3386a75M72k73J44k60j43M23l43K69l52J26K35j58m2J53l08K44k75K85o7o3M2
$$ plain form
3222 -181 118 -154 -107 -94 172 -102 -123 45 -24 -84 -130 -67 -239 -170 -21 -132 -209 -157 -89 117 55 -203 57 -32
3246 -32 -167 16 -149 -346 -209 -133 203 154 -117 43 -262 -11 -229 36 -48 -207 72 84 -261 25 -126 -48
3268 -48 50 -328 68 270 134 112 140 -36 248 -61 40 2 5 61 305 93 -160 43 136 171 -137 187 2
3291 2 -127 150 119 259 203 -296 194 18 -168 -195 -72 72 98 235 -52 214 222 -2 -11 152 126 -60 0 101
3315 101 122 -94 -118 33 -257 -16 -8 -122 -370 48 -154 -393 -174 -185 -70 12 -6 -38 -61 35 -98 9 109
3338 109 48 41 -120 -158 -104 -47 -158 57 -1 55 159 35 -69 121 8 72 89 -16 182 -31 -70 63 -117 167
3362 167 119 12 301 -15 -10 -2 -7 98 92 -88 164 119 67 -74 15 229 -82 -56 258 0 146 -25 151 -175
3386 -175 297 24 168 -92 -235 188 -155 114 -238 -112 123 -35 -77 76 -232 12 -263 22 -45 -108 -66
3407f6J11l25L82l18J89k4M0j59K01M4l59J23k2k9J73r4J73L2m3j18j44L29j2
3430H4Q5M7j97N7j37K8J13j13oJ53k30J10K11k47J93m6j11K8J81k77R0j0K65l24
3454e3j47M83j79r6j38L61k61K48j50R6j33O8K77l21k13L2K31J5N2j91K63l87
3476a43J49O0l1j64K2l2M26j0k67p5J91M2k07J94jN0k53J89j93j02q7K55m0j65
3500a92K12l34O5J44K12l4q0m9jK13o6%k0l28J20J48pj74J27K29j63k52K52p7
3524e5k49L22j84J30l2O0K95m37K78k95J10O1l48L64J40j02K39m37K59L0n8P1
3546A62P2k09j20K83k7k0j38RP6j01J12O1k95K56l4R1k36J12n2q2q4M09l22L13
3570B36l68j3J12J81k16J48k64N3j21L37J20m39J43jO8J42q4j97Q0k1j5j29L17
$$ plain form
3407 -66 45 -280 102 -216 -27 -51 -11 -170 31 75 -284 -161 -183 -212 -39 -133 40 72 29 -89 -233 96 84
3430 84 169 216 19 76 -61 -33 80 -33 -39 114 -116 -6 205 -42 151 105 -6 22 203 -74 16 6 271 -53
3454 -53 -200 283 104 8 -130 231 -30 218 68 164 31 99 376 55 -158 -126 105 120 172 -19 244 -143
3476 -143 6 66 35 -129 -107 -139 287 277 10 -65 126 168 -39 155 154 204 -49 140 -53 -155 -242 13 -27 -192
3500 -192 20 -314 -249 -105 107 73 -7 -56 -57 156 90 90 70 -258 -138 10 3 -171 -44 185 22 -230 22 -55
3524 -55 -304 18 -166 -36 -68 -8 287 -150 128 -167 -57 4 -344 20 160 58 297 -140 119 149 91 162
3546 162 234 25 -95 188 161 141 3 12 88 -13 99 160 -135 121 87 178 -58 54 2 -80 -164 245 -77 236
3570 236 -132 -145 -33 148 -68 80 -184 -131 -252 85 205 -234 -91 -92 -24 118 34 -163 -83 -104 -119 -248 69
3593F9k09Q2K3o6p9J29Q4J13k75j39L48j76K16j25j8P1j20j08K08P3k22J50q4
3616e5K24j49r5n2L60k06j24K89m28K71J23l45J49J82k40K12j49p0K90j64No0
3638c2L5J60j83q0K84n3k2J69l55M4L17l44K08j17RJ31l79L07n4J3J1J7r1k10
3662b15M31p6j47k69M25k17j32K93o2q8o4R8j0Q1o9j86J33J72O1k37q5k08K42
3685a29L54k76J85k52J37j49Q5J10p0J15k30J50l8j04M2J09p8J5L2J2P4k44J18
3708c2l6J07j43K34R5k51M8K02j79j64k9L79p2r7R0p7j02P5P6n7J12j56l5K52
3732B40k68L17k31J35k09J73k87K39j44J20N7l53M48k89K65k56r6J89j22j16J55
3753c3P0j86J84L7j86R2k17L22l90L02J20Pj86r2o5L95k95KJ93k95J69O1j82J93
$$ plain form
3593 69 -140 -58 -35 -101 -180 -51 33 146 -129 -268 80 -96 120 -5 -23 48 -72 -180 28 101 -121 29 -55
3616 -55 169 20 -75 -127 233 27 -97 192 -236 35 158 -187 -38 144 -96 116 -33 -103 187 23 28 -32
3638 -32 3 163 -20 -100 184 131 109 278 -77 -33 284 -60 148 31 40 171 -208 99 45 58 69 86 -5 -215
3662 -215 216 140 -7 -276 149 -68 -200 93 31 -57 -121 -23 -33 48 -21 -207 -74 98 159 -78 -163 -371 -129
3685 -129 225 -51 134 -118 19 -130 -45 65 -5 110 -120 30 -8 -112 -70 39 -39 -24 8 20 94 -150 -32
3708 -32 -68 39 -104 130 225 -26 22 224 45 -119 -148 231 159 62 152 75 -27 48 124 67 179 23 -12 240
3732 240 -28 289 58 193 -16 157 -130 109 -35 85 142 -211 237 -52 213 -43 -139 50 -72 -188 -33
3753 -33 37 -149 35 72 -114 -22 -239 83 -307 -5 115 122 -64 -156 -221 174 -121 -119 74 -221 -52 9 -173 20
3777B0k16K1K42k39K54j95M78l18l45K52J17O3J5l31K27j80J83J53j33j11R9J41
3799A97k21N7K29k34l9j03K21k50J67o1J43j1j8J21J45l20k32J57j26K76o4j91
3821a57J40N7l1j54R7J5R2J68k78J19j64R3k9j43K21m5K05k09K12j23j29j99N30
3844B88k13N0j72J01j97J82m57M03n0kJ60k43l1J00K78P8l24m3j8O9P6O9k11n3
3868a60K02kk35J85L19n86L15J5M0j60K68l40Q1N3l5P5qJ24k60M4J16o4j48L2
3892a29j20K14j5J10K56m68K20k31K38kj09J62J17m22p7N22l46K84j42%r4J43
3914A11j94K14k03J83j63K97q8M7k1k22J51p9J92k90R5J64n05L65nLJ14m3m5k26
3938a48K09j60K23k10L7K68k94J07J9n5Oj27N6j35L65k26L2N4k10L63l77Q7L22
$$ plain form
3777 20 -196 -175 67 -172 82 -113 365 47 -298 -46 71 134 149 -182 45 -135 48 201 68 -43 56 197
3799 197 -24 33 262 28 -11 -114 107 -143 24 -37 106 95 77 198 343 23 -209 -52 -178 98 34 -157
3821 -157 -17 40 9 -145 -48 -33 59 227 -51 68 -96 -3 -32 -175 46 1 206 -3 209 86 -43 -242 288
3844 288 75 125 -47 54 -143 39 -418 -15 -65 -67 93 -150 -181 -81 197 275 -49 -92 -110 -41 35 104 -107 -160
3868 -160 42 40 -195 -10 309 -277 38 53 93 -67 201 -139 -58 -5 -40 35 27 151 -109 -65 51 -13 -161 -129
3892 -129 -249 -35 -50 60 316 -152 68 -163 75 73 -36 126 243 -179 -256 266 -80 204 62 62 -32 111
3914 111 -83 131 -72 111 -52 245 157 204 183 -39 112 33 225 -65 30 194 -311 54 49 52 166 123 78 -148
3938 -148 61 -99 124 -86 -49 219 -75 32 51 -4 2 -125 -69 -204 161 -65 -33 21 -189 174 -203 -116 206
3961B06j39l5r3j78L13j08m6J5Kn1K21Mo3l1P3j04J23q8Nk93K50J14j89K46J45
$$ plain form
3961 206 67 32 -61 -239 74 -34 -80 -65 -63 -114 107 111 48 17 90 -14 109 21 26 -267 -17 97 -92 154 299
$$ [...]
8191f8
##END NTUPLES=NMR FID
##END=
