##TITLE=1H_Pr AmNCO
 200.13MHz, CDCl3,
 8 sc
 
 16.1.2025
##JCAMPDX= 6.0         $$ Bruker NMR JCAMP-DX V2.0
##DATA TYPE= NMR FID
##DATA CLASS= NTUPLES
##ORIGIN= UXNMR, Bruker Analytische Messtechnik GmbH
##OWNER= pz
$$ XWIN-NMR		Version 3.5
$$ Thu Jan 16 14:03:31 2025 Russian Standard Time (UT+4h)  she@DPX200
##.OBSERVE FREQUENCY= 200.1313
##.OBSERVE NUCLEUS= ^1H
##.DELAY= (6, 6)
##.ACQUISITION MODE= SIMULTANEOUS
##.ACQUISITION SCHEME= undefined
##.AVERAGES= 8
##.DIGITISER RES= 18
##SPECTROMETER/DATA SYSTEM= spect
##.PULSE SEQUENCE= zg30
##.SOLVENT NAME= DMSO
##.SHIFT REFERENCE= (INTERNAL, DMSO, 0, 14.3821)
##AUDIT TRAIL= $$ (NUMBER, WHEN, WHO, WHERE, WHAT)
$$ ##TITLE= Audit trail, XWIN-NMR		Version 3.5
$$ ##JCAMPDX= 5.01
$$ ##ORIGIN= Bruker BioSpin GmbH
$$ ##OWNER= she
$$ F:/spectra/data/she/nmr/H-C/1/audita.txt
$$ ##AUDIT TRAIL=  $$ (NUMBER, WHEN, WHO, WHERE, WHAT)
(   1,<2025-01-16 14:01:29.25 +0400>,<she>,<DPX200>,
      <created by zg, POWCHK disabled, PULCHK disabled
       configuration hash MD5:
       00 E9 B6 7A A2 85 ED C7 34 08 36 98 17 FE 4E 26
       data hash MD5: 16K
       9C 78 E3 9D B4 9D 94 0C E3 E7 34 6C D1 57 32 BC>)
$$ ##END=
$$ 
$$ hash MD5
$$ 49 73 0F C1 95 4A 65 4D 65 BA 53 13 C1 CD 52 AB
##$RELAX= 
##$RELAX= 
##$RELAX= 
##$RELAX= 
##$RELAX= 
##$RELAX= 
$$ Bruker specific parameters
$$ --------------------------
##$DU= <F:/spectra>
##$EXPNO= 1
##$NAME= <H-C>
##$PROCNO= 1
##$TYPE= <nmr>
##$USER= <she>
##$AMP= (0..31)
100 100 100 100 100 100 100 100 100 100 100 100 100 100 100 100 100 100 
100 100 100 100 100 100 100 100 100 100 100 100 100 100 
##$AQSEQ= 0
##$AQ_mod= 1
##$AUNM= <au_zg>
##$AUTOPOS= <>
##$BF1= 200.13
##$BF2= 200.13
##$BF3= 200.13
##$BF4= 200.13
##$BF5= 200.13
##$BF6= 200.13
##$BF7= 200.13
##$BF8= 200.13
##$BYTORDA= 1
##$CFDGTYP= 0
##$CFRGTYP= 5
##$CHEMSTR= <none>
##$CNST= (0..31)
1 1 145 1 1 1 1 1 1 1 1 1 1 1 1 1 1 1 1 1 1 1 1 1 1 1 1 1 1 1 1 1 
##$CPDPRG= <>
##$CPDPRG1= <>
##$CPDPRG2= <>
##$CPDPRG3= <>
##$CPDPRG4= <mlev>
##$CPDPRG5= <mlev>
##$CPDPRG6= <mlev>
##$CPDPRG7= <mlev>
##$CPDPRG8= <mlev>
##$CPDPRGB= <>
##$CPDPRGT= <>
##$D= (0..31)
0 0.7 0 0 0 0 0 0 0 0 0 0.03 0 0 0 0 0 0 0 0 0 0 0 0 0 0 0 0 0 0 0 0 
##$DATE= 1737021688
##$DBL= (0..7)
120 120 120 120 120 120 120 120 
##$DBP= (0..7)
150 150 150 150 150 150 150 150 
##$DBP07= 0
##$DBPNAM0= <>
##$DBPNAM1= <>
##$DBPNAM2= <>
##$DBPNAM3= <>
##$DBPNAM4= <>
##$DBPNAM5= <>
##$DBPNAM6= <>
##$DBPNAM7= <>
##$DBPOAL= (0..7)
0.5 0.5 0.5 0.5 0.5 0.5 0.5 0.5 
##$DBPOFFS= (0..7)
0 0 0 0 0 0 0 0 
##$DE= 6
##$DECBNUC= <off>
##$DECIM= 32
##$DECNUC= <off>
##$DECSTAT= 4
##$DIGMOD= 1
##$DIGTYP= 9
##$DL= (0..7)
0 120 120 120 120 120 120 120 
##$DP= (0..7)
150 150 150 150 150 150 150 150 
##$DP07= 0
##$DPNAME0= <>
##$DPNAME1= <>
##$DPNAME2= <>
##$DPNAME3= <>
##$DPNAME4= <>
##$DPNAME5= <>
##$DPNAME6= <>
##$DPNAME7= <>
##$DPOAL= (0..7)
0.5 0.5 0.5 0.5 0.5 0.5 0.5 0.5 
##$DPOFFS= (0..7)
0 0 0 0 0 0 0 0 
##$DQDMODE= 0
##$DR= 18
##$DS= 0
##$DSLIST= <SSSSSSSSSSSSSSS>
$$ [...]
##$SUBNAM0= <"">
##$SUBNAM1= <"">
##$SUBNAM2= <"">
##$SUBNAM3= <"">
##$SUBNAM4= <"">
##$SUBNAM5= <"">
##$SUBNAM6= <"">
##$SUBNAM7= <"">
##$SUBNAM8= <"">
##$SUBNAM9= <"">
##$SW= 18.0517328524113
##$SWIBOX= (0..15)
0 0 2 0 0 0 0 0 0 0 0 0 0 0 0 0 
##$SW_h= 3612.71676300578
##$TD= 16384
##$TD0= 1
##$TE= 0
##$TE2= 300
##$TE3= 300
##$TEG= 300
##$TL= (0..7)
0 120 120 120 120 120 120 120 
##$TP= (0..7)
150 150 150 150 150 150 150 150 
##$TP07= 0
##$TPNAME0= <>
##$TPNAME1= <>
##$TPNAME2= <>
##$TPNAME3= <>
##$TPNAME4= <>
##$TPNAME5= <>
##$TPNAME6= <>
##$TPNAME7= <>
##$TPOAL= (0..7)
0.5 0.5 0.5 0.5 0.5 0.5 0.5 0.5 
##$TPOFFS= (0..7)
0 0 0 0 0 0 0 0 
##$TUNHIN= 0
##$TUNHOUT= 0
##$TUNXOUT= 0
##$USERA1= <user>
##$USERA2= <user>
##$USERA3= <user>
##$USERA4= <user>
##$USERA5= <user>
##$V9= 5
##$VALIST= <valist>
##$VCLIST= <CCCCCCCCCCCCCCC>
##$VD= 0
##$VDLIST= <DDDDDDDDDDDDDDD>
##$VPLIST= <PPPPPPPPPPPPPPP>
##$VTLIST= <TTTTTTTTTTTTTTT>
##$WBST= 1024
##$WBSW= 4
##$XGAIN= (0..3)
0 0 0 0 
##$XL= 0
##$YL= 0
##$YMAX_a= 639079
##$YMIN_a= -709565
##$ZGOPTNS= <>
##$ZL1= 120
##$ZL2= 120
##$ZL3= 120
##$ZL4= 120
##$ABSF1= 10
##$ABSF2= 0
##$ABSG= 5
##$ABSL= 3
##$ALPHA= 0
##$AQORDER= 0
##$ASSFAC= 0
##$ASSFACI= 0
##$ASSFACX= 0
##$ASSWID= 0
##$AUNMP= <proc_1d>
##$AZFE= 0.1
##$AZFW= 0.1
##$BCFW= 1
##$BC_mod= 2
##$BYTORDP= 1
##$COROFFS= 0
##$CY= -3
##$DATMOD= 1
##$DC= 2
##$DFILT= <>
##$DTYPP= 0
##$F1P= 0
##$F2P= 0
##$FCOR= 0.5
##$FTSIZE= 0
##$FT_mod= 4
##$GAMMA= 1
##$GB= 0.15
##$INTBC= 1
##$INTSCL= 1
##$ISEN= 128
##$LB= 0.25
##$LEV0= 0
##$LPBIN= 0
##$MAXI= 10000
##$MC2= 0
##$MEAN= 0
##$ME_mod= 0
##$MI= 1.114404
##$NCOEF= 0
##$NC_proc= 0
##$NLEV= 6
##$NOISF1= 3.799351
##$NOISF2= 2.8
##$NSP= 1
##$NTH_PI= 0
##$NZP= 0
##$OFFSET= 14.38212
##$PC= 1
##$PHC0= 247.8479
##$PHC1= 14.5922
##$PH_mod= 1
##$PKNL= yes
##$PPARMOD= 0
##$PSCAL= 0
##$PSIGN= 0
##$REVERSE= no
##$SF= 200.129724274929
##$SI= 16384
##$SIGF1= 3
##$SIGF2= 2
##$SINO= 400
##$SIOLD= 16384
##$SREGLST= <1H.CDCl3>
##$SSB= 0
##$STSI= 0
##$STSR= 0
##$SW_p= 3205.1282051282
##$SYMM= 0
##$S_DEV= 0
##$TDeff= 0
##$TDoff= 0
##$TI= <>
##$TILT= no
##$TM1= 0
##$TM2= 0
##$TOPLEV= 0
##$USERP1= <user>
##$USERP2= <user>
##$USERP3= <user>
##$USERP4= <user>
##$USERP5= <user>
##$WDW= 1
##$XDIM= 8192
##$YMAX_p= 0
##$YMIN_p= 0
$$ End of Bruker specific parameters
$$ ---------------------------------
##NTUPLES= NMR FID
##VAR_NAME=  TIME,          FID/REAL,        FID/IMAG
##SYMBOL=    X,             R,               I
##VAR_TYPE=  INDEPENDENT,   DEPENDENT,       DEPENDENT
##VAR_FORM=  AFFN,          ASDF,            ASDF
##VAR_DIM=   8192,          8192,            8192
##UNITS=     SECONDS,       ARBITRARY UNITS, ARBITRARY UNITS
##FACTOR=    0.0002768,     1,               1
##FIRST=     0,             0,               0
##LAST=      2.2672688,     0,               0
##MIN=       0,             -709565,         0
##MAX=       2.2672688,     639079,          0
$$ Real data points
##PAGE= N=1
##DATA TABLE= (X++(R..R)), XYDATA
$$ [...]
2035B15l465K072J161k027R20K746j348k012K417N53k728R14K186p97o1J699j237
2052A208k766Q60J055p78K35J019j740j196J427O77j538R07J526j068m28J189
2068E89k01o93J170P60q85m50J025j049j200Q47N37o74M5O24j339j411M5K032
2086b28M28J04Q04p71j431L31J976m82l83J501J72j765m87N95j863j158L056J730
2104B129k723l18R93k197n61L213J115k419O66K442j720k309K774L73k445J197
2120B10L055k508k498J228J32j529J078J997j733j455K188K58k451J794K224j366
2136F24p59J516m87j481P47J915j159j162N32k63j291j28J441m19o35J027M26
2153D44j685l94R74J133k84R00R24j127j599J296M06j288L94J300q11j131O57
$$ plain form
2035 215 -3250 -1178 -17 -2044 -1124 1622 274 -1738 679 1232 -1496 -582 1604 807 746 2445 1208
2052 1208 -1558 -698 357 -421 -186 833 -907 -2103 -676 1 -1537 -630 896 -172 -600 589
2068 589 388 -305 865 1625 740 290 1315 266 -934 -87 450 -224 -179 445 -894 -2305 -2260 -228
2086 -228 200 304 1108 337 -1094 -763 1213 731 348 1849 2021 256 -231 364 -1499 -2657 399 2129
2104 2129 -594 -912 81 -2116 -2677 536 1651 -768 -102 2340 620 -1689 1085 1458 -987 210
2120 210 3265 757 -1741 -513 -381 -1910 -832 1165 -568 -2023 165 423 -2028 -234 1990 624
2136 624 -135 1381 894 -587 160 2075 916 -246 286 23 -1268 -1396 45 -374 -1009 18 444
2153 444 -1241 -1635 -661 472 188 1088 2012 885 -714 582 988 -300 94 1394 583 -548 109
2170A09q23j606N33K181m18o25J182p72j098J374J131j309M69J696p04j490L70
2187B00M51j681O62J895j695j098J179n94j117J038J114j061m8J437m98j358J684
2204E10J055j485M80J767k102j478K102L7j921J031J156k352n78J960j91k400
2220b409J882J857j794j51J833r17j091J508J169j414k71J154p13j759J014Q83
2236G81j723J30J146p44j169R44L89p67N64J195k90n99N94P03j079K90Q83o73
2254E75l86J37J27p77m36L59L16j065L48N13n09J09L34M64jK05L71j04k85L79
2274F74K26n43L35r7n75k89J90j16q47N84j18j77j02M13R4k64M88M66J8j69P28
2295I19m32j89N08k67q1J34m72n3m43MJ19m98j22O68m16M56K01K8k02N50J88k5
$$ plain form
2170 109 -714 -2320 -1787 394 -24 -649 533 -239 -1337 37 1168 -141 328 2024 1320 -170 200
2187 200 651 -1030 -368 1527 -168 -1266 -87 -681 -1798 -760 354 -707 -755 682 184 -1174 510
2204 510 1565 80 560 2327 225 -1253 849 886 -1035 -4 1152 -1200 -1778 182 -9 -2409
2220 -2409 -527 1330 -464 -615 1218 301 -790 718 1887 473 202 1356 643 -1116 -102 781
2236 781 -942 -812 334 -410 -1579 -635 -246 -1013 -449 746 456 -143 451 1154 75 365 1248 575
2254 575 189 326 453 -324 -760 -401 -85 -1150 -802 -289 -798 -689 -355 109 108 313 684 580 295 674
2274 674 900 357 692 595 20 -269 -79 -195 -1042 -458 -576 -753 -855 -442 -348 -612 -124 342 360 191 919
2295 919 487 298 806 539 458 592 120 67 -376 -372 -253 -751 -873 -205 -621 -165 36 64 -138 412 600 575
2317E75jJ78j54j66N3r9l93j60L47r49K37l4J95j83j81L34J77Q0J11K16J59L1
2339C73J32O7j79J90M6n15M7P8l75k11m10K03k36l2rN27J35k53N91J77j30J53
2361C69J38M2j80K76k63o9K19m75m97K11L52n90k85K45O2k27J90O29l61L19L46
2382D51j71N7PK53k23R5J62j12n67K10l5n55P9k08p3j07L45l6J13N5M63j86M5
2405F2K52L06l34K19J47j52j11M45r10l56N90l55m02k72M14l1j07K90K44O7l08
2426c02O76k32L73K50J04l90j24J89l58k08m2K08k59l85K84l57j65k8K58j64O31
2447d1L00K27n84J73L86j80J17P38r54m15R61n16q00L24L82q13j84R54n0r62L11
2468f26J036o45p3J394p42o61R71M58r27j04J046n40j132N50P7j257K40J351o16
$$ plain form
2317 575 574 752 598 432 485 386 -7 -167 180 -769 -532 -566 -371 -554 -735 -401 -224 -144 -33 183 342 373
2339 373 505 572 393 583 629 114 161 239 -136 -347 -757 -554 -790 -822 -831 -304 -169 -422 169 346 216 369
2361 369 507 549 369 645 382 313 532 57 -440 -229 123 -467 -752 -507 -445 -672 -482 147 -214 105 451
2382 451 280 337 344 597 374 469 631 519 -48 162 127 -428 -349 -557 -630 -737 -392 -428 -315 -260 203 17 62
2405 62 314 620 286 505 652 500 389 834 -76 -432 158 -197 -599 -871 -457 -488 -595 -305 -61 6 -302
2426 -302 374 142 515 765 869 479 355 544 186 -22 -64 144 -115 -500 -216 -573 -738 -766 -508 -672 -41
2447 -41 259 486 -98 75 461 281 398 1136 182 -233 728 212 -588 -264 118 -695 -879 75 25 -937 -626
2468 -626 410 -235 -308 1086 344 -317 654 1112 185 81 1127 587 -545 5 82 -1175 -935 416 -200
2487b00j041P40M15r08L73J215l84j61P32K29j150J83P34m77j44P22j75j283q6
2506f66K53j30k72M79N91r52J67O19o99l9R70N25j91n7M5j14p81K29P19p40l90
2527d34Q45l45q41k46M57M8k06J051l35q38Q13P34o46J16R71m33r44Q02K47j056
2547b40k40J173o31j57J73k36j558M72J691o79j85J092o84j106J128R33j085J37
2565bJ588p20j143N83L01j756O83J449q49j089J296q16j385J069J667j215N6J518
2583A235m25j930R88J350j291L14J414o26j792P16M15j310m05J749l31r96Q23
2600a02K58j421O3J845J27q91O42L59r75L56P95l35p26L03L67l55r27M89k49q00
2620a177J343M79j031r23Q13L48k81K18J241m25j015O65N98j215L14J271l65r94
$$ plain form
2487 -200 -1241 -501 -86 -994 -621 594 210 49 781 1010 -140 43 777 300 156 878 703 -580 -666
2506 -666 -413 -543 -815 -336 255 -697 -530 89 -610 -649 321 846 655 598 643 529 -252 -23 696 -44 -434
2527 -434 411 66 -775 -1021 -564 -516 -722 329 -6 -844 -31 703 57 173 1144 711 -233 569 816 -240
2547 -240 -480 693 62 -95 78 -158 -1716 -1244 447 -232 -417 675 -9 -1115 13 946 -139 -2
2565 -2 1586 866 -277 306 607 -1149 -466 983 134 -955 341 -475 -1860 -791 876 -339 -283 1235
2583 1235 810 -1120 -132 1218 -73 241 1655 1029 -763 -47 368 -942 -1347 402 71 -925 -102
2600 -102 156 -1265 -1202 643 770 -121 521 880 -95 261 1056 721 -5 298 665 310 -617 -128 -377 -1177
2620 -1177 166 645 -386 -1309 -496 -148 -429 -211 1030 605 -410 255 853 -362 -48 1223 858 -136
2638a36K43r9j354M53R15j90o63Q85M3r81J88P03k50L07Q57k7p25J16K87o71R7
2659bR25o50q78O28L22j247L80L55l73L66L33j70o74M49M45R5j01O40m86n79O01
2680C79K72o07K86j1m31k41j95J34m68L04Q29k91j50L84k55l83M08P78M2j78k03
2701D03L99o14n49M37m1k45L67M12q47j027O83L77m29J84P91n3n36P25j11n58
2721b32L37P96m59n92P53l67p42K50N70p36l41P56K7j021N63O37m67l45J096J58
2741F41j119P43N20o46J1N29k41p88N43K62r54k2O49l06o85O55p4j47R5M91L2
2762A89k87N66j97n62N94J7k20q3M31J9l87k26J06o08M2J99q1j01K81J39j43K85
2784b7P8j19K47P1L21l29J86k2J3l66N1k55j56oj13K41m25L39j21K43k95K46K65
$$ plain form
2638 -136 107 8 -1346 -893 22 -168 -831 54 97 -884 -696 7 -243 64 921 894 169 285 572 -99 -2
2659 -2 923 273 -605 23 345 -902 -522 -167 -540 -174 159 -11 -685 -236 209 304 203 843 357 -222 379
2680 379 651 44 330 319 -112 -353 -548 -414 -882 -578 251 -40 -190 194 -61 -444 -36 742 784 606 403
2701 403 802 188 -361 76 35 -210 157 569 -278 -1305 -622 -245 -674 -490 301 248 -288 437 326 -232
2721 -232 105 901 442 -150 603 236 -506 -256 314 -422 -763 -7 20 -1001 -438 199 -268 -613 483 641
2741 641 -478 265 785 139 150 679 438 -350 193 455 -499 -521 128 -178 -863 -208 -282 -429 -334 157 189
2762 189 -98 468 271 -291 303 320 100 17 448 467 80 -146 -40 -648 -606 -407 -488 -589 -308 -169 -312 -27
2784 -27 51 -68 179 250 571 242 428 406 419 53 104 -151 -307 -313 -426 -185 -610 -271 -392 -149 -444 -198 67
2807F7k48M12M5J36j69K06J49m90J87m6j25k64J7j17K7J40p3n75N23n3j7k01L41
2830a28L11J88l59L93j22J00K92n66j4K5j01l12j03p3J59j27o9j05L53j38L96
2851@J19j56K74J37K50j34k53Q8R7m4n23L6J93j42k0m99L90k89J04J55j41L2M38
2874A12l22L76K18N8j76K05l67K56j26L1R4k87k41L57m74J26K22o07K86J8k23
2895d64M34N0J55j96N26j55J35r0k92J85j02Q6r6l20j87K92o28M20O7q8n2n2M08
2918C6ql7M2J04j26M13J4k51P8j6j64k3j49J29m56P0K80k38j84N14n73J33N59
2941A47K1k01J80L92k43J3J70L37n43j76J41m22k17K40P8m18R2L38m33J94R1K51
2963C2j9j55L23J32l04L2K15j35L47m6k98l77Q0K32m66P9L06J90n42N8L09o07
$$ plain form
2807 67 -181 231 276 412 243 449 598 108 295 249 124 -140 -123 -240 -213 -73 -146 -721 -198 -251 -268 -469 -128
2830 -128 183 371 12 405 283 383 675 109 95 120 19 -293 -396 -469 -310 -437 -506 -611 -258 -396 0
2851 0 119 -37 237 374 624 490 237 325 422 378 -145 -109 84 -58 -78 -577 -187 -476 -372 -217 -358 -326 112
2874 112 -210 166 384 442 266 471 104 360 234 265 359 72 -169 188 -286 -160 62 -545 -259 -241 -464
2895 -464 -30 20 175 -21 505 350 485 395 103 288 186 272 176 -144 -331 -39 -667 -247 -180 -268 -320 -372 36
2918 36 28 -9 33 137 11 424 438 187 265 249 85 62 -87 42 -414 -344 -64 -302 -486 28 -545 -412 147
2941 147 168 -33 147 539 296 309 479 816 273 97 238 -184 -401 -161 -83 -501 -409 -71 -504 -310 -219 32
2963 32 13 -142 181 313 9 41 256 121 468 422 124 -253 -173 59 -407 -328 -22 168 -374 -316 -7 -614
2985f14M48L29L29m99N27J61o41j32N03M2n54N92Oo35n72N26j07j58K70n0m12
3006f41J46P75m99p0O19L61m28O1K34n01j63M38j25l75K45j3n58m98R41p7k44
3027c72K77L87p61L76J53O0j82Q67k77m80P3K74l00m17M46L23n72J98Mo61j46
3048g30K23L17j55O22r5j20m15L67M23k53K02M31o76q9K29q1n29L25J22P6p95
3069f01M71o8r32O35P11j45m46M45M47o79KJ040l78p05P02N37j411k91J091m16
3089Ir15J208k34j141J48J112m77n78J544L76j089j58Q03q40k18J330L37j189
3107B8K61N44j057o94Q54R9l78L75M22q02l98N83ok53Q93L89o88l11P64m55k71
3128a01O12N4o49K52L29j070mK85J2p9K73Kj08j14J7M25j21J31N33n78j06K51
$$ plain form
2985 -614 -166 163 492 -7 520 681 40 -92 411 453 -101 491 497 -138 -710 -184 -291 -449 -179 -229 -641
3006 -641 -495 280 -219 -289 330 691 263 324 558 57 -106 332 207 -168 77 64 -494 -992 -51 -128 -372
3027 -372 -95 292 -469 -93 60 120 -62 805 528 48 121 395 95 -322 124 447 -125 73 77 -584 -730
3048 -730 -507 -190 -345 277 182 62 -353 14 437 184 386 817 141 52 281 200 -329 -4 118 194 -601
3069 -601 -130 -198 -1130 -495 216 71 -375 70 517 -162 -160 880 502 -203 499 1036 -375 -666 425 9
3089 9 -906 302 68 -1073 -925 187 -290 -868 676 1052 -37 -195 608 -232 -450 880 1217 28
3107 28 289 833 -224 -918 -64 35 -343 32 454 -348 -746 -163 -169 -422 471 860 172 -139 625 170 -101
3128 -101 511 565 -84 168 497 -573 -577 -292 -280 -359 -86 -84 -192 -306 -289 136 15 146 679 101 -5 246
3150B46l6k31K01K83o56k61L57q9n23L14M26m37k8M37k06j43J94L85O5k18Q44
3171I24o64n93L28P0j12J90O90o36o62K09L19q49L57Q12k99m18L37L83q59K22
3191b51R35k17k13K77r8q73m9P12j81o61Q22L7r38J58O83o16j09P15jj85m9M97
3213C95j55l73N24J95m45MK52l57j04j04K48j97L8j65k28k42M83J80j75j28P05
3234C51l70K61k01L15l0l25M54N0m81l31N08j04n61K67J73k79j03M36m21O6N53
3255B28Rj12j70N04m57JK74M2k72j1J5o7J72k31j2m33N28l31k20L30J10j40J82
3278f1J53L6j6K95m8j79j92L47q7k99K60j81k74K49q9l93p1M44j64k75K60K91
3300FL21k80N7L54k26n4j20p3J96J07l01j79K29o1k73j87J22K48j69o2O1M86l46
$$ plain form
3150 246 210 -21 180 463 -193 -454 -97 -186 -709 -395 31 -406 -434 3 -203 -346 -152 233 298 80 924
3171 924 260 -333 -5 65 -47 143 833 197 -465 -256 63 -786 -429 383 84 -334 3 386 -473 -251
3191 -251 684 467 254 531 433 -440 -489 223 42 -619 203 240 -698 -540 143 -473 -582 133 132 -53 -102 395
3213 395 240 -133 391 586 141 145 397 40 -64 -168 80 -117 -79 -244 -472 -714 -231 -51 -226 -354 351
3234 351 -19 242 41 356 326 1 455 505 24 -307 201 97 -464 -197 -24 -303 -406 30 -391 -325 228
3255 228 237 125 -45 459 2 3 277 319 47 36 51 -16 156 -75 -87 -520 8 -323 -543 -213 -103 -243 -61
3278 -61 92 128 112 407 359 180 -12 335 248 -51 209 28 -246 3 -86 -479 -550 -106 -270 -545 -285 6
3300 6 327 47 104 458 232 178 58 -15 181 288 -13 -192 37 -24 -297 -484 -362 -114 -283 -345 -284 202 -144
3323a44O8L10k54K24J24Nj18j56J91l39J35k19M19p57K57J47j60K3J53r6Q2K99
3345A94p8N0r0J82K4J80l09J2k50K43K5j88j48J50M1l12p7qJ30Q1K3L08jj22N3
3370A13K57l66L29j32K3N1m1q9j24O4k57j12j6K5P1N1j60p5L04K62J44k69K22
3393B75Q9l7k39N52m13%P6j41k59k03M16n33K27k27L84j54o5K03J97j35J71l09
3415a25J28L62k2N0l17J84J07l75J02m4k17m6J31l09L39n2J07L04l27j70K71l53
3437b72J37N96l77K3L2q4M1k27k1rk9J18L05m01l25M51p5j92J42L97kj67K42r6
3461B07j94Q5O5o6L2J00j38r3l1J77k7m54J53j8R1j9J70l39L23J50J07M4p2q0
3485A73L9l21J21L34k44l24N38n06j92J42O8N8O3j43J26k12Q5L33j66J13M35l51
$$ plain form
3323 -144 -76 234 -20 204 328 333 215 59 250 -89 46 -173 246 -511 -254 -107 -267 -244 -91 -187 -105 194
3345 194 116 166 76 258 282 462 153 165 -85 158 183 -5 -153 -3 38 -274 -351 -359 -229 -148 -125 183 182 60 113
3370 113 370 4 333 201 224 275 234 145 21 85 -172 -284 -300 -275 -204 -153 -313 -388 -84 178 322 53 275
3393 275 364 327 88 640 227 227 303 162 -97 -300 116 -417 -190 -417 -33 -187 -252 -49 148 13 184 -125
3415 -125 3 365 343 393 76 260 367 -8 94 50 -167 -213 -82 -391 -52 -104 3 307 -20 -190 81 -272
3437 -272 -135 461 84 107 139 55 96 -131 -152 -161 -190 -72 233 -168 -493 -42 -117 -309 -167 230 228 61 303 207
3461 207 13 98 163 97 129 229 91 -2 -33 144 117 -337 -184 -202 -111 -130 40 -299 24 174 281 325 253 173
3485 173 212 -109 12 346 102 -222 316 -190 -382 -240 -172 -114 -51 -194 -68 -280 -195 138 -28 85 520 169
3507A69k14N07k73j24J05M29l77l00j01J1j94pJ49J64j9L4l22M5M84k55j6M95
3529C90l0k87J99O1k66j08K10o5n39K32J22j58j17N72k14j30o4M20k57j89N87
3550C69Ml84n5P29p68j74O40r1m89Q2rO1N5J81j07q80P25M87l44k39L68l1k69
3573a39M33K31m80O8J84k24l54J27M50m38L4P0m6m42K79Q3m9k28P94N4m09k4K19
3596A93k9k95N79o6l16J02L79p13k66L48J12m63n5P69j93n24K43L86n14O82J73
3617E32m84J33j32K34k89K79L08n01l02K12j47j85J35K96m57l2M96l56l7M24J10
3638B37j36K42p6n33L98K39j59m50N90J02o96j17M25k66l93N70L36l08o5L26l83
3659a17k46N45L05m32L25rk80J8R2k1m66J56P61q53m09P20j31l94N20j84n1oK21
$$ plain form
3507 169 -45 462 189 65 170 599 222 -78 -179 -168 -362 -369 -220 -56 -75 -41 -363 -318 166 -89 -105 390
3529 390 360 73 272 333 67 -41 169 104 -435 -203 -81 -239 -356 216 2 -128 -192 228 -29 -218 369
3550 369 373 -11 -66 663 -105 -279 361 270 -219 -137 -146 -85 -30 151 44 -836 -111 376 32 -207 161 130 -139
3573 -139 294 525 45 113 297 73 -281 -154 296 -142 -108 -38 -84 -526 -247 -164 -213 -441 353 407 -2 -26 193
3596 193 164 -131 448 382 66 168 547 -166 -432 -84 28 -435 -490 279 86 -438 -195 191 -323 359 532
3617 532 48 181 49 283 -6 273 581 80 -222 -10 -157 -342 -207 89 -368 -400 96 -260 -297 127 237
3638 237 101 343 267 -266 132 371 212 -238 352 454 -242 -359 66 -200 -593 -23 313 5 -60 266 -117
3659 -117 -363 182 487 55 380 371 91 109 201 180 -286 -130 631 -222 -631 89 -42 -436 84 -100 -151 -157 64
3682F4j52l8K63L45j71m91K55K83n24KK0K72m45R5J26m64L77J68k01L9o6M87l58
3705a14l1l0L12j01J10L62n41R2K8o7j73Q1R4j60kj32p9OL73j95K29K06k30k67
3729b29J99M29k21m8J9p0K04m87j04K48J28k07K55k62J8o8J22q8J37J3q5L88k01
3752I0K80k26J02k06j5j25J51L01l91j75J7L70j88l35J68k10N17k09o6K3J80J0
3774F3J59K70m75J28P3J39j52k47p3K9K3m16K18L74k51k0J16k51K87K33Pj34J2
3797A12q0L02j21KJ3k66K17k18n4j45J61l30J61L12k22J29n4K73m47J38K94J7
3819A94k0K30j51k52K93q5m9m37P0Q1m0pj23K36k87N56k48j9Q2R9KJ02j93P2P1
3844A77k33R5P2j89j58L25n4k28J86j05J42kj62j24L20k91J63q7K93J7L47l00
$$ plain form
3682 64 -88 -126 137 482 311 -180 75 358 -166 -164 -144 128 -317 -222 -96 -560 -183 -15 -216 -177 -243 244 -114
3705 -114 -145 -175 137 36 146 508 -33 59 87 20 -153 -72 22 -138 -140 -272 -351 -345 28 -167 62 268 38 -229
3729 -229 -30 399 178 130 149 79 283 -204 -308 -60 68 -139 116 -146 -128 -196 -74 -162 -25 -12 -97 291 90
3752 90 370 144 246 40 25 -100 51 352 -39 -214 -197 173 -15 -350 -182 -392 125 -84 -150 -127 53 63
3774 63 222 492 17 145 218 357 205 -42 -115 -86 -63 -479 -261 113 -138 -158 -42 -293 -6 227 234 100 112
3797 112 32 334 213 215 228 -38 179 -39 -93 -238 -77 -407 -246 66 -156 -27 -81 192 -255 -117 177 194
3819 194 174 404 253 1 294 209 160 -277 -207 -126 -166 -173 -296 -60 -347 209 -39 -58 24 123 125 227 34 106 177
3844 177 -56 39 111 -78 -236 89 35 -193 -7 -112 30 28 -134 -258 62 -229 -66 -153 140 157 504 204
3866B04j94L3m2%O0o8q2p4J83k71J6K98J0j10J1M2N4k86K11R3L7k3q5J83o4R0
3892B26k43Q0l37M00k03r1K29m12J70K79k71j10K81J43k42J44m9R8M8K32m0j9
3914C13k26n8J64l04K06k52K6J45L64p11M38p3p8o2Q5n3J78K53k02k40K80k3o1
3937A09k04j4L11j95j16o9J24j20J51K33m72o4K96J03N1M2n0N9Qj73O6k10J04
3960c0P7j04n3K18j22O3l07o9K73mn1K16l18J82R9K3j57J67L83l44l40M06k16
3983hJ99L0m66K62k30K31j05N0M1j57J10J3l4J62j32J61p1O5k05O0j14J49k13
4006b02J78J51k53q3r5K54j09J16k66K51J0M2k7K17J34j47l5k5j03J65j12j25
4028f4O9o8K70o59K8M88m26L09N9j84j15K84J6K8L9J0J86j41J5R3m0k60j3K18
$$ plain form
3866 204 10 43 1 1 61 -7 -89 -163 20 -251 -235 63 73 -37 -26 16 70 -216 -5 88 125 102 17 200 136 226
3892 226 -17 63 -274 126 -77 -168 61 -351 -181 98 -173 -283 -2 141 -101 43 -6 92 140 372 332 313
3914 313 87 29 193 -111 95 -157 -131 14 378 -333 105 32 -46 -108 -23 -76 102 355 153 -87 193 170 109
3937 109 -95 -109 202 7 -109 -178 -54 -174 -23 210 -262 -326 -30 73 124 166 116 175 183 10 76 -134 -30
3960 -30 47 -57 -110 108 -14 49 -258 -327 -54 -58 -109 107 -211 -29 70 93 -64 103 486 142 -198 208 -8
3983 -8 191 221 -245 17 -213 18 -87 -37 4 -153 -43 -30 -64 98 -34 127 56 121 -84 -24 -138 11 -202
4006 -202 -24 127 -126 -209 -304 -50 -159 -43 -309 -58 -48 -6 -33 184 318 171 136 111 8 173 61 -64
4028 -64 5 -63 207 -452 -424 64 -362 -53 6 -178 -293 -9 7 35 74 84 270 129 144 237 197 -63 -76 142
4052A42k63L20M3l44j21J75J05k03J12K1R7j98L90l65k01K24M89k92j09kJ08k71
4074a43J7K73k99mJ76j50p3J50O3k74M8L52k18P0J19j21k69N83j16j60j22J10
4096A2r9Ml63L85j87J43j31K03k51O2M31j71j50N82l67q2K11J07k24q4K0J00l12
4119a61R5j83J04K36j23K30n09L89j76J63k7K4J66k13K20Rj99k8K01n8k33J59
4141H6r4l8l01M04j72O6O0Pn2k72M19j71j17M62k30p2Q9j1j29Q0J26L52q03L91
4165H0k4r9j34N2J98j86kJ92j68P4K48j17o8L42p4o4j83K76j33j67n11P09m07
4188a66j9K29p9l54K73K06j27J32j3p4p6J53j0m4j55K32K18l59o3J30m2m04L83
4211b9J07r4j0l0j73k4L14j12P2n3K5J70j06p5K25j41j57K88j84o2J94k93q5J01
$$ plain form
4052 142 -121 199 242 -102 -223 -48 57 -146 -34 -13 84 -114 276 -89 -290 -66 423 131 22 20 128 -143
4074 -143 -126 147 -152 -156 20 -130 -203 -53 10 -264 -216 136 -82 -12 107 -14 -283 300 184 24 -98 12
4096 12 -87 -83 -446 -61 -248 -105 -236 -33 -284 -222 209 38 -112 470 103 21 232 339 115 31 51 151 -161
4119 -161 -66 -249 -145 91 -32 198 -311 78 -98 65 38 62 228 15 235 244 45 17 218 160 -73 86
4141 86 -8 -46 -347 57 -115 -49 11 18 -34 -306 113 -58 -175 287 57 -15 74 63 -66 14 140 492 -311 80
4165 80 56 -43 -177 -125 73 -113 -115 77 -91 -17 231 114 46 388 314 250 67 343 210 43 -468 241 -166
4188 -166 -185 44 -35 -389 -116 90 -37 95 82 8 -68 85 75 31 -124 108 326 -33 -96 34 -8 -412 -29
4211 -29 78 -16 -26 -56 -229 -253 61 -51 21 -32 -7 163 57 -18 207 66 -91 197 13 -49 145 -148 -233 -132
4235a32QLp8J01N3O0J18k17m5K57k29P8j2J97r8o8J33J45k92q2j92K67j45L55
4259A85j47l03L50N4p6k22K18K45k16J2Qj26J60j37p4J54n3L4l07l09M79k6k7
4282a24r8L64j22m21K30L19r9%L0L2k1j28k1J58j90L20p7m69L06m6q9k11O9N6
4306b32R8n3L27l80M1J45K96k3m19K67J17n5K36k06k97n3K90k00j71L63J3k30
4328a26L14O1l11K02j59j18J91J62o6l80K33j63P4J09q1J3J1j91J50O9k25j88
4350d19N03J9m73L28Q5N3J3j27Q8qj12MK03j91Q2j27J78j48j75J08qJ29j04o2
4374a61L8L7j9j32K65r1M5J31j04J54j95J80j78k45L4L85j90J73l47K38k1M8j
4397D4n98P11mm7j6jJ09O3p5L4j91J00j9l63J49o3nO0J46k13p6J20k0L72l45J27
$$ plain form
4235 -132 -124 -121 -199 -98 -45 15 133 -84 -129 128 -101 -23 -35 162 64 -4 129 274 -18 -100 -292 -25 -170 185
4259 185 38 -265 85 139 63 -159 59 304 88 100 108 -18 142 5 -69 85 32 66 -241 -550 -71 -97 -124
4282 -124 -222 142 20 -401 -171 148 49 49 79 111 90 -38 -59 99 -91 229 152 -317 -11 -57 -146 -357 -288 -232
4306 -232 -134 -187 140 -240 -199 -54 242 219 -200 67 184 129 365 159 -138 -191 99 -101 -272 91 104 -126
4328 -126 188 249 -62 140 -19 -137 54 216 150 -230 3 -160 -86 23 -58 -45 -34 -225 -75 -6 -231 -419
4350 -419 84 103 -370 -42 43 96 109 -18 70 62 -50 -46 157 -34 48 -79 99 -49 -224 -116 -124 5 -99 -161
4374 -161 -123 -86 -105 -237 28 -63 -18 113 9 163 -32 148 -30 -275 -241 144 -46 127 -220 18 -3 45 44
4397 44 -554 157 153 106 90 89 198 261 186 220 29 129 110 -253 -104 -167 -172 -112 34 -179 -255 -135 -155 217 -128 -1
4423aP1k07K90rj89J31k42M6j2P9J57o1j27n6K00j30j77K51o0K5J74J51n21N33
4447C16k46L5k53M57Nk48N7j06J01R8j00n74K26m8j53M67q3J54l46M50K4j39k27
4470a33R9R2j4R1j33L31j76Oj54r2j1j47M53l07J08j0J39k12KL47k25P0p1K61
4494C14j60j29O1N8r1K0J31l13k91K76J57j49J13P8L4p9O0l13R3N18l84J42o8
4517G8K3j91Q5j78L29j42O7M9n5m07M59j94N9l5O2kj70J80k45j6K65J27o3j41
4541e6M32m32kJ66j78J67k12M55l70q1J31k8J18j46J15J4l93M89n2l42J34M74
4563D03k74J2K5j18r1N3k83M90R7m94K04r4l5j02J53J62J82j63K2n5K13k34p6
4586cK01k61J10K0k46J42j07K31j16k52P3K80r6L14k15k16J03K68j47Rk21K57
$$ plain form
4423 -1 70 -137 153 144 -45 86 -156 -110 -122 -43 114 53 -74 -130 70 -60 -237 14 -46 -21 153 304 -217 316
4447 316 70 105 -148 309 314 66 123 17 118 216 116 -458 -232 -280 -433 34 -49 105 -241 209 233 94 -133
4470 -133 -34 58 44 135 2 333 157 163 9 -83 -94 -241 212 -95 13 3 142 -70 -68 279 54 124 53 314
4494 314 154 25 86 144 53 73 204 -109 -400 -124 33 -116 -3 75 109 30 90 -223 -130 388 4 146 78
4517 78 101 -90 -5 -183 146 4 71 120 65 -342 117 -77 -18 -53 9 7 -163 17 -228 -244 21 148 85 -56
4541 -56 376 -56 -58 108 -70 97 -115 340 -30 -111 20 -8 110 -36 79 93 -300 189 137 -205 -71 403
4563 403 129 141 166 48 -43 10 -273 217 314 -180 24 -70 -105 -207 -54 108 290 127 149 94 307 73 -3
4586 -3 198 -63 47 67 -179 -37 -144 87 -29 -281 -208 72 -24 290 75 -141 -38 230 83 92 -129 128
4608A28j57J32J01j78k89L18o0j75Q0L6K30l92J61K71m36k5L99l6rQ7l17J2K03
4631H4J09l63j3n4K94j72M3r6j87M10k78J78K30l55L62j42k25K63m5K43l31L07
4653B62l22J85KN1M3l76N77o07j18L79j0k92K00q4K73k42k14K92J25m8j59L11
4675B28j24j55K05m15N1J59L05o32O7K94k85J74k9J59J8p1L19j99n1L9q8j57L74
4698A86Kk00J4j21J19j25L36j42J44k78J05p0J49j1p4j17j79L37r7J24o7j14J09
4721C0R8Mm9j29j22rO9n0N4l00J55K64m4J00j06K21l70K61j30J47K7L8n9j19O7
4746D8j87K15l01J03o4K02O4j07K51j89J58r1j5j71j18K65q2j44K57n9k19L42
4768A58Q3l55j1K38k67j8J69j01K91l1j65j77j30N17j74M5j6j2O4q2j34M52l41
$$ plain form
4608 128 -29 103 204 26 -263 55 -5 -180 -100 -64 166 -226 -65 206 -230 -255 144 108 99 186 -131 -119 84
4631 84 193 -170 -183 -237 57 -115 -72 -168 -355 55 -223 -45 185 -170 192 50 -175 88 43 286 -45 262
4653 262 -60 125 127 178 221 -155 422 -185 -303 76 66 -226 -26 -110 163 -79 -293 -1 124 76 -83 228
4675 228 104 -51 154 -261 -210 -51 254 -378 -311 -17 -302 -128 -157 2 20 -51 268 69 18 57 -31 -188 186
4698 186 188 -12 2 -119 0 -125 211 69 213 -65 40 -30 119 108 34 -83 -262 75 -22 102 35 -79 30
4721 30 128 132 83 -46 -168 -177 -108 -158 -104 -404 -249 15 -29 71 -35 186 -184 77 -53 94 121 159 100 -19 48
4746 48 -139 76 -225 -122 -186 16 80 -27 224 35 193 102 87 -84 -202 63 -19 -163 94 35 -184 158
4768 158 241 -114 -125 113 -154 -172 -3 -104 187 156 -9 -186 -316 201 27 72 56 44 108 26 -108 344 3
4791CJ35Ml53L19j9m32J25K35J3M7j09r6P9J2j27N68k01l6j93l8K50k16N5K2K28
4816B75l70O6P6K69k04m6m39N91o5k20M5O3r3n6K09k50k6J04PK46l34L03p9k27
4840a55P0o5M7m0p4L37j47k21J78Q6k02K13q3L10k15M3Pj24R4j95K39k50L23k20
4864d4L8J26r2k09R7j85K48K17l1k52L5J04j10R2Q8J08j79Q2J34k5l82j5J06k67
4888c16M19p4j25J38k8K23k32Q5q7j8K12k42Rj07OJ11R9K34l79L16J75l97K9n7
4912fL5J9k1K12k45J17o1j3k16K57r7j19J42j27n0K14L4n5j58J90J57l54K42Q0
4936A77m9j02n1j41J61k07M34j27m10N56j81K82l72J25j35p5L25k82Nl85L45N1
4958e6m2J76l2J23j42o4j13J77j56j67K79J01J9J5k6j57Ql9J01K32k96J06J64
$$ plain form
4791 3 138 142 -211 108 89 -343 -218 17 30 77 -32 -128 -49 -37 -164 404 203 167 -26 -64 186 -30 25 47 275
4816 275 -95 -29 47 316 112 66 -373 218 153 -67 -22 41 -52 -108 101 -149 -175 -71 -64 182 -152 151 72 -155
4840 -155 -85 -150 -103 -143 -217 120 -27 -248 -70 16 -186 27 -56 254 39 82 89 -35 59 -136 103 -147 176 -44
4864 -44 -6 120 28 -181 -84 -269 -21 196 165 -87 -52 52 -58 34 122 230 51 133 267 242 -140 -155 -49 -316
4888 -316 103 29 -96 42 14 237 5 90 3 -15 197 -45 -36 -143 -137 -26 73 307 -72 244 419 22 51 -6
4912 -6 29 48 27 239 -6 111 50 37 -179 78 -19 -138 4 -123 -173 41 75 20 -138 52 209 -145 97 177
4936 177 128 26 -25 -166 -5 -212 222 95 -315 241 60 342 -30 95 -40 -115 210 -72 -67 -452 -107 -56
4958 -56 -98 78 46 169 27 -37 -150 27 -129 -296 -17 84 103 118 92 -65 -57 -96 5 237 -59 47 211
4981B11j83J0K3J53k47K87l75J31P6j07KJ45L7m5l48J68l5L9j68K83j41R1JL4
5005D2K5L56m94r6n7J02lL06n2K8n4p3L9N4j05k61L61j35m6l47J34L28o5Ol0K01
5031A64k41J65j91m0L08k30O5j57K13r5J50m52J56N47k68j7k81L13k5J52k92P1
5053A5J85J33l44O9P9j30p9p0J35k46J23K19n1J71l00L16M3k57k7j21Q8J27j56
5076g8L41j13q0J24j16p7L31m20J63j00n4Q6j69J95k97K58l7J08m1J55j60o3P5
5099C1Q5Nk92L90j18R9q0oj7m5k26n3L96l46N9p8O43l85j77L07j77Kjp3K04j31
5125A6k8j70J52J9q6K1QP9o8J00J33m96L91k24j8K04K6J0j55J88n1K0N1k53J34
5150CK74l67J46nk42K03j48K09Rk91L90j89jK34k95R1O0j00j72Q5K9L03k75j31
$$ plain form
4981 211 28 38 61 214 -33 254 -121 10 86 -21 -19 126 163 118 -230 -62 -97 -58 -226 57 -84 7 8 42
5005 42 67 423 -71 -167 -224 -122 -125 181 129 157 103 30 69 123 18 -243 118 -17 -63 -410 -276 52 -13 -7 -37 164
5031 164 -77 88 -103 -143 165 -65 0 -157 56 -39 111 -341 -185 362 94 77 -204 109 84 236 -56 15
5053 15 200 333 -11 58 137 7 -72 -142 -7 -253 -130 89 38 209 -91 225 268 11 -16 -137 -49 78 -78
5076 -78 263 150 70 194 78 1 332 -88 75 -25 -79 7 -162 33 -264 -6 -43 65 24 179 19 -44 31
5099 31 116 121 -171 219 101 200 120 114 97 52 -174 -227 169 -177 -118 -196 447 62 -115 192 15 17 16 -57 147 16
5125 16 -12 -182 -30 -11 -97 -76 -68 11 -57 43 176 -320 71 -153 -171 33 59 69 -86 102 51 71 122 -131 3
5150 3 277 -90 56 51 -191 12 -136 73 82 -209 181 -8 -9 225 -70 21 81 -19 -191 -106 -77 226 -49 -180
5174a80J41P9Q8l4n4p4j56J88Q1k1Q5l20K97j28K73k80m2q1Q1Q7j28j62L08k11
5198a63L01l67J54j97L53j55M1l6O5L30m55p1L26P8j38j10Q3j42J84l0J7j79Q6
5221b5J22o5M6l93L38k45J31J29q4M14l70%m0k08L86r1jQ9o3K4p4k9K74k88j76
5246a99L9L76l13k12L23j58K27K3o2j53J8k1Q1J1J44j79L91l09j71N0o2P0r3K17
5270C8n1K66m08p0L48l93L29O6k79K9k8K26j30J46k5j96P2R9L24l87r2j03KK86
5294F9k9l9j63L82m9n19K36j87K81j19M2K51l36L77j37l5RKk08m3L29k16m1K92
5318A49M6k59J55N3k28J60K00o8j57P9l16L6K04p5j33N08l27j35N2J70l71K60
5340CJ77j18K41q6j07j17n1L03lk93L89l70m2K46k51j03L26k86L70K0k06k10K18
$$ plain form
5174 -180 -39 40 128 94 40 -34 -190 -2 79 58 143 -177 120 -8 265 -15 -57 -138 -57 30 -98 -260 48 -163
5198 -163 138 -229 -75 -272 81 -74 -33 -69 -4 326 -129 -200 126 204 66 -44 39 -103 81 51 68 -111 -25
5221 -25 97 32 78 -315 23 -222 -91 38 -46 368 -2 -2 -42 -250 136 45 44 133 70 94 20 -9 265 -23 -199
5246 -199 -160 216 -97 -309 14 -144 83 106 44 -109 -91 -112 -31 -20 124 -55 336 27 -144 -94 -156 -86 -179 38
5270 38 -13 253 -155 -225 123 -270 59 125 -154 -125 -153 73 -57 89 64 -132 -60 39 363 -24 -116 -219 -217 69
5294 69 40 1 -162 220 171 -348 -112 -299 -18 -137 -95 156 -180 197 60 25 34 36 -172 -215 114 -102 -143 149
5318 149 195 -64 91 144 -84 76 276 208 51 130 -186 -150 54 -21 -154 354 27 -108 -56 114 -257 3
5340 3 180 62 303 217 110 -7 -58 245 242 -51 338 -32 -74 172 -79 -182 144 -142 228 248 42 -168 50
5363E0j86m0mP6J41J3l17M48o9m9k91Q4J76j85J71l54K28r3J3M14l20O3m3K90
5387B16j15j50Q1L5J69j10j36M1j62K51L7k00O7r2J48j89M6j14J35k28N14j08
5409A36j13Q3O0k31J71l4l19J77j46M04l99P5L6J34k52Q7J52J62P5m06L2K81l86
5432b21P3J98j11L36k84k8J01j11L3J41j56R9j03R3j60j15J07L45j42J27k76j74
5454b28N26k98K72k45j32K11j69j8j3P2j27J05J65R1o4j25R9k6k43p9J96m5K29
5477A54j26j21J7K50l05K36r5m2L50k49K0K2J34j89j77J58j00k4r9K84M3P9k28
5500hK36j40K07k71q7J13j28M1K45m49K42J98J37k63Q5l50L37l6k47nO5OP2L21
5524C21l36O0K45m89J33rk63J40J66q3K7L0k13R1K08J0q8n9kQ0l36L90j63M84
$$ plain form
5363 50 -136 -176 -180 -104 37 50 -267 181 112 63 -228 -144 32 -153 18 -336 -108 -201 -188 226 -94 -31 -74 216
5387 216 101 -49 32 67 236 126 -10 31 -131 120 157 -43 24 -68 80 -109 -63 -177 -42 -270 244 136
5409 136 23 106 166 -65 106 72 -247 -70 -216 188 -211 -136 -100 34 -218 -131 21 183 258 -148 -116 165 -221
5432 -221 -148 50 -61 275 -9 -37 64 -47 -14 127 -29 70 -33 60 -100 -215 -108 237 95 222 -54 -228
5454 -228 298 0 272 27 -105 106 -63 -81 -94 -22 -149 -44 121 212 148 23 122 96 -147 -226 -30 -75 154
5477 154 28 -93 -76 174 -131 105 10 -32 318 69 89 111 245 56 -121 37 -63 -87 -186 98 141 220 -8
5500 -8 228 88 295 24 -63 50 -78 -37 208 -241 1 199 336 73 158 -192 145 109 -138 -143 -78 -72 0 321
5524 321 -15 45 290 -199 -66 -75 -338 -198 -32 -115 -88 -58 -271 -180 28 38 -50 -109 -111 -31 -367 23 -140 344
5548C44l40P3j06J9J99j14k81N1J30N5r1j03J78NJ17j85J11j96J84K08p90L70
5570a62L87k28q0J02j24J44j54K77k79K14%N2j91l3K04k54J73J65K95k51j33k22
5592i8N16k29k34K08j07j22K24l44J90J87O7k20j92pK6N9K9O8J03o0j08k5p3K77
5616A35J5l70Q4K16j1M9J17j97K5K39l60k36j8K05J46k48K31M5j70K03j42NK34
5639A97j11M5O7n0Q9j23J6J49l24p4l9m4M08k34J15j23k21K99q3On4L30j48m7
5663D6Q2k19O9KP6j17LL5K32j70Q7j70r0Q7o3k59M19k30K34j13KQ0J6L8j73J98
5689A02q4k61J60m3j20N2L09j76K39p5l56K04j19L58j87k07L09k27L81j45j44
5710c0J72k79J0j25K18k08L22j8m7p5j3N0j66J7J8K94j87P5J13q0J95l93q1M63
$$ plain form
5548 344 4 77 -29 -10 189 75 -206 -155 -25 30 -61 -164 14 19 136 -49 62 -134 50 258 -532 -162
5570 -162 225 -3 -83 19 -105 39 -115 162 -117 97 97 149 -42 -75 129 -125 48 213 508 257 124 -98
5592 -98 418 189 -45 163 56 -66 158 -186 4 191 258 38 -154 -161 -135 -76 -47 21 124 64 -44 -69 -142 135
5616 135 150 -220 -136 80 69 118 235 38 63 302 -58 -294 -312 -107 39 -209 22 67 -103 100 -42 -37 197
5639 197 86 131 198 148 237 114 130 279 -45 -119 -158 -202 206 -28 87 -36 -257 42 -41 -35 -89 241 93 46
5663 46 128 -91 -22 -20 56 -61 -58 -23 209 39 126 -44 -134 -47 -110 -369 50 -180 54 -59 -57 23 39 77 -96 102
5689 102 18 -243 -83 -126 -246 -194 115 -61 178 103 -253 -49 -168 190 3 -204 105 -122 259 114 -30
5710 -30 142 -137 -127 -252 -34 -242 80 62 15 -60 -73 -23 -189 -172 -154 140 -47 28 141 61 256 -137 -218 245
5734B45l32J14j17K56k03J16k22J31K22k36J86k17l4J86k9L9N6j68j58j10J84
5755i1J73m03L10p4J19Oo9P8l1j49j38L58J31jr9J4J09j53j42J12R7q6k9p6P2
5780C8qo8N3p3k3Q7n2l7J86j31K74m16L23k66K35q2k8j03m2P9R9J4p9O6j83p1
5806b08K25j23n4K42o8K1r3J51j97M9m8J6N2kJ13J3j19Q2m48M20l96M14R7j36
5830Cl7O6j2K87l74K07k25J61K29j54k14J27j03J03J50k35j69M15j61k01p3j51
5852c61Q05o47J92Po2L38k64K54q6j22K24Ql01L57p3m55K31k76K41No7r2J74j45
5876a15l3J18j37J94j25k2R2J04l23K28j26J74J10k13L13k71M0j81q0L62j9N6
5898A46j87p8M33l68j97J57J14j40L56m2J82j14l98l9j6K99L6k83R5K79m61K11
$$ plain form
5734 245 -87 27 -90 166 -37 79 -143 -12 210 -26 160 -57 -91 95 66 105 161 -7 -165 -275 -91
5755 -91 82 -321 -11 -85 34 40 -29 49 18 -131 -269 89 220 219 120 134 243 90 -52 60 157 71 42 -34 38
5780 38 30 -38 15 -58 -81 6 -46 -83 103 -28 246 -170 153 -113 122 40 12 -91 -133 -54 45 59 -20 46 -137 -208
5806 -208 17 -106 -160 82 14 35 -58 93 -104 -55 -103 -87 -35 -37 76 89 -30 52 -396 24 -372 42 139 3
5830 3 -34 32 20 307 -67 140 -85 76 305 151 -63 64 -39 64 214 -21 -190 225 64 -137 -210 -361
5852 -361 444 -203 -11 -4 -66 272 8 262 176 54 278 286 -15 342 269 -186 45 -231 10 15 -52 -144 30 -115
5876 -115 -148 -30 -167 27 -98 -120 -28 76 -247 -19 -145 29 139 -74 239 -32 8 -173 -253 109 90 146
5898 146 -41 -119 314 -54 -251 -94 20 -120 236 194 376 262 -136 -175 -191 108 144 -139 -44 235 -226 -15
5920a5J7j09K06j56J73k95q3K95RK58k24N5P1k72n9J43m3L81m36K01l71L82j19
5943IrK47K9l26J16k45M08j1m4M4j58l21K8L54o8k35j36M96m62M92l28K1r8O14
5967D17n69J18J53R0j87oj56N8J77j94J74qm4L1k37R5N0q2K4j30J95K56l37O6
5991d6K19j00k82K80j84M3l0J17L98n14L27m12L48l09P0K97k10k9O0j25J12p7
6013d7k32M10J20j96j20r4%K46O0n84K44Q6K45r8l8J87rk14n4j03L68o2j33L65
6037C47k84J58k28j02Q1j32K07J07j92J03l03k1j93N00k09J65k85J11J06o3L25
6058A98k68O0ON0j36J40j14m9j27K14k87L32j05Q1n1m1K52J46l68J85j39j90J46
6081f5J11j29J28j40K82k20j29J92J65P0k58j8Q9m0j3n9M0M0pm3l0J7J96j27r0
$$ plain form
5920 -15 2 -107 99 -57 116 -179 -262 33 42 300 76 131 202 -70 -129 14 -29 352 -84 117 -254 128 9
5943 9 0 247 276 -50 66 -179 229 218 174 218 60 -261 -233 121 53 -182 -318 178 -284 208 -120 -99 -197 417
5967 417 -152 -34 119 209 22 16 -140 -82 95 -99 75 67 23 54 -183 -88 -38 -120 -96 -226 -31 225 -112 -46
5991 -46 173 73 -209 71 -113 -70 -100 17 415 -99 228 -184 164 -145 -75 222 12 -17 43 -82 30 -47
6013 -47 -279 131 251 55 -65 -159 -159 87 147 -437 -193 -107 138 40 2 189 180 -34 -88 -191 177 115 -18 347
6037 347 63 221 -7 -109 -28 -160 47 154 -38 65 -238 -259 -452 48 -161 4 -281 -170 -64 -127 198
6058 198 -70 -10 -4 46 -90 50 -64 -113 -240 -26 -313 19 -86 -5 -56 -97 155 301 -67 118 -21 -211 -65
6081 -65 46 -83 45 -95 187 -33 -162 30 195 265 7 -11 78 38 25 -34 6 46 39 -4 -34 -17 179 52 -38
6106c8K84k79m9k9K03k92K62q4j8j5J8k5k02J33L32l14m8O1j45J80J16p6L06l24
6130d3R0j17K25k99K13P1J86k04j54j33L34m1l8l49J85N3m3K44k0k18J10%j08
6153e6L37j11k83j10L34k85K33k48K14n0J56k7j74l68L86K06o4J5k05K09k66J75
6175A8j40K92j48J79l22K25j0l72L63j88J88k82M86n66L61k2j13J60K4o2l16K15
6197c0N2l4k8r5r4L63l04M1P8O2J00l41K50N0k92J42j8J91m14L13n1K7k33Q5K04
6222B4qK01j77L7j89J81oj09J57n3r0p3J01o0L08k65M8j67K02l8rj67K00Q3kj55
6248b6J7j6j05M7L62k49m5r9L65m92K58J66l05J94K09l9l7l05L09o3j27o0J68
6271A27l38L08q0j96p5M43j42n3J24l52L88j62L60k05j66J64k54L32m78K97J58
$$ plain form
6106 -38 246 -33 -82 -111 92 -200 62 -22 -40 -55 -37 -62 -264 -131 201 -113 -161 -100 -245 -65 51 -25 281 -43
6130 -43 47 -70 155 -144 69 140 326 122 -32 -165 169 128 90 -259 -74 -21 -64 180 160 -58 52 52 -56
6153 -56 281 170 -113 -223 111 -174 59 -189 25 -25 131 104 -70 -438 -52 154 90 105 -100 109 -157 18
6175 18 -122 170 22 201 -121 104 94 -278 85 -103 85 -197 289 -277 84 62 -51 109 133 71 -245 -30
6197 -30 22 -12 -40 -135 -229 134 -170 -129 -51 11 111 -230 20 70 -222 -80 -98 93 -321 -8 -59 -32 -265 -180 24
6222 24 16 217 40 77 -112 69 63 -46 111 58 -32 -105 -4 -64 244 -21 27 -140 62 24 15 -152 48 131 129 -26
6248 -26 -9 -25 -130 -83 279 30 -15 -114 251 -241 17 183 -122 72 281 242 205 -100 209 146 19 -41 127
6271 127 -211 97 17 -179 -254 189 47 -6 118 -234 154 -8 352 147 -19 145 -109 223 -255 42 200
6292B00m16K0L1L52k10L4j58J73l2K90l54l25L89J49m73N05n9j08J78j69n1j47
6314a81K65j57K29j53q9oj02L36l28L94k84Mn3Q9L2ml1J27N19o88J23M4p5o7k23
6339b79L51k40Mj75K96J61k85K42K9j46J88k33NQ1J38j71J5J9J58l10M5j81K10
6362g8L4K09j65J96m55M43k62L4PJ5Q4J82N7j24k51m8L80m13M61l01r6J53k86
6385b24J80o5o3L08J30l84J58J12l10K91k24J78j7l30K38j3J7j67L34m29K76j34
6407a38L63k52n1j42K80j0o8J53l39J87K46k94%J14k5J79j51j90K67k19J53J31
6429A94k75j62K11J53j84J84J1j10n2K65k7m47J17J13J09J14k17M09l24q7l79
6450c84K70K78k50j36J07p7J05j0K70k84l5J97l5k26K49l64K08K61k12K45k81
$$ plain form
6292 200 -216 -196 -165 187 -23 11 -147 26 -6 284 -70 -395 -6 143 -330 175 116 8 186 17 -34 -181
6314 -181 84 -73 156 3 -86 -92 -194 142 -186 208 -76 -72 -125 -36 -4 -8 -39 88 607 -81 42 86 11 -56 -279
6339 -279 72 -168 -164 -339 -43 118 -167 75 104 -42 146 -87 -82 -1 137 -34 -19 0 158 -152 -107 -288 -78
6362 -78 -44 165 0 196 -259 184 -78 -44 -37 -22 62 244 301 177 -74 -122 258 -155 306 5 -91 62 -224
6385 -224 -44 -109 -172 136 266 -118 40 152 -158 133 -91 87 70 -260 -22 -35 -18 -185 149 -280 -4 -138
6407 -138 225 -27 -78 -220 60 50 -18 135 -204 -17 229 -65 -65 49 24 203 52 -138 129 -90 63 194
6429 194 -81 -243 -32 121 -63 121 132 22 -30 235 208 -239 -122 -9 100 214 -3 406 82 -5 -384
6450 -384 -114 164 -86 -222 -115 -192 -87 -97 173 -111 -146 51 16 -210 39 -325 -117 144 -68 177 -104
6471a04O8LM6j0J54j83p2K22m2l31M88k18j29P3j6K47k03J20k08M5j38K62j3k01
6495a40J56k29J37q1KP5O1m8J99l68J04J52J95m53J69L0p3L49J09m22J09K65m10
6518a12K8J03n9L5J35j69M2j70L69k68N97n26J77k72K61k43J51j3p9N4j19j09
6540a87J81K48n2k28j73K29j58m8K46j05J38j40L17o7l21J71O3pj42j9j43J37
6562f0J00j79J87m9M3J88k72J58M6l65K85J33l64k7L38j33K57m7j01l86N1L33
6584A36Q5K1r2q6j35J13J56m15L14k8L6l6j55J58j53L3j32K88k95K22lj17K10
6607A25r7j04L63k79J69k93K7L59j47o4J16k8l40J84J03k37N9L36l66K74j92J45
6629A13l19J21k7L41k50r4L0r7K62J05lk43J08j68j08M31m3k32j7J50Qj86J30
$$ plain form
6471 -104 -36 -33 13 3 157 -26 -98 124 82 -249 239 21 -108 -35 -51 196 -7 113 -95 -50 -188 74 61 -140
6495 -140 16 -213 -76 -157 -155 -80 -19 -67 132 -236 -132 20 215 -238 -69 -39 -112 237 346 -76 33 298 -112
6518 -112 -84 19 -40 -5 130 -39 3 -167 202 -66 531 5 182 -90 171 -72 79 66 -13 41 -78 -187
6540 -187 -6 242 190 -38 -211 18 -140 -188 58 -47 91 -49 268 201 -120 51 114 107 -35 -54 -197 -60
6562 -60 40 -139 48 -1 42 230 -42 116 162 -203 82 215 -149 -176 162 29 286 239 138 -248 -197 136
6584 136 221 242 150 64 -71 42 198 -217 97 69 105 69 -86 72 -81 -48 -180 108 -187 35 32 -85 125
6607 125 28 -76 287 8 177 -116 -89 270 123 59 175 147 -193 -9 94 -143 -84 252 -114 160 -32 113
6629 113 -206 -85 -112 229 -21 -115 -85 -182 80 185 182 -61 47 -121 -229 202 159 -73 -90 60 68 -118 12
6652A2J6q8k12K20NK32l61Q2K41k17J41J06j29o5l2j89K15j99K36L3J1k01L5L1
6676g7K23j23K20l62N0k43K75K20k91K02J4p1O0J76k61J01j50J20l8j6J08k99
6698a62J54j85J72n0K12Nj50j21L23l0r6K85m16J09j73K52r5k46M41m50L10k40
6720a51L4J70nJ40j53j55K83k78J64Q8r7J51qJ41j46q5m57J70J8K02J90r9k88
6743a71J63O5P6j5J19l28P9J66l57Q3j22P4K65N0n4j5j67P5k33J51l2J17J03j08
6767a6p7J64k39k4J66J53J6q1j24k2m1J87k00K65o8l78M02j53o2K64Q9j0k99J78
6791I0O6j25j43M7J75n4j7lr2l8K53m5k30K17j40J20k4K7j79J48j25Q4N4k51K78
6816I3q9k95L72k05P0r0L45l87K26N0J54q4j10k61L61n9j29K24j16n7j00K47k50
$$ plain form
6652 12 28 -60 -272 -52 -47 185 -176 -94 147 -70 71 177 48 -17 -49 -238 -23 -222 14 47 58 -143 -108 -77
6676 -77 146 23 243 -119 -69 -312 -37 183 -108 94 108 37 97 273 12 113 -37 83 45 29 137 -162
6698 -162 -8 -193 -21 -71 141 146 -4 -125 198 168 72 357 -59 50 -123 129 34 -212 229 -221 89 -151
6720 -151 -117 53 48 188 35 -120 163 -115 49 137 40 191 183 324 178 93 -364 -194 -176 26 216 117 -171
6743 -171 -8 57 133 118 237 -91 -12 154 -203 -120 -242 -168 97 147 93 78 -89 -14 -247 -96 -128 -11 92 -16
6767 -16 -93 71 -168 -192 -26 127 143 62 -62 -84 -125 62 -138 127 59 -319 83 -70 -132 132 221 211 -88 90
6791 90 156 31 -112 -65 110 56 39 36 -56 -94 159 114 -116 101 -39 81 57 84 -95 53 -72 12 66 -185 93
6816 93 4 -291 81 -124 -54 -144 201 -186 40 90 244 160 50 -211 150 91 -38 186 70 13 -87 160 -90
6839i0K5K93J4l94L56j69J74l0q2l01K28j55J12P0k13J7K92k61J26oNK62l36J13
6863E0j50J00j1J50J61j88k06j6Q5K64j3j45J35m13P8Q3j30K63k84l5L15K11k92
6886A2j48J64J15l67L42K45l61kj5N9P0l16J82j11M02M7m45q0J71P8J05J63m30
6909a20r5L83k50L04k01r0Q7k7k30L17J23k32j04mJ89k4J28l35N4J74P5O7j07
6932H2K5j49n9J67q3P7O2j39R5r6j43R0Q9j45J62O7j1j72J4R0N8j32l4R0J31R8
6958B34j76j11J89k28j94L37l57N17k45p1r9K21l1k64J93J45N6j23j8j32J63r5
6980h9J27j42K16o7J39k44J8j6j95J58r1O5K24n5j48J14j04J35p9L53k60j15J16
7003F0L0j91K06j49j04r1L02j55K65j28J6l25J13L43J19l08k54L18j79K88l20
$$ plain form
6839 -90 -65 228 242 -152 204 35 209 179 97 -204 24 -131 -19 51 -162 -145 147 -114 12 6 11 273 -63 50
6863 50 -100 0 -11 139 300 112 -94 -110 -25 239 226 81 216 -197 -119 -36 -166 97 -187 -222 93 304 12
6886 12 -136 28 143 -224 118 363 2 0 -15 44 114 -202 -20 -131 271 318 -127 -207 -36 42 147 310 -120
6909 -120 -215 168 -82 222 21 -69 18 -9 -239 78 201 -31 -135 -139 50 26 154 -181 -127 47 122 189 82
6932 82 107 -42 -101 66 -17 60 122 -17 78 -18 -161 -71 18 -127 35 102 91 -81 -67 23 81 -51 -85 5 136 234
6958 234 58 -53 136 -92 -286 51 -306 211 -34 -105 -204 17 -14 -278 -85 60 116 -7 -25 -157 6 -89
6980 -89 38 -104 112 45 184 -60 -42 -58 -253 -95 -186 -121 103 48 -100 14 -90 45 -34 319 59 -56 60
7003 60 90 -101 105 -44 -148 -239 63 -92 173 45 61 -264 -151 192 311 3 -251 67 -112 176 -144
7024a44K19n6j69K87m6j16j80L92j19k32L54k42J57j4k22J82j53P3j35L69k60
7045e5%K15J1K06n13K15k76M8J78m4j37J09K57k48k55K95K19m02L50j75J9N7j40
7068f6L21k64J15p7j22L87j56l32L1O8L13m63J23P3J07l30R6M25l41QJ09Ml18
7091b89K18K05k01J51m4l83M45j48p9RN4J92j9l14N51m29j73N14l41Rk5L4n2K35
7115A20j32n7K15p6l0l06L90r1p1L18j4m63J18p2j36J27K03k80K66K77k98J36
7137A44j19Q5p5k45K57Q9J8j39p7K51k74M14k38k60o8J76r8K93o0oJ5O7k75N65
7161D40l72J54j71k06l2J00KJ39j72J06k31N0L10k9lj22k7K17j43J11L06l07L8
7184A58j34k40L70m85J41J65r2L2P9K01j69R4o5K16j64L5k14KL26k52j84J04j66
$$ plain form
7024 -144 75 19 -150 137 91 -25 -205 187 68 -164 190 -52 105 91 -131 51 -102 -29 -164 205 -55
7045 -55 -55 160 171 377 -136 79 -197 -149 29 -15 -152 -43 214 -34 -289 6 225 -177 173 -2 17 74 -66
7068 -66 255 -9 106 29 -93 294 138 -194 -163 -95 218 -245 -122 -49 58 -272 -176 249 -92 -84 25 29 -289
7091 -289 -71 134 -67 84 40 -343 102 -46 -125 -116 -62 130 111 -203 348 -81 -254 260 -81 -72 -97 -63 -115 120
7115 120 -12 -69 146 70 40 -266 124 33 -38 280 266 -197 -79 -151 -287 -160 43 -237 29 306 8 144
7137 144 25 110 35 -210 47 136 154 15 -62 189 -85 329 91 -169 -237 -61 -159 134 74 68 83 150 -125 440
7161 440 68 222 51 -155 -187 -87 -85 54 -118 -12 -243 -193 117 88 85 -37 -64 153 10 121 427 120 158
7184 158 24 -216 154 -331 -190 -25 -117 -85 -6 195 26 120 55 271 107 142 -72 -70 256 4 -180 -76 -242
7207b42K75J82l58L59o2o4P3l62J52j04m7Q9j8J41k9L85l92p7P8K62j54k8j43
7230h4K3J5J65k89J65m6J38j4J7j64p4J66J95J31j05m01K30q5j12JK76l83P0L52
7254A87m08L43j31M33n03K6M7j73L12j12j01J01J4l74M17K3k42K19J82j11k8k34
7276a13O6L3Oj21j02J16J37n5o7J34j80K83l37K23J00o4J97j26l1k63J14L64m68
7299a54L99k57l8K02k65j31P3LK10P0l78L48j52J59l18M72l07l8J98k4J71k36
7321Go6K4n8L18J4l57J94L3m8k39J79J4j41j87J28L02j6l99N58k31j07j29M46
7344B39l76J3n1J49j2m8L17j59n3j08J28K3j45K9k8K66j09J65j57l45L85j65J70
7367A28k98K98J19q5j7k13J9j46o2J68L8J05r2J50n05O24k05k68K15M3Jj26J38
$$ plain form
7207 -242 33 215 -143 216 154 90 163 -199 -47 -151 -198 -109 -127 14 -15 370 -22 -99 -21 241 87 59 -84
7230 -84 -61 -46 119 -170 -5 -51 87 73 90 -74 -148 18 213 344 239 -162 68 -17 -129 -128 148 -235 -165 187
7254 187 -221 122 -9 424 -79 -53 -6 -179 133 21 -80 21 35 -339 78 101 -141 78 260 149 121 -113
7276 -113 -47 -14 -8 -129 -231 -115 22 -33 -100 34 -146 137 -200 23 123 59 256 130 99 -164 -50 314 -154
7299 -154 245 -12 -50 152 -113 -244 -171 -168 42 112 -266 82 -70 89 -229 243 -64 -102 96 72 243 7
7321 7 -59 -35 -93 225 239 -118 76 109 61 -178 1 15 -126 -313 -185 117 101 -298 260 29 -78 -207 239
7344 239 -137 -124 -175 -26 -38 -86 231 72 19 -89 39 62 -83 -54 -82 184 75 240 83 -262 123 -42 128
7367 128 -170 128 247 162 145 -68 -49 -195 -257 -89 -51 54 -38 112 -393 231 26 -242 -27 16 17 -109 29
7390B9k11R5K20k47N2O1J27o0j14r2n6K98j37j90M38j85Q5l4lk43J57j60lL33
7414A60m42M32k54K48j85l5r0j60Q5J39n8J07j00J14L86k49PL4M7l41K88k54K77
7437A56k54J92m76Q9L82j75J72J18K7o0Rk62J84K21m24j26Q8J20J74l56K80j32
7459e3M3j05k8j64K67J62l9o6j03PJ59j4k2r6N6q8L4K62k86J21n4k36K06k61L47
7484D9N1j31K88j19p1j11L20m66K60l0J17k22j75K68n3N7p1J52l35J43J04J76
7506B01k01l8K5k21N7m5L61J36m88L75j4J04k36O2n2L1j94%J39k32L35m03J99
7529i9Mj08J31L10k06K27m26K76j31J97k27K0K70l91K06j73P6R5P8k99K65j84
7551h9J91j09k68J77J57M0j05l69K87K95l61l2L39k53n0K81j21q7K97m36J59j57
$$ plain form
7390 29 -182 -87 133 -114 -62 -1 126 66 -48 -140 -196 102 -35 -225 213 28 113 79 76 -167 -10 -170 -173 160
7414 160 -282 150 -104 144 -41 -76 -166 -326 -241 -102 -160 -53 -153 -39 347 98 105 139 186 -155 133 -121 156
7437 156 -98 94 -382 -293 89 -86 86 204 231 171 180 -82 102 323 -101 -227 -139 -19 155 -201 79 -53
7459 -53 -10 -115 -143 -307 -40 122 83 17 -86 -79 80 66 44 -52 4 -84 -50 212 -74 47 -7 -243 -37 -298 49
7484 49 100 -31 257 138 67 -44 276 -190 70 40 157 -65 -240 28 -25 32 -39 113 -222 -79 25 201
7506 201 0 -38 -13 -234 -177 -222 139 275 -213 162 148 252 16 78 26 57 -137 -137 2 -230 105 -298 -99
7529 -99 -95 -203 -72 238 32 259 -167 109 -22 175 -52 -32 238 -153 53 -120 -44 51 129 -170 95 -89
7551 -89 102 -7 -275 -98 59 99 -6 -375 -88 207 -154 -186 153 -100 -150 131 10 -77 220 -216 -57 -214
7573b14J70J00j07J31n4R4m64M24L9l15K62j95Q4J72p6J8j56n3O9L7NK09k66j42
7597b28L34l39K6M10k97P4J55k04K3R1kp3K6L24l38Q8%q7n5O8N5J4j01J7j60K33
7623E4K8oj38K05j75Q8p9J4K2j14J31K07k37j90P7K23P0j58r9J24k58L50J52l54
7647f3J86k48j9R0L07k44M9l0k55O4J76p1M17l68K94k76P5j93L45l90Q7J73O1
7670A67J1N6k01k54K76J73N8k76j03J91j12LM3o4q7J99K63o47L90PN8j16N4j76
7694h7K22k69p2J69J80L8l08j21J87pK16l43J65K00nO2j69j25l5j23M95m04M8
7717h6J59j68J27m9K03J21l46J06P0k31j37k4L81Lj65M6N7K3j08J43l32K53M3
7740H9k52J64M5j95K28k79K8K2L15l83J86j27K60j27K09r4J3j3R8j31R2j43J61
$$ plain form
7573 -214 -44 56 -51 80 26 120 -344 80 119 -196 66 -129 -45 127 51 69 -87 -140 -71 -34 -29 180 -86 -228
7597 -228 106 -233 -207 203 -94 -20 135 -69 -46 45 43 -30 -4 320 -18 70 70 -17 -72 -4 51 65 -36 -19 -179 54
7623 54 82 76 -62 143 -32 56 -23 -9 13 -101 30 237 0 -190 -113 110 180 22 -77 47 -211 139 291 -63
7647 -63 123 -125 -144 -54 253 9 58 28 -227 -163 13 -58 359 -9 285 9 84 -109 236 -154 -67 106 167
7670 167 178 234 33 -221 55 228 286 10 -93 98 -14 -11 32 -32 -119 80 343 -304 86 93 151 35 89 -87
7694 -87 135 -134 -206 -37 143 181 -127 -248 -61 -68 148 -195 -30 170 165 227 58 -67 -102 -225 270 -134 -86
7717 -86 73 -95 32 -17 186 307 -39 67 137 -94 -231 -255 126 129 -36 10 67 90 -18 125 -207 46 89
7740 89 -163 1 46 -149 79 -200 -172 -150 165 -218 -32 -159 101 -26 183 89 102 89 187 56 148 5 166
7763A66j18m2J61Kn7q8J76k80P5N0k2j40J60N8j24r7J36P0j20k3M47n29K50O7
7787A78l03R2P3k56L75k49R9p5K39l94L04q1N7k72J16L85l54K91j96p2k50N32
7809B39k09p3Q2R7j62PJ41N9l53o6K14kj38J23P3m5J09R6j71m58K91J87K3j98
7833a34K51j69K14k17K5J44k49J37o3M2k21L67k25K68r6q4o2M3j18J51M8L05k48
7856A09J17q8o6ll36M58n42L76l8J5QJ41q1k05N8N7Q7k51K10J07j11j3m7J79q4
7881E7l15J87Q4r0J23r3Q6j17P5j14J77k62J04R0o8Q9J82j11k94J99k36M80k66
7904c3L31l50j27K40J46m00J66O1q3J32k8m6R8k08J48P3L8j76o5j60K35j35P4
7927f9J73j42J19j14K99j00R3l96L4K46r1j0J83j10j25m9k09M36j32N3P9l3r0
$$ plain form
7763 166 48 6 167 169 112 24 200 -80 -5 45 23 -117 43 101 -23 -120 16 86 -34 -57 390 -139 111 178
7787 178 -125 -33 40 -216 159 -90 9 -66 173 -221 83 2 59 -213 -97 288 -66 225 29 -43 -293 239
7809 239 30 -43 39 136 -26 -19 122 181 -172 -238 -24 -26 -164 -41 32 -13 96 192 21 -437 -146 41 64 -134
7833 -134 117 -52 162 -55 -30 114 -135 2 -61 -19 -240 127 -98 170 74 -10 -72 -29 -147 4 52 357 109
7856 109 226 138 72 69 -267 191 -351 25 -13 2 10 151 70 -135 -77 -20 67 -184 26 133 22 9 -38 141 57
7881 57 -258 -71 13 -77 46 -47 39 -78 -3 -117 60 -202 -98 -8 -76 13 195 84 -210 -11 -247 233 -33
7904 -33 298 -52 -179 61 207 -193 -27 34 -49 83 55 9 107 -101 47 120 158 -18 -83 -243 -8 -143 -69
7927 -69 104 -38 81 -33 266 166 259 -137 -103 143 52 42 225 115 -10 -59 -268 168 36 89 168 135 45
7950D5P3j05J6J90k25j29L20l8k80Q7q9J40L1J87j34j17O8PP5l21J98J06R1m86
7974b90L33K4l8Ll70L82l9J50j57k70L14M8j80K12k90J80J66k26m1K99q7j20k34
7997b31P8m9K5J18JJ72k55M22m47P5K4K35q8L3j39o4m9m6M19n76L84K54k34o7
8021ep3j29L83k6o2k78L50M9l29K15k71L45j86n6J65k82K53j00K25m32M36q6k10
8044a04o7K03k10J3j47M02KJ80m38M2J78q3K88r4l04P4n9J40j11k68N26l94J41
8067i0LL7J29Lk56J45k4l7m3M73k42l97L39o7K53l31R8j69M25k69q5Q5K93l40
8091f7L9J90j28l92M38r6j14JK72k18qj2K51j00N5j33j19m5o8J88K0K45o5j73
8115c9K7K38k28j55pK19o0J15Q0l50J83J55p1Q1k04m9J38k46q6J04L77j57j62
$$ plain form
7950 45 118 13 29 219 -6 -135 185 147 -133 -46 -135 5 36 223 89 -28 40 47 122 -199 -1 105 196 -290
7974 -290 43 67 29 32 -338 44 5 155 -2 -272 42 90 -90 122 -168 12 178 -48 -89 210 123 3 -231
7997 -231 -153 -202 -177 -59 -58 114 -141 281 -166 -91 -67 168 80 113 -26 -90 -139 -185 234 -342 42 296 62 -5
8021 -5 -78 -207 176 150 88 -190 160 209 -120 95 -176 169 -17 -73 92 -190 63 -37 188 -244 192 106 -104
8044 -104 -171 32 -178 -165 -312 90 92 272 -166 -124 54 -29 259 165 -139 -65 -124 16 -95 -363 163 -231 -90
8067 -90 -87 -50 79 82 -174 -29 -53 -90 -133 340 98 -299 40 -27 226 -105 -7 -176 249 -20 -105 -20 273 -67
8091 -67 -28 162 34 -358 80 -16 -130 -129 143 -75 -83 -95 156 56 111 -22 -141 -186 -254 -66 -46 199 134 -39
8115 -39 -12 226 -2 -157 -164 55 -5 110 190 -160 23 178 107 188 -16 -65 73 -173 -259 -155 222 65 -97
8138i7M7k6P3L17r6qj72j40K44j10K45k41k01K71j92K40k27P4P0l31J34N4J82
8161A10Q5O9l71L1J0J70n1j40N0M2LO6Kr4j68L8K53j20Mq5L1j0J37K2M1k33j81
8188b89K35J1J06
$$ plain form
8138 -97 -50 -76 -3 314 218 210 38 -102 142 32 277 36 -165 106 -86 154 -73 1 71 -260 -126 -72 110
8161 110 195 264 -107 -76 -66 104 53 -87 -37 5 8 74 76 -18 -186 -148 105 -15 -11 -96 -65 -75 62 84 125 -108 -289
8188 -289 -54 -43 63
8191F3
$$ Imaginary data points
##PAGE= N=2
##DATA TABLE= (X++(I..I)), XYDATA
0@%%%%%%%qJ6j6J6k4L2m0M8n6P2q8J05j29J60j92K27k68L15l70M33n03N80o65
30c55P62q71R91j126J274j435J614j810K025k262K522k805L114l451L819m221
46b215M661n142N668o246O879p577Q352r211J0170j1249J2470j3868J5483j7370
60i195J9617k2346K5740l0094L5913m4138N6719p8577J27104m26054K14639P69751
72F39079n92502l77658K26195J92688j24149J21050k7848k26766L1588L25084
82A86761j7906k20601q9476P1028J25422R5393j94027j64631K23257K10113k38085
93a2752j89643J66339J07485q8581P0082M9272k12862m6979K96852M8321k75353
104h7819m1198J99565J2166r4126K4177j2041r9022O9416J59054p2163j83186
$$ plain form
0 0 0 0 0 0 0 0 0 -8 8 -8 8 -16 16 -24 24 -32 40 -48 57 -72 88 -104 123 -145 170 -200 233 -270 310 -355
30 -355 407 -464 527 -599 675 -760 854 -956 1069 -1193 1329 -1476 1638 -1813 2006 -2215
46 -2215 2446 -2696 2972 -3274 3605 -3972 4380 -4831 5339 -5910 6560 -7308 8175 -9195
60 -9195 10422 -11924 13816 -16278 19635 -24503 32216 -46361 80743 -345311 -130672 639079
72 639079 46577 -331081 -104886 87802 -36347 84703 56855 -169911 -138323 186761
82 186761 168855 -51746 -141222 -70194 55228 150621 -43406 -208037 15220 225333 -12752
93 -12752 -202395 -36056 71429 -17152 52930 102202 -110660 -157639 139213 187534 -87819
104 -87819 -129017 70548 82714 -11412 12765 724 -98298 -28882 130172 58009 -125177
115a25177K5308J44419J8125r9629l8994R7338P7086r5714j06459P6551R9925
126G2779n5192m2875P7325k2978j27028O8944J58240j12898j90069J14239K01651
137A42138o8632j65798K0859Q5575j7892p918N6039j2500n9125K4797N3821k9879
149B1485n7298J8555O4955R560n7411l3148L2589L2417l2716l7972L8520L9559
161C9095m4568k2727N3248q77n9702K3825O7597k4726n2717K9531K7502l9187
173c706j266M0666k9846m0943M5063L1969n7993l9411M5017M2487k4186l5594
185b7743J0660K4421m007j5683N845K1212L012j1878j1n674j5063J7124K6849
198B9064k5029l1295K1178K4879k0354k7084R083K1641K800p537m722M828J2214
$$ plain form
115 -125177 -99869 44550 62675 -36954 -75948 21390 98476 2762 -103697 -27146 72779
126 72779 17587 -25288 52037 29059 -97969 -29025 129215 16317 -173752 -59513 142138
137 142138 73506 -92292 -71433 14142 -3750 -11668 44371 31871 -27254 -2457 51364 21485
149 21485 -35813 -17258 47697 57257 -154 -33302 -713 31704 -1012 -38984 -464 39095
161 39095 -5473 -28200 25048 24171 -35531 -11706 55891 31165 -21552 7979 35481 -3706
173 -3706 -4972 35694 5848 -35095 9968 41937 -16056 -55467 -10450 32037 7851 -27743
185 -27743 -17083 7338 3331 -12352 -6507 14705 17717 5839 5828 154 -14909 2215 29064
198 29064 4035 -27260 -6082 18797 -1557 -28641 -19558 2083 4883 -2654 -7376 -2548 9666
211I666l811j3067J1249J4081j0610K116J4177j8449k4093J9488K2072k2618j7951
224a7750K2362M924k8112K633K1902r951o412J7965j783j7503Q633J9533m209
237A2232j3549K428L838k382N559k397j6141K7Q678m914k65L610j0515n782J4518
252e055R138j2780p172J6608J0324j0065m230L128P98Q926M448j3198r848M663
266d315R706L9j4128o473J0369P575n330j0821J305J6203L871j0383j591O830
280B857N730L673l885n042mJ430M364k296j0332m15N213l431n895l70N344K158
296i01p068M59P790j766o0O642O09l011j579K517M766k302n662j13j289k094M55
313b607k115m82j196k909L687K257m771L343P367k40m298M56Q674L694o835l47
$$ plain form
211 9666 5855 -7212 4037 18118 7508 9624 23801 5352 -18741 747 22819 201 -17750
224 -17750 4612 9536 -18576 -15943 5959 -3992 -10404 7561 5778 -11725 -3092 16441 12232
237 12232 -1317 1111 4949 2567 8126 5729 -10412 -10385 -1707 -6621 -6886 -3276 -13791 -19573 -5055
252 -5055 4083 -8697 -15869 739 11063 998 -3232 -104 694 9620 14068 870 -8978 -4315
266 -4315 5391 5430 -8698 -15171 -4802 2773 -2557 -13378 -12073 4130 8001 -2382 -3973 2857
280 2857 8587 12260 8375 3333 3329 4759 9123 6827 -3505 -3920 1293 -2138 -8033 -8403 -3059 -901
296 -901 -7969 -7510 280 -1486 -1546 5096 5705 2694 1115 3632 8398 6096 434 321 -968 -3062 -2607
313 -2607 -4722 -5204 -6400 -9309 -5622 -3365 -8136 -4793 2574 2334 -1964 -1508 7166 10860 4025 3678
329C678M072m103j865L300k567m015k039Q67R79m454J93N936r66k715J126K824
345B51N387M36l289L823J871m763J017L824k030m913k817J608j607m476L483O89
361a506p763J423O499o56k475J065N103L522l355j616L759K139J190k067n709
376d47n7K376o78r41m525m589K604M051l68l742p40O430J377m295M196N179k825
393C006K411N201o338o423N585O793n501p220K337j859l943O381l94j1684K590
408i058J2149j396m332K598j303j497R992M156j1900p16J6256m373j7868M786
422b506R501j0625l96J0261j0903j2451J4015Q833j7384l275J9394J634j1105
435e007N800J844r800J2971J4151j8831j2807J8563N915j5651j433N789q489R09
$$ plain form
329 3678 7750 3647 1782 5082 2515 -1500 -3539 -2672 -1693 -6147 -5954 -18 -984 -3699 -2573 251
345 251 5638 6074 2785 6608 8479 3716 4733 8557 6527 1614 -1203 405 -1202 -5678 -2195 -1506
361 -1506 -9269 -7846 -1347 -2003 -4478 -3413 1690 5212 1857 241 4000 6139 7329 5262 -447
376 -447 -504 1872 1194 253 -4272 -8861 -6257 -2206 -2574 -6316 -7056 -626 751 -3544 652 5831 3006
393 3006 5417 10618 4280 -2143 3442 10235 4734 -2486 -149 -2008 -5951 430 36 -11648 -9058
408 -9058 3091 1695 -2637 -39 -1342 -2839 7153 11309 -591 -1307 14949 10576 -7292 -2506
422 -2506 6995 -3630 -4026 6235 -4668 -17119 -3104 5729 -11655 -14930 4464 6098 -5007
435 -5007 793 2637 -7163 5808 19959 1128 -11679 6884 12799 -2852 -4285 1504 -6985 -6076
449f076J5471j0430k2173J2775J9218p609m654M804m530K448J2640o218j4182
462h516R286J7387n023j2092j209n615m861J2732O229j0882l474L653j481j290
476e156k741k449J0110J3544m502j2803K436Q647n610l426Q222P1m895M868L0
491F346j1753p371N74Q005J0258r55j1631o467O519O343j982M003P648o943o911
506d317R208N584n387n696j379M444N466l741r195n153K624M504L186P223m593
521B778j8926J138J9149L454n820N327K772q128l594M423J214j803K431j360m020
536i65Q867N03k3357r628J8074J1524j327M983j710k0747r270K3510J7701j4887
550C271n724J4646k887j1820N353Oj3253N389J8450r238j6621J5305N614l1596
$$ plain form
449 -6076 9395 -1035 -23208 -10433 8785 1176 -3478 1326 -3204 -756 11884 5666 -8516
462 -8516 770 18157 13134 1042 -167 -5782 -10643 2089 8318 -2564 -6038 -2385 -3866 -5156
476 -5156 -7897 -10346 -236 13308 8806 -3997 -1561 7086 1476 -1950 6272 6343 1448 6316 6346
491 6346 -5407 -12778 -12204 -4199 6059 5104 -6527 -12994 -6475 -132 -2114 1889 9537 2594 -4317
506 -4317 4891 10475 5088 -608 -1987 2457 7923 4182 -5013 -10166 -7542 -3038 148 7371 2778
521 2778 -16148 -15010 4139 7593 1773 7100 9872 1744 -1850 2573 3787 1984 4415 3055 -965
536 -965 7902 8405 -14952 -24580 -6506 5018 3691 8674 6964 -13783 -23053 457 18158 3271
550 3271 -2453 12193 9306 -2514 2839 2845 -10408 -5019 13431 4193 -12428 2877 8491 -23105
564b3105o30L2892k204j1040J9450r754l8060K1162M9300j9793l8668K0733J5231
577A5514k2412J1533J6201l8139r126M7925l778m0667J4544J7419k9836M881M3377
590B7436j5812l4389K6918J2136l8622J3241M5831k2476l1774K4629M643k6839
602a5078J3134J6862k9523m616M0133n372l7281R433J3919k0213J3388L1450k0097
615F139k0806K4882L30l0112J4083L1071j7738j7205K0750n520k4917J7255J5504
628A3716k8142k972L0668o299k1222J3656M559k2648J0067L2694r763k4978J1032
641C68P206j3870J0538J5043k0295j1941K0256J936k0888J552J4914q004n852
654i037J4232j508j7219O342J4591q049k993J6469L46j8841j470J4614j338r219
$$ plain form
564 -23105 -23735 9157 6953 -4087 15363 5609 -32451 -11289 38011 18218 -20450 283 15514
577 15514 -6898 4635 20836 -17303 -26429 21496 17718 -22949 -8405 9014 -20822 -15941 27436
590 27436 11624 -22765 4153 16289 -22333 -9092 36739 14263 -17511 7118 11761 -15078
602 -15078 -1944 14918 -14605 -19221 20912 15540 -21741 -12308 1611 -18602 -5214 26236 6139
615 6139 -14667 10215 10545 -19567 -5484 25587 7849 -9356 11394 5874 -19043 -1788 13716
628 13716 -14426 -17398 13270 6971 -14251 -595 3964 -18684 -8617 24077 14314 -10664 368
641 368 7574 -6296 4242 19285 -1010 -12951 7305 9241 -11647 -10095 4819 -3185 -9037
654 -9037 5195 3687 -13532 -7190 7401 -648 -3641 12828 13174 -5667 -7137 7477 6139 -3080
668c080O534M607j0503j769N616q256o510J1959P632q179l075N567k290l600P216
683A869L058o090N649R417r476j0626N727L588l371K454J717q005m167P482J240
698D66q204J178Q197q18j981K636j336j382M143K592j210j107n97J14o03q84j882
715f78j109K476l83m540q35J010q19L052K931k544k00L063P45j269p05L472K284
732E951j627j889k166p71K906k258m802K007L098k566j205j259o53K210L319J115
748A410k373J16M697P9l201K347K38j197K150j670k706J78j015j978J45J441j166
765b505j933J373K593k518J90M672j293q70M270k32l106K308K056k083k600K72
781E94J418k686j149M14k282l62L140k037j606K856P29p4J485M61Q32L29J738
$$ plain form
668 -3080 3454 8061 -2442 -4211 1405 -6851 -13361 -1402 6230 -1949 -5024 543 -1747 -5347 1869
683 1869 4927 -1163 4486 13903 4427 -6199 -472 3116 -255 2199 3916 -4089 -8256 -774 466
698 466 -7738 -6560 1637 819 -1162 1474 138 -1244 2899 5491 4281 3174 2577 2691 2088 1204 -678
715 -678 -1787 689 306 -4234 -5069 -4059 -4878 -1826 1105 -1439 -1639 1424 2169 900 195 3667 5951
732 5951 4324 2435 269 -502 2404 146 -4656 -2649 449 -2117 -3322 -4581 -5234 -3024 295 1410
748 1410 -963 -847 3850 3929 728 3075 3313 2116 4266 2596 -110 68 -947 -2925 -2780 -1339 -2505
765 -2505 -4438 -3065 -472 -2990 -2800 1872 579 -291 3979 3747 641 2949 5005 2922 322 594
781 594 2012 -674 -1823 -1409 -3691 -4053 -913 -2950 -4556 -1700 -971 -1045 440 901 1733 2062 3800
798C800J59k716J25K689k393k021L70j224p92P8r19l73l63O24J430m77k00K736
816E33M14M96J165p97J099R55j082m44k65j372j26j314l02m17j938J99J384j186
834b998L39P23N64J534L85J33J315N69P3O25r02k60K73j120n82j023j408PRj215
854b959l60K05M88J089o52Q62J799P46k70J511J3J08J76N6k30j538j59k50j859
873a224o55N74j522p43J545m80n2J536j28N5J625J270O07m38J061R88k486Q6J208
892B827k337o35J603j696k709j49J465l57j776N40K528l29j52K276k69n14J605
909A921J883n53p66l76j10j264K40N83l325j139K815j260l748J416K866j649K7
926b439L214O34l511J542N638k818k865N187J599n483p13J218k763N5M449k029
$$ plain form
798 3800 3959 1243 1368 4057 1664 -357 13 -1211 -2003 -1925 -2844 -3217 -3580 -2956 -1526 -2003 -2203 533
816 533 947 1443 2608 1811 2910 3865 2783 2339 2074 702 576 -738 -1040 -1457 -3395 -3196 -1812 -2998
834 -2998 -2659 -1936 -1372 162 547 680 1995 2564 2637 3262 2360 2100 2373 1253 671 -352 -1760 -1753 -1744 -2959
854 -2959 -3319 -3114 -2626 -1537 -2189 -1327 472 1218 948 2459 2472 2580 2756 2812 2582 1044 885 635 -1224
873 -1224 -1879 -1305 -2827 -3570 -2025 -2505 -2557 -1021 -1149 -1094 531 1801 2408 1970 3031 4019 1533 1619 2827
892 2827 490 -145 1458 -238 -2947 -3096 -1631 -1988 -3764 -3224 -696 -1025 -1177 1099 830 316 1921
909 1921 3804 3251 2485 2109 1999 735 975 1558 -1767 -2906 -91 -1351 -5099 -3683 -817 -2466 -2439
926 -2439 775 1409 -2102 -560 5078 2260 -605 4582 6181 698 -15 1203 -1560 -1505 2944 915
942I15p267K762N631n965l835P818J631m062M857K517p729m35Q399N20o112K615
958B260L073m775p08K471p153k781J1153n4j0005K730N129o391q70R022n4o479
974c432M796N906o340k665N934k089k182N297k094p389L906K144p173j42Q670
989C147j623q930M080N573o777k73J0264q37n548L239J343m731Q39M431p21k124
1005A352J867k065o370J795L621m558k101Q328K309n408l500P08O12K289O123
1020E002M146n488n904K365K679q59j531o98J35J539J471j968p644k126O804J850
1036b27p38M708r36r323J34J0202J860o082K902N410p119m719P547j53p015K917
1052f32M101m862k344K234k052k417N467L044m136J508M504o669n301Q853P149
$$ plain form
942 915 -6352 -3590 2041 -3924 -7759 59 1690 -2372 2485 5002 -2727 -3162 5237 5757 -355 2260
958 2260 5333 558 -150 2321 -4832 -7613 3540 3486 -6519 -3789 1340 -5051 -5921 3101 3047 -3432
974 -3432 1364 7270 930 -1735 4199 2110 -72 5225 3131 -4258 -352 1792 -5381 -5523 3147
989 3147 1524 -7406 -3326 2247 -4530 -4803 5461 4624 -924 2315 3658 -1073 -234 4197 3476 1352
1005 1352 3219 1154 -5216 -3421 200 -4358 -6459 1869 4178 -1230 -4730 -4022 -3410 -1121 5002
1020 5002 9148 3660 -2244 121 2800 1941 410 -288 -153 1386 2857 889 -6755 -8881 -2077 -227
1036 -227 -965 3743 2807 -6516 -6382 3820 5680 -402 2500 7910 791 -3928 3619 3466 -3549 -632
1052 -632 3469 -1393 -3737 -1503 -3555 -5972 -505 2539 -1597 -89 4415 -2254 -7555 1298 8447
1067H447l211j333k56n386m636N799O901m262o312L137K831l709k139n63j813
1082f505L118Q946L369p742n335K073j12J478R523O81j0382p21N093n100l285
1097d901N956k31n926L931O148p572m922N978j820j468J2138K020j3830P16R913
1112F130n378l785J0967M7j3575L391Q324j0452m433J3906r69j2481O232N538
1126C462j1036J748J2637o404p557J3982M354j6560K72J2645q153m361J7303j188
1140A1144k1326L014J2966r957m694J4221j765j3056Q506R577j4847m929J5756
1153D610J55q136R840M208j4835j838J2110l535o870Q284K629j1425n96Q490n724
1168b633n899Q871K429p298L347N287n915l208P657K539n197J413M032m441l297
$$ plain form
1067 8447 5236 3903 3647 -1739 -6375 -576 6325 2063 -4249 -1112 1719 -1990 -4129 -4692 -6505
1082 -6505 -3387 5559 8928 1186 -4149 -2076 -2188 -710 8813 9494 -888 -1609 3484 -1616 -4901
1097 -4901 1055 824 -5102 -1171 4977 -2595 -7517 -1539 -3359 -4827 7311 9331 -4499 -3783 6130
1112 6130 752 -3033 7934 7981 -5594 -2203 6121 -4331 -8764 5142 4173 -8308 -2076 3462
1126 3462 -7574 -5826 6811 407 -7150 6832 11186 -5374 -5102 7543 -610 -4971 12332 11144
1140 11144 -10182 -7168 5798 -4159 -8853 5368 3603 -9453 -947 8630 -6217 -11146 4610
1153 4610 4765 -3371 6469 10677 -4158 -5996 6114 2579 -4291 3993 6622 -4803 -5399 3091 -2633
1168 -2633 -8532 339 2768 -4530 -1183 4104 -1811 -5019 2638 5177 -20 1393 5425 984 -2313
1183b313M851k3n011K106K655m359k890K663J224o73J199J415k814n84L612N70
1199A628k090K583J849k158N85O38l432k026L144J686k759j130J768k931k500
1214e145L584J291k507K236K562j429j457J515N97j121J799K659k462j997J911
1229B036j413l104J999J052k500j82J801r73k292J592K032j557O67L867j581k434
1245i90K744J152j691J36J089j273j251K18P28k368j356K187m19j365Q58M3k36
1262a794J450K99O97M57j19K63P18m44M08O1q23K80r51q26m94n09j05o3p38O72
1282a561L98r65R25J477m73N51J137K90m96j85J087j95j695J079L43j950l25J99
1300c59j068l53N8M4J91l77M56J047n1O80O78j72J090K41p48N24R1q03m81l93
$$ plain form
1183 -2313 2538 2515 -2496 -390 2265 -2094 -4984 -2321 -1097 -1770 -571 844 -1970 -2554 1058 1628
1199 1628 -462 2121 3970 1812 2397 3035 -397 -2423 721 2407 -352 -1482 286 -2645 -5145
1214 -5145 -1561 -270 -2777 -541 2021 592 -865 650 1247 126 1925 4584 2122 125 2036
1229 2036 623 -2481 -482 570 -1930 -2112 -311 -1284 -3576 -1984 48 -1509 -842 3025 1444 -990
1245 -990 1754 2906 1215 1351 2440 1167 -84 134 862 -1506 -2862 -675 -1094 -2459 -1601 -1558 -1794
1262 -1794 -344 -45 652 1109 990 1253 1971 1527 1935 1996 1173 1453 502 -324 -818 -1327 -1432 -1495 -2233 -1561
1282 -1561 -1163 -2128 -1203 274 -199 352 1489 1779 1283 1098 2185 1990 295 1374 1717 -233 -558 -359
1300 -359 -1427 -1780 -1722 -1678 -1487 -1864 -1408 -361 -412 268 946 774 1864 2105 1357 1881 1972 1169 688 295
1320B95n52o69m50L22n67p45Q33K25m35R54M74L23M46O29L77K57l27L47K38p98
1340A177m34j26o09K8j185n59L22l27n18P72K09K68O5Q39R13l15K00J026L19j178
1360H87L01O11n05n17p62O8q13p53M18m79m59L44L37l08J055M40QO48Q48K02j99
1381A372K48N28o71p75O88k20j790j14Q26j974m02J519n85j205J323J609j143
1398g66j08J580P90j592J410J579j717m12J165q69j004K29L50j486q50J083o87
1415a305j896J652J456j552Q03J652o94n89J681P05o96j19J349k48j456j46m51
1432A46j409R44O33j477j087J048l76o51M65J626l24l15J898N96j569o5J778j16
1450A745Q2j28j078n08n34M20o33j204R25J83j267O11Q27j574P82L031L52k548
$$ plain form
1320 295 -257 -926 -1376 -1054 -1621 -2366 -1533 -1308 -1743 -789 -315 8 454 1083 1460 1717 1390 1737 1975 1177
1340 1177 743 617 8 36 -1149 -1708 -1386 -1713 -2231 -1459 -1250 -982 -917 -78 835 520 720 1746 2065 887
1360 887 1188 1799 1294 777 15 83 -730 -1483 -1065 -1544 -2003 -1659 -1322 -1630 -575 -135 -127 521 1369 1571 1372
1381 1372 1620 2148 1477 702 1390 1170 -620 -734 92 -1882 -2284 -765 -1350 -2555 -1232 377 -766
1398 -766 -874 706 1496 -96 1314 2893 1176 764 1929 1060 56 285 635 -851 -1701 -618 -1305
1415 -1305 -3201 -1549 -93 -1645 -842 810 116 -473 1208 1913 1217 1098 2447 2199 743 597 146
1432 146 -1263 -319 314 -1163 -2250 -1202 -1578 -2229 -1764 -138 -462 -777 1121 1717 148 83 1861 1745
1450 1745 1827 1699 621 113 -421 -1 -634 -1838 -913 -730 -1997 -1386 -559 -2133 -1351 1680 2032 -516
1468e16P02J710j144p40K364O21k885J277O44m351j21L285k034k190M101J268
1484A991n409k50M494j648k716O779K020o269J82M913l886l022N655J041n087
1499a212J612L090o005k783O140R3n854M478M180o661j097O346j533m791N702
1514A705N020n655l706N218r25m030N002J937o678j398M556j284l473K471J756
1529E16l117J106M091l015l871L505L337n69O61Q59l329k198J575J821k02n96
1545E74M25q91j882j34p9j424J373K520J108q81j073k40o06n25K918L376j649
1562B910j473L45j727k256P60K254j02j019K01r55j344N72%k17J488J170k8J203
1580A782j45l242J41L652J095j441j91j037l220J162L380p88l330R91J29j822
$$ plain form
1468 -516 186 1896 752 12 2376 2997 112 1389 2033 -2318 -2439 846 -1188 -3378 723 1991
1484 1991 -3418 -3668 826 -822 -3538 3241 5261 -1008 -826 4087 201 -2821 2834 3875 -1212
1499 -1212 400 3490 -2515 -5298 842 935 -4919 -441 3739 -2922 -4019 2327 794 -3997 1705
1514 1705 6725 1070 -2636 2582 1657 -2373 2629 4566 -2112 -3510 1046 -238 -3711 -1240 516
1529 516 -2601 -1495 2596 -419 -4290 -785 2552 1983 2644 3503 174 -2024 -449 1372 1170 574
1545 574 999 108 -1774 -1908 -1987 -3411 -2038 482 1590 709 -364 -604 -1210 -1735 1183 4559 2910
1562 2910 1437 1782 55 -2201 -1441 813 711 -308 -107 -1062 -2406 -1834 -1834 -2051 -563 607 579 1782
1580 1782 1637 -1605 -1464 2188 3283 1842 1651 614 -2606 -1444 1936 1148 -2182 -1191 -1062 -2884
1596b884J767J833k468p01M055Q64j883k40L41j819J378M119l17l927j191K81
1612g92j338P25J989K14j856q6J228j422k406J623L049J34j3J931n17l795l66
1629a698L622l98j957L078J806n661k616L956j518k724M648K391n251j327N756
1644B107j677m308M105L207m597J546N644n061n281N688K493n556J418M305n852
1659a819m165P158J258o836J913N979n405k308O702l31n464L707N103m418k836
1674a762M258j177m181L855L082n004p46K992l016k137L225P24k315J879K613
1689B290l254j515K984O23k230K957J922l095j244K633j768k231J929J066j864
1704g97K92Q54j723k163K449J231j414J034J797j511n97J894k46j490J443J238
$$ plain form
1596 -2884 -1117 716 -1752 -2453 1602 2466 583 343 684 -1135 243 4362 4045 118 -1073 -792
1612 -792 -2130 -1405 584 798 -1058 -1144 84 -1338 -3744 -2121 928 1062 1049 2980 2463 -1332 -1698
1629 -1698 1924 1526 -431 2647 4453 -1208 -3824 132 -1386 -4110 538 2929 -2322 -3649 2107
1644 2107 430 -3878 227 3434 -1163 383 6027 966 -4315 1373 3866 -1690 -272 4033 -1819
1659 -1819 -5984 1174 2432 -4404 -2491 3488 -1917 -4225 2477 2146 -3318 389 5492 1074 -1762
1674 -1762 2496 1319 -2862 993 4075 -929 -1675 1317 -1699 -3836 -611 113 -2202 -323 2290
1689 2290 -964 -2479 505 1128 -1102 1855 3777 682 -562 2071 303 -1928 1 1067 -797
1704 -797 -505 349 -1374 -3537 -1088 143 -1271 -237 1560 49 -548 1346 1100 -390 1053 2291
1720B291j086j200J361q15k574J592J424k098j267J996j98j701J210J986q89j065
1736a033K129P62k436Q06K240j097j014J694q22k082j2J138n71j387J106K25j756
1753b110P01J562j589J99K106J77j174Q60J024j226k78J394J99k041P51N83j946
1770h08m18J036o13q31P73M83p62k47J136K02n58J036R85q19K36Q67q05pR2o16
1790C62n4k93k23m65m26J56J69n65L06M97j06L40K28N51M2L36J16K62m05n3Q5
1811H60p13J68n3n05l20l32j16L11l34j40P04k49J02P14P4K05L01j34N69Q3k61
1832I34nl04k5K28j198m53N98p98J90J44j48j70L18L32m1N09N77J86m50O1P69
1853A254l81r3L2k98o6k05n94k07J33l65n17J85O3M08j21L80M83P6m2Q35K96o38
$$ plain form
1720 2291 1205 5 1366 551 -2023 -431 993 -1105 -2372 -376 -574 -2275 -1065 921 32 -1033
1736 -1033 1096 1858 -578 228 2468 1371 357 2051 1229 -853 -865 273 -298 -1685 -579 -354 -2110
1753 -2110 -1409 153 -1436 -1237 869 1046 -128 732 1756 530 252 1646 1845 -196 555 1138 -808
1770 -808 -1226 -190 -803 -1634 -861 -378 -1140 -1387 -251 -49 -607 429 1414 595 831 1698 893 886 978 362
1790 362 308 15 -208 -673 -1099 -943 -774 -1339 -1033 -536 -642 -302 -74 477 519 855 971 1233 828 775 860
1811 860 147 315 262 -243 -563 -895 -1011 -700 -1034 -1174 -470 -719 -617 97 171 376 677 543 1112 1195 934
1832 934 929 625 600 828 -370 -823 -225 -1023 -833 -689 -837 -1007 -689 -357 -398 111 688 874 424 485 1254
1853 1254 873 780 812 514 448 243 -351 -558 -425 -790 -1307 -1122 -1059 -651 -772 -392 91 167 125 960 1256 618
1875F18L69k71M7k6j10l44o29R4R4p34k52M14m29L40L93J06l3N8O05J85J53J42
1897G90O37l73k92M2k74p40K76j59k54p35L25Q5k58k81P96k78K35P87J62m26P68
1918H33L37o66R4P31l97p36J68k32l35l63L13k43o40Q7M42n49N86N73j78m5Q97
1939F77ll46O09O79j048m7J113j456j122N61O97q85J18J49o37q17P15P75j030
1958a298Q79J442q18K19J012r11r24J140R90m82q23K55m67j731Q01Q70j028l9
1976i13J106n54p26M26O43m71L03J500K19j296J43J201r86q61J554r8j707q7J062
1995D58p13j712J361J096j837k80K471j410j524K613J150k050N41K150j351k224
2011a261J964J409k688O85K966l306k928K783L51k502J303L072k293j896K600
$$ plain form
1875 618 987 716 763 737 627 283 -346 -252 -158 -892 -1144 -730 -1159 -819 -426 -320 -353 -295 310 495 648 790
1897 790 1427 1054 762 804 530 -210 66 -93 -347 -1082 -757 -672 -930 -1211 -415 -693 -458 329 491 65 833
1918 833 1170 504 598 1329 932 196 364 132 -203 -566 -253 -496 -1136 -1049 -607 -1156 -570 3 -175 -220 677
1939 677 674 328 937 1616 568 521 1634 178 -944 -383 314 -571 -453 -304 -941 -1758 -1043 -268 -1298
1958 -1298 -419 1023 205 424 1436 525 -399 741 1731 1249 426 681 214 -1517 -716 154 -874 -913
1976 -913 193 -361 -1087 -661 -18 -489 -186 1314 1533 237 380 1581 595 -266 1288 1190 -517 -604 458
1995 458 -255 -1967 -606 490 -1347 -1627 844 -566 -2090 523 1673 -377 164 2314 963 -1261
2011 -1261 703 2112 -576 109 3075 -231 -3159 -376 -25 -2527 -1224 1848 -445 -2341 259
2026B59N10l175K002L049j663n00K734j993m041K371K238j710n02K218j722k820
2042b745K123J038k594L01L149o02j114J626j057j862J657J971n00j48N01j237
2058E07k052J921O34j849J78J381j443r27J018J8o52J046Q92q52m57J277n4o46
2076f0J101Q66j032j91L97j133j664J035J735p7j409j42n32j518O40K382l8q52
2094d92J379O56j594m14J149o11p12K725J369k987j776J117q84j286L230Q82l198
2111a447l78K454j255k082K440J425j741O64K936j990k666K071J338j983P20J938
2127B444k341k139J770R71k414K47K464j445j674J812L40j197J122J770q23j126
2143b19P90P30q77n97J634k47j221N17m4j749q63J425J010m30l40O05j139q95
$$ plain form
2026 259 769 -2406 -404 2645 982 482 3216 1223 -2818 -447 1791 81 -421 1797 75 -2745
2042 -2745 -622 416 -2178 -1877 1272 670 -444 1182 125 -1737 -80 1891 1391 1243 1744 507
2058 507 -1545 376 1010 -839 -661 720 -723 -1650 -632 -614 -1266 -220 672 -180 -637 640 586 -60
2076 -60 1041 1907 875 684 1081 -52 -1716 -681 1054 977 -432 -574 -1106 -2624 -1984 398 360 -492
2094 -492 887 1543 -51 -465 684 73 -639 2086 3455 468 -1308 -191 -1075 -2361 869 1751 -1447
2111 -1447 -1825 629 -626 -2708 -268 1157 -584 80 3016 1026 -1640 431 1769 -214 506 2444
2127 2444 103 -2036 -266 705 -1709 -1462 1002 -443 -2117 -305 35 -1162 -40 1730 907 -219
2143 -219 571 1301 424 -173 1461 1214 -7 510 466 -1283 -2146 -721 289 -141 -481 124 -1015 -1910
2161a910J721J447j302L86J572l93j454L60J22j071K37K108j174j673N22k14j384
2178b100J013J784j244n35J646k5j808Q94J512j166L69J921j077k003J006M48
2194F35j598P50J088j500n23J211o40j245J053J495j600OJ986j283j143K575L95
2211A662j607K59J530j591j287J651K98k190Q15J843k295j022J896m85j515J829
2227b09J543j566m07J606l01r97O14J198j107k79J528q40j681P83M99j170k98
2244a084J410q28r45N21J162r18k84J567k02k67L80L61l90l79Q02K51j089P1L34
2263D73o95n18O94o18q3K0L86k7j96L82L88k98M21N80m94j28O36k66k26k10J26
2284C47m53k00o8j45l16K82J10l53m2M53Q4k31Q13rK44J43P4k86l3K59N7n44m6
$$ plain form
2161 -1910 -189 1258 -44 342 1914 1521 67 427 549 -522 -285 1823 649 -1024 -502 -716 -2100
2178 -2100 -1087 697 -547 -1082 564 539 -1269 -375 1137 -29 340 2261 1184 -819 187 635
2194 635 -963 -213 875 -625 -1148 63 -577 -1822 -769 726 -874 -868 1118 -165 -1308 1267 1662
2211 1662 55 314 1844 253 -1034 617 915 -1275 -460 1383 -912 -1934 -38 -523 -2038 -209
2227 -209 1334 -232 -639 967 666 -331 283 1481 374 95 1623 783 -898 -115 384 -786 -1084
2244 -1084 326 -502 -1447 -926 236 -682 -966 601 399 132 512 873 483 104 906 1157 68 139 473
2263 473 -222 -740 -46 -664 -747 -727 -341 -368 -564 -182 206 -92 329 909 415 287 923 657 431 221 347
2284 347 -106 -306 -374 -519 -835 -553 -443 -796 -838 -385 -301 -532 281 272 516 659 733 447 414 673 730 186 140
2307A40j6k68l97K5j26k05M01k67j67M64M27l52M62K22J64K24r2K12k19n44L55
2328D43k86j2n32J32J0r1l56j27J75R0J78K70n9L58K1J84Q0K71o2J09l87K1j35
2351B95n35K13ol61N4l0n63J82J03J77J96Q3K87j30L18j14K58J77p2J65k52l43
2373A02K5r6k64j17j89N5j39J22Q5l42N09K09M5Q8K98j9J28J5K94l47k88K94k98
2396A70m70M08k78j31m07M80n43K74K1L8J50l2L01j08L72K12Q5l75M33K61p93
2417F8L0L21j83l23k67N4nn42K63J00J4J92L48j22L72J5O5k35Q18j66l50l92O79
2440G54m80n98K51K56n23r2P3l24k59L14L51j54o4J042m56k65J205j62q26M23
2460D66P58p07p88P64j96j165M9J186p96q96J377m24o29P82O94q26R3J194j71
$$ plain form
2307 140 124 -144 -541 -516 -642 -847 -446 -713 -880 -416 11 -341 121 343 507 731 639 851 632 88 443
2328 443 157 145 -387 -255 -245 -336 -692 -819 -644 -554 -376 -106 -165 193 214 398 478 749 687 796 409 430 295
2351 295 -240 -27 -33 -394 -340 -370 -933 -751 -648 -471 -275 -192 95 -35 283 169 427 604 532 697 445 102
2373 102 127 31 -233 -350 -539 -484 -623 -501 -416 -758 -249 -40 5 93 391 372 500 515 809 462 174 468 170
2396 170 -300 108 -170 -301 -708 -228 -771 -497 -476 -438 -288 -320 -19 -127 245 457 542 167 600 861 68
2417 68 98 419 236 -87 -354 -300 -305 -847 -584 -484 -470 -278 70 -52 320 335 400 165 983 817 467 75 754
2440 754 274 -324 -73 183 -340 -432 -359 -683 -942 -628 -277 -431 -495 547 91 -174 1031 869 43 466
2460 466 1224 517 -271 493 297 -868 -819 367 -429 -1325 52 -372 -1001 -219 475 -351 -258 936 765
2479G65j027O31Q54j100j46J219m98j483N79L05p10j33R19j78j155Q69N84q67
2497e72j02J178n0l41O62K61j310M08P49m34k95M68k39j210J47N20l09p35R02
2516c02M37o30q5L21k29L94K5Q90j76k25M72k67j037K94M84k29q9K41m70r59K00
2537i40R73m45k08N49M7p59R18N71q00J02J129K12j436N51k90p69K75J363o40
2556D03j092M82N9j488J015J305r76l37J522p76r59P15J070j146N43J876j572
2573F44j326R81k9j615Q92J580j136j110R25J46j918R03J957j018m02J366m3j964
2591a167J319J093j113l00J542n78j060M2N46j066j71J409r4j509Q0Q66n39J57
2609e43J050R8q82L62M42k35l94M38M50l56J65M30j293p62M92Q04l08n29Q37o65
$$ plain form
2479 765 -262 369 1223 123 -23 1196 698 -785 -206 99 -611 -744 175 -3 -1158 -289 295 -572
2497 -572 -674 504 454 113 775 1036 -274 134 883 449 154 622 383 -827 -680 -160 -469 -1204 -302
2516 -302 135 -495 -580 -259 -488 -94 -69 821 645 420 892 625 -412 -118 366 137 48 289 -181 -1140 -940
2537 -940 33 -412 -620 -71 -24 -783 135 706 -94 8 1137 1349 -87 464 174 -595 -320 1043 403
2556 403 -689 -207 -148 -1636 -621 684 -292 -629 893 117 -842 -127 943 -203 340 2216 644
2573 644 -682 299 270 -1345 -453 1127 -9 -1119 -194 -48 -1966 -1063 894 -124 -526 840 797 -1167
2591 -1167 152 1245 132 -168 1374 796 -264 -222 324 -742 -913 496 402 -1107 -1027 -161 -700 -543
2609 -543 507 605 -277 85 527 292 -102 336 786 430 595 1025 -268 -1030 -538 266 -42 -571 266 -399
2629c99r16Q31O72m87J62J231j00q04k3J77m01J65J057m35r78M56o7j027J69O84
2649c3m98m3J122m38j247M81Q49j46KQ74j92r06O96K82j112K24O57m27m64M32
2669A13k18q05K76N42m0k15L57k54o06J009N28m81j40P16k17n51L24J01n34j64
2689b59J018n50p72M8J35o11O12N34n9l94K04K06L0p86J113N76o74M29J58q50
2709A08n36L45M82k09m75M42j2j227L77N13q19L50J081k62l48O17M19p72K07P81
2729A062n34r41P77J39r55l4O42p05j34R68l86o59O5R32n59k23R03rn35O15N26
2750I55o94n6K71k6n63K30L13n65m20Q13l08r05O87P2n60L40P11j86L8L33J0l71
2772A19J5O02l51k20M03l77k65j84J65m45N8J53r9q8J29L13k60L44p6j1M00M18
$$ plain form
2629 -399 -1315 -484 188 -299 -137 1094 994 190 167 344 -57 108 1165 730 -248 208 141 -886 -717 -33
2649 -33 -531 -574 548 110 -1137 -656 193 47 49 923 731 -175 521 803 -309 -85 572 145 -319 113
2669 113 -105 -910 -634 -92 -132 -347 10 -244 -850 159 687 206 66 782 565 14 338 439 -95 -259
2689 -259 759 209 -563 -515 -380 -991 -379 155 96 -298 -94 112 142 -644 469 1045 371 800 958 108
2709 108 -428 -83 399 190 -285 157 145 -1082 -705 -192 -1011 -661 420 158 -190 427 846 74 281 1062
2729 1062 528 -413 364 503 -452 -486 156 -549 -683 285 -101 -760 -695 237 -322 -545 358 349 -186 429 955
2750 955 261 205 476 450 -113 117 430 -135 -555 258 -50 -955 -268 -196 -756 -416 295 109 147 480 490 119
2772 119 134 736 385 165 568 191 -74 -258 -93 -538 -480 -327 -426 -514 -385 -72 -332 12 -64 -75 325 743
2794G43k27k47K20n6l06O4k94J25J15o02K42k86J11J49J5K32p6R2L29k18K25O5
2816D15m6j7j46L32l53O1L7k96m96O02m43m1P3Q3j11l06N99J44k41L29K01l18
2838F2j07N22J04n33M54j16k69k1k11R3k39k5j42j91J64J64J55j12K60K49j58
2859A03K2P2j19K14K68k47n3j80k4j82J41J7l51rj93J98J16k15K20L38k26J25
2881C5l3M87j27k8j46N1N6Q3l32l3m8m13m3pQ5j3qrJ64r5J31J7M89J99k2O8j23
2908C85M3J19l64rm9Qm29o8K57l61O4K41j30N4j51N15l78Q4P09m0k31K38j34r3
2932B80j06J58k24j53L68m15j66j72L60m04Q0L6K08l5J50L18k50J81J47K1k87
2953I5M17N4l97J8j9J03n81J24r0J97n14K60O0k87K24N77m1k38L59j72M49k49
$$ plain form
2794 743 516 269 489 433 127 191 -103 22 137 -465 -223 -509 -398 -249 -234 -2 -78 14 343 125 350 415
2816 415 369 352 206 538 185 246 283 -13 -509 93 -350 -391 -318 -235 -346 -652 -53 91 -150 179 380 62
2838 62 -45 477 581 48 502 386 117 96 -115 -22 -261 -286 -428 -619 -455 -291 -136 -248 12 261 103
2859 103 125 197 78 292 560 313 260 80 56 -126 15 32 -319 -328 -521 -323 -207 -422 -202 136 -90 35
2881 35 2 489 362 334 188 239 295 378 46 13 -35 -448 -491 -498 -413 -426 -434 -443 -279 -374 -243 -226 263 462 440 508 385
2908 385 428 547 183 174 125 133 -296 -364 -107 -468 -404 -163 -293 -239 -390 125 -253 -169 540 500 269 507 373 280
2932 280 174 332 108 -45 323 -92 -258 -430 -70 -474 -394 -358 -150 -185 -35 283 33 214 361 382 95
2953 95 512 566 169 187 168 271 -310 -186 -276 -79 -593 -333 -273 -560 -336 241 200 -38 321 149 598 349
2975C49K25l8m36M11j97o44j42M54m47K99O3l20J51l5J13J4q6K64N96p08P34r8
2997E22l23r8L15k95q0J24L05o00o63N72L25q83L55K52n70N69K80k64J15N42j80
3018C20j22J86J53l40m54P99j61p19L75n3l77j26M18k84j13N57Q7p15J10O39j29
3039E1L62J15k5p10N52K09o60k33L65L04m76J48r6m98l24M78Q27o89K60M22n31
3060a49j95M59L25l60K85M79k40p55K14J78p24J86O71m36q43O77M45r76J64N71
3080b4M07p65M31N71q59q1J206k35r19Q08K24j485K42P31j88o99Q35J85j270K6
3100h59J001n31l15J155N91j371K71N59n69j90Q38K13q75J87M90j054k78N56k0
3119b01l19N94L53p97j86L72J33l6K01N13l03j59M16n01k96Q04j42k84R4l41k9
$$ plain form
2975 349 574 536 100 511 314 -330 -472 -18 -465 -166 -103 -423 -272 -307 -194 -180 -266 -2 594 -114 620 522
2997 522 199 101 416 121 41 165 470 -130 -793 -221 104 -779 -424 -172 -742 -173 107 -157 -42 500 320
3018 320 198 384 537 197 -257 542 381 -338 37 -16 -393 -519 -101 -385 -498 59 146 -569 -459 180 51
3039 51 413 528 503 -207 345 554 -106 -339 26 330 -146 2 -94 -592 -916 -438 389 -300 -40 382 -149
3060 -149 -344 115 440 80 365 844 604 -151 63 241 -483 -297 374 -62 -905 -228 217 -759 -595 -24
3080 -24 383 -382 49 620 -239 -320 886 651 -268 540 764 -721 -479 252 64 -635 200 385 -885 -859
3100 -859 142 -389 -704 451 1042 -329 -58 501 -68 -258 580 793 -82 105 595 -459 -737 -181 -201
3119 -201 -520 74 427 -370 -556 -184 -51 -87 114 627 324 165 581 80 -216 588 446 162 256 -85 -114
3140a14n08M11J94k65K29J09o28J29O98j12r8L39n5K3l68J59K11k95L04K48q50
3161b39l50K50j73j23N44N11m43k11K54j10n44M99P96l89r4N70o31m08L37M66
3181E12p19J52O53k46j122L78K81o21K9J125m2q04K72M19m23k37J124J5j059N53
3201B40N36j103J12L41j77j69J23k1k18l62O95j3o47P41J27l37j43O42Mk52N95
3222G14k02k95k66K57m1m09P3K32k65j44n5q2kL72kJ20O5k9J01J34m55O05l9J31
3246E18j39k35k06k8K50l33Q1p7J05j85j44mM8j7M54j91k1K43J05R7l6l1K86p92
3270b52L46J15l05j06k3q9j98K41J61k69L2L19k10J47R0R6j69L33p2l16K41K2
3292A34P2j65j30K17m92J98R4j17q0J57J77j50J46J23j04l14N83m2k05K25j5l90
$$ plain form
3140 -114 -622 -211 -17 -282 -53 56 -572 -443 255 143 45 384 329 352 -16 143 354 59 363 611 -239
3161 -239 -589 -339 -512 -635 -91 420 -23 -234 20 -90 -634 -135 661 272 178 748 117 -291 46 512
3181 512 -207 -55 598 352 -770 -392 -111 -732 -703 422 380 -424 -152 267 -156 -393 731 746 -313 240
3201 240 776 -327 -215 126 -51 -220 -97 -118 -336 -698 -3 -16 -663 78 205 -132 -275 367 371 119 714
3222 714 512 217 -49 208 167 -242 -169 63 -202 -346 -401 -483 -485 -113 -115 5 70 41 142 276 -179 426 387 518
3246 518 379 144 -62 -90 160 -173 -92 -169 -64 -249 -393 -397 -349 -366 88 -103 -124 119 224 321 285 254 540 -252
3270 -252 94 209 -96 -202 -225 -314 -512 -271 -110 -379 -347 -28 -238 -91 -1 95 -74 259 187 -129 112 134
3292 134 206 41 -89 128 -364 -166 -72 -189 -269 -112 65 -85 61 184 80 -234 349 307 102 327 312 -78
3314g8L53j09oj58Q8k36Q7j90K17m76J60M19k04K29pj33M61k49M2K8r8K13k09
3337A44Ko2l25K89k15J64l68J13Q3n91N65L10k99O8L82j41q8ML09k48L06k62l4
3360A06k4K35m23R0j43O5n8q8PJ06j66R9O7J22p2M7L49RkM7j54K77l03l48K26
3385G1j98k06J57J84j06j42n0j4PN8K51k0P3Q9j89J81J44k8k56K7n9J90j71j54
3409a61P6k44m3P9J62k21J85J01M1M1N0K13n7n1L27l34o0J32J59l52j94J12j86
3432b25q7K32k12K52l06K25K6Q2nJ41k76O5J94J64j29j29Q4r8K5J24M4k93J29
3455B7L6l16o0K71J79o07J0N56m6j91M32p5k45L57mj20j64K82j63l57J24K2p4
3478a26k97L05M9l20M60k14n6J25K63k43j14N83k80Oj10K40j68M0j18J26m53J61
$$ plain form
3314 -78 275 166 160 2 90 -146 -59 -249 -32 -508 -348 71 -133 96 89 -44 417 168 210 238 140 353 144
3337 144 146 84 -241 48 -167 -3 -371 -258 -175 -766 -201 109 -190 -122 260 119 31 35 344 96 402 140 106
3360 106 82 317 -106 -16 -159 -94 -152 -240 -233 -127 -293 -194 -127 -5 -77 -30 319 328 326 373 219 496 193 -155 71
3385 71 -127 -333 -176 8 -98 -240 -290 -304 -297 -239 12 -8 65 154 -35 146 290 262 6 33 -26 164 -7 -161
3409 -161 -85 -329 -372 -293 -131 -352 -167 -66 -25 16 66 279 222 171 498 164 104 236 395 43 -151 -39 -225
3432 -225 -312 -80 -292 -40 -346 -121 -95 -13 -18 123 -153 -88 106 270 141 12 96 -2 23 147 191 -102 27
3455 27 63 -253 -313 -42 137 -470 -460 96 50 -141 291 216 -29 328 324 204 40 322 159 -198 -74 -52 -126
3478 -126 -423 -118 -69 -389 71 -143 -199 -74 189 -54 -168 415 135 141 31 271 103 143 25 151 -302 -141
3500a41K6P7r9Q7k5p4q3J88qJ38J14k82L69K2j93r7J84L0p7k70J9o0k49k29P46
3525A13j83k84L67P3k12L3L66j10l28P07m1j04l5l77j77p0M69J9m57o0L67j72
3547i6l01K89K09l99K22L90l89k19M39L74o74M96K72n80l96O78j01n84P7M83k33
3568d3n39K39L58n62O89K70m45M1J46K4m02N13J51p2k98K28k40j76k41N98l19
3589h0k09N03k60m75R0M86k86K20K28J67k48j13L5J7M9M6M4J10m86M23p6m56J65
3612a06J11o16N97J0k12k85O48j21n4L19K53m59j70M94m6n01J6M88m70o7R8k9
3634a02n14N83M37q06J78J43k42k56N87M78p36N54J93n92Q8K37J36o35Q28j3q16
3655b70j11M15M0o35N35J26l83P3LK11l15M78J07jR3R5l07o43P51l07K0q9J78
$$ plain form
3500 -141 -115 -38 -137 -50 -75 -149 -232 -44 -52 86 200 -82 287 309 116 19 203 233 156 -114 -95 -155 -404 -633 113
3525 113 -70 -354 13 86 -126 -93 273 163 -165 542 501 397 362 -15 -192 -262 207 226 -231 -291 76 -96
3547 -96 -397 -108 101 -298 -76 314 -75 -294 145 519 -155 341 613 33 -363 315 214 -370 -293 190 -43
3568 -43 -582 -343 15 -547 142 412 -33 8 154 178 -224 289 440 368 70 298 58 -118 -359 239 -80
3589 -80 -289 214 -46 -521 -431 55 -231 -11 217 384 136 23 58 75 124 170 214 324 -162 261 185 -271 -106
3612 -106 5 -611 -14 -4 -216 -501 147 26 -28 291 544 85 -85 409 363 -138 -122 366 -104 -171 -73 -102
3634 -102 -616 -33 404 -402 -224 -81 -323 -579 8 486 -250 304 497 -95 -7 230 366 -269 559 546 -270
3655 -270 -381 34 74 -561 -26 100 -283 -210 -207 4 -311 167 274 273 366 461 154 -489 262 -45 -25 -114 64
3678F4j66m00L33K92o41L42K57M4k28J01K16OJ72j69M5l01k14N48l57J15O3L8
3700A60m96K85K95k98l02K66J59j15l0O77q32j5N56ql32K72K44k13l00M5R8o72
3722e56P59K48n04l15K09LJ85j13J99k49J79K13k17O3j75J33j33k3M10k30p7j43
3744a34j45J16L5n1K34j79K78q3j41J02J9K23j14j05J8k73M50j93P1j69K40m44
3766b45jL45l38J25L0J59j23j62K37Q0k8M1q0L23k88J18R6j23l3j3j39J13j39
3789d5j27k2k37K71Mo7O3K41m56O09j05M6k08K04J51l4l98J41J38j47n9K3o3j88
3813b65J50q3k36J32L12l31K65K54l84J29K46k39J86j21L48n75L48J16%m11O4
3834i5M7q8n5r3J86j57j32L89R7j49J34M8N0J34j47j83J08M3J19j42j63j83L32
$$ plain form
3678 64 -102 -502 -169 123 -518 -176 81 125 -103 -2 214 220 392 223 268 -33 -247 301 -56 59 122 160
3700 160 -336 -51 244 -54 -356 -90 69 -46 -76 601 -231 -246 310 302 -30 242 486 273 -27 18 116 -556
3722 -556 203 451 -53 -368 -159 -156 29 -84 115 -134 45 258 41 104 -71 62 -71 -94 316 86 9 -134
3744 -134 -279 -163 -128 -179 55 -124 154 71 -70 32 51 274 160 55 73 -200 250 57 128 -41 199 -245
3766 -245 -246 99 -239 -114 -84 75 -48 -210 27 107 79 120 40 363 75 193 289 166 133 120 -19 94 -45
3789 -45 -172 -194 -431 -160 -156 -223 -160 81 -375 234 129 175 -33 171 322 288 -110 31 169 22 -37 -14 -77 -265
3813 -265 -115 -198 -434 -302 10 -321 -56 198 -186 -57 189 -50 136 15 363 -212 136 252 252 -159 -95
3834 -95 -48 -136 -191 -284 -98 -255 -387 2 99 -50 84 132 182 316 169 -14 94 137 256 114 -49 -232 100
3857A00l43L8N89n05Qj66J65N4j53np1M71l3j8j3r7M37m25L2J64j43r4j09L22
3881B05l11j12N9o1K4J53J67o1k49J24J92K7k00K0M11j89j47m4Qj50j35J49j38
3904b58J50p4J96M5j24M0J44j66J27K04j29MK16k07k23j48L41j31M3q6N5j47p8
3927b06o8K50r3m0O4J02M5J46j05j79K51J51m4j34Q9j87l3k39K22k02j0K58k27
3950a89J19J52l63J92k08J20K61k28J65J88j1j1j45R0l8n0jq4K7j98Q7M28m65
3973a62Q8J08N0k36L49KM6l8j3p8M8j56K10K6l79K95l82K14q4n02L01J24K2j8
3997a65L2j06J56N1q2J31K84m7j42N3k9j40L3k6K0k34J06L73l03j71J00K23k33
4020a16L34m40L52Qj09K30l00K75pj3l59J87M0o2k40J83o1o5l4K71k40J02j40
$$ plain form
3857 100 -243 -205 384 -121 -113 -279 -114 -60 -213 -218 -289 182 149 131 118 21 458 33 65 229 86 -8 -117 205
3881 205 -106 -218 -159 -220 -196 -43 124 63 -186 -62 130 157 -43 -23 388 199 52 8 16 -134 -269 -120 -258
3904 -258 -108 -182 14 59 -65 -25 119 -47 80 284 155 159 375 168 -55 -203 138 7 50 -36 19 -128 -206
3927 -206 -274 -24 -117 -157 -93 9 54 200 95 -84 167 318 274 140 229 42 9 -230 -8 -210 -220 38 -189
3950 -189 -70 82 -281 -89 -297 -177 84 -144 21 209 198 187 42 132 94 44 43 -41 -14 -212 -125 303 -162
3973 -162 -74 34 84 -152 197 199 245 207 194 116 164 8 218 244 -135 160 -222 -8 -92 -594 -293 -169 -147 -165
3997 -165 -133 -239 -83 -32 -114 17 301 254 112 165 136 -4 29 3 23 -211 -105 268 -35 -206 -106 117 -116
4020 -116 218 -222 130 138 29 259 -41 234 227 214 -145 42 82 20 -220 -37 -98 -163 -197 74 -166 -64 -204
4043b04N04l89K9K39j74O2K53J65l00l03K61j27m6pK99o15N55n7k00j97J50l03
4065d05J63L39L54j64m06K10j11K30m80N90j2k72M6O3o3j81K70l66m5J58j4j45
4087b41QM5K10j27L00j72j52O9N28l12q8N29p18K87K82l72l14J94%P2j02j94N6
4110b12q7K16J73j41R6N4j84k0J76k47L02j36J77k0j57k55O5j43K34kK98l47J93
4133C3j53R9j89J38j06J25J11J76l07r2K32j17j22J33K18j80o01N87K08n04L09
4154bk50J51O5K11Pj75J02L38l55r7K64l8l99L32m1p7l11K75L83m57L2J52j44
4177c4j59N44n95M4K53J69k61J59L46j76j22O4p8l18QJ80j76j57L45k86J61N9
4199c0J0j51P1L81j42j42j20L44j24J66m8J54m80j71K37N0Q7L6l08J08j85J96
$$ plain form
4043 -204 300 -89 -60 179 5 67 320 485 185 -118 143 16 -30 -37 262 -353 202 145 -55 -252 -102 -405
4065 -405 -242 97 451 287 -119 91 -20 210 -270 320 308 36 82 145 82 -99 171 -195 -240 -82 -96 -241
4087 -241 -233 -188 22 -105 195 23 -129 -60 468 156 68 597 -121 166 448 76 -238 -44 -44 28 -74 -268 -212
4110 -212 -299 -83 90 -51 45 99 -85 -105 71 -176 126 -10 167 147 -10 -265 -200 -343 -109 -111 187 -160 33
4133 33 -120 -21 -210 -72 -178 -53 58 234 -73 -165 67 -50 -172 -39 179 -1 -602 -15 193 -311 -2
4154 -2 -252 -101 -36 175 182 7 109 447 92 -5 259 221 -178 154 113 36 -275 0 383 -74 -42 110 -34
4177 -34 -193 351 -244 -200 53 222 -39 120 466 290 168 232 154 -164 -156 24 -152 -309 36 -250 -89 -30
4199 -30 -20 -171 -100 281 139 -3 -123 221 97 263 215 369 -111 -282 -45 5 92 128 -180 -72 -257 -61
4221f1m2R8J55k38R6K94k96J82O4k17J63j81M7k69nL6J67j0q6j92L57j21lQLJ74
4247A23j4N5N6m11J43q5J19j24K60q5J97k87J15m27K52J06j35J38j8N7l59M14
4269I0l10K61J87K03n49L88j52J42k49K1R8j69K08k51k0R1j93J43n9K81l09m8
4291a96Q4J52o3N3N5N0l2N2m50M32J2j98J10k74J20k2K13k63p8K99Oj36J77J4
4315A17k6k79L43J19k68j27L41J30m44K12J44l73j75K71j52K61l19L79k96J20
4335b2K2l5O8J02j45J74l29j8M19p9j40L30k50P0k83L4L7k71L26j60J34o5P0J67
4359A56j71K9r3K69j01l14M05nj55P9J20k00p0J57j70K5j88L2Q4k5j54M3M90m42
4383a99L32k75K57k58K34K3m4Pl11P5M77k05k92P8K83j82k75m3K71J07n4J47p
$$ plain form
4221 -61 -103 -5 150 -88 8 302 6 188 252 35 198 17 64 -205 -210 -174 -7 -17 -103 -295 62 -59 -62 -54 -51 123
4247 123 109 164 220 -191 -48 -133 -14 -138 122 37 234 -53 62 -365 -113 -7 -142 -4 -22 35 -324 90
4269 90 -220 41 228 431 -118 270 118 260 11 32 130 -39 169 -82 -102 -11 -204 -61 -120 161 -148 -196
4291 -196 -112 40 -23 30 85 135 103 155 -295 137 149 -49 61 -213 -93 -115 98 -165 -243 56 62 -74 103 117
4315 117 91 -188 155 274 6 -121 220 350 -94 118 262 -111 -286 -15 -167 94 -225 154 -142 -22
4335 -22 0 -35 33 135 -10 164 -165 -183 236 157 17 347 97 167 -116 -82 -45 -316 10 -150 -16 -81 -11 156
4359 156 -15 14 -79 190 89 -225 180 175 20 99 219 19 -51 106 -64 -39 -227 -195 -111 -136 -290 -247 243 -199
4383 -199 133 -142 115 -143 91 114 70 77 -234 -159 318 113 -179 -101 182 0 -275 -318 -47 60 6 153 146
4406A46j30L3j87M22k31R4j23J05q7j51q0rJ36n1k25L40j26L03j28j25K7J94n4
4429I3q6l1K51l86J07N6J04J5j59J8K0j21k08K51r6K32j04j01K67q9n2j8Q7J74
4453B24k56j2oM7K25k44J59M8j40k53L52j29j32r1K91K09o62J15P9L17k36L77
4475B82k61P1No8n3L61l06N1k00J54k12J97k57J42L7j33Q5M0l0M3J34k2j05J37
4499I2M4j71K76k46J69p0K23j52r2k48K82j81K34k85K68k52j14L17k31N02j83
4520A82j85j16N55k64l08K28K83n66J52J05O0kj30k76K21P9L4j04j98J75K65J3
4542B03l42L35k68j12L29J06r7m03L48J01k11J02j10k49r0L51N3k68L74r8M7J8
4564A19m2r3m2J14j27K67j76j62QJ87l66M12k58k0L34k09l65K76P4j71L43P5Q2
$$ plain form
4406 146 16 49 -138 284 53 147 24 129 42 -109 -189 -198 -62 -113 -338 2 -124 179 51 -74 -47 147 93
4429 93 7 -24 227 -159 -52 4 108 123 -36 -18 2 -119 -327 -76 -172 60 -44 -145 122 33 -19 -37 50 224
4453 224 -32 -44 -50 -3 222 -22 137 185 45 -208 144 15 -117 -208 83 292 -370 -255 -176 141 -95 282
4475 282 21 92 97 29 -24 337 31 82 -118 36 -176 21 -236 -94 -57 -190 -105 -65 -95 -52 82 60 -45 92
4499 92 136 -35 241 -5 164 94 317 165 73 -175 107 -74 160 -125 143 -109 -223 94 -137 365 182
4520 182 -3 -119 436 172 -136 92 375 -191 -39 66 126 124 -6 -282 -61 18 52 -52 -250 -75 190 203
4542 203 -139 196 -72 -184 145 251 154 -249 99 200 -11 91 -19 -268 -358 -7 46 -222 152 54 101 119
4564 119 77 -16 -58 56 -71 196 20 -142 -134 53 -313 99 -159 -179 155 -54 -419 -143 -69 -240 103 178 260
4587B60l43K31L5j28P2K4r5p7J32k41j4L09l01K39k00O3o4r7J26k26L56m6j13
4610i8J74k10N6J2JK49k84J66N5l39K80k25O5J93j79J2j57n5J56nJ56Q4m8P9P0
4635B08L9m21L95q2k28j2J84j49J59j92K5q0j9J60j57L8R2j7K63k89M1L52l52
4658d2K87J92o60N39j90j41j5O6k15N7O6q5K00q3L7k0k12J02L22k87r9L73M5m49
4682b12P0K26j55j09J57k10K18j35L46m19Q2J06J72n0j18J97l55J26J27j65J60
4703E9J53J11l14j97K14j4k0k08j94M40k09J32J80k18L32k83k03K91K35p09L44
4724g8J63n6j8oJ70K4l03N9R4J20k75r6j12J97Q7j40J51J71L8j62R3l7j95j58
4748b69K86L10o31N72l23J24j68n8J73j63M8k3K9N0K03K8j80k64L26r2r1J06J93
$$ plain form
4587 260 -83 148 183 55 127 151 56 -21 111 -130 -144 165 -136 103 -97 -34 -98 -195 -69 -295 61 15 -98
4610 -98 76 -134 -78 -66 -65 184 -100 66 121 -218 62 -163 -98 95 -84 -72 -229 -284 -128 -133 23 107 59 138 208
4635 208 247 -174 221 139 -89 -101 83 -66 93 -99 -74 -154 -173 -13 -170 -132 -40 -57 206 -83 -42 310 -42
4658 -42 245 437 -223 316 126 -15 -30 36 -179 -122 -56 -141 59 -24 13 -7 -219 -117 205 -82 -181 192 237 -212
4682 -212 -142 84 -71 -180 -23 -233 -15 -150 196 -223 -141 -35 137 87 -31 166 -189 -63 64 -101 59
4703 59 212 323 9 -188 26 12 -8 -216 -410 30 -179 -47 133 -85 247 -36 -239 52 287 -422 -78
4724 -78 85 29 11 5 175 199 -104 -45 49 169 -106 -202 -314 -117 -30 -170 -19 152 190 28 121 84 -111 -269
4748 -269 17 327 -304 268 -55 69 -99 -157 16 -147 -99 -122 -93 -43 160 188 8 -256 70 -22 -113 -7 186
4771A86l31J44K34l61N4K48n2m48M03o4k49J11O20j84l45J9M2j09L41k53O9k3
4793E2J6k42K25o2M1j08L6r1JK05k20J88j6j47MQ6J28l02L36j77j04J09j26O1
4817a07J85J18J9j31j64L52m60K45l6J32l30J48j12L28l38J71j92M28Q4j8k10
4838A12J29l8n55L83J8K07k16J9j21K13k76J20j34J60J2j45M2O2LQ5J94k25J01
4861A50k46K1p0P5NJ61m9J36j24k32J25J10J64l1m67M82k29L25j59j08j28K75
4883A86o3L6k63R2p7Q7n0l0j99N8L67M0l01O6npO3O5N6l88J59R6L3P0N9l90L16
4910G6k76K86k61K02j4K8k78J07J24m3K6J62j25j83K93J91l23j25K49O9k85p1
4932a71K03k95K53j03L3J31l6lk00J55M6j01J30J42q6l34L32k08J57p3L5l0mk06
$$ plain form
4771 186 -145 -1 233 -128 -74 174 122 -326 77 13 -236 -125 495 311 -34 -15 27 -82 259 6 75 52
4793 52 68 -174 51 -11 30 -78 -42 -133 -132 73 -147 41 25 -122 -118 -32 96 -206 130 -47 -151 -42 -168 -107
4817 -107 78 196 215 84 -80 272 -188 57 21 153 -177 -29 -141 187 -151 20 -172 256 340 322 112
4838 112 241 203 -352 31 49 256 40 59 -62 151 -125 -5 -139 21 33 -112 -70 -8 -5 80 274 49 150
4861 150 -96 -75 -145 -70 -65 96 47 183 59 -173 -48 62 226 195 -272 210 -19 306 147 39 -89 186
4883 186 123 159 -104 -12 -89 -2 -52 -82 -281 -223 144 184 -117 -51 -56 -63 0 65 121 -267 -108 -12 21 91 150 -240 76
4910 76 -200 86 -175 27 13 41 -237 -130 -6 -49 -23 139 14 -169 124 315 -8 -133 116 185 -100 -171
4932 -171 32 -263 -10 -113 -80 51 15 12 -188 -33 13 -88 42 184 98 -236 96 -112 45 -28 7 -23 -27 -233
4956b33K83k28M24l73J7P8J30k78p7J61J49l08K62R9q7Nn2j92K95j65j29K37p3
4979e5k7l70M56k5L41l80J23jl8o6P5j57J73J37k51J52K2p9n5k6J76k0k68O4K1
5004g8L5J59j04k97K58J45k15ok7K66n9j43Q4K46l12K14n8l2J34m6j80K1o1K30
5028A74o6j84j07J83K77l66J4K83k37l8K33l4l37j5L91k24j71J49L56j93j10J0
5050a2K6l68M71P4m24M52k87J05J20l94K24K81k80j58P0J75L9j62J20j73N8J70
5072A27m4l60K53J08l8j27j58L29p0N6j54P9nJ01m9r4k46K48J97j7j60j20J51
5095Gm8J76j78k59Q7K99K5k62K90J9J41k27j30K20R1j63j46L69l96J13j49K5K65
5118A69k07J20k44K71k89N2LL1j57J53L73k87m8K37l17l0R2k74L73l61K26PK05
$$ plain form
4956 -233 50 -178 246 -127 -110 -32 98 -180 -257 -96 53 -255 7 106 19 24 -28 -220 75 -90 -219 18 -55
4979 -55 -82 -452 4 -21 320 -60 63 62 24 -42 33 -124 49 186 -65 87 109 30 -25 -51 125 105 -163 -99 -78
5004 -78 -43 116 12 -285 -27 118 -97 -103 -130 136 77 -66 18 264 -48 166 108 76 210 164 -16 5 -56 174
5028 174 108 -76 -183 0 277 -89 -75 208 -29 -67 166 132 -205 -220 171 -53 -224 -75 281 88 -22 -12
5050 -12 14 -354 117 191 -233 219 -68 37 157 -237 -13 268 -12 -170 -100 75 114 -48 72 -101 -43 127
5072 127 83 -277 -24 84 46 -81 -239 90 20 76 -78 1 -4 97 48 -46 -292 -44 153 136 -24 -144 7
5095 7 -41 135 -43 -302 -215 84 109 -153 137 156 297 70 -60 160 251 88 -58 311 -85 28 -121 -96 169
5118 169 -38 82 -162 109 -180 -128 -125 -94 -251 -98 275 -12 -60 177 -140 -170 -78 -352 21 -340 -114 -107 98
5141I8q9k4O5K51l04Mj47Q0L3p3l05M20J40m43J34K79j99P9n0m01L27P9r0Q8j85
5166b33L40J4k09N2J51j48k11M28j73J12j35m6m9K61k3j98o3L41j92K89l65K9
5188b8o3r1K73N1j24Q8l1k01K28L1m30J79J01J67j46R3m4k39J19K38k27j76K29
5211cJ68l17n0J33m1L55J6m78M46l14M40j58k37l0L9j65K41j68j16L28l1k68K41
5234C1j79k0L43l82M22Lj60j94J84K2j00Q1k1q1j4J67J00l41O2J84j97L7J95%
5258A42k57P5M0j53J79O7j50J1R4j96k39L00J05P6k36K00J9jl81L21j40R4j09
5281a39R8J28j81j63L79K08l99l9K31l52L04J34l79J89k76J27l4kK22k19J83q1
5303f1J74r7J22q9j82J05L8J7j1j33J4L4J73k09R4n3K43J23m44l3K76j03m3K7
$$ plain form
5141 98 9 -15 50 301 -3 1 -146 -66 -33 -106 -411 9 149 -294 -160 119 -80 -1 -51 -452 -125 -46 -136 -48 -233
5166 -233 107 121 -88 -36 115 -33 -244 184 11 123 -12 -58 -107 154 131 -67 -130 211 19 308 -57 -28
5188 -28 -91 -182 91 142 18 106 75 -126 102 133 -297 -118 -17 150 4 97 53 -186 -67 171 -56 -232 -3
5211 -3 165 -152 -202 -69 -110 245 261 -217 229 -85 355 197 -40 -70 -31 -196 45 -123 -239 89 58 -210 31
5234 31 -148 -168 175 -207 215 218 58 -136 48 70 -30 51 30 -51 -65 102 202 -139 -77 107 -90 -53 142 142
5258 142 -115 -40 0 -153 26 93 -57 -46 48 -148 -387 -87 18 94 -142 58 77 76 -305 16 -124 -30 -139
5281 -139 -41 87 -94 -257 122 330 -69 -108 123 -229 75 209 -170 19 -257 -130 -164 -166 56 -163 20 -61
5303 -61 113 16 138 49 -133 -28 10 27 16 -117 -103 -69 104 -105 -11 -64 179 302 -142 -175 101 -2 -45 -18
5327a8j06K98j50J88l57K41J3j41L9J50j03m02L27j83OJ95n1j57K83k7N1k80J06
5350g8K34J44m29J33K2r1J85j05p3k0j33MK13P6o2Jj72l6J46k46L04k62L40k67
5374a72k6L2J77p3J29m7m1n4L5K6l7K62k87K65j29n6j10l9K32K8j49j41J77J82
5398A84j80L47m44j04L23k4k00j33J57%J68l42J03j0J49J42k32N2n5J90nm6m1
5421aK13J19j45R6m62K26O8k64K84J37k9n34J23L07m6r4JO0K99k67J86m5k62K8
5445bP7j97Q7pj08K51kL9k54J69k20M23m03mM13k19l8K6Q5L3j8K3j28O3K1p6O3
5472I7p3m2k47LL48n5n1j88K94n6K56l96K06K1j26K24j45J20q5M8j79l5k27M8
5496b40J26J41r2k5J60J52j70K15l08J37j55J49n6J92k40L2J49p6j78J80k31J4
$$ plain form
5327 -18 -124 174 24 212 -145 96 109 -32 7 157 54 -348 -21 -204 -198 -3 -54 -211 72 45 96 -184 -78
5350 -78 156 300 -129 4 26 -65 120 15 -58 -78 -211 -207 6 82 20 21 -151 -187 -41 -287 17 -245 95 -172
5374 -172 -198 -166 11 -62 67 20 -21 -75 -40 -14 -51 211 -76 189 60 4 -106 -145 87 115 -34 -175 2 184
5398 184 4 351 -93 -197 126 102 -98 -231 -74 -74 94 -248 -145 -155 -6 136 -96 -44 -99 91 86 40 -1
5421 -1 212 331 186 282 -180 46 114 -150 134 271 242 -292 -169 138 92 -2 -1 59 358 91 277 232 -30 -2
5445 -2 75 -122 -35 -42 -150 101 99 138 -116 53 -167 256 -147 -151 262 43 5 31 116 149 131 154 26 89 110 34 97
5472 97 24 -18 -265 -262 86 31 -20 -208 86 30 286 -110 96 117 -9 215 70 190 105 153 -26 -61 -288 -240
5496 -240 -114 27 -65 -90 70 222 52 267 -41 96 -59 90 34 226 -14 18 167 91 -87 93 -138 -124
5518a24P2O4j54m4J62j75L10l08J78O4N1j85jL01J0k65J70k18m7L57k73K30k39
$$ plain form
5518 -124 -52 12 -142 -186 -24 -199 111 -197 -19 45 96 -89 -90 211 221 -44 126 -92 -139 218 -55 175 -64
$$ [...]
8191a0
##END NTUPLES=NMR FID
##END=
